##TITLE=1H_LR-683B-CS2_CHL
 CDCl3, 8 sc, 
 2.3.2020
##JCAMPDX= 6.0         $$ Bruker NMR JCAMP-DX V2.0
##DATA TYPE= NMR FID
##DATA CLASS= NTUPLES
##ORIGIN= UXNMR, Bruker Analytische Messtechnik GmbH
##OWNER= root
$$ XWIN-NMR		Version 3.5
$$ Mon Mar  2 14:11:54 2020 Russian Standard Time (UT+4h)  she@DPX200
##.OBSERVE FREQUENCY= 200.1315
##.OBSERVE NUCLEUS= ^1H
##.DELAY= (6, 6)
##.ACQUISITION MODE= SIMULTANEOUS
##.ACQUISITION SCHEME= undefined
##.AVERAGES= 8
##.DIGITISER RES= 18
##SPECTROMETER/DATA SYSTEM= spect
##.PULSE SEQUENCE= zg30
##.SOLVENT NAME= CDCl3
##.SHIFT REFERENCE= (INTERNAL, CDCl3, 0, 15.7039)
##AUDIT TRAIL= $$ (NUMBER, WHEN, WHO, WHERE, WHAT)
$$ ##TITLE= Audit trail, XWIN-NMR		Version 3.5
$$ ##JCAMPDX= 5.01
$$ ##ORIGIN= Bruker BioSpin GmbH
$$ ##OWNER= she
$$ F:/spectra/data/she/nmr/H-F/1/audita.txt
$$ ##AUDIT TRAIL=  $$ (NUMBER, WHEN, WHO, WHERE, WHAT)
(   1,<2020-03-02 14:09:27.48 +0400>,<she>,<DPX200>,
      <created by zg, POWCHK disabled, PULCHK disabled
       configuration hash MD5:
       00 E9 B6 7A A2 85 ED C7 34 08 36 98 17 FE 4E 26
       data hash MD5: 16K
       ED 64 14 67 52 53 61 14 36 52 EA E9 C3 37 87 1C>)
$$ ##END=
$$ 
$$ hash MD5
$$ BC 6B C1 50 2E BB 3F 88 13 96 62 54 80 47 D4 E3
##$RELAX= 
##$RELAX= 
##$RELAX= 
##$RELAX= 
##$RELAX= 
##$RELAX= 
$$ Bruker specific parameters
$$ --------------------------
##$DU= <F:/spectra>
##$EXPNO= 1
##$NAME= <H-F>
##$PROCNO= 1
##$TYPE= <nmr>
##$USER= <she>
##$AMP= (0..31)
100 100 100 100 100 100 100 100 100 100 100 100 100 100 100 100 100 100 
100 100 100 100 100 100 100 100 100 100 100 100 100 100 
##$AQSEQ= 0
##$AQ_mod= 1
##$AUNM= <au_zg>
##$AUTOPOS= <>
##$BF1= 200.13
##$BF2= 200.13
##$BF3= 200.13
##$BF4= 200.13
##$BF5= 200.13
##$BF6= 200.13
##$BF7= 200.13
##$BF8= 200.13
##$BYTORDA= 1
##$CFDGTYP= 0
##$CFRGTYP= 5
##$CHEMSTR= <none>
##$CNST= (0..31)
1 1 145 1 1 1 1 1 1 1 1 1 1 1 1 1 1 1 1 1 1 1 1 1 1 1 1 1 1 1 1 1 
##$CPDPRG= <>
##$CPDPRG1= <>
##$CPDPRG2= <>
##$CPDPRG3= <>
##$CPDPRG4= <mlev>
##$CPDPRG5= <mlev>
##$CPDPRG6= <mlev>
##$CPDPRG7= <mlev>
##$CPDPRG8= <mlev>
##$CPDPRGB= <>
##$CPDPRGT= <>
##$D= (0..31)
0 1.2 0 0 0 0 0 0 0 0.06 0 0.03 0 0 0 0 0.0002 0 0 0 0 0 0 0 0 0 0 0 0 
0 0 0 
##$DATE= 1583143766
##$DBL= (0..7)
120 120 120 120 120 120 120 120 
##$DBP= (0..7)
150 150 150 150 150 150 150 150 
##$DBP07= 0
##$DBPNAM0= <>
##$DBPNAM1= <>
##$DBPNAM2= <>
##$DBPNAM3= <>
##$DBPNAM4= <>
##$DBPNAM5= <>
##$DBPNAM6= <>
##$DBPNAM7= <>
##$DBPOAL= (0..7)
0.5 0.5 0.5 0.5 0.5 0.5 0.5 0.5 
##$DBPOFFS= (0..7)
0 0 0 0 0 0 0 0 
##$DE= 6
##$DECBNUC= <off>
##$DECIM= 24
##$DECNUC= <off>
##$DECSTAT= 4
##$DIGMOD= 1
##$DIGTYP= 9
##$DL= (0..7)
0 120 120 120 120 120 120 120 
##$DP= (0..7)
150 150 150 150 150 150 150 150 
##$DP07= 0
##$DPNAME0= <>
##$DPNAME1= <>
##$DPNAME2= <>
##$DPNAME3= <>
##$DPNAME4= <>
##$DPNAME5= <>
##$DPNAME6= <>
##$DPNAME7= <>
##$DPOAL= (0..7)
0.5 0.5 0.5 0.5 0.5 0.5 0.5 0.5 
##$DPOFFS= (0..7)
0 0 0 0 0 0 0 0 
##$DQDMODE= 0
##$DR= 18
##$DS= 0
##$DSLIST= <SSSSSSSSSSSSSSS>
$$ [...]
##$SUBNAM2= <"">
##$SUBNAM3= <"">
##$SUBNAM4= <"">
##$SUBNAM5= <"">
##$SUBNAM6= <"">
##$SUBNAM7= <"">
##$SUBNAM8= <"">
##$SUBNAM9= <"">
##$SW= 24.9337058887773
##$SWIBOX= (0..15)
0 0 2 0 0 0 0 0 0 0 0 0 0 0 0 0 
##$SW_h= 4990.01996007984
##$TD= 16384
##$TD0= 1
##$TE= 0
##$TE2= 300
##$TE3= 300
##$TEG= 300
##$TL= (0..7)
0 120 120 120 120 120 120 120 
##$TP= (0..7)
150 150 150 150 150 150 150 150 
##$TP07= 0
##$TPNAME0= <>
##$TPNAME1= <>
##$TPNAME2= <>
##$TPNAME3= <>
##$TPNAME4= <>
##$TPNAME5= <>
##$TPNAME6= <>
##$TPNAME7= <>
##$TPOAL= (0..7)
0.5 0.5 0.5 0.5 0.5 0.5 0.5 0.5 
##$TPOFFS= (0..7)
0 0 0 0 0 0 0 0 
##$TUNHIN= 0
##$TUNHOUT= 0
##$TUNXOUT= 0
##$USERA1= <user>
##$USERA2= <user>
##$USERA3= <user>
##$USERA4= <user>
##$USERA5= <user>
##$V9= 5
##$VALIST= <valist>
##$VCLIST= <CCCCCCCCCCCCCCC>
##$VD= 0
##$VDLIST= <DDDDDDDDDDDDDDD>
##$VPLIST= <PPPPPPPPPPPPPPP>
##$VTLIST= <TTTTTTTTTTTTTTT>
##$WBST= 1024
##$WBSW= 4
##$XGAIN= (0..3)
0 0 0 0 
##$XL= 0
##$YL= 0
##$YMAX_a= 250406
##$YMIN_a= -204819
##$ZGOPTNS= <>
##$ZL1= 120
##$ZL2= 120
##$ZL3= 120
##$ZL4= 120
##$ABSF1= 10
##$ABSF2= 0
##$ABSG= 5
##$ABSL= 3
##$ALPHA= 0
##$AQORDER= 0
##$ASSFAC= 0
##$ASSFACI= 0
##$ASSFACX= 0
##$ASSWID= 0
##$AUNMP= <proc_1d>
##$AZFE= 0.1
##$AZFW= 0.1
##$BCFW= 1
##$BC_mod= 2
##$BYTORDP= 1
##$COROFFS= 0
##$CY= 11.3945322036743
##$DATMOD= 1
##$DC= 2
##$DFILT= <>
##$DTYPP= 0
##$F1P= 16.9975609425685
##$F2P= -3.02152046262296
##$FCOR= 0.5
##$FTSIZE= 0
##$FT_mod= 4
##$GAMMA= 1
##$GB= 0.15
##$INTBC= 1
##$INTSCL= 1
##$ISEN= 128
##$LB= 0.24
##$LEV0= 0
##$LPBIN= 0
##$MAXI= 10000
##$MC2= 0
##$MEAN= 0
##$ME_mod= 0
##$MI= 1.114404
##$NCOEF= 0
##$NC_proc= 0
##$NLEV= 6
##$NOISF1= 3.799351
##$NOISF2= 2.8
##$NSP= 1
##$NTH_PI= 0
##$NZP= 0
##$OFFSET= 15.70392
##$PC= 1
##$PHC0= -9785.899
##$PHC1= 13.00082
##$PH_mod= 1
##$PKNL= yes
##$PPARMOD= 0
##$PSCAL= 0
##$PSIGN= 0
##$REVERSE= no
##$SF= 200.130013532006
##$SI= 16384
##$SIGF1= 3
##$SIGF2= 2
##$SINO= 400
##$SIOLD= 16384
##$SREGLST= <1H.CDCl3>
##$SSB= 0
##$STSI= 0
##$STSR= 0
##$SW_p= 3612.71676300578
##$SYMM= 0
##$S_DEV= 0
##$TDeff= 0
##$TDoff= 0
##$TI= <>
##$TILT= no
##$TM1= 0
##$TM2= 0
##$TOPLEV= 0
##$USERP1= <user>
##$USERP2= <user>
##$USERP3= <user>
##$USERP4= <user>
##$USERP5= <user>
##$WDW= 1
##$XDIM= 8192
##$YMAX_p= 0
##$YMIN_p= 0
$$ End of Bruker specific parameters
$$ ---------------------------------
##NTUPLES= NMR FID
##VAR_NAME=  TIME,          FID/REAL,        FID/IMAG
##SYMBOL=    X,             R,               I
##VAR_TYPE=  INDEPENDENT,   DEPENDENT,       DEPENDENT
##VAR_FORM=  AFFN,          ASDF,            ASDF
##VAR_DIM=   8192,          8192,            8192
##UNITS=     SECONDS,       ARBITRARY UNITS, ARBITRARY UNITS
##FACTOR=    0.0002004,     1,               1
##FIRST=     0,             0,               0
##LAST=      1.6414764,     0,               0
##MIN=       0,             -204819,         0
##MAX=       1.6414764,     250406,          0
$$ Real data points
##PAGE= N=1
##DATA TABLE= (X++(R..R)), XYDATA
0 0 0 0 0 0 0 0 0 5 -8 8 -8 16 -16 19 -24 32 -33 43 -50 59 -71 81 -95 110 -126 144 -167 186 -211 241 -269
31 -269 306 -340 382 -427 475 -528 587 -652 723 -800 884 -982 1086 -1202 1335 -1482 1650
48 1650 -1845 2066 -2328 2646 -3028 3513 -4142 4994 -6228 8187 -11778 20629 -91967 -87294
62 -87294 13703 -67171 33057 174171 103965 -141177 -204819 -101879 -10005 41915 122560
73 122560 86087 -86860 -182048 -69052 59873 89470 85363 54652 -83555 -196519 -110422
84 -110422 68516 119377 84656 74147 13109 -131460 -154329 17629 149379 101016 35534
95 35534 31213 -38138 -131826 -34998 182191 206141 9466 -116844 -71933 -17029 5216 85371
107 85371 164070 110918 -12204 -63074 -49370 -19685 59825 149949 111875 -32630 -87781 -1452
119 -1452 83026 107239 129655 114931 -3981 -113669 -64431 66405 116161 97749 89249 48302
131 48302 -44808 -63140 47065 136868 102031 33144 8411 -23836 -56469 9417 145305 180676
143 180676 73906 -34919 -54031 -22455 29419 103465 140204 81967 -10856 -42263 -13883
154 -13883 27154 78339 120043 87680 -16366 -80481 -38037 50401 107903 120415 85936 934
166 934 -73226 -57786 28872 94157 99010 69010 16843 -42165 -47257 29580 109881 105802 38128
179 38128 -19554 -47839 -50544 -3539 82551 123353 67518 -21190 -57974 -36908 7787 61004
191 61004 93057 58343 -23078 -66979 -36041 24523 66560 81558 55689 -14786 -73300 -56484
203 -56484 15507 69262 73975 44403 -12275 -70034 -69001 2595 68229 66338 23108 -17574 -51425
216 -51425 -60800 -10451 66750 82927 20005 -45401 -64051 -50942 -15363 44463 80659 40522
228 40522 -38449 -74480 -51467 -9340 29942 54491 31127 -36851 -82319 -59068 -1426 38283
240 38283 48347 24893 -33346 -83632 -70966 -7745 41051 45142 19019 -26761 -73632 -76290
252 -76290 -19498 39001 42326 3082 -37010 -63447 -64580 -23649 34707 48966 3516 -52345
264 -52345 -76495 -66829 -28003 25110 51077 18691 -41692 -73801 -60778 -23459 15085 32597
276 32597 7945 -45620 -77128 -57745 -10811 26866 36321 10845 -41017 -82468 -74146 -24714
288 -24714 22282 34714 11325 -30542 -64780 -62246 -21595 21604 29901 -1355 -44439 -68646
300 -68646 -56977 -14955 29014 41998 12801 -37391 -70880 -64066 -25046 16685 32531 14189
312 14189 -25373 -55645 -50163 -12097 26117 31277 2073 -38640 -63728 -54164 -11329 34656 46531
325 46531 17633 -25122 -52718 -52627 -24026 17821 36947 14802 -25167 -44599 -32537 -2210 29989
338 29989 41754 15485 -32920 -59352 -43677 -4930 30478 47138 32477 -9766 -44584 -39737
350 -39737 -5330 22348 29062 15873 -12988 -39745 -32266 9603 45250 45074 18853 -15000 -43646
363 -43646 -45741 -8988 37450 49790 25782 -3610 -20922 -23977 -5059 28994 41976 15446
375 15446 -21313 -34311 -20990 6096 38453 55508 33329 -12250 -38982 -29752 -2844 24482
387 24482 42076 34391 709 -25381 -16713 12236 32523 34509 20178 -9634 -36223 -28703 10062
400 10062 43903 48281 29685 931 -26571 -32437 -6794 28066 38143 20236 -2815 -15461
412 -15461 -12754 8473 36608 44540 20100 -14898 -32088 -25150 192 32116 48353 34027 1041
425 1041 -22057 -19908 -526 21055 31293 19596 -7426 -25658 -16344 11324 35124 40458 24102
438 24102 -6202 -29447 -27096 -773 27985 38046 26685 3140 -17009 -18891 1077 24634
450 24634 31184 14637 -10009 -23617 -17372 5862 31074 38792 22698 -6326 -27115 -24991 -3300
463 -3300 21614 32643 23174 1399 -15938 -14262 4900 24383 28408 13304 -10410 -25991 -21553
476 -21553 1953 27935 36013 21606 -3710 -22256 -22230 -4691 16746 25944 14529 -5524 -18296
489 -18296 -14619 2633 22507 29953 15920 -9565 -26183 -20717 -385 19782 27697 17992 -4170
502 -4170 -23198 -22086 -2910 15538 20899 11476 -6092 -21121 -20246 -1193 20134 23997 9595
515 9595 -10352 -23227 -22528 -5879 16539 26487 15134 -6328 -21026 -20723 -6724 10974 18685
528 18685 8452 -11754 -23629 -18738 -3179 13145 20102 11413 -9479 -26193 -23953 -6356 11523
541 11523 18124 10619 -6243 -21626 -21276 -5043 12077 15901 6519 -8195 -20784 -21960 -7524
554 -7524 12184 17756 4918 -12636 -22594 -21234 -8136 10278 18710 9171 -8721 -19293 -18562 -8729
568 -8729 6144 16076 8656 -10642 -21514 -14803 -467 10427 14800 9051 -8835 -24453 -22049
581 -22049 -5682 8586 13352 9230 -3219 -17993 -19184 -3761 11621 11783 2750 -6973 -15304 -16929
595 -16929 -4320 13794 18877 7734 -8040 -17550 -18688 -7745 10158 18098 8158 -6613 -13008
608 -13008 -11740 -5725 5007 12954 7020 -9683 -17810 -11964 -187 11433 18417 12665 -5293 -19126
622 -19126 -16825 -5084 5399 11652 11465 -348 -13456 -11823 2199 11046 9028 2080 -7468 -17260
636 -17260 -17298 -2556 12012 15143 9815 532 -11419 -18231 -9116 7985 12779 3215 -6689 -9381
650 -9381 -8073 -991 10513 14235 3141 -10769 -15565 -13237 -7248 4894 16132 11617 -2991 -12163
664 -12163 -11549 -6890 60 8434 6459 -7365 -16163 -7777 4938 10105 10757 6775 -6077 -19746
678 -19746 -17137 -3338 4707 5608 8462 5539 -7435 -14574 -4012 7241 5535 -2066 -6811 -12274
692 -12274 -14323 -1772 16086 16785 2864 -6091 -7922 -12039 -10853 1925 11561 5014 -3959 -2983
706 -2983 -1955 -4358 1852 12893 7315 -11146 -17909 -7811 1889 6890 13321 13768 -1008 -13903
720 -13903 -8714 1613 1257 991 7293 5128 -6832 -8060 5503 12752 7340 2949 469 -10294
734 -10294 -16672 -2994 14992 14985 5434 2564 208 -7171 -5467 7081 10931 -488 -6014 441 1940
749 1940 -788 7040 18632 11915 -5553 -11020 -5322 -1816 2137 12901 14875 862 -7920 -28
763 -28 7672 3937 1917 6481 2227 -8927 -7259 6615 12891 9136 7946 5315 -5741 -12323 -2290
778 -2290 9742 8674 3083 3907 2162 -4347 -1681 10221 12042 231 -6904 -3748 -1949 -1794 5984
793 5984 14497 9871 -1494 -4935 -2723 -2661 -323 8107 9423 -1335 -7499 -774 6382 5669 4949 6083
809 6083 256 -8888 -7874 1421 7354 6595 6420 4340 -3353 -7724 -941 6865 5554 -217 -721 -365
825 -365 -3419 -2091 7152 11706 4532 -4489 -5845 -3521 -1701 3105 8828 6413 -1057 -4698 -879
840 -879 1257 986 4296 5818 -442 -7040 -4311 3175 6256 5025 4191 1116 -5558 -6766 198 6168
856 6168 5235 2707 1832 -1566 -5640 -1502 6383 6762 301 -3092 -1316 -1770 -2004 3285 8929 4509
872 4509 -3403 -5131 -2857 -1756 978 6731 6150 -2337 -5975 -1655 2006 735 1379 3937 85 -6789
888 -6789 -5563 1989 4512 2401 1709 623 -5695 -8288 -1651 5103 3112 -708 -356 -1520 -6205 -4680
904 -4680 2988 4406 -2237 -5759 -3610 -2665 -3252 1110 5342 1513 -5704 -6688 -4533 -4219 -2060 2986
920 2986 3171 -3137 -6508 -3189 -757 -2000 -1167 -262 -4346 -8755 -6325 -100 1538 652 1178 -1290
936 -1290 -7804 -9518 -3583 330 -1024 -2879 -1688 -2417 -5284 -3616 1700 1056 -3586 -6048 -6132 -6436
952 -6436 -4521 1006 3842 477 -4043 -5114 -4917 -4973 -2989 115 -953 -4160 -4378 -2110 -254 779
968 779 1567 -516 -5270 -7849 -5532 -2467 642 2479 2794 -189 -3447 -3984 -1924 -1063 -1183 -1772 -3148
985 -3148 -4179 -1974 1855 3485 2996 1464 -1438 -5674 -6109 -1831 1748 1960 1662 2097 135 -2079
1001 -2079 -277 2634 1089 -2469 -3104 -2020 -1364 -80 4544 6170 2729 -1139 -2347 -2381 -2423 267
1017 267 3323 2701 105 628 2547 2092 1424 3056 1826 -3423 -4826 -548 2905 2846 4237 6153 2641
1034 2641 -3011 -2533 1632 1068 -803 868 2726 666 -389 4025 6682 3600 -768 -696 -1414 -3329
1050 -3329 -1281 4694 5659 2470 1406 2713 590 -1701 1449 3230 -120 -3133 -258 3444 2281
1065 2281 2614 6188 4675 -2229 -4285 190 1764 303 1987 5326 3280 -1031 372 4108 2505
1080 2505 -721 282 570 -1675 -1691 3152 6327 4271 1842 1908 61 -2686 -686 3029 2757 694
1096 694 1706 3497 1795 1148 4117 4359 79 -2883 -808 1119 536 2101 5975 4917 489 -755
1112 -755 1465 1833 -106 873 2862 1382 -856 1161 4642 3857 1894 1492 905 -1345 -1910 1492 4068
1129 4068 2815 1828 2054 975 -412 234 2172 1547 -574 -830 485 827 958 3035 3660 908 -1642
1146 -1642 -1374 -189 -187 735 2656 2349 -105 -978 329 1427 443 -40 152 -1404 -2273 -1095 1153 1616
1164 1616 879 483 -621 -2071 -2292 -635 759 107 -642 -841 -861 -1528 -658 487 83 -1750 -2671 -1920
1182 -1920 -1868 -1010 335 1027 -926 -3020 -2668 -1787 -1429 -1239 -221 -369 -1960 -2664 -1925 -603 -634 -1437
1200 -1437 -1754 -1995 -2809 -2518 -820 47 -122 -1352 -2234 -3204 -3136 -1785 -605 -569 -1596 -2129 -2054 -1747 -1176
1219 -1176 -641 -859 -1496 -2355 -2563 -1919 -721 174 291 -958 -2274 -2716 -2260 -1197 -575 -146 -745 -1166
1237 -1166 -1266 -1237 -510 -418 -402 -1658 -2226 -1735 -1135 114 693 855 244 -1247 -1945 -1810 -869 -523 166 -378
1257 -378 -859 -945 264 928 359 -374 -906 -1607 -1931 -1484 141 1368 1226 636 31 -1101 -1216 -365 94
1276 94 -476 -1027 -912 -83 321 649 1544 1117 -693 -2124 -1908 -1422 -536 333 1343 679 -329 -322 91 -435
1296 -435 -1147 -669 -719 -1229 -1408 -92 1409 1652 776 300 -916 -2434 -2178 -565 44 74 -256 926 195
1315 195 -199 494 741 -969 -2223 -2082 -1171 -568 585 1959 1988 553 -687 -1017 -1519 -1406 -335 173
1333 173 209 -552 379 1664 1140 493 -74 -588 -1593 -1963 -680 654 1627 1612 1859 1042 -720 -481 264
1352 264 299 -289 -225 217 564 1315 2144 2325 1640 -110 -801 -973 -322 704 1603 2019 1992 1729 1202 812
1372 812 1053 804 300 281 -239 104 1345 2853 2991 2227 1160 64 -10 -208 337 1139 1789 1665 1746 1769
1392 1769 1964 1765 1731 963 -94 -543 603 1518 1923 2262 2914 2460 446 -48 577 811 352 961 1114
1411 1114 1155 744 2058 2887 1916 532 576 353 -929 -736 1530 2492 1627 1091 1235 970 -202 5 1043
1430 1043 335 -885 -255 1283 941 896 1488 2147 -134 -1892 -461 279 -145 -191 1235 1475 194 -254
1448 -254 545 680 -478 -539 -262 -941 -1432 418 1843 629 -40 122 -31 -1217 -1709 15 688 -329
1466 -329 -413 349 133 -711 -81 1064 -243 -1851 -1598 -184 -415 -820 831 1045 -577 -1626 -838 2
1484 2 -1050 -917 -115 196 -1066 -1178 135 745 -454 -764 -284 -1335 -1832 -643 908 702 -670 -522
1502 -522 159 -837 -1696 -399 551 -554 -1332 -200 -124 -866 -653 777 853 -1376 -1638 -550 -154 -715 -319
1521 -319 572 -189 -1497 -1138 -58 -532 -1050 -255 -6 -665 -1683 -544 502 -419 -1104 -738 -918 -1759
1539 -1759 -1185 904 816 -1025 -926 48 -613 -1911 -1000 709 -439 -1741 -984 678 -653 -1327 30
1556 30 21 -1792 -2637 -875 57 -1346 -949 689 275 -2085 -1561 109 -434 -2145 -1057 304 -853 -1918
1574 -1918 -602 968 -349 -1932 -780 -202 -2126 -2415 279 1146 -1006 -1087 424 -38 -1695 -1519 427
1591 427 -380 -2370 -1334 776 -330 -786 872 1475 -1074 -2235 -826 403 -1200 -599 1290 911
1607 911 -960 -512 1358 383 -1359 -605 676 -661 -1647 732 2208 1029 62 901 756 -1353 -1293
1624 -1293 1007 1462 -734 289 1887 1185 -439 949 2122 339 -1421 -91 1163 75 46 2240
1640 2240 2817 464 -591 1129 1184 -631 162 2026 1556 18 959 2800 1884 565 1201 1217 -214
1657 -214 -1122 788 1974 1033 850 2206 1496 305 418 1117 796 -93 118 1049 895 715 1575 2626
1675 2626 812 -103 444 338 -554 331 1770 1478 766 701 1930 1091 -114 454 930 -476 -1179 676
1693 676 1224 876 767 1589 1198 -400 -1082 160 347 -358 403 788 782 130 426 1324 383 -359 -661 -430
1713 -430 -830 -231 641 1345 746 -51 225 -221 -682 -458 -160 -378 -363 141 364 70 421 845 218 -647
1733 -647 -947 -878 -680 -103 487 713 276 -83 75 -160 -775 -477 -626 -195 -802 -318 799 710 437 210
1753 210 -57 -714 -1426 -804 -87 60 -220 374 353 -166 -65 -15 65 -636 -1067 -626 -585 -507 446 632 541 -44
1775 -44 -513 -702 -672 -660 -93 -33 -110 -496 53 -66 -146 73 -212 -1093 -1026 -547 -287 -55 -13 435 -60 -757 -889
1798 -889 -569 -554 -684 -95 -352 -675 -671 -420 422 231 -662 -663 -659 -1206 -931 -228 70 -194 -620 -735 -748 -988 -808
1821 -808 -690 -555 -849 -1139 -610 -351 -405 -486 -278 -640 -1131 -1271 -687 -291 -638 -446 -495 -642 -1009 -1092 -359
1842 -359 -318 -732 -932 -440 -415 -906 -298 26 -419 -774 -709 -394 -615 -379 -58 73 -499 -477 -378 -699 -357 28
1864 28 217 -65 -459 147 -84 122 129 303 -333 -694 -422 198 280 99 527 583 100 -298 219 333 43 22
1886 22 100 504 75 136 825 720 217 -262 54 164 -187 327 795 855 492 754 523 215 290 572 969 135
1908 135 23 698 949 690 666 1150 1038 59 -118 550 466 701 958 1081 881 629 432 906 682 94 408
1929 408 -64 61 841 1218 948 547 455 409 287 -291 199 412 418 389 422 592 386 328 770 557 -229 -428
1951 -428 -156 48 330 583 867 514 5 -166 -371 -414 -348 4 34 -166 29 414 437 156 -144 -295 -650
1972 -650 -580 -469 214 257 393 646 111 -70 -206 -270 -150 -439 -549 -203 -93 -256 115 570 238 113 -436
1993 -436 -699 -560 -205 -23 210 340 270 -17 -35 -163 -336 -299 -527 -552 -293 58 408 469 481 123 -217 -539
2015 -539 -483 -175 -42 -137 -334 320 481 66 190 -8 331 -107 -299 -245 -209 102 612 767 286 92 76 -344
2037 -344 -92 -149 -156 79 108 319 43 626 353 288 -156 -400 -628 -589 47 -122 339 477 275 29 168 -285
2059 -285 -287 -80 -543 -421 -309 -222 296 335 108 -494 -68 -717 -219 -292 -287 -163 -78 156 -136 -250 -275 -208 -669
2082 -669 -499 -578 -662 -142 -143 -148 45 -59 -516 -434 -514 -629 -297 -380 -172 -127 -139 28 -373 -288 -101 -488 -492 -607 -710
2107 -710 -239 -44 -27 -107 -480 -445 -398 -314 -349 -371 -493 36 8 -290 -239 309 -19 -380 -544 -360 52 188 -40
2130 -40 39 -244 -178 -78 130 -52 -140 388 45 80 -70 167 509 337 -68 30 24 -37 230 -74 327 -18 398
2153 398 -45 123 -55 208 167 233 242 207 358 12 424 414 419 221 19 -89 427 186 296 351 424 -246 348
2176 348 49 256 283 -85 383 181 50 79 113 210 232 -155 84 105 -212 -77 88 222 52 46 119 -141 -178
2199 -178 81 174 -269 -219 -76 406 50 -211 -191 239 -210 -803 -106 51 -42 -177 219 288 -310 -232 111 8
2221 8 -652 -271 44 -308 -112 251 253 57 -299 -283 -393 -452 -579 11 54 -81 -98 451 -5 -585 -259 119 -186
2244 -186 -859 -412 48 -261 -289 148 217 -587 -798 202 76 -639 -439 398 241 -183 -227 563 -26 -617 -230
2265 -230 71 -273 -450 360 958 183 -130 152 69 -726 -235 235 438 -362 46 861 431 350 303 555 141
2286 141 -623 121 201 112 61 446 843 163 164 367 491 -470 71 386 297 -411 340 834 239 144 114 342 -287
2309 -287 -506 415 462 37 -74 537 440 91 344 631 480 -629 -201 552 135 -31 697 872 54 -612
2329 -612 221 214 -320 -689 -37 373 -171 -212 582 519 -429 -215 270 -207 -857 -133 281 39 -110 210 226 -273
2351 -273 47 -303 -101 -352 -73 151 195 -16 239 423 288 -163 -208 63 -378 -310 -98 305 -88 -99 97
2372 97 315 -373 -543 -387 -418 -207 -326 431 -68 211 272 324 184 -514 -101 147 -184 -225 124 385 271 -37
2394 -37 252 137 -52 -70 -115 -133 -140 179 340 427 250 244 152 98 -329 -340 183 36 229 -54 605 334 -75 119
2418 119 276 23 -272 -97 122 235 293 377 367 -1 -189 -40 101 -67 133 386 273 47 -43 88 252
2439 252 -159 -51 -345 -2 -45 318 31 -194 87 131 216 -92 -235 -401 34 -349 -100 -158 102 12 6 152
2461 152 -631 -645 -287 -446 -142 -309 -332 -76 -280 -411 53 -121 -307 -421 -311 -369 -556 -367 28 -140 -210
2482 -210 -568 -405 -534 -556 -316 -372 -155 -459 -398 -307 -417 -427 -115 -481 -382 -100 -286 -135 -192 -421 -351 -395 -149
2505 -149 -405 -437 -59 -76 -31 -327 -260 -221 -102 153 -137 -73 -199 -141 82 351 16 -144 -402 -364 -49 -251 -98
2528 -98 249 -75 -191 127 228 194 61 -77 189 137 50 55 227 30 293 186 -66 -181 133 -2 186 147
2550 147 374 -228 76 470 220 414 -32 269 219 -85 380 337 377 89 298 455 241 109 185 513 107
2571 107 92 301 383 236 302 562 571 141 -43 169 374 60 37 567 512 23 422 61 -75 -52 32 -159 -287
2594 -287 18 358 516 36 215 208 -113 -165 -175 -177 7 -30 386 218 269 -150 223 226 -184 -28 18 90 -221 57
2618 57 348 369 -185 149 94 11 -151 -80 88 194 -49 285 325 195 -87 226 -279 -273 -194 77 499 -70 185
2641 185 428 166 -318 -5 -158 -63 -572 -38 402 248 6 358 241 -17 -282 -303 -68 174 43 -153 167
2662 167 324 317 159 172 -209 29 167 -352 -155 90 330 228 197 230 -49 8 -123 192 -135 21 -12 117
2684 117 249 231 39 493 271 55 134 -150 -412 -30 -111 228 331 90 -24 -69 -423 89 164 14 -130 -77
2706 -77 -106 42 53 133 2 -285 -369 -199 -260 -157 -73 205 175 -140 -246 10 77 -213 -126 -350 -182 -317 -290 34
2730 34 -149 83 -50 -274 -517 -382 -617 -137 -369 -384 -501 -118 -191 -341 -286 -283 -533 -375 -52 -156 -335 -461
2752 -461 -71 -144 -323 -399 -275 -536 -435 -128 -377 -289 -519 -292 -251 -197 -154 -267 113 -389 -181 -323 -26 -149
2774 -149 154 -347 -415 131 -435 94 -160 -292 88 -146 -144 -160 10 -220 -131 61 -149 1 18 27 204 -340 -254
2797 -254 -100 -79 342 182 319 5 -90 49 103 631 283 -23 252 49 207 224 202 274 106 141 -13 -94 206
2820 206 372 24 177 29 415 220 294 252 275 49 -42 76 -84 -4 -118 235 204 174 43 71 178 57 -65
2843 -65 138 122 -5 12 69 86 -2 37 55 -167 55 -37 7 255 131 -117 40 -261 101 258 4 361 32
2866 32 171 -40 -103 253 156 -225 42 -102 24 -67 62 65 125 271 112 -109 -38 -136 46 -115 -151 191 -13
2889 -13 -243 195 -84 -176 144 -191 -98 -27 -204 70 -42 318 -27 189 280 189 146 -252 5 89 169 258 277 247
2913 247 74 319 -124 -42 -59 63 -37 179 -82 355 239 -11 311 400 -22 403 161 35 262 206 201 322
2935 322 386 432 185 270 206 264 446 81 564 226 1 -167 153 46 42 258 67 307 181 120 -14 110 100
2958 100 79 387 210 6 -36 16 90 351 153 -29 49 -57 217 10 -221 38 -176 -137 327 -378 -70 60
2980 60 -58 -13 294 -165 143 -491 135 -80 206 256 48 -119 -127 -122 -172 186 -196 -276 -349 -83 58 -129 -233
3003 -233 -400 -150 46 -375 -300 -163 -15 -339 176 -65 -98 -423 -313 -365 -304 -553 -147 -2 -121 -131 -11 -89
3025 -89 -111 -458 -460 -244 -194 -179 -90 -117 -26 -112 87 -53 -11 -216 -236 9 -453 48 18 107 171 240 -207 -51 -102 -7
3051 -7 -253 -333 150 362 -140 236 -115 3 272 -251 146 90 252 99 -27 260 -27 -94 -39 175 -121 -210
3073 -210 -145 -140 -90 -22 53 -18 41 153 357 71 61 128 349 52 286 35 178 275 -20 -130 113 147 150 105 92
3098 92 125 162 294 -76 89 101 256 -211 -286 -36 -63 233 63 -50 163 123 41 15 -231 157 -26 139 -121
3121 -121 -39 -49 252 -131 59 -94 -410 164 -196 -32 102 -411 -155 -5 -132 -68 -156 167 -345 -233 -239 -159
3143 -159 -93 129 -27 -143 123 -269 20 -128 144 -265 -64 -16 -118 -310 -48 -121 -10 -7 -352 228 -194 -196
3165 -196 129 342 -99 -64 54 291 -31 62 313 167 -210 105 -10 27 240 101 -42 -52 -71 -43 -109 107
3187 107 146 -156 277 77 92 32 187 51 -35 197 129 -122 287 228 67 156 -36 55 -2 -81 95 29 242 328
3211 328 -96 139 297 28 86 -130 389 35 -29 59 -41 69 87 -194 111 169 59 152 55 37 78 139 -173
3234 -173 58 -33 -26 -119 143 -79 -112 -45 -298 -164 29 218 -27 219 352 -102 17 6 93 -193 11 64 -93
3257 -93 -71 195 -74 39 -362 -72 47 -16 -319 6 -393 -74 -553 -45 -170 -161 123 33 -46 -145 -313 -86 -79
3280 -79 -275 121 -126 100 9 -8 -216 -151 -139 -126 -36 283 -99 -14 -104 46 -11 -111 138 112 -60 -121 83 -65
3304 -65 284 -4 -140 64 84 -29 -421 -15 343 -346 -179 -24 202 28 124 150 314 -110 -279 305 169
3325 169 289 123 280 86 150 127 130 6 -64 -190 33 7 272 175 72 -128 -224 -14 -59 296 -11 178 260
3348 260 -89 -25 143 67 -25 244 101 -30 155 377 106 105 -43 166 -67 354 -144 -140 316 -57 143 24
3370 24 5 23 -145 -58 48 -47 -144 -254 -221 -108 84 -140 114 233 -257 52 -253 -127 -139 159 73 -183 20
3393 20 29 -204 -333 -410 -146 -245 -210 -195 -53 44 -41 -337 -110 -278 -29 -18 -44 -393 -314 -303 80 -247 160 -90
3417 -90 -66 -48 -146 -238 77 -95 -213 17 55 -451 26 -183 247 -101 305 198 -105 -229 108 153 -25 27 12
3440 12 -12 30 207 130 -213 76 188 127 26 6 204 -70 -182 -27 -38 85 18 63 -12 123 -159 -54 -51 171
3464 171 280 74 15 -121 262 -1 -6 -15 -2 72 47 122 68 13 94 8 49 218 113 65 131 146 123 53 284 -130
3490 -130 -143 173 -63 136 214 41 16 -177 -102 149 -102 147 -206 96 -13 -139 81 -10 141 114 -113 -38
3512 -38 -122 -138 -53 101 -33 -357 3 -147 -11 -283 53 38 -201 77 43 29 -59 -172 -220 -209 116 -234 -222 -142
3536 -142 50 -103 -146 31 6 -353 263 -129 165 90 44 37 90 -87 131 69 -164 143 -93 93 198 40 108
3559 108 -62 39 -59 -62 150 66 91 -132 -65 42 -88 -301 74 -75 -89 250 202 3 -29 185 459 45 71
3582 71 335 -190 -110 160 103 157 332 171 367 64 134 123 12 -37 -111 27 382 191 25 231 13 -63 121
3605 121 171 -115 140 -9 4 -107 176 80 -62 -79 -75 -158 151 215 119 -31 29 -221 -84 45 2 -119 67 82
3629 82 240 -116 219 -141 -340 231 -6 -25 41 282 70 -149 -137 70 96 21 -48 -149 -91 -322 -230 47 18
3652 18 113 -161 -81 -138 108 -38 -52 -136 7 -334 7 60 -152 119 206 -14 45 -67 7 -244 278 -17 -117
3675 -117 -42 52 -144 -186 3 -80 -172 222 -89 -14 -38 -43 -139 107 229 6 233 -147 265 50 101 -292 -120 201
3699 201 -53 66 -29 235 13 -157 -224 33 -35 222 -40 116 142 -275 89 -124 -85 155 115 27 6 323 -134
3722 -134 -71 -19 52 42 -90 256 154 -59 144 59 138 220 -303 15 -239 174 -53 37 -166 -75 152 -133 76
3745 76 65 -221 -74 50 188 187 135 -118 -36 -106 -135 -23 -149 -61 -217 93 -31 -70 1 -62 -60 -34 191 33 -8
3770 -8 -2 111 -238 -355 -144 -50 -257 -11 56 -183 -71 59 55 -265 -226 -77 -340 78 -166 156 183 -264 -310 65
3794 65 52 44 169 -189 50 -95 -335 -172 -225 210 -45 -260 -157 -127 287 267 9 -65 136 168 -212 -103 22
3817 22 -80 -293 -69 -157 22 -142 23 80 128 -60 172 -141 -152 366 63 -124 308 -218 269 127 99 131
3839 131 228 -48 114 9 120 488 -61 117 203 44 -154 -57 488 172 167 34 -71 -163 -5 -48 289 166
3861 166 0 29 269 310 2 -7 54 283 -55 -114 -74 -48 142 -119 -123 172 81 55 21 48 70 87 166 -187 162 70
3887 70 -228 -195 73 -131 -133 -16 329 -93 -64 98 -117 204 -98 187 -122 -144 -82 -97 168 14 -351 -119 -160
3910 -160 -102 -123 -54 99 -74 28 0 -108 -166 -58 -114 -82 -87 -100 -104 -53 -280 -149 -72 75 117 -278 96 184 -22
3935 -22 97 271 -106 -3 -56 -61 -317 -18 -234 -175 165 135 -168 151 167 104 26 -85 20 86 -22 -107 -410 -83
3959 -83 -110 -256 97 69 -58 80 222 10 -56 35 232 1 201 -44 -117 -137 -236 35 86 226 -188 346 -2
3982 -2 -11 -104 41 -96 192 199 -102 13 67 13 164 -230 178 -211 -169 241 107 -31 -17 31 44 327 -46 181
4006 181 -202 -3 -214 91 -82 -129 127 -155 29 31 -90 -224 -31 -169 98 -189 184 161 -123 -160 -12 -116
4028 -116 -155 -76 -6 -185 -18 253 89 220 -94 -268 72 -132 69 10 79 -62 -41 -230 -128 51 -151 -104
4050 -104 -183 -131 158 -266 -161 125 -343 -383 20 -93 -101 2 143 210 -206 201 -40 162 -88 -165 -84 89 -144
4073 -144 82 186 47 -37 163 -177 158 18 -112 65 306 1 -186 -89 27 71 -109 45 38 -90 -22 -153
4095 -153 93 25 136 -128 195 187 -202 -158 -107 119 78 -75 202 -108 -58 172 217 34 93 359 485 97 -207
4118 -207 130 -50 98 332 48 123 88 -112 12 231 125 -78 227 144 -98 -41 228 -1 171 -107 7
4139 7 -131 -73 386 46 -218 419 -99 9 77 -255 189 12 -129 28 126 -156 -23 120 -169 158 59 30
4161 30 -71 -60 -227 -4 -55 -136 130 73 -45 -76 103 -23 271 -184 -54 -103 77 64 -143 -37 82 -70 -4
4184 -4 -24 -203 -43 72 -130 -47 -120 -171 52 -3 213 -163 27 13 -16 -226 -41 -48 -183 -126 181 127 34 -84 -120
4209 -120 -2 -98 -54 274 43 -16 37 -39 -24 182 2 58 127 -72 -118 71 160 138 22 -283 383 177 27 105
4233 105 185 10 -59 194 109 92 88 -49 511 -43 -163 60 189 68 108 -271 -153 -58 -93 32 116 -307 -37
4256 -37 -200 -79 163 -8 112 -42 328 -313 -10 -9 -115 -49 -49 47 -240 -253 -209 -56 -53 -8 -55 -17 -122 126 -154
4281 -154 156 -116 -131 214 -154 -60 -123 20 4 -33 -219 191 -192 -50 -79 37 45 -24 -210 -296 -436 -318 27
4304 27 -103 -88 -314 -69 132 148 -351 -32 -569 -186 -146 -194 -120 -218 37 2 -90 -42 74 -4 -99 -20 -258 -68
4328 -68 -330 -346 -2 18 -153 258 -51 -121 -21 -180 260 178 -210 150 7 139 -203 -134 10 -114 299 -31
4350 -31 -216 254 -55 255 -124 -25 35 17 -63 243 356 56 115 64 55 -121 141 253 302 48 174 13 38 321
4374 321 50 -143 -87 47 -71 190 -175 -101 67 28 -242 36 -167 -99 55 97 -124 91 27 -116 70 -175
4396 -175 119 214 -49 -15 -237 -90 14 -1 -183 -35 164 -177 120 0 14 8 -40 71 -287 -172 11 254
4418 254 -233 -521 19 -122 -133 -51 -206 -323 -455 -284 -225 47 115 -17 34 -72 9 -88 -235 84 -102 -76 112
4441 112 132 -189 -77 30 16 -56 -160 120 156 -49 -204 -89 -273 -107 53 -70 -47 381 255 -66 47 -131
4463 -131 219 -159 121 -257 224 87 -109 -156 248 108 -161 126 78 34 97 131 348 -241 191 150 22 149
4485 149 -16 163 96 135 -68 51 -75 163 -5 -59 86 -21 -156 98 26 -51 156 279 44 4 -111 11
4507 11 -92 85 14 12 -53 132 -97 -62 144 -130 -126 153 5 -1 294 53 139 251 -158 -110 134 230 -256 -292 -312
4532 -312 -27 -78 116 -84 24 -85 -97 -94 -306 70 29 -107 -119 -1 65 23 -252 307 -191 -167 -90 69 13 106
4556 106 72 -134 173 -197 43 77 -336 219 138 -21 -88 55 -98 64 227 -173 -320 35 89 -91 -40 3
4578 3 123 -59 -34 200 -199 -161 -15 -310 -106 111 178 -85 78 147 307 -306 -214 -184 44 162 207 -109 -84
4601 -84 -125 92 -34 224 -148 77 -19 -339 2 248 171 -149 52 135 -9 195 -161 -131 336 62 15 180
4623 180 265 65 181 240 83 0 432 201 -176 229 192 207 -24 72 -174 172 229 151 181 266 116 102 -88 -123
4647 -123 8 150 120 140 76 -97 -75 48 44 -13 38 118 50 96 121 54 -78 255 38 -24 204 -89 -235 -90 -125
4672 -125 -80 217 85 -68 -176 -1 -114 -237 -91 163 -62 -209 -214 80 -390 -8 -116 -184 -191 -153 53 1 87
4695 87 127 121 -100 -173 -122 31 -298 -175 55 -91 -28 -219 -9 -248 -103 -195 -77 364 -54 45 -309 -205 -204 -131
4719 -131 -300 1 165 27 106 -278 -55 -122 -94 -61 0 -50 103 -211 -26 31 -24 203 -12 8 -351 -117 71
4742 71 82 -210 317 -172 -59 -196 174 231 -114 5 169 297 288 111 25 2 -54 -21 199 -255 138 -166 150
4765 150 24 91 283 21 75 376 161 -122 294 -201 -87 310 -21 166 136 -25 111 248 -57 151 -12
4786 -12 -49 -159 -145 235 5 127 170 5 -123 -19 -157 -49 51 -75 -138 54 -159 40 62 -89 -185 -96 -158
4809 -158 -187 -166 143 -214 -144 6 157 37 -7 122 209 70 -77 202 -393 214 -193 -53 78 12 -278 -159
4831 -159 166 -101 249 126 15 351 236 -255 61 101 275 291 88 79 -130 -52 -74 -385 -118 33 55 -22 -66
4854 -66 -74 -90 271 -48 -209 69 -106 19 113 -38 370 92 250 -14 45 -5 67 -98 84 30 -22 250 -26
4877 -26 317 -4 -20 47 69 131 92 161 156 -139 42 231 -187 157 169 -233 -64 122 -22 157 107 51 -4 -87 172
4902 172 -123 36 86 -74 -194 253 -187 199 -1 8 -59 186 17 -347 330 -29 164 -96 110 215 -90
4923 -90 -52 -152 -279 127 -193 -70 -16 130 -98 22 -286 114 0 -146 21 -9 -72 58 40 -10 11 29 120
4946 120 125 27 13 -136 -183 -105 -30 100 -2 123 153 -143 -115 -187 -311 167 55 46 42 -59 -128 289 -241 -236 147 -2
4972 -2 -52 -96 213 26 -42 222 172 -178 -39 118 -249 -108 -29 197 -219 39 328 151 -47 258 -409 -74
4994 -74 82 -243 -83 223 15 61 56 9 -71 166 0 -175 114 -8 86 -166 171 201 150 -48 -118 265 -9
5017 -9 373 40 19 -307 157 123 123 6 100 -73 3 -215 -276 -111 129 121 -89 100 107 25 80 32 258 224 225 322 16
5044 16 86 -52 -171 -197 -249 29 -224 82 35 -170 90 108 -121 -34 96 16 219 78 119 33 -93 70 -263
5067 -263 -280 -137 10 -174 -86 -40 32 -20 58 -268 124 72 -382 -64 75 -92 -86 131 -105 -72 82 36 -138 -22
5091 -22 77 4 -116 -295 -281 -247 -171 -63 -90 -66 -167 -90 -54 -141 17 -83 325 -4 7 -67 -30 106 66 151 41
5116 41 -68 -109 -272 159 -82 3 -7 -171 -80 303 156 -40 9 -8 13 -4 6 -32 -19 -35 131 138 -123 114 -119
5141 -119 -36 24 2 0 -162 117 88 142 104 -34 23 -105 67 -32 45 -53 -8 -124 -68 111 -106 337 220 20 7
5166 7 -70 169 175 136 84 211 88 -158 -30 41 32 27 120 -117 213 -9 -222 54 -162 -83 -184 -34 181 -246 -66
5191 -66 -139 -132 114 -19 -178 -17 97 -49 -89 35 4 -122 -99 81 36 -92 -83 83 225 -206 101 -77 252
5214 252 -184 -193 -298 -197 -65 58 33 -38 -80 -8 -20 -259 39 -157 97 -166 52 -75 128 107 -342 -46 122
5237 122 166 24 274 222 -154 -144 106 148 -57 -74 22 163 -90 -355 20 64 180 178 -37 -110 33 -146 39
5260 39 43 124 256 163 -197 -32 6 -2 104 7 307 -51 -238 -140 154 114 -37 134 143 26 -112 139 -197 -204 49
5285 49 -161 19 29 -81 385 -81 149 179 88 -68 317 74 65 -184 -190 -268 249 -173 -59 -86 89 29 37 -32 -93
5310 -93 -36 72 92 72 73 122 -136 -267 -23 -25 -56 49 -287 33 -56 -11 71 141 165 -308 80 -21 -227 286 150
5335 150 2 151 -87 162 -125 148 134 34 117 -13 258 -42 -198 -20 -7 151 59 -255 -346 -9 -27 -237
5357 -237 -148 -170 -1 -100 -138 58 -26 373 40 -59 -147 -117 -161 -228 -49 -192 -162 -228 -20 269 67 102 74 -63 147
5382 147 -205 174 -18 195 -17 -278 -20 266 -260 113 -3 -175 -121 111 -52 -53 -298 -188 92 -111 -6
5403 -6 75 -185 -25 78 47 36 44 -26 -124 77 -87 5 -34 183 -92 45 189 99 98 -189 37 37 134 -15 274 298
5429 298 258 -130 220 28 -78 158 -20 -18 -214 -41 51 -71 67 199 -55 85 15 219 197 43 -81 19
5451 19 107 -192 -155 -46 -65 319 -58 -140 -140 -295 -87 -23 -113 31 14 -212 -159 -152 -79 -168 -110 -157 -156 -107 -195 102 1
5478 1 61 371 77 -89 -76 -90 -68 -312 291 -108 -116 -89 -5 -242 -158 33 -24 111 -42 185 65 151 -30 342
5502 342 56 -77 -235 270 61 252 299 -57 26 -39 216 51 60 123 -137 33 126 -74 4 297 -251 41 -166
5525 -166 -304 43 139 95 21 115 40 287 43 182 52 162 209 -215 0 65 237 89 248 -88 -70 76 -39
5548 -39 -162 -147 76 -95 -154 88 -88 -20 -177 -60 -106 -134 211 115 119 140 115 140 -242 50 -197 58 286 85
5572 85 -67 70 63 92 -16 -174 -178 -70 66 -90 -116 -81 -44 -100 176 -47 261 -133 -13 -77 -180 138 -63 246
5596 246 10 -127 -81 -557 -199 -110 334 -230 245 70 -38 110 97 -189 185 -115 -146 -32 19 50 -262 -115
5618 -115 -86 -62 -146 -157 -203 -128 -39 85 -25 116 -193 -30 -315 79 -188 -56 78 48 -131 41 -112 -61 145
5641 145 3 174 -159 251 69 -33 165 -222 102 128 -82 6 -33 -366 -41 -28 -146 -195 -65 53 12 3 -103
5664 -103 48 -205 213 480 136 137 -142 108 -184 4 -41 124 -49 143 293 -6 -311 120 -53 146 32
5685 32 -76 83 -202 76 -98 61 257 -4 62 38 -101 16 35 -8 -129 167 65 16 296 112 -109 253
5707 253 -47 133 88 -90 -63 125 -163 28 -36 12 56 -330 7 -223 17 -233 -1 238 -15 368 -141 177
5729 177 -72 126 24 117 -83 -42 -22 54 163 123 12 45 326 -23 29 14 -406 -61 -21 61 -46 183 -186
5752 -186 11 -86 -119 -104 187 -311 -21 33 -186 14 -48 -52 -122 114 157 244 4 14 -7 98 -93 251 -87 144
5776 144 -119 66 107 32 16 53 50 -268 -79 133 -20 17 -15 -43 -25 -18 -93 127 61 -360 -100 243 -60 126 226
5801 226 -90 3 -237 276 159 91 -156 30 335 -199 -2 -94 -186 45 226 -12 -11 -139 109 212 112 -78
5823 -78 -285 -19 59 89 -126 -67 139 -44 134 -31 35 -339 -313 -16 21 315 187 21 -103 64 -257 -244 -65
5846 -65 -152 1 -191 -131 -243 87 -131 -188 43 117 343 -37 79 -15 130 -17 -77 14 74 218 -75 32 33 257
5870 257 -64 -51 -268 9 60 330 -12 -221 -177 -13 -195 -10 176 -99 -126 178 139 -10 394 -125 184 187
5892 187 -61 -135 -68 -7 -153 -30 -18 42 -204 86 62 40 -94 -112 60 -32 3 -167 -1 -128 187 76 52 -278
5916 -278 207 -32 -111 -111 -2 -332 -165 25 77 -93 -112 128 210 -124 -83 94 1 45 25 175 -199 -32 181
5939 181 255 75 -72 259 -172 119 -199 239 -25 62 9 -4 -20 -130 88 -67 -161 39 -173 28 -75 61
5961 61 82 -17 -148 54 46 39 -111 -180 29 -150 -72 -320 127 -303 -83 163 26 -631 -155 -218 -68 -62 -23 141
5985 141 -213 139 -137 73 -319 -82 -155 45 82 -241 -98 144 -98 -92 69 144 -10 -11 50 -418 -13 85 -33
6008 -33 42 130 -23 -211 -23 -103 -13 35 -110 -382 -65 12 161 -106 -215 138 20 63 -231 -193 -185 127 -151 -102
6032 -102 57 -1 55 -196 -110 44 182 133 93 111 24 -78 -216 -120 66 211 3 -58 4 -134 131 -88 36
6055 36 277 -80 61 314 -219 131 8 436 77 -171 126 220 36 -12 206 153 104 265 109 140 -142 -17
6077 -17 -175 -75 29 -88 -47 -138 -44 59 -87 -283 134 43 72 -158 -251 -141 -122 120 2 -228 127 -180 -157
6100 -157 -144 144 -154 67 143 -73 -128 350 253 98 -180 -9 106 -65 129 -59 43 -30 -186 275 -177 204
6122 204 58 -156 119 161 -203 180 -79 -136 36 -236 161 -237 112 74 -103 -326 -79 -29 57 -81 -8 -227
6144 -227 -91 100 -302 223 61 168 288 130 34 -49 300 -48 -67 450 107 154 -71 58 -5 -383 135 -48
6166 -48 -10 98 -55 -175 -44 321 -139 229 -21 148 -109 -74 158 147 15 141 296 -127 -8 142 -34
6187 -34 55 -233 -73 42 255 96 -18 13 -57 186 37 32 95 43 -114 81 23 170 163 -64 136 -70 15 -242
6211 -242 -84 -68 -38 -27 -167 -183 -2 -10 88 -101 -25 0 35 253 97 -230 47 280 -71 137 -374 -171 299
6234 299 122 73 -390 60 -117 44 -33 -32 -384 131 60 89 169 43 -13 -157 -313 -192 -329 -97 4 -20 436
6257 436 141 250 6 -267 131 -17 -117 -197 89 217 163 -101 -122 224 22 -76 51 172 161 -93 69 45
6279 45 116 -250 -207 53 -66 133 -235 176 -142 69 33 23 223 47 329 -120 -136 -175 89 -49 -211 139
6301 139 165 5 -175 -45 46 -272 -88 -256 273 23 158 -379 5 -23 -121 -84 -89 -61 -15 49 -148 224 -68
6324 -68 -18 -330 234 -5 110 181 -93 13 109 305 78 11 -232 86 -301 -145 166 -159 -362 70 -359 -15
6346 -15 -127 154 159 206 -190 97 193 -251 -136 -77 297 -34 -85 -350 -250 14 94 17 -279 12 -141 -95 -229
6369 -229 -9 2 128 177 -27 -148 54 -140 130 128 -89 170 -121 82 -126 69 -157 303 -286 -212 -106 -166
6391 -166 14 89 97 -112 -214 -73 -237 -152 -257 33 210 -433 -8 286 282 -104 -58 124 170 121 -334 192 225
6414 225 43 -248 -225 -171 -200 -194 -12 -384 45 188 217 -205 -45 -61 -186 357 -355 29 -25 152 -65 216 89
6437 89 261 181 -113 185 49 -89 -43 50 104 -38 34 -28 32 -166 118 231 -55 296 -206 -74 -74 -196 -83
6460 -83 -3 182 14 111 -34 90 -198 -282 106 -11 -227 74 -33 57 -126 290 -87 -71 163 -52 186 94
6482 94 -46 21 -81 78 40 45 -137 50 -68 -42 -141 -48 -184 125 190 102 -146 -12 -252 -72 -347 -88 3 -207
6506 -207 159 -126 -26 -24 -157 29 121 -215 267 -225 47 -364 25 256 -132 229 -101 58 152 34 295
6527 295 141 13 106 -361 255 -86 -106 19 153 122 -65 66 267 -99 2 28 305 -110 150 -161 229
6548 229 69 130 -289 184 -36 -119 119 -56 -112 125 -26 -98 -72 31 -220 119 -6 93 237 -129 -121 122 309
6571 309 185 311 -123 -80 170 -66 -372 -91 -6 57 135 -58 82 73 23 146 38 -57 47 295 61 -182 194
6594 194 -81 61 -93 40 74 8 -63 -168 109 -250 1 192 95 64 169 -85 132 -3 8 -61 138 84 135
6617 135 42 59 162 30 -5 166 102 78 372 -103 30 -139 -112 19 30 94 8 251 -27 222 -98 182 68
6640 68 -127 140 58 165 -116 138 -21 46 11 -64 -309 57 -133 -105 98 -70 -236 201 -239 7 -46 -159
6662 -159 -83 -467 -131 98 133 -22 -114 21 118 -95 259 -208 187 84 -40 -181 -167 51 213 36 66 120
6684 120 160 -102 51 206 -142 -222 -41 -40 374 117 -224 130 48 278 70 0 131 173 -176 131 -82 125
6706 125 119 73 -90 105 -38 286 164 -35 -22 58 -121 110 207 -151 -37 -180 31 -13 -53 -196 -110 -110 229 40
6730 40 -278 17 218 78 -110 120 -177 190 50 -187 -202 -111 9 -48 -61 91 150 -115 33 92 -141 -20
6752 -20 220 422 -153 -40 35 -158 131 236 -32 -146 235 -26 228 -78 68 -128 -78 -215 14 138 -54
6773 -54 -244 257 -15 216 -29 82 209 132 162 -80 158 79 -105 -372 -1 172 -31 103 -51 -159 -180 58
6795 58 -4 71 150 -225 -224 -152 26 92 -261 -103 -10 239 5 227 242 -114 -152 10 75 -21 283 19 -214 -17
6819 -17 36 72 60 -14 220 -165 -26 65 470 -283 68 379 -2 -119 -110 32 234 88 -111 114 195 139 -54
6842 -54 -24 131 130 -40 -77 -162 207 -43 -123 15 -185 -19 38 67 -157 24 -68 -69 -191 0 -115 -52 50 -16 31
6867 31 392 -68 30 79 72 -113 -27 9 51 168 160 -173 118 -141 -148 386 16 -96 -137 -127 22 173 84 171 168 39
6893 39 -12 -56 -42 59 -188 54 -102 -289 107 -180 -116 -361 -150 -18 65 -136 -172 -11 -131 67 169 -240
6915 -240 303 29 -154 -90 -84 -19 105 -225 23 177 303 39 73 -105 -160 -125 -158 14 -216 -98 73 50 51 122
6939 122 -107 200 84 132 14 -187 -119 181 15 -231 -66 -46 24 94 -168 -60 -137 7 89 -161 -21 -28 7
6962 7 166 82 71 -110 -321 -214 86 -158 -80 -81 -65 130 290 -43 104 -94 290 13 229 -23 53 188 251
6985 251 -335 -219 162 -12 127 -227 -282 16 -22 81 -57 -29 174 148 343 -27 -236 70 153 -38 -226 -1
7007 -1 -20 60 101 -32 -82 66 17 92 34 -87 107 90 126 63 -369 -53 -5 59 -26 30 205 227 -244 8 135 -104
7033 -104 -129 -124 -86 -9 -66 138 -60 94 74 55 37 64 -168 82 330 -51 87 -146 -293 315 122 -133 -84 -91
7057 -91 -27 128 -91 -288 23 68 -373 -96 180 107 144 187 84 78 -26 92 45 -47 53 -304 196 -280 5
7080 5 169 45 182 62 91 -150 262 -12 -82 -156 136 -118 -149 -156 97 -22 -315 147 -33 78 35 68 359
7103 359 -21 160 29 -116 -170 85 -108 8 190 140 165 -53 139 -351 -1 -87 161 118 252 6 91 52
7125 52 -200 -120 253 -148 -62 -131 61 217 98 149 -42 39 -115 -7 -6 104 -110 2 -148 185 -361 -179 -77
7148 -77 -130 64 -189 -263 17 -90 133 147 94 58 -276 117 38 -1 -132 53 117 -163 73 -219 -229 -236 131 -165
7172 -165 69 -265 43 242 -6 -40 -53 -134 -35 -232 -85 -2 -59 -251 -54 -15 143 -39 167 -208 14 148
7194 148 -75 107 -6 -140 96 -408 -337 -109 151 -202 126 -139 -22 6 -28 229 -137 -153 -116 22 154 64
7216 64 237 -107 -105 -31 -95 -37 -123 23 93 271 100 -22 -256 -226 139 59 183 147 -88 126 82 171 -251 145
7240 145 -248 -10 157 346 193 -27 29 0 17 0 -70 -124 -59 88 98 -16 184 -26 59 184 -205 -1 -40
7263 -40 -74 -272 -20 -357 -75 -49 47 54 371 -50 -160 182 102 -23 47 -15 82 -188 -79 -67 -32 -149 -30 75
7287 75 -148 -21 108 66 277 32 263 260 25 15 -156 504 -433 86 -114 336 169 44 33 -178 -55 8
7309 8 -206 5 -269 207 117 108 -186 -250 90 -24 101 -83 156 -225 -113 127 39 4 62 37 -157 -90 -109 146
7333 146 2 -122 -171 -168 129 184 -6 335 97 -123 155 166 254 -36 1 26 -16 99 71 30 -72 -306 -4 -117
7357 -117 163 124 -46 -14 157 36 -104 55 76 -114 -110 -75 43 -15 47 205 6 15 -124 103 -264 -23 -10 310
7381 310 78 205 -80 145 146 67 -53 20 25 99 105 -100 54 56 -34 227 -156 -16 -40 12 -14 -38 -169 -89 -71 43
7407 43 28 90 73 -82 -110 -125 157 84 -129 73 -455 -59 26 -119 81 -55 369 -73 20 -56 -356 -136 -165 199
7431 199 203 157 -38 58 36 75 191 -95 53 48 84 -115 -322 -198 26 -36 257 89 -44 107 -260 -90 181
7454 181 -141 -79 40 94 -262 -84 63 75 116 -76 32 -19 -89 78 153 157 -16 26 22 279 159 169 23 -104
7478 -104 -328 -32 20 32 210 152 -118 -40 186 -144 43 -265 94 283 144 -42 21 -87 15 157 -51 -132
7500 -132 -23 17 -26 276 -12 -111 -356 21 125 111 31 -61 81 38 112 188 -354 61 113 117 209 160 -166 101 125
7525 125 -165 93 98 -126 154 21 -39 19 33 166 162 -129 -142 -169 -39 -188 182 -45 62 -174 134 43 -144
7548 -144 -187 -7 -107 -250 39 -42 -135 134 210 -14 -80 267 -150 -156 -21 -7 292 49 -26 77 26 -70 -78 -209
7572 -209 30 -107 123 -255 88 228 103 -166 131 51 -41 137 -7 -122 -195 1 176 -502 -30 135 -133
7593 -133 78 -1 71 4 -51 65 3 -58 -185 -66 189 151 -265 -198 155 -72 102 65 -220 52 -115 94 -212
7616 -212 -156 14 25 3 -261 391 109 -144 -275 46 -174 -133 -230 87 -109 20 -74 -60 -266 -106 -133 49 -71
7639 -71 -86 49 -2 -286 -108 -98 55 134 -124 -69 265 -299 95 -24 -186 45 97 101 -161 -198 6 -169 -46
7662 -46 27 -295 -278 52 110 -66 -234 89 231 -208 -294 -168 -126 77 251 125 37 -219 -56 -22 -309 -58 -256
7685 -256 -169 -22 -133 -304 69 -140 66 27 100 -83 -98 -3 -288 64 95 -117 -46 169 -84 -38 47 432 -158
7708 -158 -10 -476 55 -56 105 252 -56 182 165 -60 -57 196 -14 186 136 -148 -46 -42 -47 49 56 62 20 -141 -107
7733 -107 58 -70 -8 241 209 -111 248 234 22 4 176 35 -157 112 40 298 49 74 35 82 -174 103 -71
7756 -71 -36 61 48 -140 8 189 18 184 278 176 0 143 40 -49 288 24 177 -13 110 87 -70 45
7778 45 242 229 -146 34 -70 -117 79 118 152 83 -296 144 -186 -179 141 -128 -96 -54 -72 -267 -88 92 -355 -383
7802 -383 35 140 93 -48 86 -256 -15 79 -82 -122 291 149 130 274 -212 181 194 -378 -370 -424 38 -109 145
7825 145 -100 -54 -157 -29 48 -80 30 -159 221 -229 63 -104 -225 -262 135 -33 299 -192 -13 -56 7 198
7847 198 264 310 134 57 -13 -84 39 -338 -42 -60 44 87 -42 -129 174 137 -160 66 -8 9 116 -133 85 90
7871 90 -32 -204 124 189 -103 209 103 5 -210 2 -74 -108 -44 180 198 63 115 -224 128 16 -234 21 15
7894 15 -168 70 -201 100 220 -182 77 120 120 -406 150 -208 -188 139 -310 -47 -63 -158 -126 18 -133 -119 28
7917 28 -11 43 72 76 36 -124 59 -154 86 1 -74 135 -41 -151 -82 47 4 54 339 -65 59 -367 -262 -21
7941 -21 -209 -72 -239 -20 -135 8 -260 34 -36 -213 147 -62 67 -29 -48 108 -76 45 -181 -31 19 327
7963 327 299 40 109 -279 4 5 8 -171 59 163 -160 91 121 -65 -8 -260 204 182 -159 83 -101 159 208
7986 208 -53 62 -97 -245 -91 -81 -128 -167 233 207 -181 -145 -1 -102 102 185 156 275 117 -240 -104 444
8008 444 96 151 -140 -131 -264 73 120 -187 -79 2 -10 74 -208 -51 -125 -45 -16 97 -57 -120 -254 -70 -226 -3
8032 -3 144 137 120 -20 -39 235 -60 184 157 -228 -232 -166 28 -344 82 75 161 -80 301 -259 -243 125 176 122 -114
8057 -114 96 161 -55 191 -118 -126 87 242 -46 -38 -244 205 -259 -169 301 8 214 66 151 168 45 -86 312
8080 312 -93 -11 -62 -81 -24 27 185 114 -67 100 192 356 69 -34 382 -42 103 -163 -73 237 82 -399 -64
8103 -64 67 -91 179 64 -146 230 176 -150 150 -39 -176 -160 131 186 -114 120 161 -172 -190 -111 12 -28 -116
8126 -116 -58 108 112 105 18 160 13 93 -261 -285 130 150 250 87 95 -61 -148 -103 196 -55 -166 -73 147 188 -48
8151 -48 223 147 -26 -216 -85 -139 49 182 70 -171 106 134 -15 17 -163 190 115 79 -139 -6 142 63 -96
8174 -96 187 85 77 21 10 83 -182 -82 -202 -24 130 4 11 59 -106 -150 -226
8191b26
$$ Imaginary data points
##PAGE= N=2
##DATA TABLE= (X++(I..I)), XYDATA
0 0 0 0 0 0 8 0 8 -8 8 -15 16 -16 24 -32 39 -47 55 -64 77 -88 104 -120 141 -160 185 -213 244 -276 313
29 313 -356 398 -446 501 -560 625 -698 774 -861 955 -1057 1173 -1300 1438 -1592 1762 -1957
46 -1957 2175 -2421 2707 -3040 3433 -3906 4486 -5218 6180 -7501 9439 -12574 18490 -33630
60 -33630 153576 250406 -120171 -162299 25468 164296 104066 99516 91091 -15447 -116056
71 -116056 -6048 148510 175272 124171 101975 12832 -105144 -80093 88926 170262 126350
82 126350 82448 45303 -49593 -64579 89705 218816 138278 2618 -21283 -13862 -32548 55487
94 55487 215467 201822 3375 -94282 -15108 30230 -291 64682 184593 137205 -45781
105 -45781 -107323 -1310 102248 132249 124191 49593 -79463 -115103 -1946 111950 128646
116 128646 118009 97871 -1742 -112328 -77568 61052 118390 72177 30923 -4988 -74162
127 -74162 -78858 49119 162147 117533 245 -57394 -76237 -82057 -6521 124812 147943 25543
139 25543 -76366 -63064 -18752 2264 46706 92896 49020 -60187 -106096 -54010 21671 71817
151 71817 86555 33357 -74599 -130417 -70558 26875 68994 58258 24746 -35911 -93562 -77340
163 -77340 6760 64531 47214 -6376 -57528 -92413 -76182 7189 84449 71121 -10147 -74918
175 -74918 -95422 -84369 -32167 45887 70832 1582 -85092 -98076 -49117 1620 35707 46186
187 46186 3434 -78366 -119041 -73553 3516 46094 45631 8336 -60224 -112389 -86893 -5055
199 -5055 47666 34597 -11649 -61636 -98077 -84254 -12926 48842 38400 -20736 -68559 -88550
211 -88550 -77827 -21022 50816 59297 -11245 -80134 -89804 -62857 -25680 22758 49736 6649
223 6649 -72214 -99131 -55684 -2122 25816 30716 203 -65443 -106170 -71155 786 39838
235 39838 33260 274 -50239 -90856 -73311 -6213 42056 33254 -7005 -48929 -77345 -65983
247 -65983 -7368 47508 39743 -13759 -57878 -72403 -59327 -12344 45303 55729 1315 -59463
259 -59463 -75182 -50561 -10881 31006 47376 10755 -48123 -68624 -37088 8878 38859 41203
271 41203 7850 -47248 -76557 -48416 8789 47895 49581 19288 -29640 -63351 -48672 4274
283 4274 44212 41066 6846 -30736 -49617 -32990 15004 56415 53573 10539 -35834 -55551 -37859
296 -37859 7205 51055 60364 27325 -20529 -44385 -28442 11976 45569 47137 16023 -25000
308 -25000 -43052 -21596 25859 62493 59726 21196 -23182 -44920 -31955 10073 51624 60136
320 60136 30080 -9987 -27847 -15632 17410 49859 53028 18101 -26044 -38726 -12921 27857
332 27857 58982 64514 34677 -13836 -40549 -23868 15075 44059 50275 32050 -3233 -26801
344 -26801 -11755 28840 54305 46184 16788 -17340 -38137 -24446 23160 62486 60886 29253
356 29253 -4245 -25321 -23891 7020 43826 47413 16268 -13103 -18651 -6238 20100 50474 56142
369 56142 19392 -27078 -40711 -20004 11785 40547 53624 34547 -7307 -29882 -14760 14204
381 14204 31380 33450 17115 -13910 -33553 -15174 25295 48612 42436 18197 -14371 -40079
393 -40079 -33406 5349 39014 39730 18259 -5490 -21220 -19791 5407 33972 32610 2961 -24952
406 -24952 -30571 -17221 10574 41204 48053 19906 -19454 -36476 -26546 -2389 21219 31424 15911
419 15911 -13242 -27487 -13823 11612 28387 26998 5770 -24806 -41292 -26857 6661 32584
431 32584 35259 17503 -10460 -31012 -26425 -946 21973 23464 5544 -16571 -27612 -18494 7191
444 7191 29551 28535 3597 -24762 -37348 -27462 -1635 24187 31057 13911 -14116 -29294 -23048
457 -23048 -1722 17449 19779 3722 -19044 -29816 -18351 6824 27633 26998 5455 -21830 -37355
470 -37355 -30034 -6025 17662 23695 8090 -14204 -26085 -20215 -1358 15705 17841 101 -23113
483 -23113 -33026 -22567 1485 22109 26102 8491 -17975 -32579 -24778 -4429 12732 16385 4755
496 4755 -15168 -28869 -22382 -873 16282 15769 -126 -19780 -31105 -24619 -1694 19127 21282
509 21282 3742 -16735 -27439 -23566 -6838 13072 18946 4680 -16439 -25700 -17126 -348 13492
522 13492 15237 1290 -19765 -30467 -21794 -2261 14665 18841 7776 -13118 -26852 -21053 -1520
535 -1520 13367 14090 2657 -12802 -22814 -18041 787 17377 17375 3243 -13758 -23726 -19641 -2608
549 -2608 16357 18970 3919 -14363 -21198 -16462 -2988 12900 18843 7275 -11771 -19952 -12479
562 -12479 1892 14387 17852 6280 -13676 -23013 -13098 3886 15493 17905 10645 -6049 -20747
575 -20747 -17851 451 14149 13765 4483 -7074 -15790 -12699 4547 19472 17499 4147 -8552
588 -8552 -15912 -14983 -931 17527 22581 8609 -7920 -13587 -10136 -1168 11329 15770 5701 -8748
602 -8748 -13897 -7393 2485 12869 18458 8186 -11068 -20551 -11810 3265 13785 16909 11931 -2486
616 -2486 -14218 -10642 2589 10248 9406 3749 -6621 -15158 -10259 6731 18196 15102 4929 -5793
630 -5793 -16249 -17862 -4499 12745 15760 6294 -3563 -8386 -7971 1547 13625 13222 -1057 -12548
644 -12548 -12046 -7267 308 12031 19417 10279 -6913 -15114 -11794 -4221 5598 12888 8340 -6454
658 -6454 -11826 -4075 6288 10138 10212 3819 -9482 -17290 -9082 5778 12774 13292 11234 2051 -11662
673 -11662 -13459 -1242 8169 6938 3656 -931 -8156 -8281 6514 20418 14088 -1374 -8955 -10191
687 -10191 -10506 -3122 12625 18013 8182 -269 -1011 -2745 -3920 5485 14139 5396 -9941 -10348 -369
702 -369 6696 12409 18227 11326 -7980 -16190 -5158 4977 5140 8038 12499 5393 -6541 -3920 7207
717 7207 9876 5202 4615 149 -11080 -10985 7728 20928 14335 4082 641 -5302 -11325 -3647 10938
732 10938 11038 457 -921 3121 692 -638 9655 14878 2482 -10478 -8701 -2742 -1075 7534
746 7534 19217 14147 -5225 -11194 -1192 3370 392 2991 6490 -1679 -9447 -1554 9673 8167
760 8167 4641 5860 371 -13861 -14901 1654 12118 7689 2864 2805 -2786 -9133 -2128 8811 5547
775 5547 -4544 -5722 -2616 -4645 -1986 10105 13245 1305 -8984 -7359 -5124 -6214 207 10442
789 10442 7874 -4688 -7831 -1598 2046 1133 3540 2394 -7159 -12584 -4685 4981 5678 3815 4493
804 4493 293 -9726 -11868 -1567 5644 3107 -285 -578 -3595 -6501 -295 7743 5228 -3501 -6276
819 -6276 -5562 -6781 -4070 5687 10566 2709 -6947 -6584 -2587 -2307 -811 3758 3216 -4079 -7600 -3099
835 -3099 1834 2785 3517 2679 -4330 -11059 -7390 1580 4804 2437 1005 -746 -5615 -8010 -2399 4114
851 4114 2738 -1711 -3500 -4338 -5645 -2004 5231 5605 -1872 -6665 -5101 -4567 -4340 988 6743 2574
867 2574 -6642 -8023 -3129 -1015 -817 1530 1448 -4575 -8456 -3920 1275 773 166 1252 -2502 -9653
883 -9653 -9191 247 4510 568 -1717 -1622 -5248 -8218 -3354 3255 1423 -4011 -4629 -3251 -5241 -4160
899 -4160 3016 4834 -2903 -8156 -6144 -3375 -3949 -912 4628 2579 -5236 -7417 -3040 -1524 -1570 566
915 566 872 -4562 -7495 -2450 2115 1917 457 819 -2550 -8516 -7208 -498 2814 1230 1005 559 -3084
932 -3084 -4762 -410 3595 748 -3298 -2293 -2004 -3282 -316 5902 6498 515 -3792 -3327 -2817 -2331
948 -2331 1645 4549 2830 -1251 -1027 1109 1631 2013 3224 1713 -3100 -4083 -255 3772 5166 6129
964 6129 4636 359 -3043 -2261 1369 2295 2644 2955 2020 146 1220 4926 5465 3195 968 -1314 -2914
981 -2914 -1610 3237 6292 6779 5207 3156 301 -737 1542 3233 2306 688 1079 1824 1934 4288
997 4288 7341 6045 1245 -1874 -1470 -1197 -245 3842 7477 5203 1200 1454 2459 1905 1414 3063 1886
1014 1886 -1820 -1405 2595 4927 5161 5434 4240 -938 -4361 -2010 1443 1343 2115 4030 3715 70
1030 70 85 4338 4299 -343 -1695 -175 -1336 -2643 2407 7727 5700 1382 209 582 -2586 -3159 1613
1047 1613 3304 136 -1062 1689 2941 1696 2595 3847 148 -5059 -3562 307 943 1253 4911 5315
1063 5315 220 -2797 368 2141 -958 -1406 1158 711 -2451 -681 4665 4988 490 -938 -290 -2828
1079 -2828 -4770 -431 3772 2665 271 930 1517 -642 -1219 1361 874 -2774 -3155 -253 1060 515
1095 515 3093 4448 815 -3471 -2753 -1015 -1831 -1507 1687 2184 -1229 -2098 1406 2231 -664 -1787 -364
1112 -364 -2093 -4672 -2543 1850 2919 664 -166 -222 -2283 -4283 -1701 840 -388 -2612 -1502 -684
1128 -684 -1481 -877 847 282 -2744 -4550 -3587 -2198 -1644 93 1360 -307 -2746 -2582 -1306 -1994 -2406
1145 -2406 -1170 -1208 -2961 -3356 -1294 682 -271 -1587 -1580 -3095 -4790 -3697 -1386 111 -970 -1854 -1483
1162 -1483 -2455 -2950 -1531 -519 -1344 -2746 -2831 -2472 -1917 -1106 298 186 -2082 -3262 -3072 -2403 -1848 -689
1180 -689 -79 -1295 -2765 -2446 -1164 -770 -1036 -652 -679 -2030 -2726 -1280 434 698 -491 -921 -1513 -2561
1198 -2561 -2228 -115 882 472 -748 -1141 -1061 -825 -50 488 94 -738 -1478 -838 -208 719 1178 1162 -5
1217 -5 -1533 -1339 -584 699 1327 1322 485 -424 -214 356 826 715 630 81 -289 -437 711 1543 2279 1803 306
1238 306 -592 -875 -122 844 1576 1824 1321 522 421 1093 1408 1024 512 -141 -586 -528 754 2345 2383 1932
1258 1932 1028 335 -956 -1082 591 1280 1193 574 986 763 1109 1318 1594 627 -777 -1033 -365 128 956
1277 956 2552 2690 1045 -623 -180 428 -166 86 860 699 -75 634 1440 1949 1285 706 262 -1340 -1803
1296 -1803 -156 1709 1758 1518 1681 1441 97 -388 322 571 -85 -464 453 789 790 2362 2731 1766 -669
1315 -669 -1141 -585 -562 -121 1431 2576 1156 800 1230 1446 889 310 257 -186 -930 -166 1742 2556 2514 2237
1335 2237 2003 333 -1101 -526 652 974 937 1280 1430 1382 1953 2304 1577 188 -342 -395 -318 594 1579 2931
1355 2931 2656 1704 688 699 162 224 421 482 502 445 1297 1872 2390 2214 1038 -647 -1024 -1068 -31 901
1375 901 1615 1969 1467 1008 477 127 -74 -82 -64 -663 -495 -212 1703 1971 1902 1059 -521 -1226 -1134 -1088 -840
1396 -840 191 901 814 -284 -63 401 571 -766 -1451 -1101 -1353 -1619 -229 1317 1212 223 -239 -722 -2140
1415 -2140 -2407 -961 -171 -919 -988 -200 386 -555 -997 159 -677 -2568 -2547 -1407 -1112 -992 123 787 -665
1434 -665 -2088 -1265 -360 -1614 -2060 -1259 -671 -1567 -1536 157 647 -614 -1485 -1244 -1468 -2648 -1798 -11
1452 -11 -17 -576 -606 -227 -1346 -1808 -622 -364 -1214 -2502 -1464 33 -629 -80 691 151 -1723 -1717 -639 -967
1472 -967 -1498 -718 866 -915 -1790 -757 464 -475 -1271 -726 -142 -1676 -1975 134 987 1 -841 -191
1490 -191 -293 -1602 -1196 300 286 -913 -616 258 -257 -1258 -425 983 -243 -1741 -1093 134 -269 -555
1508 -555 520 664 -757 -1661 -497 323 -492 -807 404 586 -1139 -825 257 680 -400 -847 7 -656
1526 -656 -1639 -490 1116 449 -661 -208 -314 -1053 -827 192 824 -284 -702 213 234 -743 -459 1242
1544 1242 224 -1615 -1098 599 222 -553 618 1603 -208 -1770 -405 847 -281 -808 889 1085
1560 1085 -848 -785 1230 1483 -433 -562 717 332 -1314 110 2346 1324 104 248 1284 -412
1576 -412 -1117 1116 1731 114 -584 1387 1940 416 302 2115 1656 -764 -756 1294 1117 178 1340 2459
1594 2459 1198 -435 504 1603 618 -322 1474 1762 84 476 2388 2670 478 658 1501 176 -1016
1611 -1016 594 2617 1800 363 1940 2463 684 -38 1672 1764 -121 -650 1550 1790 179 1096 3460
1628 3460 1875 -744 -279 1186 563 -777 1023 2513 827 -109 1572 2140 364 -415 1086 323
1644 323 -1159 -959 1695 2035 591 803 1643 241 -1600 -459 677 -90 -825 701 1117 66 16
1661 16 1142 1109 -832 -1222 -464 -486 -881 13 1470 733 -401 -332 273 -1071 -1380 -3 6 -1101 -1300 336
1681 336 654 -310 -35 102 -768 -2338 -1354 -607 -355 -754 236 452 -771 -1297 -675 178 -1285 -1777 -888
1700 -888 -917 -1058 -468 749 667 -618 -999 -764 -1251 -1747 -826 39 -417 -646 9 52 -390 -405 -456 -978 -1337
1721 -1337 -1451 -635 -481 114 438 488 -520 -814 -918 -804 -909 -818 -419 -662 -717 -106 609 163 -604 -388
1741 -388 -933 -1478 -1011 -529 19 70 31 390 -176 -527 -474 -251 -290 -1058 -630 -255 -498 41 565 368 169
1762 169 -782 -970 -1061 -894 -398 408 307 -112 -684 -43 -241 -326 -337 -566 -548 -723 -282 152 257 -39 311
1783 311 -500 -937 -979 -657 -519 -309 -272 -321 -153 -427 -138 -61 -425 -556 -647 -646 -622 -309 489 229 -19 -104 -256
1806 -256 -429 -460 -256 159 -79 -174 -60 110 22 66 195 458 -105 -531 -214 300 473 412 496 257 -213 -209 232
1829 232 422 323 274 322 -176 -78 236 928 632 204 17 178 -95 250 1142 939 772 140 399 640 396
1850 396 374 762 771 643 250 557 597 536 1189 1211 387 193 555 977 741 870 846 1035 299 196 567 990
1872 990 664 720 803 702 212 693 1103 921 408 370 694 466 331 1187 1453 1067 529 725 775 273 224 837
1894 837 748 256 86 1066 964 351 531 695 -137 -601 183 725 641 258 780 595 19 -398 -73 213 -43
1915 -43 -263 69 -23 -199 -53 694 382 -274 -504 -543 -433 -972 111 346 -17 -14 -150 150 -295 -292 -175 -403
1937 -403 -573 -599 -208 -77 45 14 287 -532 -874 -945 -538 -552 -477 316 14 -587 -412 244 -235 -514 -555 -450
1959 -450 -586 -871 -442 203 554 -286 116 -299 -752 -731 -293 39 -362 -326 216 87 160 135 122 -467 -772 -814
1981 -814 -452 -478 -44 388 207 76 -143 -278 -187 -547 -253 -150 -228 -322 87 449 354 190 275 -506 -695 -740
2003 -740 -313 -101 -21 470 143 -48 176 -23 421 -215 -563 -460 -196 -36 150 456 452 127 -46 -648 -801
2024 -801 -507 -330 -84 -82 48 68 426 396 69 -91 -8 -621 -496 -230 108 331 487 500 -123 -54 -304 -679
2046 -679 -717 -459 -167 -319 -151 -59 207 59 257 -452 -507 -466 -620 -352 35 97 237 48 -107 -413 -735 -690
2068 -690 -381 -36 -454 -197 -53 308 207 57 -62 -202 -788 -667 -726 -468 11 347 11 8 -412 -101 -317
2089 -317 -271 -249 -313 -145 -243 27 489 454 268 15 -152 -317 -219 118 54 -125 1 292 484 -34 349 -24
2111 -24 -33 -206 -339 -155 139 145 403 514 539 198 -29 54 291 46 217 455 268 296 522 375 360 130 93
2134 93 -328 81 285 501 591 41 60 321 7 72 469 239 403 13 53 274 549 343 456 261 298 -7
2156 -7 192 196 173 327 316 -30 63 -27 14 -57 252 219 6 103 17 145 106 -65 -161 110 -69 -19 -133 259 -118
2181 -118 103 -88 -213 -142 -452 -213 81 180 -442 -236 122 -87 -377 -58 12 -81 -482 -304 197 -239 -70
2202 -70 124 200 -290 -409 -256 319 -16 -110 214 227 31 -251 261 -37 -89 -526 128 -59 -561 32 461 247
2224 247 -466 70 283 -222 -221 263 177 -139 -237 236 278 117 -9 439 -27 -277 -225 294 2 -179 500 873
2246 873 162 -323 297 725 -31 -99 471 253 53 78 806 837 9 192 292 62 -397 49 589 266 -28
2267 -28 499 808 137 -217 584 649 -366 -346 438 555 172 24 956 234 -506 -168 203 -133 -352 97 460
2288 460 158 171 720 513 -187 -444 249 -158 -574 -199 640 346 -133 -102 406 13 -672 -107 115 -530 -599
2309 -599 106 717 -29 -277 683 292 -478 -448 -170 -126 -464 -307 639 129 -445 -515 288 -278 -698 -71 -110
2330 -110 -635 -739 -133 398 -268 -108 161 -329 -387 -700 27 143 -392 -98 461 100 -333 35 279 -263
2350 -263 -696 -380 -23 -342 -132 349 457 -112 -574 -138 -302 -373 -266 195 239 -398 362 287 57 352 14
2371 14 -59 -488 -626 -124 315 -112 78 228 120 -145 -68 28 12 -187 -72 10 151 -63 88 557 87 -84
2393 -84 -126 157 -423 -474 111 469 104 -144 98 406 -70 -103 70 21 -111 -140 240 75 342 -12 -114 -27
2415 -27 -279 -233 -57 104 -54 -68 443 -34 -148 293 -69 -257 -444 -123 -48 -525 -180 57 -21 -153 20 -268
2437 -268 -282 -470 -404 -379 -455 -519 -90 125 -383 -142 185 -120 -471 -781 -550 -203 -233 -15 -96 -51 -270 -145 -27
2460 -27 -108 -359 -317 -222 -319 -285 -173 120 -369 -250 -103 20 -165 -371 97 95 -61 -83 71 9 -231 -375 75
2483 75 -118 -81 -45 72 287 114 -10 250 -25 -127 120 142 174 37 404 101 246 96 -194 332 123 125
2505 125 58 232 434 506 184 155 494 74 -48 242 120 667 351 314 528 161 405 192 385 365 637 262
2527 262 320 736 479 341 364 418 136 283 247 166 36 155 195 397 37 209 77 292 342 -131 433 84
2549 84 647 458 480 460 76 -91 -298 188 258 5 88 469 144 27 350 394 83 -13 -70 -3 -89 -231 -8
2572 -8 239 128 77 -205 277 -73 -174 122 -34 -216 -173 225 0 -93 -16 96 -184 -206 -94 134 -166 -243 -129
2595 -129 0 -241 -123 170 -185 -426 -129 -219 -180 1 -99 313 -78 -479 -440 -22 -613 -460 10 111 -85
2616 -85 -145 250 4 -221 -47 213 -41 -41 -124 204 25 42 85 261 -161 -566 -166 159 -155 -196 311 13 0
2639 0 20 410 208 -455 -171 -13 -176 -231 232 430 391 -211 168 64 -33 -322 -136 108 -97 -175 445 82
2661 82 -15 370 -92 -235 -142 -16 -205 -74 105 152 402 -104 14 -137 62 -178 -180 -189 41 -272 -44 -134 -267
2684 -267 -69 -40 -267 -439 -386 -285 -68 -176 -463 1 292 -182 -282 -104 -232 -102 -556 -315 -29 81 132
2705 132 6 -304 -108 -354 -217 -112 -676 -51 36 52 -15 -32 17 -169 -317 -128 -334 -327 -197 -188 53 57 -8 -129
2729 -129 -277 -363 10 -48 -52 -115 -162 106 -101 -8 -79 69 42 -16 -111 -277 13 103 219 -74 25 -197 -15 79 153
2754 153 -38 69 -148 123 347 169 101 -42 134 111 -51 106 410 476 51 204 251 144 183 280 290 136
2776 136 158 334 289 106 304 339 274 376 142 -74 44 266 357 202 224 299 114 15 -28 169 130 320 109
2799 109 88 246 352 368 -61 207 206 446 166 191 224 -27 450 2 158 277 -261 192 23 208 -362 -124
2821 -124 125 346 -59 -153 221 122 -334 -30 195 287 229 -100 24 30 -192 185 448 83 43 125 -180 28 30
2844 30 124 -96 137 -406 -22 -141 141 -53 103 -32 -211 -214 -20 -11 -111 349 -32 -9 116 -304 142 -178
2866 -178 89 171 -175 -175 -333 -68 48 -82 -108 160 14 -196 -72 -39 -145 -51 -80 -150 27 45 5 6 -98 -22
2890 -22 132 81 -21 -49 3 82 -106 -116 -154 -193 -7 73 4 -2 125 -32 110 102 105 118 -29 35 -30 -21 -8 -140 303
2917 303 122 37 -68 144 -78 232 70 149 -271 248 182 118 44 61 269 -115 -303 -198 260 -129 -208 -99
2939 -99 -60 -131 -61 -93 -19 -176 -206 -78 -111 -529 -50 75 127 40 -90 -196 119 -334 -146 -307 -166 -387 -265
2962 -265 -322 -287 -79 4 8 -65 -225 -121 -131 -479 -168 -378 65 -280 -97 -50 113 -346 14 -68 -118 -400 -218
2985 -218 -186 29 -272 -184 -247 142 -16 -139 -96 -203 -101 96 -8 276 16 63 -286 -383 8 -315 -202 15
3007 15 57 376 242 53 34 11 -59 -151 -29 171 27 87 409 157 242 -1 87 -220 212 -42 128 66 263
3030 263 345 339 105 -58 5 -38 -42 5 82 165 109 305 344 476 -11 62 -13 200 -260 42 264 43 -112 280 146
3055 146 58 266 -171 -19 -112 247 -101 214 334 271 -180 67 -80 -3 57 -315 -116 143 408 -138 36 123
3077 123 52 -83 -145 87 -152 107 -276 -40 -189 160 154 176 64 -103 90 -70 -283 -153 136 307 61 5
3099 5 357 -277 -219 -446 -53 -111 -206 41 123 -423 -116 -269 18 -133 67 -140 -69 -103 16 -89 -204 -116 206
3122 206 -331 -170 -1 -130 241 -135 100 -79 30 -262 112 256 98 -30 91 -124 15 -280 -53 58
3142 58 -82 -150 30 70 -174 -47 -75 134 207 7 139 61 -17 -120 25 84 -143 285 248 128 -108 -7 144
3165 144 106 122 205 39 -13 181 3 366 47 58 214 -18 -199 223 496 145 61 -69 378 149 -136 -48
3187 -48 83 102 80 93 162 44 -121 79 228 -263 -318 -45 -81 -48 62 253 57 -379 163 112 172 -90 -65 262
3211 262 167 -41 -173 158 -139 -105 -306 -45 -86 -72 -179 -48 -173 39 -243 -194 -290 -153 -242 270 -202 -195 -322
3234 -322 -158 136 -21 -167 -266 -115 -334 -309 19 -312 -151 87 -251 -173 -158 51 79 -556 57 36 -427 81
3256 81 -89 290 -219 71 -98 -196 -131 -281 -144 206 20 -10 80 -28 -32 53 -181 -30 68 -17 -237 140 -14
3279 -14 -28 45 284 173 186 -113 58 256 -220 17 36 107 -61 53 183 -467 68 -11 106 58 106 238 137
3302 137 27 243 361 87 159 266 -79 -148 -87 -28 -243 7 70 344 -102 26 159 185 -282 -164 222 -195
3324 -195 -33 86 92 -156 -115 -154 56 84 -276 292 186 -341 115 -129 -155 25 -236 -254 -75 -93 -122 -311 -89
3347 -89 -69 -134 98 -184 -229 58 -412 -113 49 146 244 -45 -244 108 -102 151 69 -4 -339 -322 13 -49 103
3370 103 63 -231 179 -1 -203 -19 11 20 -6 -201 59 31 -275 -148 -280 -159 -11 -35 51 -24 -66 168 -84
3393 -84 -85 -3 205 1 -95 -120 186 221 -84 190 -93 -164 -110 28 -142 -27 19 -100 291 230 164 13 59 331
3417 331 67 -105 121 -148 0 -109 200 287 221 -120 -152 -171 199 152 -72 74 59 -25 300 -144 31 12 88
3440 88 232 -63 176 -10 162 247 -20 358 188 212 -316 -252 -20 39 143 -61 44 143 -64 64 158 -64
3462 -64 -222 187 -36 10 91 1 -99 285 263 162 -48 82 95 -130 275 -199 -112 233 196 -9 -121 26 45
3485 45 -161 -321 -70 7 -210 34 225 -157 12 73 -27 192 -130 -93 -30 -382 -40 130 -105 -268 -87 -164
3507 -164 57 -145 -23 348 -140 -26 -56 -401 90 12 -82 157 283 388 155 401 -172 -86 -176 53 55 -28 -18
3530 -18 274 121 18 -227 -123 158 65 -106 46 27 -193 50 11 320 -151 125 251 6 181 348 -119
3551 -119 131 -34 -18 -74 145 78 68 338 150 26 -142 -113 -215 315 174 191 294 -134 -169 158 109 -143 256
3574 256 87 22 248 77 406 -118 -129 -95 -149 71 -193 214 85 -328 -102 -20 -22 -157 24 -64 -157 194 15
3597 15 126 -129 -62 161 -216 59 -111 83 -86 -74 -24 14 -174 -103 268 -111 72 7 -217 -18 -41 -5 142
3620 142 -203 -117 -116 102 241 -148 -190 -299 -51 -373 -93 -237 -104 -39 -55 113 245 36 10 -210 170 -217
3642 -217 -171 -130 -145 -122 34 -171 -242 24 217 74 341 -29 -146 96 -261 25 227 56 -118 39 -31 124
3664 124 42 -66 -206 19 -185 -61 37 -118 121 303 -26 -198 176 175 22 79 -80 18 81 137 78 24 -218
3687 -218 -44 -184 76 148 335 -131 513 72 165 189 -162 9 145 78 216 -63 170 64 -280 173 93 183
3709 183 -61 149 97 -129 -245 100 14 -107 241 -187 97 -42 6 -113 221 168 -298 63 -29 54 -115 -79
3731 -79 -300 -64 9 30 -34 48 -141 35 -17 23 -171 73 -132 -398 -40 -186 -102 -173 -267 -230 -34 -86 -109 60
3755 60 51 -246 26 136 23 -279 81 96 -173 -206 51 27 -96 49 65 2 -58 -138 59 -53 155 -213 140
3778 140 -132 48 -120 98 -79 -68 -99 17 -283 -290 37 6 192 -5 140 12 47 135 -18 -217 -30 35 39
3801 39 150 38 242 -58 209 80 -174 87 30 94 184 128 79 241 111 153 176 116 51 311 51 254 -85
3824 -85 336 266 -200 -82 133 149 230 245 -7 108 197 277 -30 -123 -191 82 -90 -260 309 406 -47 32 92 -77
3848 -77 349 -5 51 -33 286 -58 -21 191 -200 119 192 -63 -36 -184 -182 8 -101 380 -48 -175 -134 -152 -24
3871 -24 -232 -282 -93 -296 -160 -265 -28 66 110 -215 -195 33 -282 165 58 -14 109 155 89 34 99 27 51 -96
3895 -96 -307 151 -72 -141 -69 210 -132 176 -7 -145 60 -446 95 -263 -230 -178 165 133 113 -100 39 -116
3917 -116 -127 -368 -149 44 -13 271 61 195 153 -321 -142 255 169 -103 351 17 -71 23 -122 224 205 160 170
3940 170 -115 -48 76 -33 114 202 242 87 96 -139 -175 97 -17 -53 -260 -39 -223 -87 34 93 190 -29 -159
3963 -159 292 -108 280 110 62 -288 -246 -22 -113 56 -121 224 112 -72 94 -63 -87 -32 112 -89 -137 -200
3985 -200 -93 119 68 -209 62 229 -29 -45 -136 -48 -159 -154 36 216 100 2 2 -206 -259 -7 -31 314 -253 -341
4009 -341 28 5 -106 -47 -144 52 -173 -142 -133 -55 167 -248 -72 43 -6 -6 -202 -73 -90 -37 90 -62 -304 -108
4033 -108 -11 -53 -74 94 -155 -210 -178 -176 280 31 -37 -33 172 255 -112 -460 128 103 -65 6 -37 -192 73 -255 191
4058 191 139 47 123 -92 -94 151 27 86 -29 44 47 79 73 185 332 67 210 -121 172 -72 94 -105 33 -112
4082 -112 18 -107 -199 234 -31 -49 286 101 31 348 188 271 108 104 -46 96 -112 171 345 24 82 -5 131
4105 131 35 48 -55 52 40 3 56 -85 216 -119 76 9 -214 105 2 96 17 229 203 6 -165 68 132
4128 132 -229 8 -217 254 -46 207 -51 -183 305 54 -213 -95 -6 -43 -85 156 87 -274 -243 -242 -127 187
4150 187 -99 101 29 -160 -59 -26 -115 -73 31 -55 -90 6 113 -99 175 -114 108 -137 -128 -140 95 -55 42 -96
4174 -96 -95 214 -112 69 280 -117 10 -238 -85 150 97 218 36 101 -31 -24 256 117 40 79 217 209 483 20
4198 20 -69 -95 4 -83 -211 18 -43 -33 -114 -30 48 165 34 -206 107 141 142 -168 351 -309 45 132 -64 183 258
4223 258 117 243 101 -149 165 -274 70 -201 -5 150 184 216 39 72 -36 73 -143 137 -53 -93 20
4244 20 -12 18 94 43 130 87 8 -60 -111 -331 76 -185 -43 -369 -350 161 -12 -42 -119 -226 -203 -450 -346 146 26
4269 26 -244 -125 112 -47 73 -403 -179 -253 93 -32 -197 3 80 -306 -201 -15 278 3 104 -122 60
4290 60 -171 -47 252 -4 -49 290 -69 -305 199 94 78 -232 286 130 137 172 -14 -27 182 -14 49 142 -74
4313 -74 -164 44 274 52 -171 -75 -252 -62 127 260 209 255 221 -134 -314 -85 63 61 289 -217 -103 -153 -160 -121
4337 -121 320 179 -70 170 8 -53 147 -260 -71 120 -192 27 130 154 77 -200 67 350 1 -298 -237
4358 -237 320 -121 -191 -293 4 198 70 -269 150 -226 82 -39 -232 233 18 -131 17 209 -129 39
4378 39 81 -30 -292 -30 144 -13 29 -3 -69 80 -109 -101 -66 -337 47 177 -41 -94 -182 -144 -333 205 332 -114
4402 -114 260 -30 -267 -177 94 -190 143 -210 -91 -4 221 78 186 -72 -15 -251 -17 -69 138 -46 -302
4423 -302 148 84 -83 -189 64 -271 299 -180 -28 32 43 -36 -20 -93 -121 19 349 -111 146 -503 166 -185
4445 -185 -78 7 131 238 134 216 -131 138 -12 68 285 70 -56 -66 214 -68 -113 273 -97 196 213 -38
4467 -38 192 -77 198 153 63 109 -73 -165 -99 142 97 -51 -295 -26 35 -24 -463 38 184 -259 173 29 -9
4490 -9 145 -94 -55 -103 47 -67 150 -212 -80 284 -103 -115 -30 -69 -47 238 1 -22 -60 -7 127 326 -56 -75
4514 -75 -185 -130 -102 54 18 -187 -193 -66 -113 -161 33 103 -90 -282 342 -365 -204 -36 -93 73 -80 -78 -239 -231 -21
4539 -21 78 -50 130 -256 76 -111 61 -73 143 220 234 -67 -112 -31 -104 -196 -99 -303 83 238 -55 -116 -7
4562 -7 117 235 -102 15 -119 156 118 258 45 63 32 -61 270 -119 -110 9 -438 -13 71 -6 116 274 -55
4585 -55 327 -37 202 80 190 176 -175 -182 11 57 -17 -86 5 342 166 221 21 -73 14 25 126 -78 126 223
4609 223 -88 248 -71 164 -59 -171 154 138 192 301 69 -190 -54 -37 116 -13 117 44 44 -107 -123 -84 -184
4632 -184 113 18 -8 -127 -479 91 150 -111 -59 -113 -154 159 77 111 -45 197 -95 -115 67 91 -182 -125 -109 75
4656 75 -10 -18 257 210 -52 207 -148 141 157 -176 -46 143 -40 60 -210 -90 -293 111 207 -61 134 -253
4678 -253 208 50 91 -269 36 -104 -383 -20 391 -73 198 -149 -70 -127 68 216 120 233 94 -114 121
4699 121 -24 -43 145 -257 -32 -34 -54 212 33 -137 86 -27 209 -62 3 139 128 -63 -272 -197 75 354
4721 354 -223 -28 -134 230 101 -181 -210 -16 41 -109 149 113 21 164 150 -122 -71 -22 -24 123 45 348 -66
4744 -66 -59 -139 -207 154 -175 102 20 165 87 33 210 99 -12 -32 35 94 -74 -178 19 37 8 -46 -133 17 113
4769 113 -173 -447 -74 -125 18 -106 -245 30 84 -239 104 -60 95 -50 115 -26 -229 -74 218 376 -32
4790 -32 32 -51 -146 -90 -202 -54 -38 -60 -80 135 16 -204 -133 39 -116 -310 -70 20 153 -81 46 -242 -174 -167
4814 -167 74 51 -46 -88 72 -63 57 -243 -87 145 5 125 -192 195 -136 74 76 63 78 285 61 -316
4836 -316 85 22 150 84 -6 173 -107 -97 -196 39 -71 61 -68 -72 57 9 -104 77 -56 97 198 91 232
4859 232 60 -120 -256 -53 -112 336 366 161 -283 24 1 -107 76 -38 144 59 188 -54 247 30 152
4880 152 51 89 -159 -385 -59 103 -148 -115 127 -77 182 178 201 43 -30 -154 180 -140 -50 92 34 52 211
4903 211 60 -187 -63 -192 -127 2 -153 -18 170 26 292 137 -187 -231 -89 123 312 -244 35 -66 265
4924 265 -144 -71 -34 -139 53 30 -102 33 -30 99 44 -53 109 -138 77 102 -182 118 7 144 4 -91 -101
4947 -101 191 -205 -69 68 163 -30 -5 4 4 162 194 192 -179 64 138 -12 31 76 58 232 228 27 -77 164 29
4972 29 6 -293 -291 172 144 -162 -71 210 -30 -4 -26 98 49 195 -281 266 64 44 12 33 141 -165 191 -65
4996 -65 -161 -87 -90 88 159 24 84 -82 90 324 -100 44 38 109 -279 122 32 66 20 91 41 10 15 82 156 133 -33
5023 -33 50 269 23 76 -31 202 25 -186 -41 49 -104 69 286 111 -39 -134 38 -379 147 224 -63 177
5045 177 -101 -43 -166 -134 81 18 35 -56 -149 -79 90 -70 -183 -92 -118 86 239 58 -257 95 218 218 -55 -70
5069 -70 131 24 18 -146 164 114 -38 56 -379 -254 -233 105 -48 36 4 184 -446 -329 -3 61 93 136 -94 176
5093 176 -427 21 -170 108 122 35 196 116 230 -131 -153 -330 165 -100 -84 225 214 -126 -139 88 342 37
5115 37 -340 -187 288 85 236 122 -13 -184 8 -94 87 -21 229 -157 -117 27 40 95 -72 -98 55 107
5137 107 -99 112 -138 43 168 44 101 -93 147 232 70 48 293 -20 207 -2 -59 -7 41 5 -42 137 -122
5160 -122 105 -50 77 -59 -64 202 37 -197 -245 -167 87 -130 86 -121 -64 72 143 -154 26 215 115 70
5182 70 -157 294 -127 -171 82 -238 -47 -15 -46 72 -41 -45 -107 -45 -229 -258 -267 -27 -84 130 267 400 -152 -191
5206 -191 0 -224 -87 142 29 -401 -85 38 66 37 15 313 22 -78 436 214 26 11 37 149 -56 -25
5228 -25 37 -204 4 147 72 23 -33 106 -275 100 -53 82 -306 -93 195 -290 339 70 35 -95 -225 256
5250 256 24 -94 -124 -74 152 103 142 108 -129 -12 259 -104 -245 -81 -62 -109 98 26 118 198 128 63 248 18
5274 18 35 -59 -150 -137 45 43 -30 -26 -38 -56 187 -265 -159 73 -2 -288 255 -6 -149 138 109 -11 -299 -61 -220
5299 -220 62 -67 -140 -92 -112 -141 -53 132 125 82 155 -173 15 -158 -73 -176 -8 -54 -83 182 -178 -34 -281 112
5323 112 20 -157 -115 -31 -184 -234 -34 -14 382 38 -209 -153 -64 -109 -28 -18 -48 193 95 -65 -61 -50 -158 16 -132
5348 -132 87 -79 -102 -274 -132 -262 138 35 -98 69 113 -15 -172 -9 144 -178 178 45 25 -282 50
5369 50 162 84 -54 147 -95 307 -104 117 156 -127 65 -240 287 -4 209 -20 31 118 244 34 -316 72
5391 72 -72 -158 19 -138 214 371 -70 268 -73 361 99 30 -142 150 307 74 -234 110 183 -191 289
5412 289 1 -235 30 -229 -47 146 -287 -339 -10 -326 72 37 71 -143 -138 59 1 -233 402 -12 186 345
5434 345 146 -182 23 -83 50 -44 292 78 164 -54 10 108 -77 114 19 107 -250 -339 -9 54 -132 -210 38
5457 38 97 237 -27 185 241 -47 -9 28 108 -162 -70 26 137 294 190 -158 136 146 18 -140 -119 19 -161
5480 -161 14 -106 -87 92 -21 -100 -83 51 -109 -36 113 -83 -110 -72 62 59 262 -287 -265 52 -79 140 42
5503 42 97 -67 126 156 106 -183 -85 167 -207 78 22 -53 -52 3 358 193 211 138 280 -133 154 90 96 75 -238
5528 -238 -3 -74 136 -32 -26 19 -142 127 -89 164 -159 -46 -293 -259 -159 -227 -50 2 104 99 122 57 -55 -438
5552 -438 -286 187 -28 -198 -37 -111 65 134 291 68 -28 -290 -70 -218 -38 -84 -44 -5 72 28 36 82 -334 -269
5576 -269 205 -208 -201 -92 -19 -23 -332 -222 86 79 46 -199 -115 -120 13 -244 177 41 5 -92 -130 127 90 -16 17
5601 17 -79 153 -91 -169 18 -20 107 -110 -182 -122 440 -335 27 74 86 -139 -12 -86 126 -220 -61 -191 -146
5624 -146 -150 -523 -144 -143 -48 17 -102 81 -79 519 -62 -124 168 88 -301 37 77 -62 -122 53 292 -32 227
5647 227 254 124 -171 -75 -48 15 -14 -106 -21 -119 -387 -397 -14 18 -10 -273 135 -223 45 -28 -242 96 -202 -81
5671 -81 -106 -195 -108 -160 -27 187 -54 -9 18 422 287 105 -320 -21 -105 -63 -90 61 -165 -11 -457 -106 141
5694 141 -52 -52 -150 172 -71 126 -35 -97 92 -25 -46 -70 38 -72 -77 -80 -105 -77 255 -170 -124 79 -148 276
5718 276 215 -8 81 35 26 -194 -137 161 192 82 57 -216 105 52 23 98 169 -23 148 -274 -25 178 7 350
5742 350 -119 233 14 -47 -113 320 -179 -178 -40 109 10 -52 -96 10 38 423 -6 45 24 -197 86 -8 263 -4
5766 -4 206 -48 94 138 -52 67 126 238 -76 160 -22 -180 -346 382 197 189 55 60 -22 -181 107 410 102
5789 102 224 24 -129 157 -275 23 144 -113 135 40 -148 -115 -140 -95 -341 15 -10 263 44 -184 -334 -237
5811 -237 -165 -30 222 93 135 -410 -5 38 21 -88 -54 -107 -106 36 -58 -130 31 -73 -181 39 -60 84 96 -113
5835 -113 -8 20 -144 -385 163 166 -67 -2 -70 -160 229 -226 116 -193 79 11 -444 -47 -249 -1 -31 -167 -238
5858 -238 -275 -100 133 5 -77 -87 32 -419 -86 -46 263 37 -196 155 106 -153 -16 -125 -257 118 0 23
5880 23 208 57 -209 -222 13 -194 -49 173 148 137 113 -245 -62 -115 -46 -347 184 -103 134 -37 70 -181
5902 -181 -260 -161 -12 193 105 -340 -80 90 76 131 -16 -172 59 114 229 -37 -125 84 27 -208 151 94 16
5925 16 126 -157 264 -152 -264 70 53 -195 -196 -214 -119 -63 18 82 -339 -272 194 -98 -195 -365 -271 -152 38 -6
5949 -6 26 -232 41 99 124 -71 -155 -107 123 -34 -108 60 63 196 378 -111 -40 -6 -96 56 -23 -25 -202 240 -18
5974 -18 124 -115 140 301 -50 -210 44 122 234 53 236 -51 -267 -88 -36 30 63 75 -254 123 193 -11
5996 -11 9 -106 -227 63 -111 -303 20 -102 -10 -76 225 287 -186 142 -19 -321 -189 28 214 -151 165 330
6018 330 -46 -187 398 -121 -13 212 -3 42 -376 222 154 77 -5 -130 -247 106 4 258 -14 -358 -119
6039 -119 203 198 12 282 -384 134 133 292 164 -243 -174 27 10 104 207 0 -78 -10 -98 128 -192 148 -193
6062 -193 125 177 -22 1 186 66 -113 -265 1 -172 -45 -65 102 192 221 -146 -129 -84 -16 -215 -103 -50 -218
6085 -218 -68 -114 -279 302 205 -183 115 -134 -405 182 127 -238 42 161 -97 100 12 -1 -84 -152 150 36
6107 36 -97 -326 -40 -108 -70 244 34 110 -134 49 138 -136 -280 179 -41 -388 177 -98 -196 45 357 -299
6129 -299 48 -29 108 38 -3 -18 -7 229 -264 97 87 60 10 -204 -41 399 23 120 58 334 119 136 -92 272
6153 272 104 342 -168 -294 246 12 341 96 125 208 -128 33 -49 55 -3 3 22 -129 -235 -79 -180 157
6175 157 232 -47 66 19 218 130 52 -207 -5 269 -99 143 -55 190 13 -143 63 -85 -146 32 -34 -32 198
6198 198 -98 -33 141 -142 87 -39 -80 77 33 21 -168 203 -105 186 -83 -6 192 -177 -23 -337 -141 18
6220 18 59 6 33 -107 128 -98 155 -78 -175 222 84 -154 -170 22 -132 30 -102 193 -198 299 -44 163
6242 163 -126 -138 -67 15 -204 28 140 89 -277 -20 159 -59 -35 4 153 -48 55 -159 -2 52 36 -148 -64
6265 -64 -36 393 126 -132 -47 28 524 97 87 -22 7 -282 100 -8 -48 -65 -216 113 28 12 -67 142 10 71
6289 71 103 136 337 -161 27 109 126 -236 -193 179 -164 181 154 -61 -22 195 243 -7 93 -315 108 123 -234
6312 -234 153 -63 87 27 154 60 -38 -58 88 207 -363 232 145 108 147 56 -65 308 185 -82 -230 -201 -78
6335 -78 -35 -134 76 -167 -27 129 -267 -165 -90 -9 -160 -26 -53 32 -53 -62 218 -209 -3 -181 80 285 -109
6358 -109 128 131 495 -329 25 -65 78 -142 -15 -48 -127 154 107 -296 -6 -144 -145 110 -111 -117 150 10 -87 -31
6382 -31 -256 183 -16 -36 -69 247 108 -16 68 116 -93 -67 -137 -10 70 -10 11 -13 -62 83 -81 36 110 229
6406 229 84 164 161 20 114 148 -69 -58 436 -148 15 237 -244 154 64 -229 -60 -176 -248 -69 -127 -136 32 -188
6430 -188 -220 235 403 209 55 75 173 -151 33 -17 210 87 112 -80 -227 -14 -34 297 -28 6 152 -157
6452 -157 -36 40 19 -178 -19 -234 -70 -185 115 146 -182 -97 97 126 81 -173 -172 -95 -144 -110 78 -77 -174 2
6476 2 -115 89 -180 122 142 -19 128 32 -59 -23 256 -115 -96 -94 -188 -62 15 261 -217 -71 331 -211 28 180
6500 180 -293 -142 14 192 198 63 -176 117 -5 -59 130 -40 -31 -57 -60 -109 174 -62 248 -176 -126 211 1
6523 1 73 103 112 -44 156 -141 9 63 -63 -21 230 171 15 -83 -71 47 190 -113 299 64 -139 -88 -85 -102 230
6548 230 -60 -29 35 -37 73 29 -2 -23 -34 394 -36 -211 -153 -178 79 -123 91 -78 224 -72 262 -43 -1
6571 -1 87 83 208 105 88 -60 -173 -221 18 191 162 -99 47 -149 47 -37 -186 -4 323 27 -66 36 271
6594 271 -166 438 -69 -79 -53 -37 -305 234 109 107 -60 -249 -173 -39 132 -400 -408 127 -27 -66 -36 122 29 -10
6618 -10 -19 161 -89 28 11 29 -152 -13 -231 172 -51 -75 99 143 178 -141 -110 -231 72 -100 -77 139 121 -25
6642 -25 -49 27 10 96 83 -33 195 143 -65 -158 57 -113 -11 188 6 62 56 -150 187 -3 -11 -46 -9 -124 -68
6667 -68 79 -201 -28 32 -65 -138 16 172 130 370 309 -27 -109 -50 -211 -16 200 143 66 -165 -69 91 93 147 -104
6692 -104 -106 -75 26 25 184 -69 349 -40 142 -157 -141 -38 32 127 93 252 -215 -150 185 312 -182 -53 79
6715 79 -53 -24 -27 236 135 -145 205 68 43 -51 52 -147 67 -158 -105 -131 -168 -118 -298 -284 -72 -130 -34 -12 -312
6740 -312 165 -331 -231 168 -9 -248 186 49 -380 63 -205 55 -224 38 309 125 212 -75 -137 4 230
6761 230 11 16 7 -102 -8 -181 -76 131 130 -18 -62 -249 -10 -42 -25 -129 75 -9 -162 -56 -26 -61 59 262
6785 262 86 108 -376 247 129 14 265 186 -77 -4 14 2 262 -105 -422 -215 -50 -135 145 -189 18 43
6807 43 27 -33 70 62 -106 -136 84 -227 -172 122 113 61 -153 -101 234 227 -80 -243 97 118 212 145 -228 64 205
6832 205 -89 76 -149 -78 83 129 -94 -246 36 -192 166 -3 99 -381 -76 83 -49 -196 79 -35 225
6853 225 -96 -159 -35 294 345 -111 -195 -106 -55 -159 -103 24 76 28 -129 411 104 84 169 147 -199 298 34 -303
6877 -303 -27 -33 154 -16 31 -38 15 127 -133 -29 -85 95 -357 -90 55 237 -95 -132 132 99 140 -144 40
6900 40 193 -8 2 68 -174 325 79 -165 -27 37 -55 -74 106 116 3 -234 115 -263 -55 312 184 42
6922 42 136 -3 -85 245 -88 -26 20 55 122 -193 -46 219 -10 3 -188 -39 173 -116 -422 61 188 49 -73
6945 -73 -103 64 -234 36 52 325 95 29 90 24 212 161 268 -219 -82 -22 -19 54 -82 -8 -137 86 257 91
6969 91 -31 -214 -181 197 397 -238 -76 170 291 8 249 127 -74 376 99 -74 43 -67 -229 -50 -63
6990 -63 -210 -191 -72 -126 -99 2 149 36 -156 -34 -118 121 2 -168 -88 -28 93 -69 87 33 186 275 320
7013 320 -279 -231 47 -169 152 5 87 -194 21 -72 -97 -197 -57 -85 -160 182 -197 -109 -152 -38 -35 104 151 -194
7037 -194 -20 146 -88 -13 -182 158 101 -140 276 181 -99 -253 256 186 -47 71 -51 -108 -74 186 -201 118
7059 118 -84 -16 -18 -116 30 377 -18 200 -152 -206 90 -8 131 41 -39 176 51 192 -2 310 320 -194 187
7082 187 -164 264 -271 -42 82 -99 -68 189 11 -6 -223 -226 74 -151 -167 50 -60 141 56 40 -59 -43 -333
7105 -333 -108 108 -50 94 -7 -88 -82 -4 30 206 143 -26 30 104 -84 5 -338 -41 148 -58 136 -88 62
7128 62 -121 -39 2 -82 -137 -13 -45 -103 36 229 318 -144 240 63 44 174 -142 -19 149 -136 -247 94 -80
7151 -80 -189 58 -76 150 131 83 20 271 102 2 73 -95 -63 -107 -229 157 179 -66 290 75 -246 -49 279
7174 279 241 123 104 5 -104 -110 59 135 132 -144 -164 101 158 90 35 -67 214 -46 12 -265 124 65 121 102 12 26
7200 26 -139 70 -97 -96 68 53 97 69 -294 100 -122 -99 -115 -371 210 24 53 -5 -18 -159 -285 -166 91 -21
7224 -21 152 -147 -82 -22 217 -153 -142 57 237 -306 77 158 78 150 -17 -97 -46 -88 94 -4 -51 -202 -136 17
7248 17 -140 -8 -215 83 2 -229 -76 -349 -178 -89 188 186 186 49 14 87 -14 227 12 -147 -27 -103 125
7271 125 -86 67 71 39 85 -133 -302 20 -60 171 108 133 -158 -22 -101 41 37 195 -43 54 -192 0 152 265
7295 265 -173 -191 -12 66 151 35 -193 -277 -459 75 3 110 230 -95 101 -211 61 -1 40 -184 128 219 143
7318 143 -136 -69 48 -117 90 -292 86 205 164 -73 263 19 -46 -160 9 -92 -126 -77 219 -208 -52 -102
7340 -102 -90 117 -106 -123 135 194 -273 -143 210 -6 121 116 -49 -131 -118 -75 -67 173 97 81 -204 -120 -349 -4
7364 -4 69 26 -40 -107 20 148 7 -6 -80 -201 -70 40 -57 -171 -298 244 -37 -197 -350 -217 -6 186 -67
7387 -67 100 -102 -430 73 -334 -175 54 60 -235 138 -124 -219 -243 -76 -256 -117 -232 101 65 87 -83 51
7409 51 -80 -157 193 -104 -47 12 7 -57 -340 426 -10 119 -105 81 151 -111 67 -82 33 145 -221 -214 6
7432 6 -119 328 -182 -39 -7 129 -47 -277 -127 78 -107 50 -185 163 -34 157 35 20 180 216 273 -157
7454 -157 17 -25 -245 178 -6 -133 54 56 6 -22 9 -256 -56 82 -26 151 -99 6 197 184 3 189
7476 189 301 -140 77 -72 -51 55 -66 -76 23 -209 -259 -132 18 106 168 -17 51 -31 -134 459 124 -294 -33
7499 -33 -115 116 -350 -24 11 14 -279 431 89 80 35 31 -28 -211 -20 -15 -19 63 -64 382 48 -191 -255 -181 62 46
7525 46 -70 -232 169 -22 -5 -110 133 97 125 -40 -80 -59 -50 47 418 189 -109 -241 -212 -117 -122 82 -131 23
7549 23 -17 -14 -81 19 1 23 -120 -121 133 -7 140 230 -215 172 103 119 -365 41 -39 264 172 24 21 -86 262
7574 262 106 -44 -141 63 -11 -95 135 -273 -62 -295 325 0 -111 -16 157 299 -165 45 -16 48 48 0 -73
7597 -73 -36 331 191 -177 -151 -129 92 -27 -171 -16 -268 110 147 48 -151 -112 -61 12 140 -134 48 -144 -78
7620 -78 8 182 40 16 131 259 157 -6 100 -146 -267 -132 -204 -146 68 38 129 -46 -107 -73 -67 -84 -120 -159 189
7645 189 165 -162 240 107 0 135 111 -208 -176 48 313 -194 -171 -278 -381 208 276 -133 343 -152 96 112
7667 112 20 -337 -138 -11 222 169 89 44 -84 -224 -120 23 -202 188 206 210 -76 -46 1 54 16 -30 140 9
7691 9 89 -151 -241 47 -16 -119 52 -126 83 193 150 -190 -85 101 -284 6 22 5 287 247 163 95 69 206
7715 206 -160 80 -12 -306 64 150 -25 -110 213 -165 393 186 181 345 188 -2 -33 -36 -11 -93 -26 71 334 153
7739 153 61 -90 -313 31 120 211 201 116 133 -102 -250 94 317 42 -72 -41 -142 158 -142 200 -135 -96 87
7762 87 178 -139 132 -112 -11 -176 40 48 -313 36 112 48 -25 -53 146 -50 -22 -88 97 60 -48 -253 23 -20
7786 -20 105 -86 -28 109 -182 -140 -235 -240 40 -112 -67 -124 26 -65 -267 -5 84 -123 95 -183 77 32 -103 91
7810 91 230 1 -35 -85 -63 54 41 -188 175 -106 86 6 -327 -230 236 25 216 -204 208 256 22 -193 61
7833 61 29 -347 -34 63 143 206 -87 163 -137 -289 -111 -214 -132 14 62 -180 251 -81 173 -49 -62 214 168
7856 168 -123 -313 -105 -14 32 100 210 159 -109 -213 70 -34 109 137 -355 -109 -63 -14 8 96 -1 -95 185 225
7880 225 -77 -85 -122 -237 -36 -95 23 138 -235 -1 -46 77 113 168 -29 -37 5 34 90 -30 -202 -280 191 -41
7904 -41 -156 -227 144 -215 -82 -145 -5 241 -19 -245 -9 171 -70 -156 135 -200 -213 -115 -46 185 -357 -45
7926 -45 324 19 -193 -31 -154 -518 166 179 219 0 -99 -210 141 176 -252 -112 -319 17 -99 45 -70 -149
7948 -149 73 302 -51 -157 431 11 -68 37 449 64 46 56 64 -166 116 -285 216 21 -145 20 -43 -164
7970 -164 -63 101 118 60 -56 107 -162 75 103 141 -61 -86 -31 -106 136 -129 -57 50 -82 -116 86 -43 184
7993 184 -30 1 78 78 -100 -176 112 -51 -53 27 -185 -80 -136 231 93 303 108 -234 126 143 -122 378 193
8016 193 -81 102 -6 -127 340 -9 20 -141 -398 -256 104 -298 36 173 -107 56 -6 177 -229 -3 -257
8037 -257 235 -97 27 88 202 267 -72 80 -129 36 -265 -147 116 271 -72 -34 -55 -18 -48 54 167 21
8059 21 -252 28 170 -12 -167 75 336 169 67 156 13 -15 68 20 -103 414 -195 -153 65 -39 171 -46
8081 -46 -79 -33 -170 -99 253 -337 -13 345 -232 69 67 92 -27 -193 0 -136 -26 55 10 -8 -184 -24 8 6
8105 6 -39 -150 200 97 164 121 67 -226 58 151 -3 -27 134 230 133 -47 -111 108 2 -223 180 150 -156 82
8129 82 -293 -53 93 287 -152 139 -133 129 94 232 148 -187 29 -105 -5 156 108 -124 -117 319 49 -1
8151 -1 115 -107 5 -78 -87 168 280 -176 105 73 -202 -92 -1 -360 112 -83 -175 -291 -49 41 -199 30 35 15
8175 15 122 -96 -273 2 -70 -124 -38 -68 195 18 -33 107 -27 -128 52 58
8191E8
##END NTUPLES=NMR FID
##END=
