##TITLE=1H_LR-683B-CS2ME
 CD3OD, 8 sc, 
 3.3.2020
##JCAMPDX= 6.0         $$ Bruker NMR JCAMP-DX V2.0
##DATA TYPE= NMR FID
##DATA CLASS= NTUPLES
##ORIGIN= UXNMR, Bruker Analytische Messtechnik GmbH
##OWNER= root
$$ XWIN-NMR		Version 3.5
$$ Tue Mar  3 16:42:55 2020 Russian Standard Time (UT+4h)  she@DPX200
##.OBSERVE FREQUENCY= 200.1315
##.OBSERVE NUCLEUS= ^1H
##.DELAY= (6, 6)
##.ACQUISITION MODE= SIMULTANEOUS
##.ACQUISITION SCHEME= undefined
##.AVERAGES= 8
##.DIGITISER RES= 18
##SPECTROMETER/DATA SYSTEM= spect
##.PULSE SEQUENCE= zg30
##.SOLVENT NAME= DMSO
##.SHIFT REFERENCE= (INTERNAL, DMSO, 0, 15.7039)
##AUDIT TRAIL= $$ (NUMBER, WHEN, WHO, WHERE, WHAT)
$$ ##TITLE= Audit trail, XWIN-NMR		Version 3.5
$$ ##JCAMPDX= 5.01
$$ ##ORIGIN= Bruker BioSpin GmbH
$$ ##OWNER= she
$$ F:/spectra/data/she/nmr/H-F/1/audita.txt
$$ ##AUDIT TRAIL=  $$ (NUMBER, WHEN, WHO, WHERE, WHAT)
(   1,<2020-03-03 16:40:43.68 +0400>,<she>,<DPX200>,
      <created by zg, POWCHK disabled, PULCHK disabled
       configuration hash MD5:
       00 E9 B6 7A A2 85 ED C7 34 08 36 98 17 FE 4E 26
       data hash MD5: 16K
       DA 79 66 1D CF 8C A9 BA 3F AE 2D CD AC FF 8B BF>)
$$ ##END=
$$ 
$$ hash MD5
$$ C4 FD 70 5B 93 45 67 B3 7B DB 61 F7 5D 8E 59 57
##$RELAX= 
##$RELAX= 
##$RELAX= 
##$RELAX= 
##$RELAX= 
##$RELAX= 
$$ Bruker specific parameters
$$ --------------------------
##$DU= <F:/spectra>
##$EXPNO= 1
##$NAME= <H-F>
##$PROCNO= 1
##$TYPE= <nmr>
##$USER= <she>
##$AMP= (0..31)
100 100 100 100 100 100 100 100 100 100 100 100 100 100 100 100 100 100 
100 100 100 100 100 100 100 100 100 100 100 100 100 100 
##$AQSEQ= 0
##$AQ_mod= 1
##$AUNM= <au_zg>
##$AUTOPOS= <>
##$BF1= 200.13
##$BF2= 200.13
##$BF3= 200.13
##$BF4= 200.13
##$BF5= 200.13
##$BF6= 200.13
##$BF7= 200.13
##$BF8= 200.13
##$BYTORDA= 1
##$CFDGTYP= 0
##$CFRGTYP= 5
##$CHEMSTR= <none>
##$CNST= (0..31)
1 1 145 1 1 1 1 1 1 1 1 1 1 1 1 1 1 1 1 1 1 1 1 1 1 1 1 1 1 1 1 1 
##$CPDPRG= <>
##$CPDPRG1= <>
##$CPDPRG2= <>
##$CPDPRG3= <>
##$CPDPRG4= <mlev>
##$CPDPRG5= <mlev>
##$CPDPRG6= <mlev>
##$CPDPRG7= <mlev>
##$CPDPRG8= <mlev>
##$CPDPRGB= <>
##$CPDPRGT= <>
##$D= (0..31)
0 1.2 0 0 0 0 0 0 0 0.06 0 0.03 0 0 0 0 0.0002 0 0 0 0 0 0 0 0 0 0 0 0 
0 0 0 
##$DATE= 1583239242
##$DBL= (0..7)
120 120 120 120 120 120 120 120 
##$DBP= (0..7)
150 150 150 150 150 150 150 150 
##$DBP07= 0
##$DBPNAM0= <>
##$DBPNAM1= <>
##$DBPNAM2= <>
##$DBPNAM3= <>
##$DBPNAM4= <>
##$DBPNAM5= <>
##$DBPNAM6= <>
##$DBPNAM7= <>
##$DBPOAL= (0..7)
0.5 0.5 0.5 0.5 0.5 0.5 0.5 0.5 
##$DBPOFFS= (0..7)
0 0 0 0 0 0 0 0 
##$DE= 6
##$DECBNUC= <off>
##$DECIM= 24
##$DECNUC= <off>
##$DECSTAT= 4
##$DIGMOD= 1
##$DIGTYP= 9
##$DL= (0..7)
0 120 120 120 120 120 120 120 
##$DP= (0..7)
150 150 150 150 150 150 150 150 
##$DP07= 0
##$DPNAME0= <>
##$DPNAME1= <>
##$DPNAME2= <>
##$DPNAME3= <>
##$DPNAME4= <>
##$DPNAME5= <>
##$DPNAME6= <>
##$DPNAME7= <>
##$DPOAL= (0..7)
0.5 0.5 0.5 0.5 0.5 0.5 0.5 0.5 
##$DPOFFS= (0..7)
0 0 0 0 0 0 0 0 
##$DQDMODE= 0
##$DR= 18
##$DS= 0
##$DSLIST= <SSSSSSSSSSSSSSS>
$$ [...]
##$SUBNAM2= <"">
##$SUBNAM3= <"">
##$SUBNAM4= <"">
##$SUBNAM5= <"">
##$SUBNAM6= <"">
##$SUBNAM7= <"">
##$SUBNAM8= <"">
##$SUBNAM9= <"">
##$SW= 24.9337058887773
##$SWIBOX= (0..15)
0 0 2 0 0 0 0 0 0 0 0 0 0 0 0 0 
##$SW_h= 4990.01996007984
##$TD= 16384
##$TD0= 1
##$TE= 0
##$TE2= 300
##$TE3= 300
##$TEG= 300
##$TL= (0..7)
0 120 120 120 120 120 120 120 
##$TP= (0..7)
150 150 150 150 150 150 150 150 
##$TP07= 0
##$TPNAME0= <>
##$TPNAME1= <>
##$TPNAME2= <>
##$TPNAME3= <>
##$TPNAME4= <>
##$TPNAME5= <>
##$TPNAME6= <>
##$TPNAME7= <>
##$TPOAL= (0..7)
0.5 0.5 0.5 0.5 0.5 0.5 0.5 0.5 
##$TPOFFS= (0..7)
0 0 0 0 0 0 0 0 
##$TUNHIN= 0
##$TUNHOUT= 0
##$TUNXOUT= 0
##$USERA1= <user>
##$USERA2= <user>
##$USERA3= <user>
##$USERA4= <user>
##$USERA5= <user>
##$V9= 5
##$VALIST= <valist>
##$VCLIST= <CCCCCCCCCCCCCCC>
##$VD= 0
##$VDLIST= <DDDDDDDDDDDDDDD>
##$VPLIST= <PPPPPPPPPPPPPPP>
##$VTLIST= <TTTTTTTTTTTTTTT>
##$WBST= 1024
##$WBSW= 4
##$XGAIN= (0..3)
0 0 0 0 
##$XL= 0
##$YL= 0
##$YMAX_a= 568621
##$YMIN_a= -393155
##$ZGOPTNS= <>
##$ZL1= 120
##$ZL2= 120
##$ZL3= 120
##$ZL4= 120
##$ABSF1= 10
##$ABSF2= 0
##$ABSG= 5
##$ABSL= 3
##$ALPHA= 0
##$AQORDER= 0
##$ASSFAC= 0
##$ASSFACI= 0
##$ASSFACX= 0
##$ASSWID= 0
##$AUNMP= <proc_1d>
##$AZFE= 0.1
##$AZFW= 0.1
##$BCFW= 1
##$BC_mod= 2
##$BYTORDP= 1
##$COROFFS= 0
##$CY= 11.3945322036743
##$DATMOD= 1
##$DC= 2
##$DFILT= <>
##$DTYPP= 0
##$F1P= 16.9975609425685
##$F2P= -3.02152046262296
##$FCOR= 0.5
##$FTSIZE= 0
##$FT_mod= 4
##$GAMMA= 1
##$GB= 0.15
##$INTBC= 1
##$INTSCL= 1
##$ISEN= 128
##$LB= 0.24
##$LEV0= 0
##$LPBIN= 0
##$MAXI= 10000
##$MC2= 0
##$MEAN= 0
##$ME_mod= 0
##$MI= 1.114404
##$NCOEF= 0
##$NC_proc= 0
##$NLEV= 6
##$NOISF1= 3.799351
##$NOISF2= 2.8
##$NSP= 1
##$NTH_PI= 0
##$NZP= 0
##$OFFSET= 15.70392
##$PC= 1
##$PHC0= -9790.184
##$PHC1= 15.00082
##$PH_mod= 1
##$PKNL= yes
##$PPARMOD= 0
##$PSCAL= 0
##$PSIGN= 0
##$REVERSE= no
##$SF= 200.130013532006
##$SI= 16384
##$SIGF1= 3
##$SIGF2= 2
##$SINO= 400
##$SIOLD= 16384
##$SREGLST= <1H.CDCl3>
##$SSB= 0
##$STSI= 0
##$STSR= 0
##$SW_p= 3612.71676300578
##$SYMM= 0
##$S_DEV= 0
##$TDeff= 0
##$TDoff= 0
##$TI= <>
##$TILT= no
##$TM1= 0
##$TM2= 0
##$TOPLEV= 0
##$USERP1= <user>
##$USERP2= <user>
##$USERP3= <user>
##$USERP4= <user>
##$USERP5= <user>
##$WDW= 1
##$XDIM= 8192
##$YMAX_p= 0
##$YMIN_p= 0
$$ End of Bruker specific parameters
$$ ---------------------------------
##NTUPLES= NMR FID
##VAR_NAME=  TIME,          FID/REAL,        FID/IMAG
##SYMBOL=    X,             R,               I
##VAR_TYPE=  INDEPENDENT,   DEPENDENT,       DEPENDENT
##VAR_FORM=  AFFN,          ASDF,            ASDF
##VAR_DIM=   8192,          8192,            8192
##UNITS=     SECONDS,       ARBITRARY UNITS, ARBITRARY UNITS
##FACTOR=    0.0002004,     1,               1
##FIRST=     0,             0,               0
##LAST=      1.6414764,     0,               0
##MIN=       0,             -393155,         0
##MAX=       1.6414764,     568621,          0
$$ Real data points
##PAGE= N=1
##DATA TABLE= (X++(R..R)), XYDATA
0@%%%%%%%Qj6J8k4L0m0M8n6P0q4J03j21J43j68J92k26K60k98L45l95M52n11N78
$$ 0 0 0 0 0 0 0 0 8 -8 10 -14 16 -24 24 -32 38 -46 57 -64 79 -89 103 -123 137 -161 184 -211 241 -270 308
30C08o55P37q29R27j036J157j285J430j589J764j956K165k399K654k938L257l612
$$ 308 -347 390 -439 488 -548 609 -676 754 -835 929 -1027 1138 -1261 1393 -1545 1712 -1900
47a900M018m479N010n632O367p257Q356r757J1612j4205J8122k4798L9198j25234
$$ -1900 2118 -2361 2649 -2983 3384 -3873 4483 -5274 6338 -7867 10255 -14543 24655 -100579
61a00579J64181K92671n2815l8503q0179j96179k77179q6053P1402J23055J57306
$$ -100579 63602 356273 303458 264955 184776 -11403 -288582 -374635 -303233 -180178 -22872
72b2872K48524J63891m3257j90668k04454k12280j32039O5367K26824J97917J28818
$$ -22872 225652 389543 346286 155618 -48836 -261116 -393155 -327788 -100964 96953 225771
83B25771J02823P974j82601k44390j44633o2594k2065J37702L10964K44436m852
$$ 225771 328594 336568 153967 -90423 -235056 -297650 -319715 -182013 128951 373387 368535
94C68535j40170j39188j64742j76369m5823J06922J29653J24866J86545J47075
$$ 368535 228365 89177 -75565 -251934 -297757 -190835 -61182 63684 250229 397304
104C97304p6802k50260k05971r7192m8136M7288K03558K37688J03269k2305p0554
$$ 397304 320502 70242 -135729 -232921 -281057 -233769 -30211 207477 310746 288441 217887
115B17887j32185j88799j37640j5952P1166J47549K24077J74490k3971j72261
$$ 217887 85702 -103097 -240737 -256689 -185523 -37974 186103 360593 336622 164361
125A64361j61742j20047j11772k4423J30196J79277J08754P6692P1336n5267k31234
$$ 164361 2619 -117428 -229200 -253623 -123427 55850 164604 241296 312632 257365 26131
136B6131k34020p1317N7850J10432J66727J81721P2662o8362j19098j24507j45405
$$ 26131 -207889 -279206 -221356 -110924 55803 237524 310186 241824 122726 -1781 -147186
147a47186j06074K5730J32185J48723J42900J16829j1672j80145k16751j12791
$$ -147186 -253260 -227530 -95345 53378 196278 313107 301435 121290 -95461 -208252
157b08252j6660L2739J05357J68513J36234M1955k8331r5460j79521j87517o1553
$$ -208252 -224912 -192173 -86816 81697 217931 259886 231555 136095 -43426 -230943 -292496
168b92496Q6164J51904J60765J36792M0085r5004j52823j19294r1018o9153K3068
$$ -292496 -206332 -54428 106337 243129 283214 188210 35387 -83907 -174925 -244078 -221010
179b21010J47827J81689J15838L6203m4721j49470k02568j25759J1825R5178J21623
$$ -221010 -73183 108506 224344 260547 215826 66356 -136212 -261971 -250146 -154968 -33345
190c3345J35277J09529K3645o8149j19765j47519j39346m6617R6086J75931J53741
$$ -33345 101932 211461 235106 166957 47192 -100327 -239673 -286290 -190204 -14273 139468
201A39468Q5639M366q9058j51631j33811o6508r472M8895J24715J62465J10030
$$ 139468 225107 229473 140415 -11216 -145027 -211535 -221007 -172112 -47397 115068 225098
212B25098O324q6597j48361j64583r6731K7840J17928J32024J08415P2039K957
$$ 225098 231422 144825 -3536 -168119 -264850 -237010 -119082 12942 121357 193396 196353
223A96353q2946j31178j25893q6267j3842R0580J65555J50060N9810l8101j05696
$$ 196353 113407 -17771 -143664 -229931 -243773 -153193 12362 162422 222232 184131 78435
234G8435j34111j12809m7873K3831P9145J17455J26741P8673j6129j04955j45878
$$ 78435 -55676 -168485 -216358 -192527 -113382 4073 130814 209487 193358 88403 -57475
245e7475j29813n7619M6837J24922J33508Q9791L0737k9525q8039j21337j06941
$$ -57475 -187288 -244907 -198070 -73148 60360 150151 180888 151363 63324 -58013 -164954
256a64954n1955K3840J01654J47668J23487L4762o4906j22375j24155q3499j7703
$$ -164954 -216909 -193069 -91415 56253 179740 214502 149596 27221 -96934 -180433 -198136
267a98136M9896R6997J11059R3260M0642l7725j11059j40123j04300j9550P3577
$$ -198136 -148240 -51243 59816 153076 193718 155993 44934 -95189 -199489 -219039 -145462
278a45462J28558J22949O9942p5o1791r9061j06924p9496k2496N1611J14791J33070
$$ -145462 -16904 106045 175987 175912 114121 15060 -91864 -171360 -193856 -142245 -27454 105616
290A05616R0759N505q2924j31115j18859n7149J7680P3233J01863J02290O9176
$$ 105616 196375 201880 118956 -12159 -131018 -188167 -170487 -97254 4609 106899 176075
301A76075N505o4676j14831j22558p9656P552R6533J34369J07804M4622k4747
$$ 176075 181580 116904 2073 -120485 -200141 -192589 -96056 38313 146117 190739 165992
312A65992q2621j10268r4728m8104P917O7276J16979J22164O3437k7557r8679
$$ 165992 83371 -26897 -121625 -169729 -161812 -94536 22443 144607 208044 180487 81808
323H1808j26064j05386l8648M3691R5666J03240Q2205M4426j6944q3875j17106
$$ 81808 -44256 -149642 -188290 -144599 -48933 54307 136512 180938 163994 80119 -36987
334c6987j01911m9040K7792J03912J35038R4252J6248n0375r1082j04944q2582
$$ -36987 -138898 -187938 -160146 -56234 78804 173056 189304 138929 47847 -57097 -139679
345a39679k4747L6463Q0495J05720J00603M1863m7957j11607j17771q0945j6106
$$ -139679 -164426 -127963 -47468 58252 158855 200718 152761 41154 -76617 -157562 -173668
356a73668N7464J06090J01113N9224J3232l4821q6506j11061q2907j8252M9637
$$ -173668 -116204 -10114 90999 150223 163455 128634 42128 -68933 -151840 -170092 -120455
367a20455J02584J19996P7006n512p2937r6848q9977o0054m018N6498R0647R0750
$$ -120455 -17871 102125 179131 173619 100682 3834 -86143 -146197 -150215 -93717 -3070 87680
379H7680O8820J6761o0058j14304j08155n3086J2409O9914J02590R1434L9863
$$ 87680 156500 173261 113203 -1101 -109256 -162342 -149933 -80019 22571 114005 153868
390A53868j7063n6133q3468r2428o1088N419P0230J02708R7755N0936k4277q6688
$$ 153868 136805 80672 -2796 -95224 -156312 -150893 -80663 22045 119800 170736 146459 59771
402E9771j02950p4319k8624K0612O6395R0619P9133M0180j3912p0934j07206r2027
$$ 59771 -43179 -117498 -146122 -125510 -59115 31504 110637 150817 136905 65971 -41235 -133262
414a33262l1474L8048Q4661R7120P3306J9406l9224p4188q2514p0607l4320K5396
$$ -133262 -164736 -126688 -42027 55093 128399 147805 108581 34393 -48121 -118728 -153048 -127652
426a27652Q1991J02850P8586K1703m4597r3754r8858o0704l878M5335P6297Q3808
$$ -127652 -45661 57189 135775 157478 112881 19127 -79731 -140435 -144313 -98978 -22681 61127
438F1127O2785J7168l7580q1105r7298p2491j1447N5818R5620R1802N2940k833
$$ 61127 123912 141080 103500 22395 -74903 -147394 -158841 -103023 -7403 84399 137339 134506
450A34506n3673q2840q1424n2760n591M5832Q5286R2317O0651j17o1326r6120
$$ 134506 80833 -2007 -83431 -136191 -141782 -95950 -10664 81653 142304 142187 80861 -15259
462a5259q9508m4233J5866O3170Q1370P2148M3643j2n1536q8573q7962m8317J0541
$$ -15259 -104767 -149000 -133134 -69964 11406 83554 127197 127185 75649 -12924 -100886 -149203 -138662
475a38662O5084R5051Q5438L6301k5562o9744q1387o7734l4240J3016O0396Q5285
$$ -138662 -73578 21473 106911 143212 117650 47906 -33481 -101215 -135455 -122439 -62043 23242
487B3242P7797M0244j8384p2547r4642p3337k4222K9302P1362Q5135O4070J8778
$$ 23242 101039 141283 122899 50352 -44290 -117627 -141849 -112547 -41185 43950 108020 126798
499A26798k4558n8762p9800p6331l2916L1642P9687R0169O5607J5431m0502p6825
$$ 126798 102240 43478 -36322 -112653 -145569 -113927 -34240 55929 121536 136967 96465 19640
511A9640p8653n3156j4705L1596P0831Q0619N8104J6938l1161p5114r2433o1351
$$ 19640 -59013 -112169 -126874 -95278 -24447 56172 114276 131214 100053 24939 -67494 -128845
523a28845j155M9907P3834P5071N2331M010m5429p0986p0719n3688j2454M3687
$$ -128845 -130000 -80093 -6259 68812 121143 125153 79724 8738 -61981 -115669 -128123 -84436
535h4436Q3636Q2747M8141k553n3568q4003p1821l1644P291L9036O9041P9337
$$ -84436 -800 81947 130088 127535 73967 -10036 -81857 -113501 -106210 -67174 1867 81204
547H1204M7684q105n2937p3498p4824m7245J0200O3556Q1635O5273L1533j3685
$$ 81204 128888 120783 67846 -5652 -80476 -127721 -117521 -53965 27670 92943 124476 110791
559A10791n7230p4398o0024l2006M375N1617Q5134P4411K6356k2991n8706p8075
$$ 110791 53561 -20837 -80861 -112867 -108492 -56875 28259 102670 129026 106035 47329 -30746
571c0746o6949k0768L0039N6640O2657N9824L4301j8956o6277p7979n9379k2936
$$ -30746 -97695 -118463 -88424 -31784 30873 90697 124998 106042 39765 -38214 -97593 -120529
583a20529K5942O8771P7558N1313J2905k6091o2370p6111n1459p373K8179N2188
$$ -120529 -94587 -25816 51742 103055 115960 89869 27499 -48612 -100071 -107444 -79265 -27077
595b7077P1970O3157J6333m0178p0941p1315m8251n498M1743O5729O0176M0787
$$ -27077 44893 108050 124383 84205 13264 -58051 -106302 -111800 -70057 -4328 55848 96635
607I6635J3774l0232o9840p4776m4216r09L8897O9207P2397L8330q095m1774o0761
$$ 96635 110409 80177 10337 -64439 -108655 -109564 -70667 -1460 70937 109267 101172 59398 -1363
620a363o5723m2302N259M6731O2402N9130M0736J476m7312p3416o5530l3053J0778
$$ -1363 -67086 -109388 -104129 -57398 5004 64134 104870 106346 59034 -14382 -79912 -112965 -102187
633a02187N2758P0487N4464K2329q216l8641o6145o6562l3319J5658N3999O9340
$$ -102187 -49429 21058 75522 97851 89635 50994 -15151 -81713 -115032 -99374 -45375 23965
645B3965N9669K3447k1922n2916o1488n3928k6595J7003N6534O7384N0123K0178
$$ 23965 83634 107081 85159 32243 -29245 -83173 -109768 -92765 -36231 31153 81276 101454
657A01454j6106n2809p0360n5948j7777K5801N9146O8312M6849Q497k5526m9426
$$ 101454 85348 32539 -37821 -93769 -111546 -85745 -26599 41713 88562 97059 71533 22107
669B2107o0895n2677j8033K7478O0126O6898M8436R471l4504o0578o0571l9185
$$ 22107 -38788 -91465 -109498 -82020 -21894 45004 93440 102911 68407 7829 -52742 -91927
681i1927p858K7963N6792O4079M3580N871l3971n9434o1408m0038m214L4970O2398
$$ -91927 -99785 -71822 -15030 49049 92629 98500 64529 5095 -56313 -96351 -100565 -65595 -3197
694c197O3610L6290n318l8671n5089n4229l6085k595L4871O1245O3404L6302p753
$$ -3197 60413 96703 91385 52714 -2375 -56604 -92689 -95284 -60413 832 64236 100538 92785
707I2785m5266n9285n2683k9739N776M1797O0242N2064K6839m910l9599o2326
$$ 92785 47519 -11766 -64449 -94188 -88412 -46615 13627 65691 92530 87620 48021 -14305
719a4305n6356k4869J2928M2936O0006N3894K2019j6533m3988n5806n0418k3136
$$ -14305 -70661 -95530 -82602 -39666 20340 74234 96253 79720 35732 -20074 -70492 -93628
731i3628J7598M7155N3221M7223K6725j3748n5192o4549m0571q804J6575M2702
$$ -93628 -76030 -28875 24346 71569 98294 84546 29354 -35195 -75766 -84570 -67995 -25293
743b5293N9224M6457J1833k1833m5032n7580m6460j1115K7088M8026N3947M4943
$$ -25293 33931 80388 92221 70388 25356 -32224 -78684 -89799 -62711 -14685 39262 84205
755H4205J1175l1888n3968m8651l3197j3048K2726N5308N8049L2625L358k3783
$$ 84205 95380 63492 9524 -39127 -72324 -85372 -62646 -7338 50711 83336 86694 62911
767F2911n2039o0640l5269M526L2005M8069N2971L5221l771l4882m6567m9282
$$ 62911 10872 -49768 -85037 -80511 -48506 -437 52534 87755 83984 49102 2535 -46747
779d6747l7928j906M2031N7608M4203K5802J437l4666o0754n0992j9193Q095L0887
$$ -46747 -84675 -86581 -44550 13058 57261 83063 84500 49834 -10920 -61912 -81105 -73010 -42123
792d2123N2921N3656K3906j2099l5936n1548n3462k6191J8309M4216M6084M3539
$$ -42123 10798 64454 88360 76261 40325 -11223 -64685 -90876 -72567 -28351 17733 61272
804F1272K7691j0880m9606n4267l6485j9279N042M2701O2625M4040R247j5483
$$ 61272 88963 78083 28477 -25790 -62275 -81554 -76512 -33811 28814 72854 82101 66618
816F6618l7734n6189m7869j0275K3103L8033M8335M7859J6851k7009m7061m4946
$$ 66618 28884 -27305 -75174 -85449 -62346 -24313 24022 71881 88732 61723 14662 -30284
828c0284l8928k0135K1362N5246N1643K8386R227j4763m7061n7661l2980j893
$$ -30284 -69212 -89347 -67985 -12739 38904 67290 76517 61754 14693 -42968 -75948 -77841
840g7841J9612M0310N6352L9677j316l0057l9414m6519m0309m731L6323M6837
$$ -77841 -58229 -17919 38433 78110 76794 46737 7323 -39196 -79505 -84236 -47913 -1076
852a076L7593L0616J1282k8294n5830m5502k0666j988K2089N0867N3028K0890
$$ -1076 36517 67133 78415 50121 -5709 -51211 -71877 -73865 -51776 -909 52119 73009
864G3009r098k5352m0826n0165k8332J2019L3993L8041M1864L1276o272m1734
$$ 73009 63911 38559 -2267 -52432 -80764 -68745 -34752 3289 45153 76429 70157 28423
876B8423m6514l2725k1668J270L7054N3684L5798J0902o167k8369n1525m3574
$$ 28423 -18091 -50816 -72484 -71214 -34160 19524 55322 66224 60057 31688 -19837 -63411
888f3411r870J6569K9571M3053M4785J5822k2984l8270l7248l5492j9530J7636
$$ -63411 -73281 -56712 -27141 15912 60697 76519 53535 15265 -21983 -57475 -77005 -59369
900e9369M6020M2887K6864J3146j1391m3315n1165k8054k424J4809L6438N1032
$$ -59369 -13349 29538 56402 69548 58157 14842 -36323 -64377 -66801 -51992 -15554 35478
912C5478L3774j622k2843l3148m3216l8354l453L1095M0339L6447L0748R420k8326
$$ 35478 69252 67630 44787 11639 -31577 -69931 -73384 -42289 -1950 34497 65245 74665 46339
925D6339m8271l8554k1985n731K1667M8289M6424J9756l509k0887m0745m9281
$$ 46339 -1932 -40486 -62471 -68202 -46535 1754 48178 67934 64425 43538 2793 -46488
937d6488k5589R882K8836L6364M2566K9357o587l5988m0072l4516k5337Q1L5264
$$ -46488 -72077 -62195 -33359 3005 45571 74928 68341 32353 -7719 -42235 -67572 -67491 -32227
950c2227M7896L4934J6777j921k9140m9136l9789j3240R333K5896M4159M3791
$$ -32227 15669 50603 67380 65459 36319 -12817 -52606 -65846 -56513 -30617 13542 57333
962E7333J5727j6113l1196l7259l8900k1103J4659L8433L9200L1135J7568r360
$$ 57333 73060 56947 25751 -11508 -50408 -71511 -56852 -18419 20781 51916 69484 60124
974F0124l8704m4548k8857j1194R088L3768M7000L2936N762j5081l0856m2443
$$ 60124 21420 -23128 -51985 -63179 -54091 -20323 26677 59613 65375 50294 19438 -23005
986b3005l5330p115K0456L3315L7235L2594J0082k1825l8378l5902k6125r547
$$ -23005 -58335 -65450 -44994 -11679 25556 58150 68232 46407 8029 -27873 -53998 -63545
998f3545J8206M0211L9482K2335L907j6627l7011m1907k4059J156K0336L3076
$$ -63545 -45339 -5128 34354 56689 60596 43969 6958 -34949 -59008 -57852 -37516 -4440
1010d440L9397K6903j769k5649l5190l4767k3728n8K6436L7718L3586J9687r76
$$ -4440 34957 61860 60091 34442 -748 -35515 -59243 -59301 -32865 4853 38439 58126 57150
1023E7150k5254l9432l4159j6426L665K4337L8484L4970J5600p487k4858l6641
$$ 57150 31896 -7536 -41695 -58121 -54456 -30119 8365 43335 58935 51448 26590 -10051
1035a0051l5222j7053J0532K9434L4773L1509J6497q782l2052l8167k8821j1879
$$ -10051 -45273 -62326 -51794 -22360 12413 43922 60419 51637 19585 -18582 -47403 -59282
1047e9282R156L0260L8774K9429R744j2073l0121l7401k9944q993J4617L1092
$$ -59282 -50126 -19866 18908 48337 58081 46008 15887 -21514 -51458 -60451 -45834 -14742
1059a4742L6426K8845P939j6027l1546l6549k7756o762J7266L4135L4932K5210
$$ -14742 21684 50529 58468 42441 10895 -25654 -53410 -60172 -42906 -8771 26161 51371
1071E1371N767j7116l4543l6353k3317k976J7445L3048L6771K3858J709k0601
$$ 51371 57138 40022 5479 -30874 -54191 -57167 -39722 -6674 30097 53955 55664 35063
1083C5063l3213l4480k3414j921K1726L5650L4048K0561n0k1088l4637l4765k0809
$$ 35063 1850 -32630 -56044 -57965 -36239 -589 33459 54020 53970 32882 -1755 -36520 -57329
1096e7329K516K3332L4377L2727J8768k234k3266l5217l2700j6894M432K3365
$$ -57329 -54813 -31481 2896 35623 54391 52157 28891 -6326 -39026 -55920 -51488 -28123
1108b8123L4788L1915J6578n641k4736l4198l1295j5414O858K5734L4643L0177
$$ -28123 6665 38580 55158 49517 24781 -9417 -40712 -56126 -49268 -23534 11109 41286
1120D1286J3491q222k6136l3610k8753j2551Q950K6567L3597K7777J1353r798
$$ 41286 54777 46555 20419 -13191 -41944 -54495 -45545 -18978 14619 42396 53749 43951
1132D3951k7442l3987k5901q787J0103K6596L3704K7717P392j4454k7310l0581
$$ 43951 16509 -17478 -43379 -52166 -42063 -15467 18237 45954 53346 38892 11582 -18999
1144a8999k4967q906J3753K9917L2845K2487M645j3857k8682l1798k2213l921
$$ -18999 -43966 -52872 -39119 -9202 23643 46130 50775 36918 8236 -23562 -45775 -49696
1156d9696J5702K9253L1224K0674K161j5995k9415l0946j9865k90J8083K8976
$$ -49696 -33994 -4741 26483 47157 49318 33323 3908 -27038 -46903 -47193 -29110 -134
1168a34K9314J9575L11k0328l0529k8401j6007J220J8959L0432K8696J6289k749
$$ -134 29180 48755 49066 28738 -1791 -30192 -46199 -44979 -26020 4412 33108 49397 46648
1181D6648k0460l1945k8793j3188O068K0332K8462K8370J5647o183k4220l0830
$$ 46648 26188 -5757 -34550 -47738 -41670 -21338 7124 35494 51141 44958 20738 -10092
1193a0092k5410j1752N900K2904L1304K6277J1046q183k4821l0417k5050r799
$$ -10092 -35502 -47254 -41354 -18450 12854 39131 50177 41994 17173 -13244 -38294 -48093
1205d8093Q633K4924L1406K4263Q011r903k4810l0559k5331q140J3331K6730K9191
$$ -48093 -39460 -14536 16870 41133 49144 39241 14431 -16128 -41459 -49599 -36268 -9538 19653
1218A9653K1268P068j0128k6666l1570k2944n016J4272K7109K8644K0559N473
$$ 19653 40921 47989 37861 11195 -20375 -43319 -48335 -34063 -6954 21690 42249 47722
1230D7722j3169k7114l1200k0851k059J5838K6577K7801J9604L508j5176k8423
$$ 47722 34553 7439 -23761 -44612 -46671 -30833 -4256 23545 43149 46657 31481 3058
1242C058k9536j8393k51J6530K6834K8249J7586j64j7560k7128k6842j6441j57
$$ 3058 -26478 -44871 -45122 -28592 -1758 26491 44077 43913 26353 -775 -27617 -44058 -44215
1255d4215J7327K8418K7558J5161k680j8982k6813k5523j4818J835J9309K9215
$$ -44215 -26888 1530 29088 44249 41569 22587 -4226 -29749 -44567 -42732 -23423 5792
1267E792K5658J1194m757j7991k6051k5745j3774N336K1711K7367K3179J0408
$$ 5792 31450 42644 37887 19896 -6155 -31900 -45674 -40338 -18627 8740 31919 42327
1279D2327o110k0032k6827k3331j0475O831K1993K7754K1682P934p289k1634k7904
$$ 42327 36217 16185 -10642 -33973 -44448 -37617 -15624 12130 33812 41746 34457 12823 -15081
1292a5081k1680o119J0239K0832K5547K1578O921j1017k3261k5487j8874n884
$$ -15081 -36761 -42880 -32641 -11809 13738 35316 42237 31220 7959 -17528 -36402 -42286
1304d2286J0260K4053K6109J8293M752j1905k5038k5512j6384j980J1188K2559
$$ -42286 -32026 -7973 18136 36429 41181 29276 4238 -21274 -37658 -39638 -28450 -5891
1316e891K7371J8243L66j5208k3125k4245j7213r18J6161K4662K3474J4693P05
$$ -5891 21480 39723 40089 24881 1756 -22489 -39702 -40620 -24459 203 23677 38370 39075
1329C9075j5756k5302k2941j3364l46J5419K6921K4806J1212l173j5671k4361
$$ 39075 23319 -1983 -24924 -38288 -38634 -23215 3706 28512 39724 36551 20880 -3481
1341c481k4675j2796N484J8126K2928K2220J3385l982k0177k4858k0735j0962
$$ -3481 -28156 -40952 -35468 -17342 5586 27806 41191 37209 17032 -7826 -28561 -39523
1353c9523M471J9853K5758K0342Q488n125j8357k6157k1161p339P253J8149K4724
$$ -39523 -35052 -15199 10559 30901 39389 34264 15907 -10250 -31411 -38750 -31497 -13348 11376
1366A1376K2533P393j0136k0413k3023j9155p647R404K1269K3445J7473O949q116
$$ 11376 33909 41302 31166 10753 -12270 -31425 -39072 -29668 -8399 15046 32519 39468 31352
1379C1352k2898k5314j6564l516R428K0362K5564J7583J550j1889j9637k2876
$$ 31352 8454 -16860 -33424 -36940 -27512 -7150 18414 35997 37547 25658 6021 -16855
1391a6855j7899k911J3024K1720K2330J6116K692j3781k3502k1448j3380k230
$$ -16855 -34754 -37665 -24641 -2921 19409 35525 38217 24436 934 -20514 -33894 -36124
1403c6124J3188K3656K1959J2065J5j1981k2413k3909j2748K528J4695K0859K2195
$$ -36124 -22936 720 22679 34744 34759 22778 365 -23544 -36292 -33764 -19069 1790 23985
1416B3985J3310l454j6714k1429j8830j2354J593J6574K3422J9411R408j718j6919
$$ 23985 37295 33841 17127 -4302 -23132 -35486 -33893 -17319 6103 25514 34922 33204 16285
1429A6285k4120k0196p453N117J5689K2289J9980P722o189j6544k1515j9461q639
$$ 16285 -7835 -28031 -35484 -30367 -14678 7611 27591 35313 29124 12580 -8935 -28396 -37035
1442c7035P482J8814K1079J7463P879p121k0065k2176j4915n629N827J8340K3279
$$ -37035 -29553 -10739 10340 27803 35682 28561 8496 -13680 -28595 -34224 -28397 -10057 13222
1455A3222J6886L993q843j7666k2625j7254l190J1388J8656J9814J5557L875j0350
$$ 13222 30108 34101 25258 7592 -15033 -32287 -35477 -24089 -5433 14381 29938 33813 23463
1468B3463j9799k0566j4502k936J0700K0311K1423J3298J103j1011k0584k1309
$$ 23463 3664 -16902 -31404 -34340 -23640 -3329 18094 31392 32495 21484 900 -20409
1480b0409j1317m09J1322J9469K0864J3004q35j2937k0419j9579j2215J455J4407
$$ -20409 -31726 -32135 -20813 -1344 19520 32524 31689 18752 -1667 -21246 -33461 -32006 -17599
1493a7599K0891J7914J0162j154j3635k0583j8786r501K167J4099K0893J8669
$$ -17599 3292 21206 31368 30214 16579 -4004 -22790 -32291 -30124 -16025 4868 23537
1505B3537R141m198j4716k0258j8357p928M423J5844K0178J6657Q112m739j5732
$$ 23537 32678 28480 13764 -6494 -24851 -32779 -28356 -12512 7666 24323 32435 27696 11964
1518A1964k0446j7320o952N974J7097K0241J5664N879o364j6588j9830j5428n477
$$ 11964 -8482 -25802 -32754 -26780 -9683 10558 26222 32101 25737 9149 -10681 -26109 -31586
1531c1586P029J6876K0143J5302M545p957j7864j9715j4301k917Q261J7227J9466
$$ -31586 -24557 -7681 12462 27764 32309 24352 6488 -13227 -27528 -30445 -22184 -4957 14509
1544A4509J4172K281r547j6933j8661j3916k610J0268J8911J8658J1705J065j0324
$$ 14509 28681 30962 21415 4482 -14179 -28095 -30705 -20437 -1526 17132 28837 29902 19578
1557A9578j8045j8130j1421r16J0500J8116J9162J1354j304j1707j7790j8110
$$ 19578 1533 -16597 -28018 -28934 -18434 -318 18844 30198 28894 17187 -603 -18713
1569a8713j0824J617J3097J7778J6494R975j045j2643j8758j6410r537J701J3277
$$ -18713 -29537 -27920 -14823 2955 19449 29424 28379 15736 -3022 -19432 -28969 -27268 -13991
1582a3991J9316J6868P186l247j3046j8736j6742o698N103J2673J7125J6952P974
$$ -13991 5325 22193 29379 26132 13086 -5650 -22392 -29090 -23987 -11314 5811 22763 30737
1595C0737n421j5358j7924j4667o737N127J5507J8469J3447N389m769j5031j9352
$$ 30737 25316 9958 -7966 -22633 -29370 -24243 -8736 9733 23180 28569 23800 8769 -10583
1608a0583j3646l644N225J4435J9414J4957K586q524j4426j6902j3908m209R495
$$ -10583 -24229 -27873 -22648 -8213 11201 26158 28744 20220 5794 -11108 -25016 -29225 -19730
1621a9730J5787J5882J2362M324q400j7451j7647j0165k149Q127J6826J7852J0045
$$ -19730 -3943 11939 24301 28625 20225 2774 -14873 -25038 -27187 -19060 -2234 15618 25663
1634B5663l30q302j5064j7783j1646J011J1000J4666J5993J1886l17j2509j6878
$$ 25663 25333 17031 1967 -15816 -27462 -26451 -15451 -785 15208 27094 26777 14268 -2610
1647b610j4217q953m12J1267J8161J4548P269n29j0445j8012j6718o434L882J0974
$$ -2610 -16827 -25780 -26192 -14925 3236 17784 25053 24524 14079 -3933 -20651 -27085 -23203 -12229
1661a2229J5871J6171P488n313j2566j4554j4200q326L988J4373J6619J2565O603
$$ -12229 3642 19813 27301 21988 9422 -5132 -19332 -27658 -23670 -9297 7322 19887 26490
1674B6490l322j4522j8004j2728l375M089J2371J7945J3889K899o371j2161j6077
$$ 26490 23168 8646 -9358 -22086 -25461 -21372 -9001 8944 22833 25732 19361 7200 -8877
1687h877j4885l904Q634J4330J4638J2416M727p602j6063j5674r965l466O031
$$ -8877 -23762 -27666 -19032 -4702 9936 22352 27079 19477 3414 -12260 -22225 -25691 -19660
1700a9660J5924J7394J0349J002o858j4865j7509j0994O39R050J3361J5497J2063
$$ -19660 -3736 13658 24007 25009 18151 3286 -14223 -25217 -24578 -15528 -2167 13330 25393
1713B5393K27j0505j4640j4159j0613k029J1339J6620J4133P669R10r225j6831
$$ 25393 25620 15115 475 -13684 -24297 -26326 -14987 1633 15766 23435 24345 15120 -1711
1726a711j5245o923J256Q468J5599J6476Q027l301j0786j4127j5104q688L781
$$ -1711 -16956 -23879 -22623 -14155 1444 17920 25947 22646 11860 -2267 -17371 -26059 -22278
1739b2278J2293J4150J2266Q098j689j2777j5701j2245n958J763J1372J7341J3667
$$ -22278 -9985 4165 16431 24529 22840 10063 -5638 -17883 -23841 -22078 -10706 6635 20302
1752B0302L342m087j0468j5114j3779m479N827J1131J3787J3350N538o545j3273
$$ 20302 23644 19557 9089 -6025 -19804 -24283 -18456 -7325 6462 19812 25350 18805 5532
1765E532j3845j0825m819N292J4028J4966R660L003n349j2599j5919j0046j426
$$ 5532 -8313 -19138 -23957 -18665 -4637 10329 19989 22992 17643 5044 -10875 -20921 -22347
1778b2347O075J1882J5237J1704P26q724j2777j2777j0355j696Q477J4226J2802
$$ -22347 -16272 -4390 10847 22551 23277 14553 1776 -11001 -21356 -23052 -14575 -349 12453
1791A2453Q409J864q028j4887j3783p562L17P702J3990J4644P088j689q362j3069
$$ 12453 20862 22726 14698 -189 -13972 -21534 -21217 -13515 475 15119 22207 20518 12156 -913
1805i13j3698q224K093R988J3146J2761P582j635j1121j4374j1602n981J820J0274
$$ -913 -14611 -22835 -20742 -10754 2392 15153 22735 21100 9979 -4395 -15997 -21978 -20158 -9884
1819i884J4727J2049M869k301r963j4643j3244m447M494J0290J3874J2120N003
$$ -9884 4843 16892 21761 19460 9497 -5146 -18390 -22837 -18343 -8053 5821 17941 22944
1832B2944m578j1866j3231j1177m769M559J1965J4268J0534L806m665j2291j4219
$$ 22944 18366 6500 -6731 -17908 -22677 -18118 -6153 8115 18649 22455 17790 5499 -8720
1845h720j0331k694N201J1740J4318J0398J909n722j1381j4156j0666k484P307
$$ -8720 -19051 -21745 -16544 -4804 9514 19912 21821 16099 4718 -9438 -20104 -22588 -15281
1858a5281J3005J2890R526J450o939j2738j2926q581j841P493J2727J3190Q220
$$ -15281 -2276 10614 20140 21590 14651 1913 -11013 -19594 -21435 -13942 -1215 11975 20195
1871B0195P41p581j2423j3467q295J018Q069J2355J2273Q197q88q534j2915j2050
$$ 20195 20936 13355 932 -12535 -20830 -19812 -11743 612 12885 21082 20194 11660 -1255 -13305
1885a3305p361Q71Q873J3260J1564O475r91r180j3346j1178n683J966Q663J2758
$$ -13305 -20666 -19795 -10922 2338 13902 20377 19386 10206 -3140 -14318 -20001 -18035 -9372 3386
1899C386J1916N176k527r693j2586j0980n387L316J0242J2286J0671M318l644
$$ 3386 15302 20478 17951 8258 -4328 -15308 -20695 -17379 -7137 5149 15820 20138 16494
1912A6494r760j2546j0257m180L785J0551J3032R741K906m674j0619j1908r926
$$ 16494 6734 -5812 -16069 -20249 -16464 -5913 7119 16860 19766 15092 4473 -7435 -17361
1925a7361k688N195J0875J2304R095J686n046j0647j2501r252j496O191J1489
$$ -17361 -20049 -14854 -3979 8325 17420 19106 14060 3413 -9088 -18340 -19836 -13645 -2156
1938b156J1602Q480J243o389j1821j2023p101q76O861J1408J2060P125K50p265
$$ -2156 9446 17926 19169 12780 959 -11064 -18165 -19041 -12180 -772 11288 18413 18663 11398
1952A1398j1888j1611o823Q07P544J1288J1348P036j199q188j1736j0808o151
$$ 11398 -490 -12101 -18924 -18117 -10573 715 12063 19099 17900 9712 -2024 -12832 -18983
1965a8983J219Q370J2118J1169N212k154q429j1692j0805n301K090R182J2096
$$ -18983 -17764 -9394 2724 13893 19105 16951 8522 -3170 -13975 -19276 -17186 -8004 4092
1978D092J0618M711l027r437j1770j0156m353L045R547J2285R485M102l601r668
$$ 4092 14710 19421 16394 6957 -4813 -14969 -19322 -16277 -6730 5555 15040 19142 15541 5873
1992E873j1921r712l328L797J0165J1617R371L427m511j0257j1797q807k597M603
$$ 5873 -6048 -15760 -19088 -15291 -5126 6491 15862 19289 14778 4521 -7276 -16083 -18680 -14077
2006a4077J0175J1355Q936K425n118j0281j2225p807j384N110J0455J1008P990
$$ -14077 -3902 7453 16389 18814 13696 3415 -8810 -16617 -18001 -12891 -2436 8572 16562
2019A6562J717n975j0930j0651p378j205N875J0867J1339P049L42o471j0765j0737
$$ 16562 18279 12304 1374 -9277 -16655 -17860 -11985 -1118 10221 17270 17612 11141 376 -10361
2033a0361o175m16O799J0656J0435O193m41p028j0762j0222n500P99P227J0659
$$ -10361 -16536 -16952 -10153 503 10938 17131 16690 9662 -1100 -11322 -16822 -16023 -8796 1863
2047A863R990M949r40p507j0906r367m761J565P858J0657R163M299k057p837j0935
$$ 1863 11853 16802 15862 8355 -2551 -11918 -16679 -15114 -7256 3401 12564 16863 14806 6969 -3966
2062c966r532l357L040Q253J0345Q738L595l341q491j0643q597l145M170Q683
$$ -3966 -13498 -16855 -13815 -5562 4783 13521 17116 13775 5284 -5359 -13956 -17101 -12931 -4248
2076d248J0437P854K749l800r254j0953p460j666M267R081J0689P500J568n201
$$ -4248 6189 14043 16792 12992 3738 -7215 -14675 -16341 -12074 -2993 7696 15196 16764 11563
2090A1563r507r998p586j220N860R740R745O620J154n776r851j0220o229j16N532
$$ 11563 2056 -7942 -15528 -16748 -10888 -1148 8597 15217 16371 10595 744 -9476 -15705 -15821 -10289
2105a0289J0143J0530N478l16n662r735j0315o339Q54O954R673R490N810o02p302
$$ -10289 -146 10384 15862 15546 9884 149 -10166 -16505 -15651 -8697 976 10466 16276 15674 8372
2120H372r986r426n046L27Q005J0612Q618M413j403o927j0487r210m013J962P325
$$ 8372 -1614 -11040 -16086 -15759 -7754 2858 11476 15889 14486 7559 -2928 -12138 -16151 -14189 -6864
2135f864J0022R143M323k709q267r260q681m400K746Q462J0042P951L367k310
$$ -6864 3158 12301 16624 13915 5648 -3612 -12293 -16693 -13947 -5485 4557 12508 15875 13565
2149A3565q417j0392p505l189K874Q189J0327Q104K068l711q224r405q031j969
$$ 13565 5148 -5244 -12749 -15938 -13064 -4875 5452 13556 15624 11913 3689 -5716 -13747 -15716
2163a5716M373Q009R642P510K036m845r109q827o543j638L937R422R691N836J000
$$ -15716 -11343 -3334 6308 13818 15854 11009 1900 -6927 -13470 -15108 -11171 -1749 7942 13778 14778
2178A4778m429q710r962o463L78N437P950R330O356k0o000q926q396n672k6O304
$$ 14778 10349 1639 -8323 -14786 -14408 -8971 -1021 8309 14665 14645 8645 -281 -8677 -14349 -14375 -8071
2194h071R068Q555M544M1n966r840q396m194Q28N743R518Q681M440j979o622q316
$$ -8071 997 9552 14096 14137 8171 -1669 -10065 -14259 -13431 -7688 1830 10511 14951 12972 6350 -1966
2210a966q377m811K176P472Q580P648L955j859p574r325p065k966K069O815R452
$$ -1966 -10343 -15154 -12978 -5506 3074 10722 14677 12818 5244 -4081 -11146 -14112 -12043 -5228 4224
2225D224Q022K082k781o952r100p732k383L767P277Q374P634K367l975q099q523
$$ 4224 12246 14328 11547 4595 -4505 -12237 -14620 -10853 -3576 4798 12432 14799 10824 2725 -5798
2240e798o834j991L649Q503R499N499J443l412q610r328n624o80M033P664R190
$$ -5798 -12632 -14623 -10974 -2471 7028 12527 13970 10558 1948 -7380 -13004 -13684 -9651 -1987 7203
2255G203O609R1n111q018q113o167o13N580Q232Q369N117L82n145q729q255m748
$$ 7203 13812 13903 8792 774 -7339 -13506 -14119 -8539 -307 8062 13179 13561 8416 -313 -8568 -13316
2271a3316r1N284R071Q687M296j497n125q023q562m277J177O194P658P564M910
$$ -13316 -13407 -8123 948 9635 13931 12434 7309 -714 -9276 -13553 -12376 -6182 1476 9040 13950
2286A3950j360o427q719p242l762J308O880Q610O948L278j817o268q456p873k825
$$ 13950 12590 6163 -2556 -9798 -13560 -12252 -5372 3238 10186 13464 11647 5379 -3077 -10950 -13775
2301a3775K468O822Q099P266K835k837o927q173o658k610K843P115Q167N884K690
$$ -13775 -11307 -4485 3614 10880 13715 10878 3951 -4222 -10880 -13490 -10647 -3532 4635 10519 13209
2316A3209k855p132q557o220j589L453P412P974N885J101l706o971p839o062j185
$$ 13209 10354 3222 -5335 -11555 -13144 -9691 -2279 5695 11580 12681 8975 2004 -5835 -11897 -13082
2331a3082M273P591P813N249J028m670p735p364n309m4M329P517P927M724M3m731
$$ -13082 -8809 -1218 6595 11844 12872 8202 467 -6897 -12206 -12250 -7921 -404 7523 12247 12290 7559
2347G559p384q091m501L96N047P883P337L806q78m873p429p186m040P85N323P684
$$ 7559 175 -7916 -12417 -12021 -6974 909 8246 12052 11174 6301 -1128 -8314 -12354 -11569 -6246 1438
2363A438P532L754j498n804p834p020k873J760N962P384O179L400j727n606q223
$$ 1438 8970 12724 11226 5422 -2412 -9432 -12305 -10545 -4583 2801 8980 12380 10653 5047 -3176
2378c176o566k874J900O532Q187N944K447k536o529p176o179k316K658O280P720
$$ -3176 -9742 -12616 -10716 -4184 4003 9947 12394 9858 3329 -3847 -10026 -12342 -9684 -3404 4316
2393D316N944K283k807p208p791n733j126L520O079P868N158J119k907o694p642
$$ 4316 10260 12543 9736 2528 -5263 -10996 -12122 -8602 -2523 5345 10503 11622 8715 2021 -5621
2408e621n510j181L965P273P605M637K71l972o868o975m386p61L688P268P619
$$ -5621 -11131 -12312 -8347 -1074 6531 11168 11439 7467 599 -6376 -10762 -11523 -7835 -567 7052
2423G052L956Q34m547p530p326m128R28M462O979O540M181q88m396o588p093m150
$$ 7052 11008 11842 7295 -235 -7561 -11689 -10761 -6299 680 7220 11401 10513 6117 -471 -7564 -11714
2439a1714M42N669P422O478L550j199n779p306n776k257P91M074P633O546K846
$$ -11714 -11272 -5603 1819 8297 11847 10648 4869 -2437 -8213 -10470 -9679 -5605 2028 8574 11420
2454A1420j658n125p302o500k603K715N747O679N528K267k052n619p091n137k563
$$ 11420 9762 4637 -2665 -9165 -11768 -9053 -3306 3373 8901 11168 9116 3497 -3594 -8731 -11294
2469a1294J859N919P899N502J648k815o287p304m992p14L184N048O564N702J567
$$ -11294 -9435 -3516 4383 9885 11533 8718 2431 -4873 -9865 -10579 -7395 -2347 4217 9919 11486
2484A1486l284n959p117n436j120M260O562O341M069O34k921o426o783m073m86
$$ 11486 8202 2243 -4874 -10310 -11430 -7170 -608 5733 9802 10436 7515 1089 -5694 -9767 -10253
2499a0253K962O206P602M520m65m259o571o476l443l8M731O074N327M181K26l934
$$ -10253 -7291 -1085 6517 11037 10572 6313 -258 -6734 -10177 -10215 -5484 590 5917 10098 10324 6390
2515F390p116o161l792M31M771P116O493K323j279m476o049o001k884J195M285
$$ 6390 -726 -6887 -10679 -10248 -5477 1639 8132 10455 9176 4700 -1349 -7350 -10234 -9039 -4754
2530d754O301O293L255j677n542o999m934k167J973N066O414M527J734j050m511
$$ -4754 1547 7840 11095 9418 3876 -3123 -8057 -10224 -8251 -3185 3229 7756 9490 8440 3929
2545C929p160n338j769J864N334P248N119J089l245n123n475m980j663K389N493
$$ 3929 -3231 -8569 -10338 -8474 -3140 4108 9227 10316 7071 1948 -3527 -8507 -10170 -7781 -2288
2560b288O421M544J836k828o332o568m024o95L484N541N954L622L49k698m765
$$ -2288 4133 8677 10513 7685 1353 -5215 -9239 -9934 -6450 -909 5045 8667 9016 6318 1553
2575A553o480m758q19L885O115O326M206n95m063o367m972k990j66L209O063N736
$$ 1553 -4927 -9685 -10504 -6619 -504 5822 10028 9433 5370 -997 -5969 -8959 -9125 -5916 147 5883
2591E883L496K26l877o735o296l084J435M587N817N154K671j117l931n835m881
$$ 5883 9379 9605 5728 -1007 -7303 -10387 -8952 -4365 1452 6606 9277 8160 4229 -1606 -6487
2606f487l540N51M712O768N666K488j807n386o050m769j306J399M304N064N329
$$ -6487 -10027 -9476 -4764 2004 7670 10158 8351 2965 -3085 -7854 -9160 -7761 -3457 1607 6936
2621F936K668j154m919o342n680k030K686N770N756M639J117k841m646n130m173
$$ 6936 9604 8450 3531 -2811 -8491 -10521 -7835 -2065 3691 8330 9447 6606 1960 -3170 -7343
2636g343j623R35N308O478M740J539l405n194o552l420r1K807M388N263L911J227
$$ -7343 -8966 -8031 -2723 3755 8495 10034 6629 1435 -5117 -8537 -8628 -5821 -1433 3830 7741 8968
2652H968k212n167o334m349o83L798O076N581K820n49k909n265n035k851j97K844
$$ 8968 6756 1589 -4745 -9094 -9777 -5979 97 5678 8498 7949 5040 -225 -5260 -8111 -8308 -5464
2668e464N040N646M093k4m212n821n764k545J642L430N212M270K499J28l265n585
$$ -5464 -424 5222 9315 9291 5079 -742 -6506 -9051 -7409 -3979 1233 5503 8002 8130 4865 -720
2684g20n428l053J065M422O041M935J658k226m076m546m208j909O61M199M999
$$ -720 -6148 -9201 -8136 -3714 2327 7262 8920 6694 2618 -1928 -6136 -8045 -7384 -3185 1814
2699A814N036K595j735m661o120n025r10K573N014N024L172J196j318m136n025
$$ 1814 6850 9445 7710 3049 -3071 -8096 -9006 -6433 -1419 3605 6777 7973 6655 2519 -2506
2714b506n048j827K323N160O236M171J93k847n173m662k940p35K017M379N000
$$ -2506 -7554 -9381 -7058 -1898 4338 8509 8702 5855 682 -3980 -6920 -7655 -5638 -1259 3741
2729C741L824J449k427n269o251l758K30L859M874N083K412n46k636l901m863
$$ 3741 7565 9014 6587 1318 -4933 -8691 -8461 -4602 272 5355 7767 7221 4585 684 -4179
2744d179l710l14K631N699N675K967o06m255m856m547k315Q36L049M452M550K650
$$ -4179 -7889 -8203 -5572 127 5802 8769 8163 3908 -948 -5495 -7810 -6974 -3925 527 5077 7727
2760G727j02l085n705n051k710J295M694N369M019J136j132l402m425l981k471
$$ 7727 7625 4540 -1165 -6216 -8926 -7631 -2937 2432 6451 7587 6455 3053 -1372 -5353 -7824
2775g824M78L521N762M853K263j884n136n322l397o65J695L571L983L899J650
$$ -7824 -7346 -3825 1937 6790 9053 7169 2033 -3289 -6686 -7351 -5656 -2085 1898 5797 7447
2790G447n90m097n426m794r17K071N120N140L181J98k467l750m486l172p07J271
$$ 7447 6857 2760 -2666 -7460 -8377 -6306 -1186 3954 7135 7333 4866 1116 -3370 -6542 -7249 -5978
2806e978L915N299L957Q52k494n224n276k817P11L308L410M085K887K69k010l932
$$ -5978 -2063 3236 7193 8045 5551 327 -4949 -7766 -7055 -3747 -337 3748 6635 6904 4894 962
2822I62n257l625l37L349N377N086K195j357l222m239l333k077k62K608M168M744
$$ 962 -4295 -7920 -8257 -4908 469 5555 7750 6393 3171 -1068 -4401 -6478 -6740 -4132 36 4780
2838D780L292p37l521n789m026k209J874M007M348L134J603p06l230l788m561
$$ 4780 8072 7335 3814 -1975 -6001 -8210 -6336 -2329 2019 5153 6756 6050 2820 -968 -5529
2853e529k197J085L548N653L920J263k183m147m384k982n94J243L052L923M273
$$ -5529 -7726 -6641 -3093 2560 6480 7743 5560 1413 -2971 -5953 -6547 -5304 -2252 1671 5944
2868E944J778j245m613n333l891p86K840M518M441K362K60j464l629l950l644
$$ 5944 7722 6477 1864 -3469 -7360 -8146 -5306 -788 3653 6015 6275 4811 1182 -2768 -6412
2883f412j187J753M591N302L417ql268m577l905k473M75K076L457L840L063J187
$$ -6412 -7599 -5846 -1255 4047 7464 7456 4188 -389 -4294 -6767 -6292 -4216 -759 3081 6144 7331
2899G331k096m865m924l167K27L637N142L470J803l90k911l292l892k511m31K316
$$ 7331 5235 370 -4554 -7721 -7494 -3857 1285 4755 6558 6168 3257 -35 -3927 -6438 -6869 -4553
2915d553M720M930K520n09m259m685l827p57J163K575L724L016K474n66k256m672
$$ -4553 167 5097 7617 7108 2849 -1836 -5663 -6420 -5257 -2682 1042 4058 6532 5966 3710 -962
2931i62m408k246J484M248M086L736O20j350l481l264k959j695O42L149M316L966
$$ -962 -5370 -7616 -6132 -1884 2202 5938 6558 5208 1727 -1537 -4496 -6191 -5549 -2400 1916 5882
2947E882J659j712l953m806l050l89K513K853L554K612J068j097l181m213l951
$$ 5882 7541 5829 1876 -2930 -5980 -6369 -3856 -1003 2551 5163 6231 5134 1953 -2260 -6211
2962f211j184K355M442M631K629m33k158l970l430j553n58J173L185M470L288
$$ -6211 -7395 -5040 -598 4033 6662 6229 4071 101 -3329 -4882 -5440 -4267 -1082 3388 6676
2977F676M83k656m457m354k391Q87L287L323K942J865k71j813l165l743k466p19
$$ 6676 7159 4503 46 -4308 -6699 -5812 -2525 798 3740 5605 5334 3521 356 -3387 -5853 -6572
2993f572K589M976M448J318j015l397l661l218j365R03K019L435L382K704j37
$$ -6572 -3983 993 5441 6759 5744 2347 -1314 -4532 -5897 -4994 -2975 460 3842 6546 6409
3008F409l143m849m001j493J766L561M007K311Q48p65j915l913l398j771N48K987
$$ 6409 3266 -1583 -5584 -7077 -5311 -1750 2257 4568 5416 4651 2736 -1177 -4575 -6346 -5798 -2811
3024b811M874L850J099k231l867l437k448n31J201K692L069L253J731j135l411
$$ -2811 2063 5913 7012 4781 914 -2523 -4971 -5502 -4301 -1609 1460 4713 6444 5309 1898
3039A898m641l562o38K194M217M132J744j91j590k526l169l015p56J214L128M957
$$ 1898 -2743 -6305 -6943 -4749 -532 3600 5344 5153 3563 1037 -2132 -5147 -5903 -4689 -1561 3396
3055C396K870L53l320m033l060k005L19K005L386K851K003P30j426l642m378k688
$$ 3396 6266 6619 3299 -734 -3794 -5799 -5480 -3475 -89 2762 4765 5495 4069 427 -3951 -6639
3071f639N24K806M311L288J556j182k281l026k628k212J49J853L453L819K295
$$ -6639 -6115 -3309 1002 4290 5846 4664 2383 -643 -3271 -5483 -5334 -3481 -28 3791 6086
3086F086k0l935m071l107p05J444K343L029K553J458l59j835l586l833k007J123
$$ 6086 6066 2131 -1940 -5047 -5752 -4308 -1965 1064 3617 5075 4716 2881 -705 -4538 -6545 -5422
3102e422L397M288K994P63j925l021l047k115j048O50K442L440L694J179j623
$$ -5422 -2025 2263 5257 6020 4095 1074 -1973 -4088 -5136 -4486 -2044 1396 5090 6269 4646
3117D646l538m266k196l47K401K993K787K011M02j090k433l333l393r56J585M402
$$ 4646 1108 -3158 -5354 -5701 -3300 -307 2480 4491 4893 3803 1370 -1963 -5356 -6312 -4727 -325
3133c25L908K368o06k251l359k937j323m16J605K505L294K793O45j787m155m012
$$ -325 3583 5951 5345 3094 -265 -3202 -4525 -4941 -3336 -831 2463 5256 5901 4114 -41 -4053
3149d053k188J109K678L374K660J198l70j353l084k885k478k48K361L875L895
$$ -4053 -6241 -5132 -2454 920 3580 4778 4408 3055 -29 -2914 -5392 -5640 -3279 596 4491
3164D491J500j053k758l732k810m60P98J755K670L382J836j20k593l907l667j299
$$ 4491 5991 4938 2180 -1552 -4362 -4822 -4024 -2269 401 3783 5619 5499 2906 -1001 -4668 -5967
3180e967J525L374L431J947M33r74k182k367k894j499O53J873M625L367M75j569
$$ -5967 -4442 -1068 2363 4310 4743 3769 1587 -780 -3674 -5173 -4520 -2647 1978 5345 5820 4251
3196D251l380l389j932j34J199K475K610K317J179q50k821l856k568q78J918L874
$$ 4251 871 -2518 -4450 -4584 -3385 -910 1700 4017 5196 4346 1525 -2331 -4899 -5777 -3859 15
3212A5L207J911j85k000k574k437k195o32J392K703L732K505O3k145l675l347
$$ 15 3222 5133 4948 2948 374 -2063 -4258 -4890 -3498 -795 2937 5442 5505 3360 -315 -3662
3228c662j573J144J992K413K563J657j4j156l278l111k356K4K719L705L377P23
$$ -3662 -5235 -4091 -2099 314 2877 4534 4520 3364 86 -3025 -5381 -5357 -2638 1067 4444 5167
3244E167j126k576k366k120j377M22J598K554L178K262o37l014l538l030o03J178
$$ 5167 4041 1465 -901 -3021 -4398 -3976 -2378 176 3354 5616 4979 1965 -1573 -4603 -5206 -4028
3260d028K975K563J952O45k84j733l157l152j136R44K784L639K851L36j804k665
$$ -4028 -1053 1510 3462 4107 3823 2090 -1067 -4219 -5355 -4411 -1627 2012 4863 5199 3395 730
3276G30k867j748l61R37J809K850K532J431j208l219l546k202j95J862L191K563
$$ 730 -2137 -3885 -4246 -3309 -1500 1350 3882 5313 4105 886 -2660 -4862 -5057 -3195 -4 2559
3292B559J455J50j145k067k965k322q13J596K906L600K249k17k211l441k564r01
$$ 2559 4014 4164 3019 952 -2013 -4335 -5148 -3552 -646 2954 5203 4986 2775 -666 -3230 -4131
3308d131j69J730K522K549K045K69j435l787l061j716M63K703L121K480O00p49
$$ -4131 -4300 -2570 -48 2501 4546 4815 3380 -407 -3468 -5184 -4721 -2018 1103 3583 4183 3434
3324C434j588j949k738j556J47J429L546L017J561r48k675l533j919k80N49J987
$$ 3434 1846 -103 -2841 -4397 -4250 -2821 725 3742 5303 4355 1680 -1853 -3772 -4052 -3503 -1516
3340a516K459K207J205n19j628l268k827j104J135K645L062K275K47j265k173
$$ -1516 943 3150 4355 3836 2208 -1060 -3887 -4991 -3856 -1211 1851 4126 4373 3108 935
3355I35k601j610j284O88K352L463K199R30j202l305l024k034K85J168K452K582
$$ 935 -1666 -3276 -4560 -3872 -1520 1943 4142 5072 3870 565 -2459 -4493 -4208 -3040 -588 1994
3371A994J809N69j184k280k754k684n38K152L059K887J534k10k166k367k217j311
$$ 1994 3803 4372 3188 908 -1846 -4530 -5068 -2916 143 3030 4564 4354 2188 -179 -2396 -3707
3387c707n71J258K471K924J968M06j773l033l038j302K80K277K277K061J494m3
$$ -3707 -4278 -3020 -549 2375 4343 4749 2976 -57 -3095 -4397 -4117 -1840 437 2498 3992 3949
3403C949j715k330k676j594P0J909L167K751R34r17k028k368k198p92L20J343
$$ 3949 2234 -96 -2772 -4366 -4296 -2387 780 3531 4465 3548 1520 -848 -3046 -3838 -3518 -2175
3419b175K593K718J431o22k614k700k367j057J405K585K177K094N60q56j634k322
$$ -2175 418 3136 4567 3945 1331 -1369 -3736 -4793 -3388 -803 1374 3468 4028 3172 1538 -784
3435g84k337j462J016K275K918K302P06j434k826k379j637m09J178J887K499K000
$$ -784 -3121 -4583 -3567 -1292 1626 3928 4634 3200 374 -2005 -3642 -4051 -2873 -986 1513 3513
3451C513Q33j141k325l180k089P0J614K674K709J141L7j473j887k564j661n13
$$ 3513 4346 3205 880 -2300 -4389 -4319 -2705 -31 2678 3819 3856 2383 496 -2068 -3729 -4242
3467d242J310K434K765K045j60j510l032k362j174N10J402K373J907J287M23j357
$$ -4242 -2932 -498 2267 4312 4152 2642 -390 -2752 -3926 -3416 -2014 359 2266 3553 3976 2619
3483B619k919k532j579M38K038L028J940Q85l75j782k555j919j037J51J682K736
$$ 2619 -300 -2832 -4411 -3973 -1935 1093 3033 3918 3543 1761 -794 -2713 -3750 -3599 -1917 819
3499H19K400J089m45k289k755k281m63J173J538K630J427R38l89j681k585k515
$$ 819 3219 4308 3863 1574 -1181 -3462 -3925 -2752 -1214 1416 2843 3781 3392 1711 -874 -3389
3515c389r40J044K320K846J695L36j104k253j843j746p21P46K127K174K436O97
$$ -3389 -4329 -3285 -965 1881 3576 3912 2808 555 -1288 -3034 -3755 -3009 -882 1292 3728 4425
3531D425j443k338k320k092j77J436K028K288J320N63j020k262k384j511n08J348
$$ 4425 2982 644 -1676 -3768 -3945 -2509 -481 1807 3127 3690 2670 408 -1976 -3487 -3995 -2647
3547b647K280K937J271Q9j846k390k120j148k25J493K342K030J998J5k044k531
$$ -2647 -367 2570 3841 3930 2084 -306 -2426 -3574 -3799 -2306 36 2066 4064 4079 2035 -496
3563d96k402j020L49J770K526J903Q58j31j545k059k501r19J18J738K802K055
$$ -496 -2898 -3918 -3569 -1799 727 2630 3488 3357 1812 -247 -2748 -3667 -3549 -1811 991 3046
3579C046R73p66k140k230j859m48L38J850K148J748J198n84j786k677j891p68
$$ 3046 4019 3253 1113 -1117 -2976 -3424 -3086 -1236 912 2660 3858 3274 1488 -1189 -3080 -3848
3595c848R62J960K402J722Q2p79k049j696j862o80P95K138K348J809O94j598k137
$$ -3848 -2886 -926 1476 3198 3280 2501 452 -1244 -3106 -3786 -2991 -853 1495 3304 3998 2400 263
3612B63k123j424q3J088J589K394J238P59r68k201k548j576j90J437K385K270
$$ 263 -1860 -3284 -3367 -2279 -690 1704 2942 3701 2733 532 -2016 -3592 -3782 -2345 40 2310
3628B310J189n3j080k596j606j615j00J400J755K460J790k65j710k394j921q64
$$ 2310 3499 3446 2366 -230 -1836 -3451 -3551 -2151 -396 2064 3854 3589 1879 -515 -2436 -3300
3644c300M68Q49K265K134R62j6j485k403j901j226M38J680K218K116R87o45j891
$$ -3300 -2832 -1983 282 2416 3378 3362 1877 -526 -2427 -3653 -3215 -1535 683 2799 3786 3141 1250
3661A250j887j588j458L96J617K447K016J064n82j865k648j786p67J104J718K103
$$ 1250 -637 -2225 -3683 -3287 -1670 777 2793 3857 3275 1410 -1238 -3024 -3791 -2687 -969 1134
3677A134J621O66n43j819k161j815o59R73J498K678J429M67r66j740k225j420
$$ 1134 2755 3421 2878 1059 -1102 -2917 -3576 -2603 -1105 1573 3002 3469 2503 763 -1462 -2882
3693b882l13O43K216J860J429N79j006k017k548j233k15J122K239K176J061O8
$$ -2882 -3195 -2552 -336 1524 2953 3532 2526 509 -2039 -3272 -3487 -2365 -126 2050 3111 3179
3709C179q35j818k360j590K64J016K219K332J050r7j526j928j774j296J85J309
$$ 3179 2344 526 -1834 -3424 -3160 -2144 75 2407 3457 3360 1834 -94 -1868 -3164 -2979 -1670
3725a670K101J617J195j40j475j857k536n54O1J905K023J636J038k91j402j999
$$ -1670 431 2048 3243 3103 1628 -229 -2765 -3319 -3258 -1353 670 2306 3344 3053 1651 -348
3741c48j916j120M15J571K451J532O70o11j353k160j856n71P40J674J670J693
$$ -348 -2264 -3384 -2969 -1398 1053 2585 3255 2644 1291 -869 -2725 -3296 -2556 -882 788 2481
3757B481Q42n42j857k171j659n61J035J912J998J412M51j160j823j599j468n99
$$ 2481 3323 2781 924 -1247 -2906 -3467 -2432 -520 1478 2890 3341 2181 358 -1241 -2709 -3308
3773c308R32J704K202J478K46o87k162j830j586j1R47J717K160J063J08q55j854
$$ -3308 -2376 -672 1530 3008 3254 2567 405 -1425 -3011 -3022 -2075 -358 1802 2865 2973 2118 264
3790B64k117j126k47J237J846K285P79J44j208j881j973r76K79Q20J991J787J326
$$ 264 -1853 -2979 -3226 -1989 -143 2142 2921 3065 1857 -24 -1997 -2973 -2694 -1874 117 1904 3230
3807C230m02j159k156j742r40M86J267J862J751Q86l10j520j808j702o26J77J217
$$ 3230 2828 1669 -487 -2229 -3169 -2683 -1416 446 2197 3083 2773 1253 -555 -2257 -2883 -2706 -1489
3824a489J921K112N16m19j553j998j374q30N55J391K142J697N89q03j477k043
$$ -1489 432 2544 3060 2641 1088 -910 -2284 -3114 -2559 -1168 974 2671 3260 2457 980 -1063
3840a063j367n85R31J358J801J087P40m88j918j550j388o53R12J659K066J258
$$ -1063 -2430 -3015 -2084 -726 1075 2162 2902 2414 496 -1054 -2442 -3095 -2183 -524 1542 2800
3856B800J83q78j763j655j499r0Q57J880J615J367j3o06j612k395j125k07J343
$$ 2800 2983 2105 342 -1313 -2812 -2902 -2045 -165 1450 2817 2804 2198 586 -1809 -2934 -3141 -1798
3873a798J563K111Q52J76j191j635j869j057J92Q61J760J967R60k41j173j577
$$ -1798 -235 1876 2728 2904 1713 78 -1791 -2848 -2656 -1795 -35 1932 2892 2651 1478 -99
3889i9k018m61j86J704J548J364R94J84j591j876j808p07K57J460J667J628R55
$$ -99 -2117 -2578 -2764 -1060 488 1852 2846 3030 1439 -437 -2245 -2952 -2695 -1235 432 2060 3015
3906C015m93j387j982j453r37P99J288J970J612N42m37j644j894j328m53L67J461
$$ 3015 2522 1135 -847 -2300 -3237 -2438 -1150 820 2432 2974 2537 893 -1001 -2329 -2782 -2415 -954
3923i54J634J476Q61q44j107k294j224m65M26J900J874J404p8m68j620j902j052
$$ -954 680 2156 3017 2173 1066 -1228 -2452 -2917 -2491 -591 1283 2687 2609 2141 521 -1381 -2433
3940b433l29R61J407J526J426J88n64k051j372j400k84J074J772J639J168J7r74
$$ -2433 -2762 -1801 -394 1132 2558 2746 2182 131 -1241 -2641 -2925 -1851 -79 1560 2728 2745 1771
3957A771k121j536p41p6J028J602K006R71o5j174j760j762o28k8J058J731J518
$$ 1771 -350 -1886 -2627 -2703 -1675 -73 1933 2904 2839 1665 -95 -1857 -2485 -2513 -1455 276 1794
3974A794Q80O7j098j881j620q30m5J251J907J817L94k79j091j974j423o43N65
$$ 1794 2674 2741 1643 -238 -1858 -2688 -2733 -1482 425 2242 2636 2357 1266 -708 -2131 -2774 -2209
3991b209J352J684J217Q78m66j675j596j405n98P50J145J411J727L43o59j079
$$ -2209 -857 827 2044 2922 2456 781 -815 -2220 -2818 -2068 -923 488 2215 2558 1899 820
4007H20k029r01o36P79J364J628J336M25o55j658j805j038j38O01J470J917R26
$$ 820 -1209 -2110 -2746 -1967 -603 1025 2361 2786 2131 473 -1332 -2370 -2508 -1907 -437 1480 2406
4024B406M68j123j520j739j161r5J207J426J816O26N2n78k054j270p10m81J196
$$ 2406 2874 1751 231 -1508 -2669 -2764 -1557 -131 1685 2311 2363 1785 -269 -1539 -2249 -2730 -1534
4041a534J724J750N08K95j043k084j306p30j44J047J696J602P66k55q83j594j556
$$ -1534 190 1940 2448 2743 1700 -384 -1690 -2420 -2564 -1517 179 1781 2547 2292 1409 -185 -1741
4058a741o68K25J048J523J397J051m15j452j704j192q01O6J675J577J445N21m09
$$ -1741 -2409 -2184 -1136 387 1784 2835 2420 968 -736 -1928 -2729 -2663 -988 589 2034 2555 2146
4075B146j533j539j278n47N09J359J563J450M57o14r72j573j890pL86J260J678
$$ 2146 613 -926 -2204 -2751 -2242 -883 680 2130 2587 1973 1001 -572 -2462 -2469 -2083 -823 855
4092H55J486K34p84j330j506j400l15P72J592J752P48K24k89j839j220j151l25
$$ 855 2341 2575 1791 461 -1045 -2445 -2760 -1988 -396 1356 2104 2328 2039 200 -1020 -2171 -2496
4109b496Q03J497J527R63J03o59j841j364j020k96J295J271J592J101k05r50j210
$$ -2496 -1693 -196 1331 2294 2397 1738 -103 -1467 -2487 -2783 -1488 -217 1375 2476 2271 1321 111
4126A11j648j043K69R04J661J279R24j75q39j700j323p17R3J063J409J395Q05
$$ 111 -1537 -2580 -2311 -1407 254 1533 2457 2282 1443 -257 -1580 -2297 -2204 -1141 268 1663 2468
4143B468m17r13j448j367r89N24J023J459J413N80L9j209j910j018p70P76R93
$$ 2468 2051 1138 -310 -1677 -2666 -2142 -1119 340 1753 2333 2372 1163 -747 -1765 -2535 -1759 -766
4160g66J530J141O15m85j309j709j167l60O34J374J401J081P39q61j541j651q07
$$ -766 764 1905 2520 2035 726 -983 -2150 -2510 -1876 -502 899 1980 2719 1858 317 -1334 -2141
4177b141m32O49J496J385J494n92L55j674j415j347o4J041J051J091J002J74p67
$$ -2141 -2573 -1924 -428 957 2451 1859 2214 540 -875 -2222 -2286 -1245 -194 897 1899 2073 1306
4194A306j115j504p02l32Q82J270J744Q44J6j241j391j290p30J27Q28J644J261
$$ 1306 191 -1313 -2015 -2347 -1465 -195 1549 2393 2409 1168 -223 -1513 -2243 -2116 -1288 356 1617
4211A617N54o8j012j418j111r18J37J281J099J371Q38r7j319j444j349l77K12
$$ 1617 2171 2103 1091 -327 -1438 -2356 -2219 -938 161 1532 2370 2273 954 -490 -1839 -2216 -2004
4228b004J149J250J390O80k32j455j289j510k51N67Q87J708R55M48o88j120j323
$$ -2004 -855 395 1785 2465 2233 778 -511 -2021 -2272 -1705 -818 890 1845 2293 1605 485 -838
4245h38j005p65J042O96J847R27L71p19j147j110j470j49P66J048J579O77P28
$$ -838 -1843 -2608 -1566 -870 977 1904 2275 1556 409 -701 -2171 -2320 -1554 -506 1073 1750 2478
4262B478o82j290j518j067k19N11J547J095J038M20q16j307j275j101K65O27J392
$$ 2478 1796 506 -1012 -2079 -2298 -1787 -240 855 1893 2313 1497 190 -1085 -2186 -1921 -1294 98
4279I8J080J261k62q56j398j172r32K30P40J387J198Q55k5r53j475j214p78M7
$$ 98 1178 2439 2177 1321 -77 -1249 -2181 -1951 -1211 176 1374 2229 2204 1251 -224 -1438 -2216 -2169
4297b169J138J396J203M80j91p42j222j226q17J46J092J216J329Q05o07q68j068
$$ -2169 -1031 365 1568 2048 1857 1115 -107 -1333 -2150 -2004 -912 304 1633 2438 1831 963 -105
4314a05j719q6L3R30J469J105M03j69j265j230r74p35R24O92J443J129M29m29
$$ -105 -1824 -1910 -1877 -947 522 1627 2030 1861 596 -634 -1608 -2343 -1419 -727 716 1845 2274 1845
4332A845j345j348j119j96N92J110J362R59J90m20j345j240p51m46M90J540J226
$$ 1845 500 -848 -1967 -2163 -1571 -461 901 1860 2050 1630 285 -955 -1706 -2152 -1662 -122 1104
4349A104R15L51j031j119j335j181J34O20J523R80Q78K54n94j448j146j005O1
$$ 1104 2019 2370 1339 220 -1115 -2296 -2162 -1542 -19 961 1839 2093 1499 51 -1095 -2100 -2039
4366b039N30J571J069J094l68p81r33j793m29J45P44J518J129N24k34o40j355
$$ -2039 -1509 62 1131 2225 1857 1076 143 -1650 -2079 -1934 -1190 328 1457 1981 1747 1107 -248
4383b48r23r74J65R37J338J379N70n18q69j354j215m20K49J246J106J073O37p40
$$ -248 -1171 -2145 -1980 -1043 295 1674 2244 1726 857 -497 -1712 -2132 -1883 -637 469 1542 2179 1439
4401A439p97j169r71o35L45J115J424J003M79o74q05j349r12n12O66R27J208J059
$$ 1439 642 -527 -1498 -2133 -1788 -673 751 1754 2233 1559 754 -595 -1507 -2019 -1353 -426 782 1841
4419A841M85p38j332r52j071l20P80Q55J013J109L39o52j256j045n87k62N51J087
$$ 1841 2326 1588 256 -696 -1767 -2087 -1307 -452 561 1670 2009 1357 101 -944 -1531 -1793 -1242 -155
4437a55J147R86O5r41r17j341p32q3R86J137R74R82k00r33q48j461q99K67R40
$$ -155 992 1978 2043 1102 185 -1156 -1888 -1971 -985 152 1126 2108 1908 975 127 -1334 -2233 -1966 -1026
4456a026J372R95N61R9q91j573o06q22J6P05J713Q25O74m43q28j217r86k67rP30
$$ -1026 346 1341 1902 2001 1110 -463 -1069 -1891 -1875 -1170 543 1368 2042 1599 771 -446 -1432 -1699 -1708 -978
4476i78J431R03O18m43n85j376r94j54J45O59J317J024L03l29r48j185q28k08
$$ -978 453 1356 1974 1531 946 -430 -1424 -1578 -1433 -774 543 1567 1870 1541 593 -592 -1420 -1628
4494a628J47J014R38J054M77m27j190r56j264J74M99Q10J302Q38K2n48r36j346
$$ -1628 -1481 -467 471 1525 2002 1575 385 -571 -1835 -1661 -1162 -352 950 1788 1810 1262 326 -1020
4512a020q22j40R96P17J425O10J30o11j399p11j153L48O81P92J091Q29j1o43r97
$$ -1020 -1842 -1982 -986 -269 1156 1766 1896 1285 -114 -825 -1978 -1630 -949 -157 934 1763 1752 1109 112
4531A12j113p48J77O29R76R96R99l16q86j159r65k00Q0O92J033R21O23k82p23
$$ 112 -1001 -1749 -1572 -943 33 1029 2028 1712 826 -333 -1298 -1498 -1418 -726 307 1228 1851 1569 846
4550H46p77j447O6n33J327R60N76Q71l52q62j296q65n62P76R06Q23J095M24o54
$$ 846 69 -1378 -1312 -1845 -518 442 1018 1889 1537 675 -621 -1486 -2048 -1272 -366 457 1552 1976 1322
4569A322m64j503o47n46K19R43J379J241N1n55j179j040j008K06L30R73J081Q19
$$ 1322 858 -645 -1292 -1838 -1619 -676 703 1944 1995 1440 261 -779 -1787 -1581 -1251 -278 803 1622
4587A622L43q18q11j204n96o19Q98J135P50R92K43q93r56j069l82l93Q18Q39J201
$$ 1622 1965 1147 336 -868 -1464 -2083 -1185 -50 700 1692 1935 1042 86 -983 -1365 -1758 -940 -101 1100
4606A100O09P3q10j019r93p70N7P72J197Q43O71k10o32j026r32n39K51M87P18
$$ 1100 1709 1782 972 -47 -1040 -1810 -1753 -981 216 1059 1730 1520 888 -138 -1070 -1609 -1358 -871 -153
4625a53J333N51M8j211j198o45n61K06O98J198J062M95N7j101j488j044k56N21
$$ -153 1180 1731 1779 568 -630 -1275 -1836 -1630 -932 266 1328 1823 1880 779 -709 -1753 -2009 -1488
4643a488J235P29O98O03m86p07j048j159j35M01R68R18R06J41m30o57j312q00
$$ -1488 -253 476 1174 1777 1291 584 -464 -1623 -1758 -1357 -389 529 1435 1576 1146 489 -823 -1623
4661a623J04M74N18J198R28K62p14o96j176r87K15L05J006J066P86J44o48j171
$$ -1623 -1519 -1045 -527 671 1599 1861 1147 451 -725 -1712 -1497 -1192 -186 880 1666 1810 1162 -9
4679ij158n96N9N98J128J125O18n52k83r72o56r07K12O29Q40J017O23J91j216
$$ -9 -1167 -1763 -1704 -1106 22 1147 1765 1213 930 -42 -698 -1605 -1393 -764 76 1093 1716 1907 691
4698F91q25r63m67J19N96J126J039K03J24q12q42q99l79l37Q51J374P31K32j30
$$ 691 -134 -1097 -1564 -1445 -849 277 1316 1519 1643 831 -11 -910 -1289 -1626 -775 599 1330 1562 1432
4717A432n54j005j227m12O27L02J225P28O03k97q93r20j087j16M28M44J066J163
$$ 1432 878 -127 -1354 -1766 -1139 -837 388 1116 1719 1422 529 -391 -1478 -1594 -1166 -722 344 1507
4735A507M65o59q82r02p97k70M07Q34J088M69M68m25p73j283p48K5L80P29J207
$$ 1507 1972 1313 431 -471 -1268 -1538 -1131 -297 791 1260 1728 1303 530 -753 -1501 -1476 -1096 -367 840
4754H40Q13k50j55r79p85r94j76N31J057O68J052k03l87j086r13l89j40M93J315
$$ 840 1653 1403 1248 269 -516 -1510 -1686 -1155 -98 570 1622 1419 1032 -54 -967 -1356 -1496 -1003 312
4773C12N93M82K82q34j004m92q41N8O44Q17Q68M44m3o70r03q63m70K13P44R40
$$ 312 905 1387 1669 835 -169 -661 -1502 -1444 -800 17 885 1329 1286 616 -287 -1150 -1620 -1407 -663 277
4793B77N19O76j67q36p99o74n19K64P57N54J115L76k6j059j025n35l85K54N26
$$ 277 796 1472 1305 469 -330 -1004 -1523 -1259 -502 52 1167 1543 1517 458 -567 -1102 -1487 -1233 -707
4812g07J122R10K9N4j035j059n07k93L01N73J150O22N08n22r47n54r35q6Q5J324
$$ -707 415 1325 1354 1408 373 -686 -1193 -1486 -1185 -612 538 1160 1668 1146 199 -355 -1290 -1376 -1291 33
4832C3M34J143J56o03j086j078m15O7J83R90R96N87L82j313m45q71o19J06R58
$$ 33 467 1610 1766 1163 77 -1001 -1416 -1349 -1166 -176 820 1407 1789 476 31 -840 -1459 -1353 -395
4851c95M60P30O03k04j73r78r65q91O12O42N24P45R10k15o37q42j034m45R3R03
$$ -395 65 795 1398 1194 1021 43 -922 -1813 -1201 -559 -35 710 1620 1405 768 -74 -1108 -1553 -1460 -557
4871e57O57Q42O09l45p43o49r71m36K74O24Q75R47K8k06l62j039p17j62R4P80
$$ -557 100 942 1551 1206 463 -186 -1157 -1593 -1319 -695 180 1127 1155 949 587 -452 -1169 -1331 -1237 -457
4891d57R21O83L38k61o11r35p69l30M74N44R06P69j83p0m93j123m52n23P36N80
$$ -457 464 1147 1485 1224 613 -322 -1091 -1421 -947 -403 503 1272 1089 1019 526 -597 -1049 -1572 -836 -256
4911b56O55P10M58q33l67j066p22L11J15Q93N56J042m6n69j174p06m90L25J94
$$ -256 399 1109 1567 734 367 -699 -1421 -1110 -995 -102 454 1496 1450 881 -293 -999 -1489 -1164 -970
4930i70R46P81O70P8o52j080o88k37k5M11P25J002K24J77o73o54q65m81j39Q55
$$ -970 -24 757 1427 1505 853 -227 -915 -1152 -1177 -766 -41 961 1185 1362 689 35 -830 -1311 -1450 -595
4950e95O92O29O83q1p69n05o89n52K21M10R48L56O53k90m67p88p99o44L29L53
$$ -595 97 726 1409 1328 559 54 -635 -1187 -966 -556 392 748 1401 1111 644 -144 -943 -1587 -1258 -905
4970i05J048J128j21l40l02j003n49j88P01J53N77Q66M95n50q43l17r53j24J78
$$ -905 143 1271 1150 810 508 -495 -1044 -1232 -531 -378 199 1065 1560 1010 167 -150 -1103 -1227 -1049
4989a049Q71J080M42J04m14j112m30k57m13q8J226Q49M65K54o69o47r55n99K65
$$ -1049 -178 902 1344 1448 1034 -78 -508 -765 -1178 -1266 -40 809 1274 1528 859 212 -743 -1342 -1077
5008a077P3R34Q44L20l1l33n68p88q10lP42R68L57P70K62j069n41r25k80p4L90
$$ -1077 -1004 -70 774 1094 1063 730 162 -626 -1436 -1439 -697 271 628 1398 1660 591 50 -875 -1155 -1229 -839
5029h39P10J161Q3L22o32q64j062j29L13L75O83P86K34N7o40o57o69l33k35N07
$$ -839 -129 1032 1115 1437 805 -59 -1121 -1250 -937 -562 121 907 1141 1198 558 -99 -768 -1101 -1336 -829
5049h29R22P24P80k33p30j207l53k50q1J058P66N65l2J39r66o84m49m33L35L66
$$ -829 93 817 1597 1364 634 -573 -926 -1176 -1257 -199 567 1132 1100 1239 273 -411 -860 -1293 -958 -592
5069e92J189K87j0J36o97p70q26J03J62O32J004M71K55o21n27p82n42l18N60P14
$$ -592 597 884 874 1010 313 -457 -1283 -1180 -1018 -386 618 1089 1344 723 196 -586 -1128 -1446 -886 -172
5089a72Q05M17j6j50q65o16q2l50K49N35R41O08k31m87m72r63l27J64L64M93J149
$$ -172 633 1050 1034 884 19 -597 -679 -1029 -780 -245 696 1304 1073 586 114 -849 -1176 -1012 -648 -155 994
5110I94j31K04o72n93m42k87j53M87M95R23K80J65o09j041o7p02L59M38Q00P31
$$ 994 863 1067 395 -198 -640 -927 -1080 -593 -98 825 1105 1270 661 -380 -447 -1149 -790 -352 448 1179
5130A179J03m43r2r24m49n35M59K26R00L54N47m38l51n03q20r2j97Q10O71Q74
$$ 1179 1282 839 747 -177 -626 -1161 -702 -476 424 778 1325 887 536 33 -787 -879 -1076 -266 405 1279
5150A279k59j88m72q73o21L60j23Q57R46M3M30m63n03r58j90j93K23M96N61J013
$$ 1279 1020 832 360 -513 -1134 -774 -897 -40 906 949 1379 916 413 -545 -735 -928 -705 -209 352 1365
5170A365l72m30l09p15m68q7K71P86O02N06j54o76l09p08k81PL97N03R42q1J57
$$ 1365 993 563 254 -461 -929 -1016 -745 41 643 1149 995 319 10 -698 -979 -972 -575 -72 870 789 946
5191I46m10o17o43J19j66L1P89K58Q56j6q8j139n34k32l44N14O65P84N11j31o79
$$ 946 536 -81 -724 -605 -771 -740 49 307 1163 1147 1059 -80 -614 -846 -1190 -676 -11 773 1284 1153 474
5212D74m56o71m84L4M02J066K51M53k42m47o99n30k29K21N71N43M08M44j17m31
$$ 474 18 -653 -1137 -1103 -701 365 616 1069 827 380 -319 -849 -1078 -857 -286 257 665 1109 992 561
5232E61q07n64j91L85J97Q58M57K11j86p94m64n20o6L6P32N71N75M8l89k74r82
$$ 561 -246 -810 -1001 -616 -419 439 896 1107 921 127 -337 -857 -923 -887 -155 416 991 1039 650 376 -606
5253f06k08k36K39M12P84K72L22m7p99p74m04J63K02N04Q32K14J36m71n64l30
$$ -606 -814 -1050 -811 -399 385 657 979 932 133 -641 -1045 -882 -680 -176 656 870 1006 535 -29 -359
5273c59l31l45L87O93O55L56l1j28j450k6k54p6M88M36O73O3J33o08j27r22o2
$$ -359 -690 -1035 -648 45 700 1056 1025 897 -553 -579 -833 -909 -421 15 688 751 884 276 149 -773 -835
5294h35k9L23Q93J89J12K49m60q29l71m37K33N17Q07J96K24J78l75q29o86P3j76
$$ -835 -864 -541 352 541 653 902 442 -387 -758 -1195 -962 -445 362 558 782 960 585 -244 -930 -857 -1033
5315a033P69Q61K09K20k90j004J85q01j52L83L56O42M44K23l51l84n85m11KJ36
$$ -1033 -264 597 806 1026 736 -268 -83 -884 -1036 -653 -297 345 789 1012 661 277 -308 -719 -717 -581
5335e81J26R94J51J71j8m22o54n41l16K81P32N55N56q1m04m03m52m95j78K03N96
$$ -581 -455 539 690 861 843 421 -233 -774 -1090 -809 -77 478 1034 953 549 146 -306 -801 -979 -776 -180
5356a80N42N01J11k78p50n69j85j29N23N09M22L07L26p53m18m99j83l57M67Q33
$$ -180 362 863 974 696 -54 -623 -808 -937 -414 95 517 824 1150 397 -21 -520 -703 -1060 -593 240
5376B40O58J66j38m42o93l16m76J44Q45N21K20J81j41o7q19m45m84K78N25N96
$$ 240 898 1064 926 484 -209 -525 -1001 -857 -12 509 729 910 769 702 -117 -562 -1046 -768 -243 353
5396C53O31k93m4n35n94j25l93L66K09O88M19J74j77j80o48o83m4J67M53N20K70
$$ 353 984 691 647 112 -482 -607 -1000 -634 -425 263 682 856 679 499 -149 -832 -876 -709 -256 264 534
5417E34K41j63m63n91l72N2L41K16P51J4L43k78k67p71n56r8M06O10N16J62M18
$$ 534 775 612 149 -442 -814 -762 -421 -205 546 560 903 625 358 -413 -969 -1067 -661 -51 465 627 1045
5438A045m15n32m62p29L04J19N73L26M68J86m75l04m28n15l1O03L67K90N21j06
$$ 1045 630 98 -364 -1093 -789 -670 -97 229 697 883 408 104 -324 -839 -870 -267 100 390 911 805
5458H05l32l41p06l19K43K00M70N38K29q0k53q85j86j45j87O10M18N32M73o38
$$ 805 473 132 -574 -893 -650 -450 20 558 787 707 454 -431 -617 -762 -949 -339 79 611 1084 446
5478D46mp88l89k80J53M02Q06L91J80l35l56k56n35r0k32M46O30N14J33j84k59
$$ 446 442 -346 -735 -1015 -862 -460 346 737 917 582 226 -30 -565 -655 -887 -441 189 703 836 652 393
5499C93l63p42j25L64K18P49P2Pk91n6m78m78o5L71L76N04M80j54o86Q2o02j63
$$ 393 30 -712 -837 -473 -255 494 566 573 282 226 -252 -730 -795 -424 -48 456 936 782 96 178 -424 -587
5521e87k77M70K84L33L98K57m31n11m21j43k7M27L09M38K28J89l11m02n56o20
$$ -587 -864 -394 -110 223 621 878 447 -64 -485 -628 -655 -228 81 519 747 936 625 223 -333 -953
5541i53L91n8P13N25J66O5l38n42m49j33J42J16L75P23j4J07o66l43q5o38K03
$$ -953 -562 -620 93 618 784 849 511 -31 -480 -613 -471 -355 20 743 729 836 170 -173 -258 -896 -693
5562f93O69K01N19L38l07m05l33o37l13L53O96K8P15k81J10n97k71m64j04N12
$$ -693 -24 177 696 1034 727 322 -11 -648 -961 -608 88 116 831 550 660 63 -208 -672 -776 -264
5582b64pK89N55J58J8m74m33l46n60K15P30O23O4J67o8m73m75p12j4L88K11P36
$$ -264 -271 18 573 731 749 275 -158 -504 -1064 -849 -119 504 568 735 667 194 -281 -993 -1007 -619 -408 328
5604C28M58k59rm69l22m02j16M20M08J75M52K67n04j59n62m37l0J78N11L59O39
$$ 328 786 527 518 49 -273 -675 -791 -371 37 212 664 931 427 268 -294 -731 -761 -583 -72 287 926
5625I26l5l58q38m6k50l05L64L67O73K60P4n07l66n13k42M66K85LO42J10J24l30
$$ 926 891 533 -305 -351 -601 -906 -542 -175 498 758 832 325 -41 -554 -796 -330 -45 -42 600 710 834 504
5647E04o03n24N5m0J93Q88J60m0M3m13l53n68J78O6J43N26L44pJ66n84m47k67
$$ 504 -99 -623 -568 -608 -415 473 633 593 636 223 -130 -698 -520 -454 -311 215 559 552 718 134 -313 -580
5669e80j21J64L05K12K96L61j10n12K4m34k88K85L28N81k38L11M0l95q81J46J71
$$ -580 -701 -537 -232 -20 276 637 527 15 39 -395 -683 -398 -70 511 273 584 624 229 -652 -506 -335
5690c35N8J00K23N99K0l50l47j69p55K20l4Q61Q5N54l05l5k95k77k22k81J10N52
$$ -335 -277 -177 46 645 665 315 -32 -201 -956 -736 -770 91 176 730 425 390 95 -182 -404 -685 -575 -23
5712b3O13J04l96k15k45k76k2N3J91j1M59L54Oq8p68K39m97J00R4M44p5N25l15
$$ -23 590 694 298 83 -162 -438 -460 -407 -216 -227 232 586 592 504 -264 -25 -522 -422 -328 116 41 566 251
5735B51J38m60j19j22n43P60P3P46J2l3m27m85m25j44K88J91N88O2K75l04j70
$$ 251 389 -71 -190 -312 -855 -95 -22 724 736 703 276 -209 -634 -778 -490 -299 289 351 626 322 152
5756A52k88l21l64L0Q20P1M82k5m5m72mm12j82K1K64M70K80J03k77j00r10N41
$$ 152 -136 -457 -821 -791 29 100 582 557 512 40 36 -376 -558 -537 -273 197 477 580 303 203 -707 -166
5778a66m43L98J51J48M20jj39j77n20l08l6K02M20K50J75nj32K5n72n30L43l6
$$ -166 -609 -211 -60 88 508 507 368 191 -329 -637 -673 -471 -51 199 374 369 237 262 -310 -840 -497 -533
5800e33L97L80J29J98l60p0q8n26p4J98O63K5J54K37m24k82j48o46J09L65J33
$$ -533 -136 244 373 571 211 141 53 -473 -547 -349 314 339 493 730 306 24 -124 -770 -661 -296 -163
5821a63O54L47n99j08k45k82k6J03J20N06j29P55l64j92l45l80k93R3K82L44N67
$$ -163 491 838 239 131 -114 -396 -422 -319 -199 307 178 933 569 377 32 -348 -641 -548 -266 78 645
5842F45j20J9p5l33m90k55J48L72K26L09K79k93m08n56L31q1l22K06P09J44L37
$$ 645 525 544 469 136 -354 -609 -461 -89 137 446 725 432 24 -532 -201 -282 -604 -398 311 455 792
5863G92j4n09o92j49p0M35N84k4K16l35o4l26l48j24NL22J73M60p7L00k01m04
$$ 792 778 269 -423 -572 -642 -207 377 353 569 234 170 -156 -504 -628 -623 -301 -128 332 255 555 354 -50
5885e0j57q40O64j40N89J3N60P1k99l4p19k08j04L96N28M09j3m68N3k18k68j67
$$ -50 -207 -1047 -383 -523 66 79 639 710 411 377 -342 -550 -654 -258 270 679 666 198 251 33 -235 -402
5907d02K52m86M91P17k4j22k21l56k23kM6J10O33J3K04m04j83l0o11J35j6L83
$$ -402 -150 -636 -145 572 548 426 205 -151 -374 -376 -330 -220 413 426 630 226 43 13 -598 -463 -479 -96
5929i6J70L24J92q1j37o21O1K9j80M8J07P00K75j12o99l70J59l12K20O58J39j84
$$ -96 74 398 590 509 372 -249 -188 -159 -339 -291 -184 516 791 679 -20 -390 -231 -543 -323 335 474 290
5951B90o3K22k70m35j53L8L9M09O23k50K21k86m88j8k00p6k76M90P26p0J91m13
$$ 290 227 449 179 -256 -409 -371 -332 77 700 450 671 385 -103 -121 -321 -397 -673 -183 543 473 664 251
5973B51j67o46J67n4L23K60J53j35M03k66Pm48m31L29J19N41N6j20K24k16m23
$$ 251 84 -562 -395 -449 -126 134 287 152 555 289 296 -152 -583 -254 -135 406 462 342 566 350 -73
5994g3k06O2K2k24N62J32J15K75l67l92l83l6Q0K26N65J68K4j99j49j5l66l23
$$ -73 -279 -217 -195 -419 143 275 390 665 298 -94 -477 -513 -433 -207 358 526 550 351 202 187 -179 -502
6016e02l7M33J94M96r0m4l16n03j05O0J77R7J11M69J07k00k19k45l64J77J05J03
$$ -502 -539 -106 88 584 494 450 134 -369 -474 -414 -237 -140 -29 440 547 347 128 -117 -481 -304 -199 -96
6038i6L47J81k77K43k76k45o3l14L63J72J91L37Nj91l30l95L47m63L08J56m9N17
$$ -96 251 432 155 398 122 -123 -186 -500 -137 35 226 563 568 377 47 -348 -1 -464 -156 0 -49 468
6060D68O6N2o54k30j48J4K73J9L96N1R0J68o53l8j37j21k50O51M4K20K17j04p90
$$ 468 534 586 -68 -298 -446 -432 -159 -140 256 307 397 565 -88 -126 -263 -384 -634 17 61 281 498 394 -396
6083c96P6m63N93J30J18L15K53k15j37K7p59KJ7L94K44L35k79j28N9m05M6m7j53
$$ -396 -320 -783 -190 -60 58 373 626 411 274 301 -458 -456 -439 -45 199 534 255 127 186 -219 -173 -220 -373
6106c73K62KK21M90j91l79k53L6k96J89K86NM34k50L15k57k00p8n20J43N00K03
$$ -373 -111 -109 112 602 411 32 -221 -185 -481 -292 -6 -1 433 183 498 241 41 -37 -557 -414 86 289
6128B89J24k40O2j51k21k23J66k49L91K99K61j3j22m84j43Nj7j49O38K30j05m5
$$ 289 413 173 235 84 -137 -360 -194 -443 -52 247 508 495 373 -111 -254 -249 -266 -415 223 453 348 303
6150C03q2l15n5j69k18J55O02J64j34J64l78k22k24L26k86J55R8O4N10n1j31j02
$$ 303 221 -94 -149 -318 -536 -381 221 385 251 415 37 -185 -409 -83 -369 -214 -116 -52 458 407 276 174
6172A74l76J12l37K92K14mN32j18o73J39j52k26j02P1N30K38Q0j32j09j81m37
$$ 174 -202 -90 -427 -135 79 75 607 489 -184 -45 -197 -423 -525 -454 76 314 394 262 153 -28 -465
6193d65J30K06j52L60M1J90k14j70q1K0k92O6K37J46N25l00L07j54k90n89K55
$$ -465 -335 -129 -281 79 120 310 96 -74 -155 -135 -427 -361 -124 22 547 247 554 400 110 -479 -224
6214b24j18J70L59K4N11k63o85K20m45p3K12J54N84j14PJ42l36p8k18k5j2J66
$$ -224 -342 -172 187 211 722 459 -226 -6 -451 -524 -312 -158 426 312 319 461 125 47 -171 -196 -208 -42
6236d2Q2K66K96k75k70k20k09K29p2pL99K80j40J07l83k09j76R3o6L69J25p4K13
$$ -42 40 306 602 327 57 -163 -372 -143 -215 -222 177 457 317 424 41 -168 -344 -251 -317 52 177 103 316
6259C16o87N76o69J02O8J80o6M28N27n24j00m27J44j4j03r0M58o6J49j80K72l73
$$ 316 -371 205 -464 -362 -294 -114 -180 248 775 251 151 -276 -132 -146 -249 -339 119 53 202 22 294 -79
6281g9oj65J86k0J89j50M21j04l97l5o1l10K59L51q5N79l15j84j62P8j02p2O2
$$ -79 -85 -250 -64 -84 105 -45 376 272 -125 -160 -221 -531 -272 79 -6 573 258 74 -88 -10 -112 -184 -122
6304a22K45j93K80k0Ok89k24J56m54O96k98N96l57J54J17j83j18k24qJ91m1K95
$$ -122 123 -70 210 190 196 -93 -317 -161 -615 81 -217 379 22 176 293 110 -8 -232 -240 -49 -90 205
6326B05J12Q2j39j91M3k53j92K96nL35j70K52k12N8m62j13oO6L47K03K72m22k8
$$ 205 317 399 260 69 112 -141 -333 -37 -42 293 123 375 163 221 -241 -354 -360 -294 53 256 528 106 78
6349G8n5k53j54K65o5P8K36K05N1k83O0m03N0j49O5O54k50m2L8J09l90nj76j4
$$ 78 23 -230 -384 -119 -184 -106 130 335 386 103 163 -240 -190 -339 -274 380 130 88 126 235 -155 -160 -336 -350
6373c50M39P6J72n3l9l51k35L89n2l08K80J71P9j04J18k35j02K73k79J25J83K80
$$ -350 89 165 337 284 245 -106 -341 48 -4 -312 -32 139 218 114 232 -3 -105 168 -111 14 197 477
6395D77m21L05O3m40M8l09P9L58l08J23M27j8j28m73J8r1j4J23K76mM98n40N70
$$ 477 56 361 424 -16 32 -277 -198 160 -148 -25 402 384 256 -217 -199 -290 -304 -181 95 91 589 49 619
6418F19o39l32J22K5J22J5O32j62kj03n58K46n2l16L10L12l81O16O9m41l82o2
$$ 619 -20 -352 -230 -205 -83 -68 564 402 400 297 -261 -15 -67 -383 -73 239 -142 474 543 102 -280 -342
6440c42L43o03O11j59L12k05L88k16o7m3j10q8K61j88K24J83J6l1k41J07n02K25
$$ -342 1 -602 9 -150 162 -43 345 129 62 19 -91 -179 82 -106 118 301 317 286 45 152 -350 -125
6462a25J85j16K10L16k81k95J34l66L84J31k64K10j91M67p7l90n2j30k59K31L66
$$ -125 60 -56 154 470 189 -106 28 -338 46 177 -87 123 -68 399 322 -68 -120 -250 -509 -278 88
6483H8k27L48j93Q3j39j00J34j9j82l3L77K31n14J82m45L65l58K84j51R5M16k02
$$ 88 -139 209 16 99 -40 -140 -6 -25 -207 -240 137 368 -146 36 -409 -44 -402 -118 -269 -174 242 40
6505D0J46K82o38K43k39l2j66M18O3J76o1m06J50m7j67j9K76p6K09O5K60m63j70
$$ 40 186 468 -170 73 -166 -198 -364 54 117 293 232 -174 -24 -71 -238 -257 19 -57 152 217 477 14 -156
6528a56J53j80j01MK65M78k16M4k67j19j23l19K86L98n5j8k20M76k24J17k23p7
$$ -156 -3 -183 -284 -280 -15 463 247 291 24 -95 -218 -537 -251 147 92 74 -146 330 106 223 0 -77
6550g7Q1j65K91l8K14k36Q1k83k42K01J4n0L6K57J26J06k99K27m58q9L27j35K01
$$ -77 4 -161 130 92 306 70 151 -132 -374 -173 -159 -209 -173 84 210 316 17 244 -214 -303 24 -111 90
6573I0J39j47j13J65l18r5K31J06M7j44K52M3J1j42k72M9n8p1L42J00j68j86L02
$$ 90 229 82 -31 134 -184 -279 -48 58 105 -39 213 256 267 125 -147 -98 -156 -227 115 215 47 -139 163
6596A63j13j50m76J92O89n30J73J93N60n04j41j53j35o7K83k44K34Q0L77j49R1
$$ 163 50 -100 -576 -384 305 -225 -52 141 701 197 56 -97 -232 -299 -16 -260 -26 54 431 282 373
6617C73l24l79K51J05l76O48j22pK96l11l40J82j58P1NL36pk53J02l42n9K3J70
$$ 373 49 -330 -79 26 -350 298 176 169 465 154 -186 -4 -162 -91 -86 250 243 -10 92 -250 -309 -286 -116
6640a16J44l27M77O4k14r4N5j1K90n47K27O6J98Q2j01J99l04j72J34k47o1K39
$$ -116 28 -299 178 242 28 -66 -11 -22 268 -279 -52 14 212 294 193 392 88 -84 50 -197 -258 -19
6662a9K8L30k31k16J29j41q5N3R9j15L15j23J67j51j37K63m05J37N1Q5K57j83
$$ -19 9 339 108 -108 21 -120 -205 -152 -53 -168 147 24 191 40 -97 166 -239 -102 -51 34 291 108
6684A08P4j64j59J74k64m4J52L07K62l17%J43k68j17l6L0K14k6R0K4O5l8n42K32
$$ 108 182 18 -141 33 -231 -275 -123 184 446 129 129 272 4 -113 -149 -119 95 69 159 183 248 210 -332 -100
6708a00K64k18j14R7K39K23m5o9j40m2j83k4m6R5K02k11M3M9j60J05m92M61q4
$$ -100 164 -54 -168 -71 168 391 346 277 137 95 -88 -112 -158 -63 139 -72 -29 20 -140 -35 -527 -66 -150
6731a50O3L36p8P1k23k86J71j37K65O5R9p4j44J03m32N70o31J3L01O4J40jl4j41
$$ -150 -87 249 171 242 19 -267 -96 -233 32 97 196 122 -22 81 -351 219 -412 -399 -98 -34 106 105 71 -70
6755g0K32l93j65J57K98j54J02K38K05k58q2m2p1j22k0L15m25Q6K38Q9q8k92n0
$$ -70 162 -231 -396 -239 59 -95 7 245 450 192 110 68 -3 -125 -145 170 -255 -169 69 158 70 -222 -272
6778b72L05l5k7K86j0Q2l46K6j9j36N9Q0k87L52J42l94L21l2k05q8q2J74K78n8
$$ -272 33 -2 -29 257 247 329 -17 9 -10 -146 -87 -7 -294 58 200 -194 127 95 -110 -198 -280 -106 172 114
6802A14L61m15J85l79lK33l72L0N36m8k8k65K3J49l53k63M36R3L81l18k2K56j0
$$ 114 475 60 245 -134 -137 96 -276 -246 290 242 214 -51 -28 121 -232 -495 -59 34 415 97 75 331 321
6825C21l2o31J87k05N79l52L92k26j12L01j92j17j24L32q1J21j0J1j40j58J86
$$ 321 289 -342 -155 -360 219 -133 259 33 -79 222 30 -87 -211 121 40 161 151 162 22 -136 50
6846E0k33J9K68j31J06P1p0J79l18l8l30M34j54K9N08k18K97j33n26K9o6R6J6
$$ 50 -183 -164 104 -27 79 150 80 259 -59 -97 -427 7 -147 -118 390 172 469 336 -190 -161 -227 -131 -115
6869a15K77j34J10R8o2J17m97R7o1m4K20K30k08J46J86j08k06m66N23j71J78J92
$$ -115 162 28 138 236 174 291 -206 -109 -170 -214 6 236 28 174 360 252 46 -420 103 -68 110 302
6891C02k70K71k77l4j05j10k21M69O7J10l32M08j49r0K0k26k03L23J14L49k58
$$ 302 32 303 26 -8 -113 -223 -444 25 92 202 -130 278 129 39 59 -167 -370 -47 67 416 158
6912A58k5k23P0L1j53k4K7O0K15N3k4k18N8j16nJ62k47K62PL86m25p7rj94M43
$$ 158 133 -90 -20 11 -142 -166 -139 -79 136 189 165 -53 5 -111 -116 46 -201 61 68 454 29 -48 -57 -251 192
6937A92k84n9R8j11O05m77P6k17O5j78Q4L11j01J63R4K6l63J26n19L85j61J76
$$ 192 -92 -151 -53 -164 441 -36 40 -177 -112 -290 -206 105 4 167 261 287 -76 50 -469 -84 -245 -69
6959f9J73N0j27J64k90Q7P3k79L34j95k48N89k58k22K15J07j05j39K78j37J09
$$ -69 104 154 27 191 -99 -12 61 -218 116 -79 -327 262 4 -218 -3 104 -1 -140 138 1 110
6980A10%mLm41N92l86rK49m1k6K7m7J79n2m43L19j50K56kK0jj23J05k53J75n08
$$ 110 110 106 109 -332 260 -126 -135 114 73 47 74 27 206 154 -289 30 -120 136 134 154 153 30 135 -118 57 -451
7006d51O7J94L06J84J07k19j77j2J3j30j01L31lJ26k8j6q7j80Jr8pj09K18K01
$$ -451 -384 -190 116 300 407 188 11 -1 12 -118 -219 112 109 235 207 191 104 -76 -75 -173 -180 -289 -71 130
7030A30M25o12L5n2k4k47P7J79L47m71K54P8r8q2m83M08j45P7M12m5j14J42k28
$$ 130 555 -57 -22 -74 -98 -345 -268 -89 258 -213 41 119 21 -61 -544 -136 -281 -204 208 163 49 191 -37
7053c7J40m44J16K68K1N7K32j05N3n2m94j02J88mK6P88m51j66R8m82p0L84n5q0
$$ -37 103 -341 -225 43 64 121 353 248 301 249 -245 -347 -159 -163 -137 651 200 34 132 -350 -420 -36 -91 -171
7077a71K78J47k7O8K84q06J77k8J73k80J54J41k4j52j7j46p8K46k52K35J5J51
$$ -171 107 254 227 295 579 -227 -50 -78 95 -185 -31 110 86 -66 -83 -229 -307 -61 -313 -78 -63 88
7099H8K91l31J3k35q5L23l55L35j07J91L51n74K00m50K37J53k57K22j57J80j9
$$ 88 379 48 61 -174 -259 64 -291 44 -63 128 479 -95 105 -345 -108 45 -212 10 -147 33 14
7120A4K03l48P1m19N2K17M10k82M04J20k85K07l58l8O0l19J91J55J76L8p4P8n09
$$ 14 217 -131 -60 -479 -427 -210 200 -82 322 442 157 364 6 -32 28 -291 -100 55 231 269 195 273 -236
7143b36K07k27L6J31J20N7J23K07j61l75q9Q6j18L22l41N08J50n72L71l31k94
$$ -236 -29 -256 -220 -89 31 88 211 418 257 -118 -207 -121 -239 83 -258 250 400 -172 199 -132 -426
7164d26M31l0J41l31M8K89k80J0n7J38j07J83j42L09J71k85L68l54J8m16J31N6
$$ -426 5 -25 116 -215 -167 122 -158 -148 -205 -67 -174 9 -133 176 347 62 430 76 94 -322 -191 -135
7186a35M06j59J96j03j22J41k52L2k02J14K55j20p8K32m06J12M3n9n6k8Q6j46
$$ -135 271 112 308 205 83 224 -28 4 -198 -84 171 51 -27 205 -201 -89 -46 -105 -161 -189 -103 -249
7208b49M79P8l73j14j3k41L78J33p2K82j15K92p67J04J24j92L4K53P6J21k3M9
$$ -249 230 308 -65 -179 -192 -433 -55 78 6 288 173 465 -302 -198 -74 -266 -232 21 97 218 195 244
7230B44l00J2pj28j55L92Q4j55K90j05l60K70m60M83j84Q5M9m8J63m5p2k28Q4
$$ 244 -56 -44 -51 -179 -334 58 142 -13 277 172 -188 82 -378 105 -79 6 55 7 170 125 53 -175 -91
7253i1l67L39R1N0K5K51l46L80l44l05N8J80J76JJ54qp9j18j66N4n51P37j80K28
$$ -91 -458 -119 -28 22 47 298 -48 332 -12 -317 -259 -79 97 98 252 244 165 47 -119 -65 -616 121 -59 169
7277A69K66l28J75k27k27p1J71j50J41J0K48J19l96L7j21k5J34J5O0J53J42R6
$$ 169 435 107 282 55 -172 -243 -72 -222 -81 -71 177 296 -100 -63 -184 -209 -75 -60 0 153 295 391
7299C91l36l08J10K55k07k52M41J5M04j07m44K1k70k1J95m0J13K00J83j52q0j20
$$ 391 55 -253 -143 112 -95 -347 94 109 513 406 -38 -17 -287 -308 -113 -153 -40 160 343 191 111 -9
7321il26J01R8Q7N6K51J38r7l35M3j39j5P5q6M43J26k70J91l01j71K13k30R6k2
$$ -9 -335 -234 -136 -49 7 258 396 299 -36 7 -132 -147 -72 -158 285 411 141 332 31 -140 73 -157 -61 -83
7345h3L00n7L58l85j93m9l44J06K74p1L15P6Q0j5J51n08l12J68o6L78K41J75k42
$$ -83 217 160 518 133 -60 -109 -453 -347 -73 -144 171 247 327 312 463 -45 -357 -189 -255 123 364 539 297
7368B97j3r4m73P2J42p7M4J57L68k55j92q7j74K9O9jJ63Q8L92k58P1r7l71r3M21
$$ 297 284 190 -283 -211 -69 -146 -102 55 423 168 -24 -111 -285 -256 -187 -188 -25 63 455 197 268 171 -200 -293 128
7393A28n0L6j33j96N16k26k5j08k94J42K4J65J52K73l34k31J63K06k79L2K32m7
$$ 128 78 114 -19 -215 301 75 50 -58 -352 -210 -186 -21 131 404 70 -161 2 208 -71 -39 193 146
7415A46K42j97J14k86N0l73K35j57rM25%Q8J33k43l22j04P6J62Q0q3J99J24k74
$$ 146 388 191 305 19 69 -304 -69 -226 -235 190 190 278 411 168 -154 -258 -182 -20 60 -23 176 300 26
7438B6L1j42p8k80L13Q0K10L4qJ1l61J59l71J99j07L20K98L3l06j79l3j74R1J08
$$ 26 57 -85 -163 -443 -130 -50 160 194 186 197 -164 -5 -376 -177 -284 36 334 367 61 -118 -151 -325 -234 -126
7462a26k12K53K02j5J39k12o4J51n06M63k41J9J03J99q2J5k24j25j45K58K58k41
$$ -126 -338 -85 117 102 241 29 -35 116 -390 73 -168 -149 -46 153 71 86 -138 -263 -408 -150 108 -133
7484a33M92O8l08L57l63l88L7o4K16jL79j24J26l29J1l81L9L61j14K76k04M85
$$ -133 359 427 119 476 113 -275 -238 -302 -86 -87 292 168 294 -35 -24 -405 -366 -5 -119 157 -47 438
7506D38k71mM0j25k72j19L00j63N16oJ83j34k18l69P3k23K24j5M24r7k18n6J08
$$ 438 167 163 203 78 -194 -313 -13 -176 340 334 517 383 165 -204 -131 -354 -130 -145 279 182 -36 -92 16
7529A6l44n5K21P6K06K79j61K0j79l15j9oL37j16L43K6j19j5m15K04L0n76K12
$$ 16 -328 -383 -162 -86 120 399 238 258 79 -236 -255 -261 76 -40 303 329 210 195 -220 -16 14 -562 -350
7552c50L00J04K50J4j15j16k44J54k38K9M4L96j84K6p5k9j41JO1J54P0Q9L05k97
$$ -350 -50 54 304 318 203 87 -157 -3 -241 -212 -168 228 44 70 -5 -34 -175 -174 -113 41 111 200 505 208
7576B08j5l93L04k89J06J11P0M40j80l11j1R0n51K2J12L31J23K55r7J00k23m25
$$ 208 193 -200 104 -185 -79 32 102 542 362 51 40 130 -421 -399 -287 44 167 422 325 425 202 -223
7598b23J08k59J51K39J80r4J37J1rm32j9OJ19m3m5M26R1Nj13n49L31j92K62j09
$$ -223 -115 -374 -223 16 196 102 239 250 241 -191 -210 -204 -85 -128 -173 253 344 349 236 -313 18 -174 88 -21
7622b1K09q8j66R4j22L95q11L70k14M95k18K63j6K23l44k50N0j58R8j08K86L38
$$ -21 188 100 -66 28 -94 301 -510 -140 -354 141 -77 186 170 393 49 -201 -151 -309 -211 -319 -33 305
7644C05Q7k98M4k12m86J72R4J55J54K65N0l39k1Om03L15r3p3O27r6kp9k15O0n50
$$ 305 392 94 138 -74 -560 -388 -294 -139 15 280 330 -9 -30 -24 -427 -112 -205 -278 349 253 251 172 -43 17 -533
7669e33L61j8N86l02K30p0%m84L5L1J1k45N61J05N9L5k82L09n81j76K20M72k40
$$ -533 -172 -190 396 94 324 254 254 -230 -195 -164 -153 -398 163 268 327 362 80 389 -192 -368 -148 324 84
7692H4m5J43K07m29k37j33ON13k39J24K24K04m22L4J06l77N7j24K77OK09j64o5
$$ 84 39 182 389 -40 -277 -410 -404 109 -130 -6 218 422 0 34 140 -237 -180 -304 -27 -21 188 24 -41
7715d1J91k03k29P4L78l21pM84n8j31k20j26J42o1NK35J95p8j01K38k48m86q6
$$ -41 150 -53 -282 -208 170 -151 -158 326 268 137 -83 -209 -67 -128 -123 112 307 229 128 366 118 -368 -454
7738d54K41J91J04k72M48k27N6o0k59K7Q2k27J4K78L23m7k1k00k02j00j5J46K46
$$ -454 -213 -22 82 -190 258 31 87 27 -232 -205 -123 -350 -336 -58 265 218 197 -3 -205 -305 -320 -174 72
7761G2L25k1j2k81m42K78j61K40k13M29J03N3k00o6n6j28k01J16L30k64L44p8
$$ 72 397 376 364 83 -359 -81 -242 -2 -215 214 317 370 170 104 48 -80 -281 -165 165 -99 245 167
7783A67K32k48k80j4O6r2M85o1j32J00k96P0j87J95ml4j68L60O8L7l82J47J15
$$ 167 399 151 -129 -143 -77 -169 316 255 123 223 -73 -3 -190 5 1 -33 -201 159 227 264 -118 29 144
7806A44l62m9j39L97l0O9K40o7q3M5n87R5M23o0K76j11P3O2j75m91J09K4L6M94
$$ 144 -218 -267 -406 -9 -39 30 270 203 120 165 -422 -327 96 36 312 201 274 336 161 -330 -221 -197 -161 333
7830C33k7J64l37J07p4m24p0J12J22M27k06L37m91K39j26l82J10k24L15J18J76
$$ 333 306 470 133 240 166 -258 -328 -216 -94 333 127 464 -27 212 86 -296 -186 -410 -95 23 199
7851A99m0m9J05l79m9j5r0P5K69L22K47l60k82k51l77J66L61J73J33j06J09J84
$$ 199 159 110 215 -164 -213 -228 -318 -243 26 348 595 235 -47 -298 -675 -509 -148 25 158 52 161 345
7873C45m17j12L30o68L63n6K92K42J81k82j66M6l43J98q9J41J74J49l62L36l09
$$ 345 -72 -184 146 -522 -159 -215 77 319 500 218 52 98 -245 -47 -136 5 179 328 -34 302 -7
7894gl1j78M5j69L53k6O33o1m78j68K75q27M83j29L04J39R3J69m17n9K86m20k84
$$ -7 -38 -216 -171 -340 13 -13 620 559 81 -87 188 -639 -156 -285 19 158 251 420 3 -56 230 -190 -474
7917d74M14j34J66L04j4j69N0lj26l80O1L95P0J59N9j98m28K06k91k42M73O3J64
$$ -474 -60 -194 -28 276 262 93 143 140 14 -366 -305 90 160 319 378 180 -248 -42 -333 -575 -102 -39 125
7940A25K90m6l05j16lk57J34l8K68J74k25O4K10m01j34j87N17k68J34N8L68p3
$$ 125 415 369 64 -52 -55 -312 -178 -216 52 226 1 65 275 -126 -260 -447 70 -198 -64 -6 362 289
7962B89n36L28l16Rj41M41n8L43j32k38P8n7l11J84n9J91J55q3L01l65P3n29K39
$$ 289 -247 81 -235 -226 -367 74 16 359 227 -11 67 10 -301 -117 -176 15 170 87 388 23 96 -433 -194
7985a94k38L83R0M14n93K54N6n9q8l20j89M96Q0J0K35p9J08n08m14N00j05J17
$$ -194 -432 -49 41 455 -138 116 172 113 25 -295 -484 12 92 102 337 258 366 -142 -556 -56 -161 -44
8007d4K01J5R1nj93k08q3p8J21J24j68L88K88k19k58k9k39p5K12o8L89K7O5j91
$$ -44 157 172 263 258 65 -143 -226 -304 -183 -59 -227 161 449 230 -28 -57 -296 -371 -159 -227 162 189 254 63
8031F3j23J92j83j01j18J93J95K31N1j16J49m26k25j74J83L4L59j22K40J66l30
$$ 63 -60 132 -51 -152 -270 -77 118 349 400 284 433 7 -218 -392 -209 -175 184 62 302 468 138
8052A38n66K04J12k61J98K40L33m3l06n0J22n55L67k42L26J61K72j94m7k05o7
$$ 138 -428 -224 -112 -373 -175 65 398 355 49 -1 121 -434 -67 -309 17 178 450 256 209 4 -63
8073f3k33n0m7M01J63%L50m48j21j66k57J28L71K79j08p8J33j11m21j7k4j25K83
$$ -63 -296 -346 -393 8 171 171 521 73 -48 -214 -471 -343 28 307 199 121 254 143 -278 -295 -319 -444 -161
8096a61N7M09J48j94l51j07p1j50K37K20M05k92j20L57m19J63m98J82k30M22J41
$$ -161 -104 305 453 259 -92 -199 -270 -420 -183 37 442 150 30 387 -32 131 -367 -185 -415 7 148
8117A48p6L43j26K0Kn44l34M88nL04k48J76J74j15j11m90J69p0J77J64j83O54
$$ 148 72 415 289 309 311 -233 -567 -79 -84 220 -28 148 322 207 96 -394 -225 -295 -118 46 -137 517
8139E17l44k89j8j93P1jK55K85j63J71L9n39j7M1j52Q8K36K96m9p1M6k44m12K88
$$ 517 173 -116 -134 -327 -256 -257 -2 283 120 291 330 -209 -226 -185 -337 -249 -13 283 234 163 209 -35 -447 -159
8163a59k03K28J73j23L90j0j45k19J09k52N8j31L13O9K21K81m81k09j98J91K29
$$ -159 -362 -134 39 -84 306 296 151 -68 41 -211 -153 -284 29 98 319 600 119 -90 -288 -97 132
8184A32j90o8M59K27j01j13m45
$$ 132 -58 -126 333 560 459 346 -99
8191i9
$$ Imaginary data points
##PAGE= N=2
##DATA TABLE= (X++(I..I)), XYDATA
0@%%%qJ6qQj6K4l2L8n4O5p4R2j10J34j64J95k30K65l11L64m17M82n53O32p18Q13
$$ 0 0 0 0 -8 8 0 8 -8 16 -16 22 -32 33 -41 51 -59 75 -89 106 -124 141 -170 194 -223 259 -294 338 -380 433
29D33r23J039j168J310j465J640j827K034k262K508k783L081l411L779m183M633
$$ 433 -490 549 -619 691 -774 866 -961 1073 -1189 1319 -1464 1617 -1794 1985 -2198 2435
45B435n137N708o352P089p946Q947j0146J1608j3432J5797j8991K3574l0758M3728
$$ 2435 -2702 3006 -3346 3743 -4203 4744 -5402 6206 -7226 8571 -10420 13154 -17604 26124
59B6124p4591K81501L35587l29392j97657j46363j20533j36096J10251K38732
$$ 26124 -48467 233034 568621 239229 41572 -104791 -225324 -361420 -251169 -12437
69a2437K07240J01391R4381m1620k20250k78179j43889l2468Q4218K19504K74522
$$ -12437 194803 296194 390575 348955 128705 -149474 -293363 -325831 -241613 -22109 252413
80B52413J23450l7350r5023j38079k30467j83393N698J35568J40890J89975K24143
$$ 252413 375863 338513 243490 105411 -125056 -308449 -302751 -167183 -26293 163682 387825
91C87825N8167k12938k78231j50396n7919j4061J10003K15745J60310N3686K9261
$$ 387825 445992 233054 -45177 -195573 -253492 -267553 -157550 58195 218505 272191 301452
102C01452l6677k10387k78871j11397Q1806J33884J52493J98760J31181o4466
$$ 301452 264775 54388 -224483 -335880 -254074 -120190 32303 231063 362244 297778
112B97778j87301j63217j21966r2953Q890J38876J78433J49056J08994m515j85787
$$ 297778 110477 -52740 -174706 -267659 -258769 -119893 58540 207596 316590 312075 126288
123A26288k52336j31844K936M7857J06072J89694J56732J0613p1645p5297j38953
$$ 126288 -126048 -257892 -254956 -207099 -101027 88667 245399 256012 184367 109070 -29883
134b9883k12444j13352J05217K10319J65748J08419M7298q1126j88795j63977
$$ -29883 -242327 -355679 -250462 -40143 125605 234024 281322 200196 11401 -152576
144a52576p6513k4394L8623J44660J86438J10895J6922m8678j43163k20229j49951
$$ -152576 -229089 -253483 -214860 -70200 116238 227133 244055 195377 52214 -168015 -317966
155c17966K9324J38905J37266J24806J08021J8479r8816j43914j34764j20266
$$ -317966 -288642 -149737 -12471 112335 220356 238835 140019 -3895 -138659 -258925
165b58925m9931R8347K04186J74859P6272j1363j05886j82203j56584m5480L5510
$$ -258925 -308856 -210509 -6323 168536 244808 233445 127559 -54644 -211228 -256708 -221198
176b21198O5783J18677J68858J16104j8792j14820j46683j56834j12473K1509
$$ -221198 -155415 -36738 132120 248224 229432 114612 -32071 -188905 -301378 -279869
186b79869J55570J76358J12263M7452j6675r9807j49697j27911o9871o81R6948
$$ -279869 -124299 52059 164322 211774 195099 95292 -54405 -182316 -252187 -252868 -155920
197a55920J84205J69833N5706o0968j24526j50614j29352m2799N9178J08892J16417
$$ -155920 28285 198118 253824 192856 68330 -82284 -211636 -254435 -195257 -86365 30052
208C0052J18172Q1262k1228j24845j60905j29781n9582M6683J48539J69254R8984
$$ 30052 148224 229486 208258 83413 -77492 -207273 -266855 -220172 -71633 97621 196605
219A96605R387n0895j00014j33295j11537l7564M1896J04548J48771J36034M4304
$$ 196605 205992 155097 55083 -78212 -189749 -227313 -185417 -80869 67902 203936 248240
230B48240p7498j45778j40578q7526j0949O8959J17279J16836Q5672L4302m2815
$$ 248240 170742 24964 -115614 -203140 -214089 -145130 -27851 88985 174657 208959 166144
241A66144j20037j47438j04829j9503P3721J41629J45786P7608j5742q1772j08207
$$ 166144 46107 -101331 -206160 -225663 -151942 -10313 135473 213081 197339 115567 7360
252G360j08311p7660j2165O3301J14571J28553R5776J1600q8941j46939j28786
$$ 7360 -100951 -178611 -190776 -127475 -12904 115649 211425 223025 134084 -12855 -141641
263a41641n7200K5081Q7750J16186J02395N6686n258o7861j14174j23475p7847
$$ -141641 -198841 -173760 -86010 30176 132571 189257 183999 116138 1964 -121511 -199358
274a99358R482R7355J41711J20359M6223m1098r9569j14930r0889m1214J9520
$$ -199358 -189876 -92521 49190 169549 215772 174674 75105 -39825 -130714 -171928 -152408
285a52408P8022J14641J12085O1109k4156j03514j39236j10302l3040N3834J09671
$$ -152408 -74386 40255 152340 213449 189293 85779 -53457 -163759 -196799 -142965 -33294
296c3294J13836P9876K7091l2104q7369j15542r9207m2911L4369J07707J39152
$$ -33294 80542 160418 187509 155405 68036 -47506 -146713 -189624 -155255 -47548 91604
307I1604J01398J4980o7194j10312j11378p6437j3177N1848R2615J04143Q8781
$$ 91604 193002 207982 140788 30476 -80902 -157339 -170516 -118668 -26053 78090 166871
318A66871L5929m8290j19740j30585q3435p575P0095J19539J13282N8711n368
$$ 166871 202800 154510 34770 -95815 -179250 -186825 -116730 2809 116091 174802 169434
329A69434n4719r1811j09327q0258j2959N9652J10281J23582Q2275n831q9726
$$ 169434 114715 22904 -86423 -166681 -179640 -119988 -9707 113875 196150 190319 100593
340A00593j18384r7132n1900O907O8173J02210R4484N9660Q091o0186j19856j20936
$$ 100593 -17791 -114923 -166823 -159916 -91743 10467 104951 164611 172702 112516 -7340 -128276
352a28276n9401K0836Q3083J14294J01827M0922l1353p4709q9654q8358n8513
$$ -128276 -187677 -166841 -83758 30536 132363 173285 141932 67223 -22431 -110789 -169302
363a69302Q046P7247J10022J00736N3622k3220r7035j19807q1998k3304L0820
$$ -169302 -161256 -84009 26013 126749 180371 157151 60116 -59691 -141689 -164993 -134173
374a34173P6047R9299Q1388L1761k2008p0404j06882j00877l8049M5257R6996
$$ -134173 -58126 41173 122561 154322 132314 61910 -44972 -145849 -183898 -138641 -41645
385d1645J03437P6699J9937m8082q8881q7365o3336k6891K6150Q3525J06352P9526
$$ -41645 61792 138491 158428 110346 21465 -65900 -129236 -156127 -129977 -46452 59900 139426
397A39426K1925m4936r8278j10165o6209K946N7208Q3941Q4894O0205R802m4480
$$ 139426 161351 116415 18137 -92028 -158237 -155291 -98083 -14142 70752 130957 140759 96279
409I6279q2062r4519p2696j2819O0236J03746R6770N2286p129o3615r3073q2311
$$ 96279 14217 -80302 -152998 -165817 -105581 -1835 94935 147221 140092 76477 -16596 -98907
421i8907m2345L620M7549Q4735R4253O0441m255o6723j00258r3737m5795K3288
$$ -98907 -141252 -137632 -90083 -5348 88905 149346 145091 78368 -21890 -115627 -161422 -138134
433a38134P5564R0473P2872L5982j3124n9931q6868q2330m6506J1137P1429J03131
$$ -138134 -62570 27903 100775 136757 123633 63702 -23166 -105496 -152002 -140865 -69436 33695
445C3695Q7839L1926l1836p7558r0597p0262k5916K6035O6555Q6324P6281L5797
$$ 33695 121534 153460 121624 44066 -46531 -116793 -142709 -116674 -50119 36205 112486 148283
457A48283k3494p6753r9261p8090k4074M0802Q4481R0223O0446J2391l2893o6771
$$ 148283 124789 48036 -51225 -129315 -153389 -112587 -28106 62117 122563 134954 102061 35290
469C5290q2898p1346k6893L4659Q1759R4264O9186J5707m6405q8813q8708n1354
$$ 35290 -47608 -118954 -145847 -111188 -29429 64835 134021 149728 103323 14510 -74198 -125552
481a25552k550M1021P2584Q1331N9725J3008m0155q1347r1519o1083j938N5840
$$ -125552 -128102 -87081 -14497 66834 126559 139567 99412 18065 -73454 -134537 -136475 -80635
493h0635Q4974Q1271M8331m101n3729p6246p1119m7669q427M4215Q7136Q9865
$$ -80635 4339 85610 133941 129840 76111 -135 -71254 -118923 -127350 -83135 4001 93866
505I3866M8515r535o0669q7628p7003l5200J6652N4483P5014P2271M0725j0297
$$ 93866 142381 132846 72177 -15451 -92454 -127654 -111002 -56519 18495 90766 131491 121194
517A21194n5811p7490p6432m6197J3169P0815Q9733O6549K5069j8959o1015q1372
$$ 121194 65383 -12107 -88539 -134736 -121567 -50752 38981 105530 130599 111640 50625 -30747
529c0747o5108k4846J6894N4539Q1246P6174L0495k7705o9823q4263o6897j7936
$$ -30747 -95855 -120701 -103807 -49268 31978 108152 138647 110942 41119 -43144 -110041 -127977
541a27977L7697O6682O7092N5314K7871k2180p0614q2407n7395j9303K6905P0597
$$ -127977 -90280 -23598 43494 98808 126679 104499 33885 -48522 -105917 -125220 -98315 -27718
553b7718Q7525N8838N879l9557o8076p5235n1816n636L5550O0085P2155O1817
$$ -27718 59807 118645 124524 84967 16891 -58344 -110160 -115796 -80246 -20161 51994 113811
565A13811J5257m5205p8562p3117m8100n317M6135P7683O7652L4264K117l1142
$$ 113811 129068 83863 5301 -67816 -115916 -121233 -75098 2585 70237 104501 106618 75476
577G5476o7823p9578m8273L666M6129P1987P4796M2573j1209n2618o7874o5052
$$ 75476 7653 -71925 -120198 -116532 -70403 1584 76380 118953 107744 55126 -12748 -77800
589g7800l9511Q662N3829O8387N6043L7064J526m8103q1476p0845k8239J6880
$$ -77800 -117311 -108649 -54820 13567 69610 106674 108200 60097 -21379 -92224 -120463 -103583
601a03583N4835P4121O0296K0446j8710m4695o3504o6624l3729J9807N9559P0756
$$ -103583 -48748 25373 85669 106115 87405 42710 -20794 -87418 -121147 -101340 -41781 28975
613B8975N9229K6061k4177o3816o8368m8695k0145J9235N8185P2746N0234J3803
$$ 28975 88204 114265 90088 26272 -42096 -90791 -110936 -91701 -33516 39230 89464 103267
625A03267k0880n2593p2165n9123j5642L2159O3931P0618M9485N082l6504n5637
$$ 103267 82387 29794 -42371 -101494 -117136 -84977 -21046 49572 99057 104139 67635 11998
637A1998n7403m7778j8431K9230O6746P1016M5643N614l7834o6371o4673l6797
$$ 11998 -45405 -93183 -111614 -82384 -15638 55378 101021 106635 68801 2430 -62243 -99040
649i9040j407L2310O1161O7538M1435k475l8922n8714o2308m2779q05M2688O7266
$$ -99040 -100447 -68137 -6976 60562 101997 99522 60600 1886 -60422 -103201 -104006 -61318 5948
662E948O4231L5523q569m7031o1696n3064l1321R15L9173O5864O3611L3266r635
$$ 5948 70179 105702 97133 50102 -11594 -64658 -95979 -95064 -55891 9973 73584 106850 97215
675I7215m7759o7707n8799k4362J6264M5386N9331N4821K8883j1821m8643o4479
$$ 97215 49456 -18251 -77050 -101412 -85148 -39762 19569 74390 103273 91452 42809 -21670
687b1670n4829k3453J5970M8880O3468N4784K3190k0735n5327o2524m5425j5130
$$ -21670 -76499 -99952 -83982 -35102 28366 83150 106340 85605 30278 -32246 -77671 -92801
699i2801J7702M6467O0477N1607K1649k1452n7199o5640m5039r381K4920N0919
$$ -92801 -75099 -28632 31845 83452 105101 83649 26450 -39190 -84229 -93610 -68690 -17771
711a7771O0214M5349R589k7599m9661n7499m5965j2595L0031N6477N8255M0501
$$ -17771 42443 87792 97381 69782 20121 -37378 -83343 -95938 -65907 -9430 48825 89326
723H9326P994l1677n7666n6324l4735n060K8984N6061N7611L3000J007k6551n3012
$$ 89326 97320 65643 7977 -48347 -83082 -88142 -59158 -3097 54514 87514 88521 61970 8958
736H958o3934l9261P287M2368N1129M7563L3691P84l8199n6803m9877l0045J002
$$ 8958 -54976 -94237 -86950 -44582 6547 54110 87801 88585 50386 -6417 -56294 -86339 -85337
749h5337L8549N9274N0775K4513m729l7363o1184n3122j8355J4220L4270N0209
$$ -85337 -46788 12486 63261 87774 83045 45682 -15502 -68624 -86979 -72759 -38489 11720
761A1720N3930K6906j6519m3976n0997m7027k6808J3509N0400N6644M0096J7876
$$ 11720 65650 92556 76037 32061 -18936 -65963 -92771 -79262 -28862 27782 67878 85754
773H5754j3385m6796n6681l9641j3599J1303M1962O2230M7219P075k4795m0300
$$ 85754 72369 25573 -31108 -70749 -84348 -73045 -31083 31147 78366 85441 60646 20346
785B0346n2097m8463j2560L0144M8991M6587L8439J4821k4178n2270n1863l5378
$$ 20346 -31751 -80214 -92774 -62630 -13639 32948 71387 86208 62030 9760 -42103 -77481
797g7481j1859K3255N6082N6491K9235J334k0858m6819o0175l5913M968K9848
$$ -77481 -89340 -66085 -10003 46488 75723 77057 56199 9380 -50795 -86708 -81740 -51892
809e1892M1198N1773M2609R40l8929n0974m3825l3288m453L6002N6018M4679K4410
$$ -51892 -10694 41079 83688 84628 45699 -5275 -49100 -82388 -86841 -50839 5179 49858 74268
822G4268L912k9041n7824n2352k0091N748K6544N1190N6800K6090j6176l5684
$$ 74268 78180 49139 -8685 -61037 -81128 -75380 -48836 2354 59154 85244 69068 33384
834C3384m2052m6853l1309J0219M2658M7055L9339K7676l896m4148n5376l7071
$$ 33384 -8668 -55521 -86830 -76611 -33953 13102 52441 80117 76221 32073 -23303 -60374
846f0374j6161M134L6469N9015M2808Q220j3473k8926m9268n0301j4745K3360
$$ -60374 -76535 -72401 -35932 23083 65891 74111 60638 31712 -17556 -67857 -82602 -59242
858e9242L7696M1219M2694K0941k1818m7095m2705l0371j7797J4079M7550N0414
$$ -59242 -21546 19673 62367 83308 61490 14395 -28310 -58681 -76478 -62399 -14849 35565
870C5565K7462P970j1260m0850n5671l3450J263K1351L4352M8191L8768R65l0686
$$ 35565 63027 70997 59737 18887 -36784 -70234 -68971 -47620 -13268 34923 73691 74656 43970
883D3970l7284l8272l4783q811L1097M7946L7308K4302P957k4065n1857m4312
$$ 43970 6686 -31586 -66369 -75180 -44083 3863 41171 65473 73430 49365 -2492 -46804
895d6804j7501K415J9514M4424N0419K2020j0588k7058l7349m5228k8561J0249
$$ -46804 -64305 -61890 -42376 2048 52467 74487 63899 36841 -508 -45736 -74297 -64048
907f4048L6418L9587L5985K6547m756l9429m6429l1837j7799J548L3390N2871
$$ -64048 -27630 11957 47942 74489 69733 30304 -16125 -47962 -65761 -64213 -30823 22048
919B2048L8085R134r428k7665m7222m4806j1512J8476L1016L9791M1950J8236
$$ 22048 60133 69267 59839 32174 -15048 -59854 -71366 -52890 -21874 17917 59867 78103
931G8103k0446l9790l8220l3320j9597J4592M4516M5530K7228J0977j0821l9705
$$ 78103 57657 17867 -20353 -53673 -73270 -58678 -14162 31368 58596 69573 58752 19047
943A9047n0836l0332l199J4601L3273M8113L7089L291k4055l4502m0726l6247
$$ 19047 -31789 -62121 -65320 -50719 -17446 30667 67756 71047 46992 12490 -28236 -64483
$$ [...]
8191e42
##END NTUPLES=NMR FID
##END=
