##TITLE=1H_LR-683B-CS2
 DMSO, 8 sc, 
 28.2.2020
##JCAMPDX= 6.0         $$ Bruker NMR JCAMP-DX V2.0
##DATA TYPE= NMR FID
##DATA CLASS= NTUPLES
##ORIGIN= UXNMR, Bruker Analytische Messtechnik GmbH
##OWNER= root
$$ XWIN-NMR		Version 3.5
$$ Fri Feb 28 14:42:35 2020 Russian Standard Time (UT+4h)  she@DPX200
##.OBSERVE FREQUENCY= 200.1315
##.OBSERVE NUCLEUS= ^1H
##.DELAY= (6, 6)
##.ACQUISITION MODE= SIMULTANEOUS
##.ACQUISITION SCHEME= undefined
##.AVERAGES= 8
##.DIGITISER RES= 18
##SPECTROMETER/DATA SYSTEM= spect
##.PULSE SEQUENCE= zg30
##.SOLVENT NAME= D2O
##.SHIFT REFERENCE= (INTERNAL, D2O, 0, 15.7039)
##AUDIT TRAIL= $$ (NUMBER, WHEN, WHO, WHERE, WHAT)
$$ ##TITLE= Audit trail, XWIN-NMR		Version 3.5
$$ ##JCAMPDX= 5.01
$$ ##ORIGIN= Bruker BioSpin GmbH
$$ ##OWNER= she
$$ F:/spectra/data/she/nmr/H-F/1/audita.txt
$$ ##AUDIT TRAIL=  $$ (NUMBER, WHEN, WHO, WHERE, WHAT)
(   1,<2020-02-28 14:41:33.23 +0400>,<she>,<DPX200>,
      <created by zg, POWCHK disabled, PULCHK disabled
       configuration hash MD5:
       00 E9 B6 7A A2 85 ED C7 34 08 36 98 17 FE 4E 26
       data hash MD5: 16K
       2C 1F 0D 10 55 FC F2 A7 3A 6D C1 1F E3 0B D3 5C>)
$$ ##END=
$$ 
$$ hash MD5
$$ 38 5F D7 E7 63 FF EF 97 E5 6D 46 7C 48 3B 5C 25
##$RELAX= 
##$RELAX= 
##$RELAX= 
##$RELAX= 
##$RELAX= 
##$RELAX= 
$$ Bruker specific parameters
$$ --------------------------
##$DU= <F:/spectra>
##$EXPNO= 1
##$NAME= <H-F>
##$PROCNO= 1
##$TYPE= <nmr>
##$USER= <she>
##$AMP= (0..31)
100 100 100 100 100 100 100 100 100 100 100 100 100 100 100 100 100 100 
100 100 100 100 100 100 100 100 100 100 100 100 100 100 
##$AQSEQ= 0
##$AQ_mod= 1
##$AUNM= <au_zg>
##$AUTOPOS= <>
##$BF1= 200.13
##$BF2= 200.13
##$BF3= 200.13
##$BF4= 200.13
##$BF5= 200.13
##$BF6= 200.13
##$BF7= 200.13
##$BF8= 200.13
##$BYTORDA= 1
##$CFDGTYP= 0
##$CFRGTYP= 5
##$CHEMSTR= <none>
##$CNST= (0..31)
1 1 145 1 1 1 1 1 1 1 1 1 1 1 1 1 1 1 1 1 1 1 1 1 1 1 1 1 1 1 1 1 
##$CPDPRG= <>
##$CPDPRG1= <>
##$CPDPRG2= <>
##$CPDPRG3= <>
##$CPDPRG4= <mlev>
##$CPDPRG5= <mlev>
##$CPDPRG6= <mlev>
##$CPDPRG7= <mlev>
##$CPDPRG8= <mlev>
##$CPDPRGB= <>
##$CPDPRGT= <>
##$D= (0..31)
0 1.2 0 0 0 0 0 0 0 0.06 0 0.03 0 0 0 0 0.0002 0 0 0 0 0 0 0 0 0 0 0 0 
0 0 0 
##$DATE= 1582886492
##$DBL= (0..7)
120 120 120 120 120 120 120 120 
##$DBP= (0..7)
150 150 150 150 150 150 150 150 
##$DBP07= 0
##$DBPNAM0= <>
##$DBPNAM1= <>
##$DBPNAM2= <>
##$DBPNAM3= <>
##$DBPNAM4= <>
##$DBPNAM5= <>
##$DBPNAM6= <>
##$DBPNAM7= <>
##$DBPOAL= (0..7)
0.5 0.5 0.5 0.5 0.5 0.5 0.5 0.5 
##$DBPOFFS= (0..7)
0 0 0 0 0 0 0 0 
##$DE= 6
##$DECBNUC= <off>
##$DECIM= 24
##$DECNUC= <off>
##$DECSTAT= 4
##$DIGMOD= 1
##$DIGTYP= 9
##$DL= (0..7)
0 120 120 120 120 120 120 120 
##$DP= (0..7)
150 150 150 150 150 150 150 150 
##$DP07= 0
##$DPNAME0= <>
##$DPNAME1= <>
##$DPNAME2= <>
##$DPNAME3= <>
##$DPNAME4= <>
##$DPNAME5= <>
##$DPNAME6= <>
##$DPNAME7= <>
##$DPOAL= (0..7)
0.5 0.5 0.5 0.5 0.5 0.5 0.5 0.5 
##$DPOFFS= (0..7)
0 0 0 0 0 0 0 0 
##$DQDMODE= 0
##$DR= 18
##$DS= 0
##$DSLIST= <SSSSSSSSSSSSSSS>
$$ [...]
##$SUBNAM2= <"">
##$SUBNAM3= <"">
##$SUBNAM4= <"">
##$SUBNAM5= <"">
##$SUBNAM6= <"">
##$SUBNAM7= <"">
##$SUBNAM8= <"">
##$SUBNAM9= <"">
##$SW= 24.9337058887773
##$SWIBOX= (0..15)
0 0 2 0 0 0 0 0 0 0 0 0 0 0 0 0 
##$SW_h= 4990.01996007984
##$TD= 16384
##$TD0= 1
##$TE= 0
##$TE2= 300
##$TE3= 300
##$TEG= 300
##$TL= (0..7)
0 120 120 120 120 120 120 120 
##$TP= (0..7)
150 150 150 150 150 150 150 150 
##$TP07= 0
##$TPNAME0= <>
##$TPNAME1= <>
##$TPNAME2= <>
##$TPNAME3= <>
##$TPNAME4= <>
##$TPNAME5= <>
##$TPNAME6= <>
##$TPNAME7= <>
##$TPOAL= (0..7)
0.5 0.5 0.5 0.5 0.5 0.5 0.5 0.5 
##$TPOFFS= (0..7)
0 0 0 0 0 0 0 0 
##$TUNHIN= 0
##$TUNHOUT= 0
##$TUNXOUT= 0
##$USERA1= <user>
##$USERA2= <user>
##$USERA3= <user>
##$USERA4= <user>
##$USERA5= <user>
##$V9= 5
##$VALIST= <valist>
##$VCLIST= <CCCCCCCCCCCCCCC>
##$VD= 0
##$VDLIST= <DDDDDDDDDDDDDDD>
##$VPLIST= <PPPPPPPPPPPPPPP>
##$VTLIST= <TTTTTTTTTTTTTTT>
##$WBST= 1024
##$WBSW= 4
##$XGAIN= (0..3)
0 0 0 0 
##$XL= 0
##$YL= 0
##$YMAX_a= 216193
##$YMIN_a= -88940
##$ZGOPTNS= <>
##$ZL1= 120
##$ZL2= 120
##$ZL3= 120
##$ZL4= 120
##$ABSF1= 10
##$ABSF2= 0
##$ABSG= 5
##$ABSL= 3
##$ALPHA= 0
##$AQORDER= 0
##$ASSFAC= 0
##$ASSFACI= 0
##$ASSFACX= 0
##$ASSWID= 0
##$AUNMP= <proc_1d>
##$AZFE= 0.1
##$AZFW= 0.1
##$BCFW= 1
##$BC_mod= 2
##$BYTORDP= 1
##$COROFFS= 0
##$CY= 11.3945322036743
##$DATMOD= 1
##$DC= 2
##$DFILT= <>
##$DTYPP= 0
##$F1P= 16.9975609425685
##$F2P= -3.02152046262296
##$FCOR= 0.5
##$FTSIZE= 0
##$FT_mod= 4
##$GAMMA= 1
##$GB= 0.15
##$INTBC= 1
##$INTSCL= 1
##$ISEN= 128
##$LB= 0.24
##$LEV0= 0
##$LPBIN= 0
##$MAXI= 10000
##$MC2= 0
##$MEAN= 0
##$ME_mod= 0
##$MI= 1.114404
##$NCOEF= 0
##$NC_proc= 0
##$NLEV= 6
##$NOISF1= 3.799351
##$NOISF2= 2.8
##$NSP= 1
##$NTH_PI= 0
##$NZP= 0
##$OFFSET= 15.70392
##$PC= 1
##$PHC0= -9798.668
##$PHC1= 29.60082
##$PH_mod= 1
##$PKNL= yes
##$PPARMOD= 0
##$PSCAL= 0
##$PSIGN= 0
##$REVERSE= no
##$SF= 200.130013532006
##$SI= 16384
##$SIGF1= 3
##$SIGF2= 2
##$SINO= 400
##$SIOLD= 16384
##$SREGLST= <1H.CDCl3>
##$SSB= 0
##$STSI= 0
##$STSR= 0
##$SW_p= 3612.71676300578
##$SYMM= 0
##$S_DEV= 0
##$TDeff= 0
##$TDoff= 0
##$TI= <>
##$TILT= no
##$TM1= 0
##$TM2= 0
##$TOPLEV= 0
##$USERP1= <user>
##$USERP2= <user>
##$USERP3= <user>
##$USERP4= <user>
##$USERP5= <user>
##$WDW= 1
##$XDIM= 8192
##$YMAX_p= 0
##$YMIN_p= 0
$$ End of Bruker specific parameters
$$ ---------------------------------
##NTUPLES= NMR FID
##VAR_NAME=  TIME,          FID/REAL,        FID/IMAG
##SYMBOL=    X,             R,               I
##VAR_TYPE=  INDEPENDENT,   DEPENDENT,       DEPENDENT
##VAR_FORM=  AFFN,          ASDF,            ASDF
##VAR_DIM=   8192,          8192,            8192
##UNITS=     SECONDS,       ARBITRARY UNITS, ARBITRARY UNITS
##FACTOR=    0.0002004,     1,               1
##FIRST=     0,             0,               0
##LAST=      1.6414764,     0,               0
##MIN=       0,             -88940,          0
##MAX=       1.6414764,     216193,          0
$$ Real data points
##PAGE= N=1
##DATA TABLE= (X++(R..R)), XYDATA
$$ [...]
1889b40K05j51J90L25k45l6k86N85j73ok53O3M12r1j00K52Mj97O1k45o7N6K19
1912B82J75j02K15P2j59j12j8J06l19l5L45j37r4J39K20k10k25N6l42J19RN28
1934E13l75L11j66J05m12J00K68k15K98j64j61M14l23P6R4j69o4J73k50j81N23
1955C95L64p91M39k14q0j9q7J33J65k01j71N21k70j17k0j88J92k46R8J26m7K77
1977B59k60l7k58Q8q7K11j18K07j15J41r5k31J43j71j13J01N2J01o6j35K61l6
1999a58q6j20N5J2p9j16M1J24K53M9j59j88mM9r7m4J13L01k8J40k37Rm18j10M47
2024b51J12m15L10O1K03r9l24kl3Q8R4r2J78P9K44j02l04k97M96k37j33l17N32
2047b09K12J83n90Q9l5J08m4M8m9L2J51J57Jr1Q2l73K84p9j71L59J71j40J01r4
$$ plain form
1889 -240 -35 -186 4 329 84 48 -238 347 174 168 -85 -22 390 299 199 451 455 258 319 74 7 63 282
1912 282 457 355 570 642 483 371 353 459 140 105 450 313 219 358 578 368 143 199 -143 -24 -15 513
1934 513 138 449 283 388 -24 76 344 129 427 263 102 516 193 269 363 194 130 303 53 -128 395
1955 395 759 -32 407 193 113 94 7 140 305 104 -67 454 184 67 47 -141 51 -195 -97 29 -18 259
1977 259 -1 -38 -296 -208 -295 -84 -202 5 -110 31 -64 -295 -152 -323 -436 -335 -283 -182 -248 -383 -122 -158
1999 -158 -244 -364 -309 -297 -376 -492 -451 -327 -74 -25 -184 -372 -376 -327 -424 -468 -355 -54 -82 58 -179 -170 -588 -698 -251
2024 -251 -139 -554 -244 -183 20 -79 -403 -405 -438 -350 -256 -348 -170 -91 153 51 -253 -550 -54 -291 -424 -741 -209
2047 -209 3 186 -404 -315 -350 -242 -286 -238 -287 -255 -104 53 54 -37 45 -328 -44 -123 -294 65 236 96 197 103
2071A03K6lM3m66L97K26o9l73L38j95j14L37k75Q1L7j87J69K24j6K33K5m77j62
2094i8J83J61J27j42J6%K37k10M3ml90J05L79P9o3j16o9K7J53j42l2J00j17m4
2118A83M9J78m50J39K03j15k58m6M81l45p7M26N7o29L54J10k87J15k34L21n4R
2140A30J09j32m63M60j47R2n61O55L23n34N1L66r2k29j77kj15N2J48L33q8k86
2162a07M15j05j10k53j99K74J65k38J18r9k65K51m2J19j1j89J00m0l6j26M39l85
2184c24K43j57L58o06L10j99M73l06M1L09o9m48N3k7K88j29J09k06J56l0j20J67
2206a14j87j35O63k72m56J93L83Q7n06J77p5M1m1J37J18m05M50j27K03l22K40
2227E2k21k9K4P4J18p5J6p1L02j98m96N29j21j9j53K46K89N9k38J32N4m10K94
$$ plain form
2071 103 129 126 169 -297 100 326 257 -116 222 27 -87 250 -25 56 93 -94 75 299 283 516 541 64 -98
2094 -98 85 246 373 231 247 247 484 274 317 313 -77 28 407 486 423 307 238 265 418 276 244 344 227 183
2118 183 232 410 -40 99 302 187 -71 -117 364 19 -58 368 425 -204 150 260 -27 88 -146 175 121 130
2140 130 239 107 -356 104 -43 49 -512 143 466 -68 -17 349 257 28 -149 -151 -266 -214 -66 267 179 -107
2162 -107 308 203 93 -160 -359 -85 80 -158 -40 -139 -404 -153 -195 -76 -87 -276 -176 -216 -252 -378 61 -324
2184 -324 -81 -238 120 -486 -176 -375 98 -208 -167 142 73 -375 -322 -349 -61 -190 -81 -287 -131 -161 -281 -114
2206 -114 -301 -436 227 -45 -501 -308 75 162 -344 -167 -242 -201 -242 -105 13 -392 58 -69 134 -188 52
2227 52 -169 -198 -174 -100 18 -57 -41 -112 190 -8 -504 25 -96 -115 -268 -22 267 326 88 220 274 -136 158
2250A58j63K4o5L00r4M5k89M65n89J04K38J33k8%l13O13m62J17j59K03k04J37
2272A71J21L8j11k15J17Q9K20k88R9J9J03j55L0j45N5q4k00K60j01K44k62J13
2294A18K72j60j36J05j37J29l92L03J26J49o5l05K09J90k94j11J9J46r3L56j33
2315B96k77L12k53J33m60K70l40K68J20P1nm0J87k06k67K10r3O1J51k13RJ77Q2
2338A93m23J46p0R6o7M61j30l94J89%J14k90J40j35j14K09N0j61l8rJ55j14L6
2361a56j01J13k1J26k64K08M24o47M29n36K19j4L09n81M70k68M08j75j75j68L29
2382g1K3l23L56J34n0j52J20l32jL88l13K07j12N5M3K4K3M7l23j22J73M82l59
2405h3j47L60k17j62L60k72J41P3j32j88j5J80L26K12m71j1J08L13l35r2j86M35
$$ plain form
2250 158 -5 19 -46 254 160 205 -84 381 -208 -104 134 267 239 239 -74 539 77 194 35 238 34 171
2272 171 292 330 219 4 121 210 430 142 241 260 363 208 238 93 148 64 -136 124 23 267 5 118
2294 118 390 230 94 199 62 191 -201 102 228 377 312 7 216 406 112 1 20 166 73 429 296
2315 296 19 331 78 211 -249 21 -319 -51 69 140 135 95 282 76 -191 19 -74 -13 138 -75 -66 111 193
2338 193 -230 -84 -154 -58 -125 336 206 -188 1 1 115 -175 -35 -170 -284 -75 -25 -186 -224 -233 -78 -192 -156
2361 -156 -257 -144 -165 -39 -303 -95 329 -318 111 -425 -206 -220 89 -492 -22 -290 118 -57 -232 -400 -71
2382 -71 -48 -371 -15 119 69 -83 37 -295 -296 92 -221 -14 -126 -71 -28 -4 19 66 -257 -379 -206 276 -83
2405 -83 -230 130 -87 -249 111 -161 -20 53 -79 -267 -282 -102 224 436 -35 -46 62 375 40 -52 -238 197
2427A97k63J78L1m66L90P8K53m71k49J99K69L71o63J99J46k79K85k43j84K20J68
2448A66O3l78J38N7L76j19M3j86j29J84k33K36J01l73Q4J81p1k89N42k71Q7j38
2470G1L19k59j40K99k35J65j41j64M15L3l34j25M05lk69q1j06J21J50K4k35K10
2492A20J22J05r9l22J16j0J35J51l2k54J3k10L21k44m10O51Kl6j69j38M35k28
2514A9J91j61j35J03J23K20m72jj41J49K03k67Q9P2J09O8j21l78J62J64J90m32
2536b46k74N86J52m28j99M01n5J41l04K49m2j88oR9k09K6N50j05k02p4j5J16Q4
2559E7l42K53k29Q0K00k1l32L38k20K05K55l14k33L32N3j3l29p2J21J16K34k28
2581h9l86K14N72l86j0K1J32j85R3l48K93n5L7M37l41j82L00j80L3j19N5J45l17
$$ plain form
2427 197 -66 112 143 -323 67 145 398 -73 -322 -123 146 517 -146 53 199 -80 205 -38 -222 -2 166
2448 166 229 -149 -11 46 422 303 346 160 31 215 -18 218 319 -54 30 211 140 -149 393 122 209 71
2470 71 390 131 -9 290 55 220 79 -85 330 363 29 -96 309 306 37 -44 -150 -29 121 145 -90 120
2492 120 242 347 248 -74 42 32 167 318 286 32 45 -165 156 -88 -498 153 155 119 -50 -188 247 19
2514 19 210 49 -86 17 140 360 -112 -113 -254 -105 98 -169 -80 -8 101 169 48 -330 -168 -4 186 -246
2536 -246 -520 66 218 -210 -409 -8 -63 78 -226 23 -19 -207 -213 -114 -323 -297 253 148 -54 -128 -143 -27 57
2559 57 -285 -32 -261 -181 19 -2 -334 4 -216 -11 244 -70 -303 29 82 69 -260 -332 -211 -95 139 -89
2581 -89 -475 -261 311 -75 -85 -64 68 -117 -24 -372 -79 -134 -97 340 -1 -183 117 -63 -30 -149 -94 51 -266
2604b66N88o0j78j58N9M41j72n03K9N97k17m4j42j17J05P5K91j32l39L21K12k60
2626A30p5m8P3j11J38l05J95K90J22k81M6j00O9L72o33j56M73j56j3q8m9R6M27
2649D16k52l61J11K71r8o5L8k23K34J44rl3Nj8j42K28j40k27M2L6N62l80j62o6
2673h9M26O6l05O2j11l79O99m31k07J85K17J13k52k16J08J50K08r9j65J8L83k81
2695A00J6k46J50q9K12j67k72J42m1M26m68L10l26J96K6j26k70L59j9P6ml58L51
2718b2j88J13K32o8j81L8N3q4j50J70qk8L28m14K36j97K82j42k21j6K10k2n2L29
2742A98n21K78o1K50l31j33M05l33L03j32j53J7R4RRq3K67o6J39l58L1q6K25L78
2766C46n59K6K69J07k44j3o8K67J11k50k57K80l9J76J72m27Q8J0J15J47k72p9
$$ plain form
2604 -266 322 262 84 -74 -15 426 254 -249 -220 377 160 116 -26 -143 -38 37 328 196 -143 178 390 130
2626 130 55 7 80 -31 107 -198 -3 287 409 128 174 74 143 515 -118 -274 199 43 30 -58 -107 -11 416
2649 416 164 -197 -86 185 87 22 60 -163 71 215 206 173 178 160 18 246 106 -121 -79 -43 519 139 -23 -89
2673 -89 337 403 98 160 49 -330 369 -62 -269 -84 133 246 -6 -222 -114 36 244 145 -20 -2 381 100
2695 100 116 -130 20 -69 143 -24 -296 -154 -195 231 -237 73 -253 -57 -31 -157 -427 -68 -87 -11 -15 -373 -22
2718 -22 -210 -97 135 67 -114 -76 -23 -107 -257 -87 -95 -123 205 -209 27 -170 112 -30 -251 -267 -57 -79 -131 198
2742 198 -323 -45 -106 144 -187 -320 85 -248 55 -77 -230 -213 -119 -110 -101 -184 83 17 156 -202 -171 -257 -32 346
2766 346 -213 -187 82 189 -55 -68 -136 131 242 -8 -265 15 -24 152 324 -103 -15 -5 110 257 -15 -94
2788i4K24l49K14K5J77j61L15l51nK4k03K69J23Pl64J55L25k02j7k25J60K29l27
2811e1K6j20K69P5j03r5r3L34l09J68j3k01J83J54j62L96m26j03M90j88l3l04
2833a06J59K50k42r7j35L42n5j0J60j38k66P96n70Oj23J39K61j85j29J7J29n5
2855A48J23k75j91M97L2l39J60j25k20J54R0M4j15p0m6M70m76K45j29k39K68n1
2877d5L5J77n4k21o0N7J96J8J25k23Q1l19R6K42mn43M08M14m02Q5k30K64k64M7
2901a20J95j13J24k19k3J29J14l0l18J82j14JK06k07M0M4j23J13o2K28k43J44
2923e2R8q1m22L11LL99m72J99J5m17K88N7r9N3l8p4R2J55L0j29k69k5M96k43R0
2948c5k3K39j99k46M61l10J44j67L52n24J29L92j89K52j92j79K08k13J57j06k3
$$ plain form
2788 -94 130 -219 -5 20 197 36 351 0 -5 19 -184 85 208 215 -149 6 331 129 112 -113 47 276 -51
2811 -51 -25 -145 124 199 96 1 -92 242 -67 101 88 -113 70 224 62 458 32 -71 419 231 198 -106
2833 -106 53 303 61 -36 -171 171 116 106 266 128 -138 658 88 94 -29 110 371 186 57 74 203 148
2855 148 271 -4 -195 302 334 -5 155 30 -190 -36 54 98 -17 -87 -133 337 -139 106 -23 -262 6 -45
2877 -45 -10 167 113 -108 -168 -111 85 103 228 5 86 -233 -137 105 101 -442 -34 380 -22 63 -167 97 -167 -120
2901 -120 75 -38 86 -133 -156 -27 87 57 -261 -79 -193 -192 14 -193 -153 -109 -232 -119 -181 47 -196 -52
2923 -52 46 -35 -457 -146 -143 256 -216 -17 -2 -419 -131 -74 -173 -120 -158 -232 -140 15 45 -84 -353 -378 118 -125 -35
2948 -35 -58 181 -18 -264 197 -113 31 -136 216 -308 -179 213 24 276 84 -95 113 -100 57 -49 -72
2969g2R7N7P0l49J21K61p7K9l03J83k2K86l89J55J29j43K38l56J31l41M88j54
2991C9K43j22r0J42j81l02L02J26o4j5m0j0K01k67J65j15K59m05J05L60j59j20
3013E2K10k8N2k90j91M18n5j06J03j48K28J64m67M03k77RM5N9o1k19K37o9l1n7
3037a9J8j0pL91k27m17M39K05n15P9O6J05R7j55j19J13j56r5M0K00j47K76j48
3060A4k20j2M10j17m28J02K23r5R3K87m40K02j1q4Q1K02j99j36r6Q7J6M6L8j24
3084a61L56k22j17K2j06L60l7o3R2r0j97P4J18l66K11K08j34q8q9o8M18m67R8
3107b48L01j06m9JJ01K5k74J3L30k90O0N6l9M8j01J57j38J35j49lK5l5k8K77o9
3132@J01j30k2R5p2N1j08j35L68k17j46L33j38j13J7LP7j97L45m5j40k37J4M70
$$ plain form
2969 -72 25 82 152 -197 -76 185 108 137 -166 17 -5 281 -108 47 176 33 271 -85 46 -295 193 39
2991 39 282 160 70 212 31 -271 31 157 93 78 38 28 229 -38 127 12 271 -134 -29 331 172 52
3013 52 262 234 286 -4 -195 223 168 62 165 17 245 409 -58 345 68 77 122 181 120 -99 138 69 38 -19
3037 -19 -1 -11 -18 373 146 -271 168 373 -142 -63 3 108 205 50 -69 44 -112 -207 -167 33 -114 162 14
3060 14 -206 -218 192 75 -353 -251 -28 -123 -30 257 -183 19 8 -76 5 207 8 -128 -224 -137 -121 -75 -37 -161
3084 -161 195 -27 -144 -122 -228 132 95 32 124 34 -163 -89 29 -337 -126 82 -52 -140 -229 -297 121 -346 -248
3107 -248 53 -53 -102 -101 0 25 -249 -236 94 -196 -136 -80 -119 -71 -172 -15 -153 -18 -167 -170 -145 -180 -208 69 0
3132 0 101 -29 -51 44 -28 23 -85 -220 148 -69 -215 118 -20 -133 -116 -113 -36 -233 112 67 -73 -310 -296 174
3156A74p4j18J19J49j70j70N1J33J35l80J35j01l3M00k04j49R2r6P4K1O3K54l69
3179f4m6L00r4j70K71j98O3K61j07k66J19J96j61J83o0O5k6l54J91l1N5n4J3j78
3203i2K08k97M24l6P6l59j67L15L41o53O0J33q2L30J7j84J05P2L7k51K03J2o55
3226d43P02p4n3K7j1k19J45j48pj3K06k8r8J56j64l54K71J73n8J60j67J84k62
3249g5k02M96j27L09l85J07k45O9j40M54m77K63O5j11j89l6Q7K98j11j93M5j00
3271a98NJ83J56l17J79J34k29j48O4r9J74J09oJ10m80N02o09L93Nr4rmo0K61j51
3296a29r4Q4P2p7j1r0K66k2l31N36l86J9j25L88l09K40P3p5J63l15R0j2O4p4o0
3321a15RR8j10L04J68l38j10J34k84J67k17K63P9Q9mM7j18j28j53K98N1j29P7
$$ plain form
3156 174 100 -18 101 250 80 -90 -39 94 229 -151 -16 -117 -150 250 46 -103 -11 -107 -33 -12 51 305 -64
3179 -64 -110 190 96 -74 197 -1 62 323 216 -50 69 265 104 287 227 292 266 -88 103 72 127 73 86 -92
3203 -92 116 -181 243 207 283 -76 -243 72 413 -240 -180 -47 -129 201 218 34 139 211 248 -3 200 212 -443
3226 -443 259 185 132 159 148 -71 74 -74 -81 -94 112 84 -14 142 -22 -376 -105 68 10 170 3 187 -75
3249 -75 -277 219 92 401 16 123 -122 -53 -193 261 -216 47 112 1 -188 -224 -137 161 50 -143 -98 -198
3271 -198 -193 -10 146 -171 8 142 -87 -235 -171 -270 -96 13 7 117 -363 139 -470 -77 -72 -166 -175 -179 -239 22 -129
3296 -129 -223 -139 -67 -144 -155 -245 21 -1 -332 204 -182 -163 -288 100 -209 31 104 29 192 -123 -33 -45 19 -55 -115
3321 -115 -106 -8 -118 186 354 16 -94 40 -244 -77 -294 -31 48 137 133 180 62 -66 -219 79 130 1 78
3344G8k91K96J60j53j99J76P4j31J00J11k09k2m8J1j15K79k09K0L29j28j15j58
3366a44K25m9N2O1rK65m08P6l50M93k37j97J98L9L38k69r5J25J47j92l2q5R9k18
3390a67J01j12M04j98j14J89j12J0O1j10J1O6n5r6K09j09j91M0j88O21j23%j92
3413e5O6k59K87J48k10j42K61k82p9M21M8m61N72k30j33R1j31N4Jj25J32j9K48
3436B03K1l6q1k8j06r2j48O67j78m79K89l58M03j84Q6r7K12K65m39O2k57K22J06
3459E3O9Op0J43n62Q2L44l24K39l61K52k0J31M7J54p7j60J51M9K11o28J80j57
3482b48J46K4j27K90m31M15r1l4j16R2K94l98J66J22J63m67K78j04j5J59j75L93
3504C36l87K2L90j01m53j4J41L04l42K15r0m22P69l56n2M1J9J03J39M2l86n8J81
$$ plain form
3344 78 -213 83 243 90 -109 67 141 10 110 221 12 -10 -58 -47 -162 117 -92 -72 257 129 14 -144
3366 -144 81 32 84 145 136 401 -7 69 -281 212 -25 -222 -24 15 353 84 -11 114 261 69 37 -48 51 -167
3390 -167 -66 -178 226 28 -86 103 -9 1 62 -48 -37 29 -26 -122 87 -22 -213 -173 -361 260 137 137 -55
3413 -55 11 -248 39 187 -23 -165 96 -186 -265 156 204 -257 315 85 -48 43 -88 -34 -33 -158 -26 -45 203
3436 203 224 188 107 79 -27 -119 -267 400 222 -257 32 -326 77 -107 -21 -118 94 359 -80 -18 -275 -53 53
3459 53 122 128 58 201 -361 -279 65 -259 -20 -381 -129 -149 -18 29 183 106 -54 97 146 357 -271 -91 -248
3482 -248 -102 -78 -205 85 -346 69 -22 -56 -172 -80 214 -184 -18 104 267 -200 78 -26 -41 118 -57 336
3504 336 -51 -29 361 260 -193 -207 -66 238 -104 111 21 -401 368 12 -40 1 20 123 262 304 -82 -140 41
3527D1m1j34J65J46j84J4L1j9kj95K73K31l80K1J64j66K48m3j56J67K86m75kL01
3551B91l49J73j69L35k06k12j6K54j39J53Jl6L49l76j07q4mL55l21j42K47r2K16
3574A21K24n34j6L24l91J85Q8M0n5q0l5J4q7K34jJ15p4k09o7R6j07J58MJ60k1
3599H6r3o3K0R1O5Ql16L36Km3j64j4n9m9J71m5J7O7J31k55K09P6j88r8NL60l10
3626e3O3K9j99J28j2o5J37j54J59j48l4j1L30k51n6R7l94O49n18K59k76J87k6
3649a59j46M55j12k83J86L22m49J74j65K49n3J58n9P6k20K76j03j37K90m15K71
3670A56j61K20k03j17K14k16J76q7K0O2p1j02j49L23k21J61J97k21l0M6J05l84
3692b82J15L76l16j17R0K12M6n1R7j29p0Lk10J59J34Jo7j13L02k89j46K45J48
$$ plain form
3527 41 0 -134 31 177 -7 7 38 19 17 -178 95 326 -54 -33 131 -35 213 170 14 181 467 -8 -10 291
3551 291 -58 115 -54 281 75 -137 -153 101 -38 115 116 80 429 53 -54 -138 -142 213 -108 -250 -3 -95 121
3574 121 345 -189 -205 119 -272 -87 1 41 -14 -94 -129 -115 -202 32 31 146 72 -137 -204 -108 -215 -57 -53 107 86
3599 86 -7 -70 -50 41 106 114 -202 134 136 93 -71 -85 -144 -193 -22 -67 -50 17 148 -107 102 178 -10 -108 -103 257 -53
3626 -53 10 39 -160 -32 -44 -109 28 -126 33 -115 -149 -160 170 -81 -137 -40 -434 215 -303 -44 -320 -133 -159
3649 -159 -305 150 38 -245 -59 263 -186 -12 -177 72 19 177 118 194 -26 250 147 10 300 -115 156
3670 156 -5 215 12 -105 109 -107 69 -18 2 64 -7 -109 -258 65 -156 5 202 -19 -49 -3 102 -282
3692 -282 -167 209 -107 -224 -134 78 124 73 170 41 -29 -26 -236 -77 57 58 -9 -122 180 -109 -255 -10 138
3715A38p8Rj3K3j31Q1q4o2M3Q3K07k62J82r1p5J04r3j17n5J97q4M1K3n3l5K00
3741I8R0l87K74m3k21L94j49m9J9n6K43k02j14J88l74L94k08K61k53J91K06k66
3763C6J06p8J78k59J37o3l6n8K6J99j78j25N3k97N94l17L1J95j94j63O1K40m07
3786c19K80J63j28k06M5j59M28q1J45l74J1o0K50K32l40J56j84L2l2Q6J12l9j39
3809a21o6k9K76l21K54k02J63q2J6K08n0p6k26L97j24J66l10Q5J36J2N9l98L53
3832A20l04K31l6p1J49r5K14m9j74RN0J65k56k41N61m79n2O06m87J42J42l90J9
3855b26K76q3k73M24j42J70j18j72K35l61J16L69j03m7rm7J53j01J12L5k79J20
3877D9m8m7J33R5m48K31J36k55q2J60J84j6P9k04j63K03p0K50o6k45J44K89l53
$$ plain form
3715 138 60 69 56 79 -52 29 -55 -117 -74 9 216 -46 136 45 -30 74 -19 -136 -191 6 -78 -37 -14 -67 -102 98
3741 98 188 -199 75 32 -189 205 56 7 26 -30 213 11 -103 85 -289 105 -103 158 -95 96 302 36
3763 36 142 64 242 -17 120 57 21 -37 -11 188 10 -115 -62 -359 235 -82 -51 144 -50 -213 -152 88 -319
3786 -319 -39 124 -4 -210 -165 -324 104 23 168 -206 -195 -255 -5 227 -113 43 -141 -109 -141 -55 57 18 -121
3809 -121 -187 -216 60 -261 -7 -209 -46 -128 -112 96 46 -30 -256 141 17 183 -127 -42 94 106 165 -233 120
3832 120 -184 47 11 -60 89 -6 208 159 -15 -6 44 209 -47 -288 273 -206 -258 348 -139 3 145 -245 -226
3855 -226 50 -33 -306 118 -24 146 28 -144 91 -270 -154 215 112 65 56 9 162 61 173 208 -71 49
3877 49 1 -46 87 182 -266 -35 101 -154 -236 -76 108 92 171 -33 -196 7 -63 187 121 -124 20 309 -44
3900d4K04j61J02N6r5j13J30M0q4j94M33j79r9Ll49K26j17K27J65j6j25K8o4J96
3924A70k75R1K26l72J4L48J06l89K73k36j48Q6J16QOj80Q5k1J27O1o0J1O0j25
3948a8l62M53L09m08J61m11L49k06K04N8j63j05O6M2j46j03J39J92j90J17l4M81
3970D25n73L06j89k23J94JK14j00K6j91J74j98J54l35J34J29P8J79l58j68K51
3991g0q9J87K26l60J28o6K35k79J76R6j9j34RJ21j66lq0J22m2k95J95J64j89R9
4015c4J70j46J35L2j39K09l02L1L6q8m8J93O5L18n16K26Oj36j9L3o5L56m56J68
4039B9j77N2PJ87k34K97j78K02J67m46J44k44J39m1P9J18K12l54Q7kM4j73K64
4062A79j30l5k7p6R1J62j59j61R5M8L2R7J58l60J71j66K32Nj61L8k09K90j57r0
$$ plain form
3900 -44 160 -1 101 157 62 -51 79 119 35 -159 274 95 -4 -1 -350 -124 -241 -14 151 135 10 38 -26 170
3924 170 -105 -14 212 -160 -146 202 308 -81 192 -44 -192 -106 10 18 24 -156 -71 -92 35 96 36 47 107 -18
3948 -18 -380 73 382 -26 135 -276 73 -133 71 129 -34 -139 -73 -31 -177 -280 -141 51 -139 -22 -56 425
3970 425 -148 158 -31 -254 -60 -59 155 55 81 -110 64 -134 20 -315 -181 -52 26 205 -153 -321 -70
3991 -70 -159 28 254 -106 22 -44 191 -88 88 184 165 31 40 161 -5 -8 -88 34 -8 -303 -108 56 -133 -34
4015 -34 136 -10 125 157 18 227 -75 -44 -8 -96 -144 49 114 432 -84 142 148 12 -7 26 -39 317 -139 29
4039 29 -148 -96 -89 98 -136 161 -17 185 352 -94 50 -194 -55 -96 -17 101 313 -41 46 44 88 -85 179
4062 179 49 14 -13 -89 2 164 5 -156 -61 -13 19 116 274 -86 85 -81 151 156 -5 33 -176 114 -43 -133
4086a33J82O3j20J35l00L17K0l53K98o8K7j2m7j65o2l8Q7j45K74J18K1j15Q7L3
4110A04J9j39k60J56K51L20n85k8J29L52k87m5J2m0J8l6o0J80m3K02r4K2p3j09
4134c4q8k21N70m49J99j35J43J01k2j24rn4N0K71k36J05J49J44m98J8K6K81j6
4157A71J41k07q0Q2l25rJ83K72m91K50q9J0j7k4l1K86K9l43L14o6k70M65n9j84
4181HK1j67J49m9j79M43j41K32l29Q7oj23K5P6J11j66L13l86R8J65k68q0J38L13
4205B85n6P8l41K3J08J8j0o5q3K11j60J05k8j69Q7K32n15K05K6p2n2L53l20N0
4229i0O0j00J48o7K78j45k91L84k35K13rj54Q9n6r3L11l15J23l7j6M0N9l20L06
4253H3j10J13l56L07j97J20k78K44J44j14j69K85J0j78M34j20n7N7k61p1J02k
$$ plain form
4086 -133 49 112 -8 127 -173 144 164 -189 109 41 68 56 9 -156 -218 -256 -169 -314 -40 78 99 -16 71 104
4110 104 123 -16 -276 -120 131 451 -134 -162 -33 319 32 -13 -1 -41 -23 -59 -119 61 18 220 126 148 75 -34
4134 -34 -122 -343 227 -222 -23 -158 -15 86 64 -60 -69 -123 -73 198 -38 67 216 360 -138 -120 -94 187 171
4157 171 312 105 25 107 -218 -227 -44 228 -263 -13 -102 -92 -109 -133 -164 122 151 -192 122 56 -214 251 192 8
4181 8 29 -138 11 -38 -217 226 85 317 -12 75 69 -54 -29 47 158 -8 305 -81 17 182 -86 -166 -28 285
4205 285 229 307 -34 -11 97 115 105 40 -43 168 8 113 85 -84 3 235 -280 -75 -49 -121 -173 180 -140 -90
4229 -90 -30 -130 18 -49 229 84 -207 177 -58 155 146 -8 81 25 -68 243 -72 51 14 -2 38 97 -223 83
4253 83 -27 86 -270 37 -160 -40 -318 -74 70 -44 -213 72 82 -96 338 218 161 218 -43 -114 -12 -14
4275a4J03%j38R8M2j51J26O8P2j01j2o1P5J59j04m7k13M84k63m1k13K88M5p3l92
4300b63J08J99k2M7k7j99R8K01r6q0k07K39J41j77N8j97J11n9K49O4j37j5Lm5
4324fj02J27R5j71k05J71L40j58o6j49K20q3j60r4j24J20P6Q4J69k05k7J0L5N5
4348d8J66J7j38R9j96K83o8j82J28j41L38k16L1l8J89j02m20M01M3jq7M5j0l25
4372b32K51k02K63n8j07J20p3J60k02L7K0k6K15j71J27j19j43J9M34n26K16j06
4394a03Mk2K05r5M4p0j11P6N3K33k18N5j26J50K41j63p0M8k30J41o0Q4q2J50l9
4419I5j60O6L7Q2q3K9q4l6L41n13mJ17J5M30l28l5J36k38K73j62L32l19L23l25
4443a1l15M85j91K3K17j84n3J07j93M21l25R1r9rR4j35p9N7o7L08L4j45p7K10
$$ plain form
4275 -14 89 89 -49 49 91 -60 66 134 206 105 93 32 107 266 162 115 -98 386 123 82 -131 157 202 129 -263
4300 -263 -155 44 22 69 42 -157 -59 142 46 -34 -241 -2 139 -38 20 -177 -66 -125 124 188 51 36 39 -6
4324 -6 -108 19 114 -57 -262 -91 249 91 25 -124 96 13 -147 -241 -365 -245 -169 -85 84 -121 -148 -138 -103 -48
4348 -48 118 135 -3 96 -100 183 115 -67 61 -80 258 42 73 35 224 122 -298 103 146 145 58 103 93 -232
4372 -232 19 -183 80 22 -85 35 -38 122 -80 -43 -23 -49 166 -5 122 3 -140 -121 313 -213 3 -103
4394 -103 -99 -121 84 -11 33 -37 -148 -72 -19 214 -4 51 -75 75 316 153 83 131 -99 42 -18 66 -16 134 95
4419 95 -65 1 38 120 37 66 -18 -54 287 -226 -230 -113 -98 332 4 -31 105 -133 140 -22 310 -9 314 -11
4443 -11 -326 159 -32 -9 208 24 -29 78 -115 306 -19 72 -27 -36 58 -77 -156 -99 -166 142 176 31 -46 164
4467A64q2Q0j8l28L51j03O6r3J35j54J63r6j52Q1m1k2O8J5j28J13o4R1k00mK47
4492H9k79M59k67j50L48M1j54k98k4L26l14J5R0P1k8K98m06N20l73J65Lp9j66
4515a13M9O8j58P3q4Q8O7j2J44N1j90L05j97r7J17Qj9l02L59p9K30j59m9Pl67
4540b60K44Q2j23J17l6l0J20j78K55r7pj08K08k91mK02k08J99K08l11J23p8k39
4563b12K22K19k30K56m80J65j99P0J25n8J59N2P7l72K66J22p13M97k47L14l1R1
4585I3m7J31k41k0K25j0m06M14n3j5j60K6L5%l9L3j88K81K19j58k71J58q4j71
4609b48K6P5P9j47J64K30j39k86L99j54p5K27l49P4R5k07K83l94L31N7j19OJM7
4633b4K20l08K39j22J45L06n30J33j25m0k88L46K55j47R7k45J56j58J31o7L04
$$ plain form
4467 164 82 162 144 -184 167 64 130 37 172 18 181 85 -67 14 -27 -49 19 34 -94 19 -45 46 -154 -158 89
4492 89 -190 269 2 -148 200 241 87 -211 -235 91 -223 -208 -118 -47 -75 223 -183 337 -36 129 132 53 -113
4515 -113 -64 4 -154 -81 -165 -77 -10 -22 122 173 -17 288 91 -6 111 119 100 -202 157 78 308 149 100 107 -260
4540 -260 -16 66 -57 60 24 -6 114 -64 191 94 87 -21 187 -104 -108 94 -114 85 293 -18 105 27 -212
4563 -212 10 229 -1 255 -225 -60 -259 -189 -64 -122 37 89 166 -206 60 182 -531 -34 -281 33 2 93
4585 93 46 177 -64 -84 141 131 -275 139 86 71 -89 -63 -28 -28 -67 -34 -222 59 278 120 -151 7 -77 -248
4609 -248 -222 -147 -68 -215 -51 179 40 -246 153 -1 -76 151 -198 -124 -29 -236 47 -347 -16 41 -78 -72 -71 -24
4633 -24 196 -112 127 5 150 456 -74 59 -66 -106 -394 -48 207 60 157 -88 68 -90 41 -26 278
4654B78j66j84k73K80k0K68l20nJ51J41L03l14k56j95M08o2j27O5j58K37N5l12
4676b06M30l54K09j73M7K46k52j91J4K76Q5r2m3mK7k15K29N1k81J58j49K19o7
4699c6K22j30j95K31m33K43K71k70R2K79j58n6n7K09l37J85N1O3j53J96l11Q6
4721hJ39K8j83j31j14N16k15K44j86j3j71l69M83k76J61K12k53L3J99j74J97r7
4743B2j9j71p1M33j64j29J34K35k60L29j54k26J37m9N4j8k03J6L38j55j13K3n7
4766f8J28k03P3N1l4J52l13Q9J07P8J35k85rk62K60P4m0K21k64L21k80n4M4J53
4790G4P9l05J73j92K08k3r3L2K0o3p4J76K30j90J4k04o5L1J44J1K3j51K08K2j3
4815G2q5PL0k41J68N8m3J19R6k47L3K05q8mj2J45o4l6J85k07Nj33M66k03l68K23
$$ plain form
4654 278 112 -72 -345 -65 -85 183 -137 -142 9 150 453 139 -117 -312 96 34 -93 -28 -186 51 106 -206
4676 -206 224 -130 79 -94 -47 199 -53 -244 -230 46 131 39 -4 -8 19 -196 33 84 -197 -39 -188 31 -36
4699 -36 186 56 -139 92 -341 -98 173 -97 -5 274 116 60 3 212 -125 60 111 174 21 217 -94 -8
4721 -8 131 159 -24 -155 -269 247 32 276 90 77 -94 -463 20 -256 -95 117 -136 -103 96 -78 119 22
4743 22 3 -168 -239 194 30 -99 35 270 10 339 185 -41 96 47 101 83 -120 -104 234 79 -34 -11 -68
4766 -68 60 -143 -70 -19 -53 99 -214 -125 -18 60 195 -90 -99 -361 -101 -27 -67 154 -110 211 -69 -123 -79 74
4790 74 153 -152 21 -171 37 14 -79 -47 -27 -90 -164 12 242 52 66 -138 -203 -172 -28 -17 6 -145 63 85 72
4815 72 -13 -6 24 -217 -49 9 -34 85 181 -66 -33 172 84 80 68 213 149 113 298 91 96 -37 429 226 -142 81
4841H1J51l81J25p6K06J62l55j01J26J75j75j55J23j9K81o9j41q7L16k54J86K9
4863A48k07K27j5k35l9lj73M93q4P0l35K85k31K00Q8k95o3K15P1q5j75L7Pj45
4887b44O7J50oN5k47K66k2Q2M1m5M1l95J53j70lN91m45L04o9p5J34j03qN2j53
4912d9p6J30K6k2n5K3J16q5j46j22L08N2l02M9K65m72L22r7R1p2nL54k24j29P9
4937d1j15K61L3j63Q4j02O5j93j54K33O7J42j87J43j58j4J58n4oJ22l71j35K05
4960a80J22O7J01k06j45K25J11j45K44j69K09k57N8Q1k56M7K25j61J5qJQ5k38
4983a74L60K40n12J95j6r5l4M0J4l04L58L0k46j54N85K1k29J14m0j43j17J69r0
5006b8OK15M0n23N20j56k92J29O7N7l46L60P6m2k38L38l33L7QK34k90O1J53J02
$$ plain form
4841 81 232 -149 -24 -100 106 268 -87 -188 -62 113 -62 -217 -94 -113 168 99 -42 -129 187 -67 119 148
4863 148 -59 168 153 -82 -121 -124 -297 196 112 182 -153 132 -99 101 189 -106 -169 46 117 32 -143 -106 -99 -244
4887 -244 -177 -27 -33 22 -225 41 19 101 142 97 138 -257 -104 -274 -277 314 -131 173 104 29 163 60 52 104 -49
4912 -49 -125 5 31 9 -46 -23 93 8 -138 -260 48 100 -202 -153 112 -360 -38 -135 -44 -116 -121 233 9 -120 -41
4937 -41 -156 105 138 -25 59 -43 22 -171 -325 -92 -25 117 -70 73 -85 -99 59 5 -1 121 -250 -385 -180
4960 -180 -58 9 110 -96 -241 -16 95 -50 194 25 234 -23 35 116 -140 -93 132 -29 -14 -22 -21 64 -174
4983 -174 186 426 -86 109 93 -2 -36 4 18 -286 72 102 -144 -298 287 308 79 193 153 10 -107 62 -28
5006 -28 -22 193 233 -290 230 74 -218 -89 -22 35 -311 49 125 83 -155 183 -150 -113 -105 129 -161 -100 53 155
5030A55m71L93R7K0k14J33k93K74q9k1K3j00OJ72J2j48j84K08o1p9j45K76LJ77
5054A44k01Q2K56k28k5m0R6j71K54j27k9J38k46K0K70j31O7J75j44J2k7j14O9
5077A00l21K87L4j12K76l36N3m63L50J65Kp1J61N6l47K09j32J5K30m91M65j52
5099b2k07J43J36M1j52k81K22K11k6P9Q9k88O3j13j21L43N7R9j81j31R3K8j25
5122d3L20l89J02L6j09M0Q4q3R8j9J00p7M2j4j5p6m5l62K58K28j24K87j97j7r1
5147f6P7J40J52m50L28l50LJ61J37j57j4j42M1p4M65k42L8j5k12N20l61K19l29
5170a31J43L8j23K36j44J24l2j34J82K36k38k29J1J34N9k82K83J98o30N5R2M83
5192C31P4l23K73m94L54k28j55m3L86k39n2r8pL29j01J57j07j66l6K67L3j54J59
$$ plain form
5030 155 -316 77 174 194 -20 113 -180 94 5 -16 7 -93 -87 85 97 -51 -235 -27 -88 -167 -312 -36 -33 144
5054 144 -57 25 281 53 28 -12 84 -87 167 40 11 149 -97 -77 193 62 129 304 160 172 145 31 100
5077 100 -221 66 100 -12 264 -72 -19 -482 -132 33 35 -36 125 181 -166 43 -89 -74 156 -335 130 -22
5099 -22 -229 -86 50 91 -61 -342 -120 91 65 144 233 -55 8 -105 -226 117 174 273 92 -39 54 82 -43
5122 -43 277 -112 -10 26 -83 -43 41 -42 56 37 137 60 102 88 73 -3 -48 -410 -152 76 -48 239 42 25 -66
5147 -66 11 151 303 -147 181 -169 -166 -5 132 -25 -39 -181 -140 -214 251 9 47 32 -180 340 -21 198 -131
5170 -131 12 50 -73 163 19 143 111 -23 159 395 157 -72 -61 73 132 -150 133 331 -299 -244 -152 331
5192 331 405 82 355 -139 215 -13 -168 -211 175 -64 -116 -214 -221 108 7 164 57 -109 -145 122 155 1 160
5215A60m26L27k2k11mJ95O8k24L31l82J59p2j75M51q4q7n8J05k24J19K83j68k64
5238b03O7M65m75J65l6J38k3n6r7n9j6j4j23J95N3j61l9K56p3Q3q3j1O5R6p7j66
5264a29J54K10l99M6K91m82K80P3n7K0K11r7k77J41R4k01M7j34K42j42n6J62J25
5287A22k78L20q6k07J53L94m17q3nj11pkL94L9l2j84J69q3Q4j29L46n20P3K43
5311A93l39L2K02k20O6o3L11j63R8k16K67J85m06j89J44K54l58m6L46p0j74K99
5333A53n2q3l97L60Nq6K16N8j58L77n44J13J28k54K69j01R8k66K81o3k01K02Q6
5356A41j42N6r5RK65m33J11O5L06m65K63j20j18J24K1J93j96r6o0K12k26K05r9
5379g9k14K34O6l69K18M1L0j54J67O1P8j29N3l04K84K20l15J80l4l7j40K59j55
$$ plain form
5215 160 -266 61 39 -172 -176 19 87 -137 194 -188 -29 -101 -276 175 91 4 -54 51 -173 -54 229 61 -203
5238 -203 -136 329 -146 19 -17 121 98 42 -55 -114 -130 -144 -267 -72 -19 -180 -219 37 -36 47 -36 -47 18 114 37 -129
5264 -129 25 235 -164 -118 173 -309 -29 44 -13 7 218 121 -156 -15 79 -122 -75 -209 33 -109 -165 -3 122
5287 122 -156 164 78 -129 24 418 1 -82 -87 -198 -205 -207 187 226 194 10 179 96 180 51 397 -123 -50 193
5311 193 -146 -114 88 -132 -66 -129 182 19 117 -99 168 353 -53 -242 -98 156 -202 -248 98 28 -146 153
5333 153 101 18 -379 -19 -14 -100 116 174 16 393 -151 -38 90 -164 105 4 102 -164 117 54 -147 55 141
5356 141 -1 55 -40 -31 234 -199 -88 -23 283 -182 81 -39 -157 -33 -12 181 -15 -111 -171 41 -185 20 -79
5379 -79 -293 -59 7 -362 -144 -103 -73 -227 -60 1 79 -50 3 -301 -17 203 -112 68 34 -3 -143 116 -39
5402c9k7L44m93L37m1j04j44J91j36N9M57m79qoK97j64J00J85k10r0J25l37J02
5425h1M4L7k02L64j18K1J41j07J4k21N5r5K42L8p7K5l0l28L77N4q5j06J56J46
5449B64k92J2p4Q2j20L10m04j6R0j72J03L15L2l01L42j33p7j94O2K5J07M0M2k1
5473B2j80L36k82K13K7j71k10L82l3L5j23K52r5m88K23o3q5J86l8J83M2j11K0
5496D2J19k55o5j54N90l52r7K81R8R4o43N04k06J93k2j34oJ77j88Jk13M7O5J92
5520F8J47l22M9J20p4j56O1J07j9kn1R1L8K15k82J57k85N3K19k02K17j82P5J36
5544A78P2O1m10M08j05k12j19K26k72L42o3l48J13L1J35L24l13k62K50k2m5J22
5566I1j24j01J74J6k49K98j38k22L5K20O6j24l7J20J02O7j09K8r4J68m25J00J31
$$ plain form
5402 -39 -66 278 -215 122 81 -23 -167 24 -112 -53 404 -75 -83 -89 208 44 144 329 119 29 154 -183 -81
5425 -81 -37 0 -202 162 44 65 206 99 113 -108 -53 -148 94 132 55 80 50 -278 99 153 68 -38 118 264
5449 264 -28 -16 -90 -8 -128 182 -222 -238 -148 -320 -217 98 130 -171 171 38 -39 -233 -171 -146 -39 1 43 22
5473 22 -158 178 -104 109 136 -35 -245 137 104 139 16 268 173 -315 -92 -155 -240 -54 -92 91 133 22 42
5496 42 161 -94 -159 -313 277 -75 -172 109 207 301 -342 162 -44 149 127 -7 -13 164 -24 -23 -236 -189 -124 68
5520 68 215 -107 -58 62 -12 -168 -107 0 -19 -21 -72 19 57 272 -10 147 -138 -85 134 -68 149 -33 42 178
5544 178 250 311 -99 309 204 -8 -127 99 -173 169 106 -242 -129 -98 37 361 48 -214 36 14 -31 91
5566 91 -33 -134 40 56 -193 105 -33 -255 -220 0 66 -58 -95 25 127 194 85 113 19 187 -238 -138 -7
5589gR2J17k01R7k58J63n0J27M42r43M66Q9N8j43k77K23p7j3K72l30J98j02j17
5612a74O8q8l6J09K66j19j46j06j11oK12J85j10J49J33o6r2l15M46k59o8J73N
5635E0k27j1J14K50j60j21J43k39J62J30J76k25M1j89K66n38L61l09K86k12K42
5656a0j65P4J18J4J60k83K11m8j1Q4n7L8m0j43K4N4K04j28r6j75K71k9j11K07
5680A63j59j27J66j58J70J65k46M1Q1k21K66J91j89k27l3L43k95N1o0mk4K17J7
5703A28r7l0n9R1j07J29j14J50l70J30K66o3J73o3J9n44M08J37k83J13j92K74
5725I6j19j13K29j00k79L24K5pk5j49Q6K36r4M4q4j79K49j36k01K71j49j4J52
5748F3n8P0j21J56O3k64K8R8J29j33j49J56l4p4J62m4j31QQ6P8K7JK1O4j40m2
$$ plain form
5589 -7 85 202 1 98 -160 3 -47 80 522 -421 45 134 192 49 -228 -5 -82 -95 177 -153 45 -57 -174
5612 -174 -106 -194 -230 -121 145 26 -120 -226 -337 -343 -131 54 -56 93 226 160 68 -247 199 -60 -128 45 50
5635 50 -177 -188 -74 176 16 -105 38 -201 -39 91 267 42 83 -106 160 -378 -17 -326 -40 -252 -10
5656 -10 -175 -101 17 31 191 -92 119 71 60 144 87 125 85 -58 -34 20 224 96 0 -175 96 67 -44 163
5680 163 4 -123 43 -115 55 220 -26 15 96 -125 141 332 143 -84 -117 226 -69 -18 -78 -82 -106 111 128
5703 128 31 1 -58 33 -74 55 -59 91 -279 -149 117 54 227 164 183 -361 47 184 -99 14 -178 96
5725 96 -23 -136 93 -7 -286 38 63 56 31 -118 -32 204 110 154 70 -109 140 4 -197 74 -75 -89 63
5748 63 5 75 -46 110 173 -91 -63 35 164 31 -118 38 4 -70 92 48 -83 -75 11 89 116 117 138 202 62 20
5774B0K04k63K60j99j39M40k66No5J41n7j36k71L86j23J25L21n18P3J07l5K69
5796B79j28l0l89K91j61J10J54Lqj19j4mK67m92K30j7n5l9L18l6j67q4Q7j11M23
5821C08m15K8k74K77q5P8K94q7j04m0lL6j06J96k63p5K27KQ7L20o91L09n7J48
5845A10j44K0K04k47N2j13K38k97K70R1k02l5l53J49L59k81L64j43k86%J37J82
5867G5J60k96J5j35K62K52l96J34k68J32l80N44k8o9Q2k51K58N3k54L35k39j55
5889a69L76k89J25L9m28L76r6J55Q0k04j4K82N6j38j25o3j10P2o2P3J39k53J43
5912c5OK84J40m88M8k15J59J39k31L64k98K32o2p1K74m63r9L67j13J60l0J99n05
5935b38J33l3L10k82J83j01J82Q0k47oK00j93j3K2K57rj59J35k38L73k05m15M62
$$ plain form
5774 20 224 -39 221 22 -117 323 57 62 -3 138 81 -55 -326 60 -63 62 383 -135 -62 45 10 279
5796 279 151 121 -268 23 -138 -28 126 129 121 2 -12 -16 251 -241 -11 -28 -83 -122 196 160 -7 -91 -4 -115 308
5821 308 -107 -79 -353 -76 -161 -83 211 124 20 -20 -23 13 -93 103 -160 -235 -8 -6 81 401 -290 19 -38 110
5845 110 -34 -14 190 -57 -5 -118 120 -177 93 184 -18 -53 -406 -257 102 -179 185 42 -244 -244 -107 75
5867 75 235 -61 -46 -181 81 333 -63 71 -197 -65 -445 99 71 2 84 -167 91 144 -110 225 -14 -169
5889 -169 207 -82 43 82 -346 30 -66 89 169 -35 -49 233 289 151 26 -37 -147 -75 -137 -64 75 -178 -35
5912 -35 -29 255 395 -93 -45 -260 -101 38 -193 171 -127 105 43 -28 246 -217 -316 51 -62 98 68 267 -238
5935 -238 -105 -138 172 -110 73 -28 154 234 -13 -19 181 -12 -25 -3 254 245 86 221 -17 356 151 -264 198
5958A98l56J62o1O2p8J65k34K3K05j2M8k42J33M6k56J70J05j9P5k47P0k02K70
5981B5j29L9O7K59n25J39j0O3L27k71p9m9J63m0l4K44j3k15P8k10K7K59l64N38
6005B89k31l34L91p0N7j91R3K82n12J62J06j41K32Q8l22p0J80KO9j85K60q4k08
6028a37K11k09J18J42q0j30J60k25LP5j53Q7K59k43L02k57j84K93k36K92j16N6
6050B8j2J0J3N2k33M31m96K32L0j13L26l64K31kk67K27k04m6L74m92L51j33K7
6073c0L08n13j59M32r4j97L84j68j40J90j18K38j64l23K31R9J57QQ9k25k2J2K5
6096B0J48l56K31j33M2r9J61P6K1j39r8J09R8P8k99K21o5J15n6k35k8j3J58j9
6120f2J93j45k12J6L5J87J00j21L4j85K50p9J11j96R1J32P3q6j8J98n30K10j0
$$ plain form
5958 198 -158 4 -57 5 -73 92 -142 -119 86 74 122 -120 13 59 -197 -27 78 59 134 -113 -43 -245 25
5981 25 -104 -65 2 261 -264 -125 -135 -72 255 -16 -95 -144 19 -21 -55 189 176 -39 39 -171 -144 115 -249 289
6005 289 58 -276 115 45 102 -89 4 286 -226 -64 42 -99 133 221 -101 -171 9 11 80 -105 155 71 -137
6028 -137 74 -135 -17 125 45 -85 75 -150 -147 -72 -225 -138 121 -122 180 -77 -261 32 -204 88 -28 28
6050 28 16 26 39 91 -142 289 -207 25 55 -58 268 -96 135 133 -134 93 -111 -157 217 -275 76 -57 -30
6073 -30 278 -235 -394 38 -56 -253 131 -37 -177 13 -105 133 -31 -354 -123 -24 133 141 230 5 -17 -5 20
6096 20 168 -188 43 -90 -48 -147 14 90 111 -28 -126 -17 81 159 -140 81 16 131 75 -160 -188 -201 -43 -62
6120 -62 131 -14 -226 -210 -175 12 112 -9 25 -160 90 11 122 -74 17 149 222 136 118 316 -214 -4 -14
6143a4NL38l74J95P8j20rm1J89k3m83L63q9r9K65k44J27o0J7R5j6l98L87M5r9
6168C5N2m2j00N0r3RL9J78o1n5j11J1J80k07K50j94M3K03k19K57r3j83m7k22M99
6193A79l55K86k29K41j27mk5K07k57Q3K51l60M2m7K3J58o8m5R5P8j47K40l34P5
6217d0K02l2j65J53J01l25J33j91J36k11M49m09K04M9K5j51K1R3L2N9j50r7j35
6240b49K34r2K28j71K81o82L44L04l16K08k64J98l24K70l23M72L0j63j69J69j75
6261a90K61p7R8j67l4j5J65l59L99j8j93rL6K29l58NM71j99j7j93J86j18m5K40
6285I8l39L47l04J28O6N3N4J29k73L3K24n7j61k05J26Kj10l2J11M6MK05l80J21
6309a14K32O1j6j37M0l4M2N4p8j63k2J74K61l49m2J24Q8k9l3l63J14K30K15m81
$$ plain form
6143 -14 -9 329 -45 150 228 108 99 58 247 224 -259 104 15 -84 181 -63 64 4 21 116 100 -298 89 134 35
6168 35 87 45 -55 -5 -98 -89 -50 128 67 12 -99 -88 92 -115 135 -59 -16 187 -32 225 132 -51 -98 -320 179
6193 179 -176 110 -119 122 -5 -9 -34 173 -84 -1 250 -110 -68 -115 -92 66 -2 -47 48 126 -21 219 -115 -40
6217 -40 162 130 -35 118 219 -106 27 -164 -28 -239 210 -199 5 54 79 -72 -51 42 74 133 -17 -114 -249
6240 -249 -15 -107 121 -50 231 -451 -107 197 -119 89 -175 23 -301 -31 -354 118 148 -15 -184 -15 -190
6261 -190 71 -6 92 -75 -109 -124 41 -318 81 63 -130 -139 -103 126 -232 -227 244 45 28 -165 21 -97 -142 98
6285 98 -241 106 -198 -70 -4 49 103 232 -41 -8 216 159 -2 -207 -81 -79 -189 -221 -110 -64 -60 145 -235 -114
6309 -114 118 179 163 26 66 32 74 128 50 -113 -135 39 300 -49 -91 33 121 92 59 -304 -190 40 255 -226
6333b26P2K59k12K3J41om9O3l8j31N3j14L02j28p0J19J72K3n32L95j82K59l88
6356a95O1J84M3R3k18Q5k86L56m33L68K38m14K86Q7k62l76O99lk46k33M10j95
6378D9r8K0j74M50m36O9J03rJ42j89n6P9M9j21J72L62j94l31Q2O3M8Oj17L73o04
6403b62L66o4J01k64K98k09K54k98J53j27o6J95K14m51P4J90l17K9J49J23j31
6424d3n9J42J0J31k18j27Q9m8K12j13P8K3j55q2K58k7j29J21r5l10M77m08M08
6447A35J24r8M2l34N5K95m05R4J56r0NL7LK54k59j50K52q4j42L10l55J56K5l95
6471c69L97J80l66J95j25j92K41Q2J0j28k60O1L1J53K0k47K26M11j08O8l58L38
6493B60k98O8J75m53K63M6j87n8K86k70P3J27q9K71k29J43l6j57j11n7L57j94
$$ plain form
6333 -226 -154 105 -107 -84 57 51 2 65 27 -104 -51 -165 137 9 -61 58 230 253 -279 116 -66 193 -195
6356 -195 -134 50 93 186 -32 53 -233 123 -310 58 296 -118 168 255 -7 -383 316 313 67 -166 244 49
6378 49 -49 -29 -203 247 -189 -120 -17 -26 116 -73 -129 -50 -1 -122 50 412 218 -113 -31 32 80 86 -31 342 -262
6403 -262 104 40 141 -123 175 -34 220 -78 75 -52 -118 77 291 -160 -86 104 -213 -184 -35 88 -43
6424 -43 -102 40 50 181 -37 -164 -75 -123 89 -24 54 77 -78 -160 98 71 -58 63 -32 -342 135 -273 135
6447 135 259 161 203 -131 -76 219 -186 -92 64 -26 -21 16 19 273 14 -136 116 32 -110 200 -155 1 26 -369
6471 -369 28 208 -158 37 -88 -280 -39 43 53 -75 -335 -274 -243 -90 -70 -317 -91 320 212 280 -78 260
6493 260 -38 30 205 -248 15 61 -126 -184 102 -168 -95 32 -57 214 -15 128 92 -65 -176 -233 124 -70
6515g0J11k88J4J93n2j1K83j25k55M42k44k7k9j02K02Q8k18j03Q5l6L44j90m1
6538b9J34N5k09J13j4L48m00k50L19J25j29J09P4Plk67K3J28O2k71K2l7l5K90
6562A65m6o8j45K6K02L2l0j79j3K21K4j55k63L46l45J84n9j26L75j39NRk66K37
6586hP7mMl9j28L79j40J3l22J61q3p8Ml07L31J96j28k8P4K19l4l9j95J42K76l72
6612b9Pl8r4J58j44m0k12K85k43M34k56L64l03J17R2l40M65m18L20j42M2k6j73
6635a74K27J52pn78N63j05l7J49l52L85j18j08l2q2J78n8p1N3J16K48l52k43K00
6658d6j52K78N4J42m08Lj80M46l00K85j40J69l11L13k23j21K88j60J87k77P0K27
6680A44m88M94k79J04J99l02K24j14K09j52j06j40K39l1RJ95j56L1k22N68o00
$$ plain form
6515 -70 41 -247 -233 -40 -92 -103 180 55 -200 242 -2 -29 -58 -160 42 130 -88 -191 -106 -142 202 12 -29
6538 -29 105 160 -49 64 50 398 -2 -252 67 192 63 172 246 253 250 -17 6 134 196 -75 -53 -90 -125 165
6562 165 119 51 -94 -68 134 166 136 -43 -56 165 189 34 -229 117 -228 -44 -103 -229 146 7 12 21 -245 -8
6586 -8 69 65 69 30 -98 281 141 154 -168 -7 -90 -168 -164 -471 -140 56 -72 -100 -26 193 159 120 -75 67 343 -29
6612 -29 -22 -60 -154 4 -140 -180 -392 -107 -350 84 -172 192 -111 6 98 -242 223 -195 125 -17 25 -1 -174
6635 -174 53 205 198 -380 183 78 41 190 -162 223 105 -3 -35 -117 61 3 -68 -15 101 349 -3 -246 -46
6658 -46 -198 80 134 276 -132 -129 -309 137 -163 122 -18 151 -160 153 -70 -191 97 -63 124 -153 -83 144
6680 144 -344 150 -129 -25 174 -128 96 -18 191 39 -67 -207 32 1 10 205 49 80 -142 426 -174
6701a74Q3l3J65Q0K01r9j65k85L67j38J3K4O7j63n3N5K72l42P4K70k35rJ6J70
6725A61j94Q2J10l00N2J65j51K06j79j60Q7J21j07j00M20n1l64J72J23M4jl72
6747b36m4N45j17j5l19N24m20J51j17P6J10r7J89k57Q3M5q4k95L65Q5j93K04o9
6770A14j72J14j38N9j50K84j0k92L63k03K10m77J78j10M28l82k1J84k01jp4K49
6792d8Q3j28L94k57o2J12K5n79L41O1J49j05rJ51O3j76n7O2lk59J15l16M49K57
6816B63j15j85K8n6j15m1J67L57m8j93O2J7m21K59n7R9J27j41j3j85L08r3j11
6839h7L29k11o9p2K23k88K72L5j1p4O1L3k65k21K90Q0m0k8pn5K03j95Q7j73p9
6864b62M16n4k21L49l79oK67jK7J22o9k7k45O1j54J77L28k75k22Q1L85j56M7k78
$$ plain form
6701 -174 -91 -124 41 121 322 223 58 -227 140 2 15 39 106 -57 -110 -55 217 -125 -51 219 -16 -25 -9 161
6725 161 -33 49 159 -141 -89 76 -75 131 -48 -208 -121 0 -107 -207 213 162 -202 -30 93 137 136 -236
6747 -236 -280 265 148 133 -186 338 -82 69 -48 28 138 41 230 -27 56 101 17 -278 87 172 -21 183 114
6770 114 -58 56 -82 -23 -173 111 101 -191 172 -31 179 -298 -120 -230 198 -184 -205 -21 -222 -223 -297 -48
6792 -48 35 -93 301 44 -18 94 119 -460 -119 -58 91 -14 -23 128 191 15 -42 20 17 -242 -127 -443 6 263
6816 263 148 -37 -9 -65 -180 -221 -54 303 255 62 124 141 -280 -21 -78 21 148 7 -6 -191 117 24 -87
6839 -87 242 31 -38 -110 113 -175 97 132 121 47 108 141 -124 -345 -55 25 -15 -43 -50 -105 98 -97 -10 -183 -262
6864 -262 154 100 -121 228 -151 -157 110 109 136 258 189 162 -83 -22 -176 1 329 54 -168 -87 298 142 189 -89
6888h9L29k94m9J44L1j55m6L40k62K06j57K8k88L13j09qK33l51J67k9M09l19k11
6911a67J13NJ67O3k37K85j97K2j40K56k57l6J22n8R4j18j11J43j80q8M95J1j68
6934A9k9j10Q1M3K3L88J5j62k75J90k05N1j83K21j12L8k53L24p9K7k48J95o2P8
6958b5J19p4k32m2J93K42k38R1J82l41M00J22k88k09J25J79j66J3j45L36l00q8
6980a46Q6J02K93k02J37l1n6k09R9R5j22j43J76k60L45q0m8k82K32J23k52M4K0
7003g9L52k58k08K32L0j80J99K6j41k01J57L9L69m86l7K80k70n8J69J44K7m29
7025c23M90k06J40m33L28M3q0k23N0K39j32m0J93k42J46o5K4J11R3j62j02K67
7047A16l74L60p8j62J05J57k70J79J54k78L21k83J49O3l90J62K1j70K95Nl7J34
$$ plain form
6888 -89 240 -54 -103 41 72 -83 -129 211 -51 155 -2 26 -262 51 -58 -66 167 -184 -17 -46 363 44 -167
6911 -167 -54 -49 118 181 -56 229 32 54 -86 170 -87 -123 -1 -59 35 -83 -194 -51 -231 -319 176 187 19
6934 19 -10 -120 -39 4 27 415 430 268 -7 183 -22 29 -154 67 -45 -7 -260 64 -15 12 -236 -41 -103 -25
6958 -25 94 20 -212 -254 -61 181 -57 34 216 -125 275 397 109 -100 25 204 38 51 -94 242 -58 -146
6980 -146 -60 42 335 133 270 239 183 -26 73 168 46 -97 79 -181 164 84 36 -246 -14 109 -143 -99 -79
7003 -79 273 15 -193 39 69 -111 88 114 -27 -228 -71 -32 337 -149 -186 94 -176 -234 -65 79 106 -323
7025 -323 167 -39 101 -332 -4 39 -41 -264 -214 25 -107 -147 46 -196 -50 -115 -91 20 113 -49 -151 116
7047 116 -258 102 24 -138 -33 124 -146 33 187 -91 230 -53 96 159 -231 -69 -48 -218 77 82 45 179
7069A79l07kL63j49j5j92J22k71P0L97k98J11j47J66J37r4k30K89l08M08N5j57
7091A27r5k01J41K21m57L64j44L08k83L8nR6j20k53M17k56J26m4j58K28m21L03
7113f8R8K8j35J70N9m57L41J24k44J74J65j19k21J73J4j26kJ73j60J31j17J21
7135A22LK1j75l15K05J0M31l22Q1j99K89mk50J17j47K84j52J2l42J45J60J70l41
7158a97J10K2P1Np5J48k5J38j52L53l79j75j5K17j93M47l38J34K00j64k6k27J30
7181IM9p4J45o4J71j05k05R6k71K19j93R1L13k48J6m9J15p9J32K99l53r8N0J7
7205a7K15j19j74o2N6p7j27L53k48L31l3L1j28kM8j52K34p2M8NO6j24j48K31k68
7230a33J61oR1O5o2q8RN3L24m08l1R1K2p8j66L09j56k8p3O8L13k96k28L64l98
$$ plain form
7069 179 -128 -130 233 84 69 -123 -1 -272 -202 195 -103 8 -139 27 164 70 -160 129 -179 229 284 127
7091 127 32 -169 -28 193 -264 100 -44 264 -19 19 14 110 -10 -263 154 -102 24 -20 -178 50 -371 -68
7113 -68 30 58 -77 93 152 -305 36 160 -84 90 255 136 -85 88 102 -24 -26 147 -13 118 1 122
7135 122 125 146 -29 -344 -139 -129 302 -20 61 -138 151 147 -103 14 -133 151 -1 11 -331 -186 -26 144 -197
7158 -197 -87 -65 6 11 -64 84 59 197 45 398 19 -156 -171 46 -147 300 -38 96 296 132 106 -121 9
7181 9 58 -16 129 65 236 131 -74 22 -249 -30 -223 -132 181 -67 -51 -100 15 -64 68 367 14 -84 -34 -17
7205 -17 198 79 -95 -157 -101 -178 -305 48 -200 131 98 129 1 -1 47 -105 129 57 105 110 176 52 -96 135 -133
7230 -133 28 22 113 178 116 28 37 90 414 6 -25 66 88 10 -156 153 -3 -31 -104 -36 277 -19 -247 117 -281
7255b81J41o2L79l59o1L55k91L47l14J15j6Q3K7k44K17J47l08M2J50m36K38K07
7277G6k74L32P1m8l69L01P1j94P4j71K44o7k6j40K76j08j54K64k53L04j95j2k9
7300b7O1k58K33K22q0o0l25J34q8J40qk05K26k7j18K12n7J2j53K83O6j45j09J65
7324I4n6Jj7O4q6p9j85J38K02k43K04J00l21J26P4l7M0j2L8l5J71J66n06J92j54
7349a21k1O2L08k68p5J79k50J59Q6J04m18L73p8j0Pm6q6L41l50K52N3k56r5L59
7373B09j59r0K62j89J80l23K92l93J80M1K3Q2R3m41M14j52r3m2J05j98lQ6L3K11
7397A28j64P1J8m41M8K55L05j12j80J03j12M0N6j20P3J7K73j75J1J89n24mM53
7420B08j74k6MO7j80N8l1j1N9J28j77N9j66J58P6l28M25k57J14k26J28oN5n2P0
$$ plain form
7255 -281 -140 -202 177 -182 -243 112 -179 168 -146 -31 -47 36 63 -181 36 183 -125 -83 67 -369 -131 76
7277 76 -198 134 205 157 -212 89 160 -34 40 -131 113 46 20 -120 156 48 -106 158 -95 209 14 2 -27
7300 -27 34 -224 9 231 151 91 -234 -100 -188 -48 -56 -261 -35 -62 -180 32 -25 -13 -166 117 183 38 -71 94
7324 94 38 39 22 86 0 -79 -264 -126 76 -167 37 137 -184 -58 16 -21 19 7 45 10 181 347 -159 33 -121
7349 -121 -142 -80 228 -40 -115 64 -186 -27 59 163 -255 118 40 30 37 -9 -95 246 -104 148 201 -55 -150 209
7373 209 50 -40 222 33 213 -110 182 -211 -31 10 33 115 208 -233 181 29 -64 -106 -1 -199 -202 -116 -83 128
7397 128 -36 35 53 -388 -340 -85 220 108 -72 31 -81 -41 15 -105 -32 -15 258 83 94 283 -241 -245 208
7420 208 34 8 12 79 -101 -43 -74 -85 -26 102 -75 -16 -182 -24 52 -276 149 -108 6 -220 -92 -98 -43 -95 -25
7445b5J23l04L56j84k77K13K62j24p8J46m6j98J14k4l2l3R8P7j15K1N04m45N5
7468H4J47m42O8L91k49j09J00Mj84K33j5k03M89j70J73k39N7j59m7J42j28K82
7490B25k91l1K40j20K92j99q6r1J38j98J90j40J65j77j40K01Q2kl08O26m81K85
7512A80l85K83r3J56r9q4J31k24J76KQ4L29l61j78J19j19j82J38J98q0j47J99
7534D3K0J42k04j7k80J00K0K22J06j45n2K43k19j92m1K69L6J02j03J89k79L9k1
7557b2r5j34N23k75K9j62K81l7K36l17K10n02K52k3q3J67j73M23j78r4o8K08k25
7580e9Q0K71l78j61N8L08j53l13M85j62J32j92J80N5m22K59J1j97l2n3L59L6q7
7603B5k2j52p9J40K26l1j42Rm7R1l4K7jmj0N9NL2p4O8o2j86j5r5o0O4M66j93j08
$$ plain form
7445 -25 98 -206 150 -34 -311 -98 164 40 -38 108 62 -136 -22 -46 -78 -111 -13 64 -51 -30 474 29 84
7468 84 231 -211 -143 248 -1 -110 -10 -6 -190 43 28 -175 314 144 317 78 135 -24 -71 71 -57 225
7490 225 -66 -97 143 23 315 116 30 -61 77 -121 69 -71 94 -83 -223 -22 60 58 -250 376 -105 180
7512 180 -205 78 -15 141 42 -42 89 -135 41 43 127 456 95 -83 36 -83 -265 -127 71 -9 -156 43
7534 43 63 205 1 -16 -296 -196 -176 46 152 7 -45 198 -21 -213 -254 15 51 153 50 239 -40 -1 -22
7557 -22 -117 -251 272 -3 26 -136 145 108 344 27 237 -265 -13 -36 -119 48 -125 298 120 26 -42 166 -59
7580 -59 21 292 -86 -247 -189 119 -34 -347 138 -24 108 -84 96 151 -271 -12 -1 -198 -230 -283 76 112 25
7603 25 3 -149 -228 -88 138 107 -35 -26 -73 18 -16 11 10 6 -4 55 60 92 18 86 24 -162 -177 -272 -332 -268 198 5 -103
7632a03J38J80k75m2K85k32r5Q9J61m2rL32n15N3J26j63P0J00j26l48L91R9j56
7655h2K51j72qj50l4M55p9j86J27k21J4J30k90L41k21K28J09k25J50j16l23Q9
7677b13K0J94J18k55K22K67m96R1K06j14j40L22j24Nrk51J02j6l4P5J06N6j4m9
7701F9j06pm0J9j46L48k59L10k12J17j22P8j18k61L85m0J91j00k57R7Q0p4r9K57
7725A10k25K23Q3k30Q3P2J00Mp9l3Kj0n0j91j9M12l77M85m71o6L3K06J19k65Q6
7750Bj18L2M38p0k50k7m5K08j79K18l48m0K57K51m21J06L12o42K52l1J27M53m90
7773eq4K08Q1j68j05J22j06L5OJ52Oj66j43M6o1P5L9J56j77K00k31J36m9K0J61
7798A48J14j48k04J44K10j52M0j00k26K81j15k33J07J67O1oq5J82l60K86j17j85
$$ plain form
7632 -103 35 215 -60 -102 183 -49 -144 -55 106 64 55 387 -128 -75 51 -112 -42 58 -68 -416 -25 74 -82
7655 -82 169 -3 -11 -161 -195 260 181 -5 122 -99 -85 45 -245 96 -125 103 212 -13 137 21 -302 -213
7677 -213 -193 1 119 -136 86 353 -143 -52 154 40 -100 222 98 103 94 -157 -55 -71 -105 -30 76 132 118 69
7701 69 -37 -44 -84 -65 -211 137 -122 188 -24 93 -29 49 -69 -330 55 15 206 106 -151 -54 26 -48 -147 110
7725 110 -115 108 191 -39 44 116 216 220 141 108 110 100 50 -141 -160 252 -125 360 -111 -177 -144 62 181 -84 2
7750 2 -116 -84 354 284 34 7 -38 170 -9 209 -139 -179 78 329 -92 14 326 -316 -64 -95 32 485 -5
7773 -5 -89 119 200 32 -73 49 -57 -22 -16 136 142 -24 -167 -121 -182 -107 -68 88 -89 111 -120 16 -33 -13 148
7798 148 262 114 -90 54 264 112 152 52 -174 107 -8 -241 -134 33 94 88 3 185 -175 111 -6 -191
7820a91q3L61O2k01J41k02K7R2j12M7J99o9m0j06O4L05k29K5k60L8L91l70J04
7843gJ61l75O2K20r4m3P9N0k1k06K73j89J03m8j74K24J28j26o9L8j21n0K33jJ7
7868F4P1j52j13qK08p6K8l49N16p6k13M3K31O5j97J89k10J39m9l28R2L7M73n31
7892a46L09l34K19LkJ94n0j64J05Q3l51L89k74J86j88m9J47j17k62K58L57k31
7914H2k24o2K51j5k48l0Q7L60j33J11k82K3J31j05Q7r6L56n71N28j50M5k68q2
7937b05K72P3l82L01K6q9J29l9k0p4j11L17j35L7k56J58J18m56L18l95M72N4q7
7960B6j89K30j60K22J35l91J15jj82K92L9j27l5M6j36J84Q6j55J01p3j50L59n4
7983A82q9o1j21m0L05r4j73J66j47K00j2l23K05k41L8K63J9j25p6k2j0M01l78
$$ plain form
7820 -191 -274 87 149 -52 89 -113 -86 6 -106 -59 140 71 31 -75 -11 294 65 90 -170 -132 259 -111 -7
7843 -7 154 -221 -159 61 -33 -76 3 53 32 -174 99 -90 13 -35 -209 15 143 17 -52 -14 -135 -185 48 47 64
7868 64 135 -17 -130 -138 70 -6 22 -327 189 113 -100 -57 174 239 42 231 21 160 111 -217 -125 -88 385 -146
7892 -146 163 -171 48 51 49 243 193 29 134 217 -134 255 -19 167 -21 -70 77 -40 -302 -44 313 82
7914 82 -142 -204 47 32 -216 -246 -159 201 68 179 -103 -80 51 -54 33 -63 293 -278 250 100 145 -123 -205
7937 -205 67 140 -242 59 85 -4 125 86 66 -8 -119 198 63 100 -156 2 120 -336 -18 -413 59 113 26
7960 26 -163 67 -93 129 264 -127 -12 -13 -195 97 136 9 -26 20 -116 68 154 -1 100 27 -123 236 182
7983 182 93 32 -89 -129 176 82 -91 75 -72 128 116 -207 -2 -243 -205 58 77 -48 -124 -146 -156 245 -133
8006a33J26Q2k21J48K9p9p7K68m19K13J83j16j65J32o4j04Q6K45N4K2m00K02J96
8029B08O4l24N4l2K40m1k87m3J56j06J62J15j48m7RK24j65L23j23l00m5m1K32
8052H5J15l48M41m58K90j76J2l69O63j55n55J84L5L05k62K89J29j18j82Q2Q5M2
8074A34J5J57n34J17K2L06k45k02KJ38P0Q8J2j08R4k56K75p8j38p6M51j24J55
8097B75j12l48n0J06R7j84L91mm12l6J96J77J26m34M3K13n1M3l4K09%l01QK42
8121A60j36j46J95j87QK3L54k80L2n6j9J04j74Q4k18K26J20K18j70k21L3l17M05
8144C8Q8j76NJ39R8m6K00m19J64j49L40n47M43P4k40n5J61j4j64K23K2nj20k96
8168b36J08j56L99RK40m05J8Q3R8p1No0m06K90K95j16m1k61J73o0L6n3J38
$$ plain form
8006 -133 -7 75 -146 2 31 -48 -125 143 -276 -63 120 4 -161 -29 -93 -197 -111 134 188 210 -190 12 208
8029 208 272 -52 2 -30 210 169 -118 -161 -5 -111 51 166 18 -29 -20 204 39 362 239 -61 -106 -147 85
8052 85 200 -148 293 -165 125 -51 -39 -408 255 100 -455 -271 -236 69 -193 96 225 107 -75 7 92 134
8074 134 149 306 -228 -111 -89 217 -28 -230 -228 -90 -20 68 80 -28 66 -190 85 7 -131 -207 244 120 275
8097 275 163 -185 -235 -129 -32 -216 175 171 -241 -277 -81 96 222 -212 -169 44 -7 36 2 211 211 -90 -82 160
8121 160 24 -122 73 -114 -106 -83 271 -9 23 -33 -52 52 -122 -38 -256 -30 90 308 138 -83 -50 -367 38
8144 38 126 -50 -45 94 192 146 346 -73 91 -58 282 -265 178 252 12 -43 118 104 -60 163 185 180 60 -236
8168 -236 -128 -284 115 124 364 -41 -23 60 158 87 92 32 -374 -84 211 95 54 -207 -34 -94 -58 -111 27
8191B7
$$ Imaginary data points
##PAGE= N=2
##DATA TABLE= (X++(I..I)), XYDATA
0@%%%%%%%qJ6j6J6k4L2m0M8n6P2q8J04j20J38j62J90k18K51k89L29l74M24m79
30b54N41o08O82p63Q52r50J057j176J307j448J602j775J966k176K409k669K965
47A562l303L686m130M653n276O034o984Q211r867J2241j5946K2592l8170J38602
61A13905J02288k44311k264J29385J7136j27960N461P8728M658m3507L6707J3685
73H3911m8373j1975N6771j8448p0327Q623P2552O558k1915J3851j1412n9977J5065
86A4904P5103k7713j01519L2391J22156j3850j17097Q074J00857j2550r6886n445
98b1575N4186k212q531M1958k314o8843j983P0249j0648q4348K664P7245O38n6424
112i938J2630M5915k1881l6817J8492K335m7666L057P0092J1430o2855j2731M7705
$$ plain form
0 0 0 0 0 0 0 0 0 -8 8 -8 8 -16 16 -24 24 -32 40 -48 56 -64 74 -88 102 -116 135 -154 175 -199 225 -254
30 -254 287 -321 361 -402 450 -500 557 -619 688 -760 842 -933 1033 -1143 1266 -1403 1562
47 1562 -1741 1945 -2185 2468 -2808 3226 -3758 4453 -5414 6827 -9119 13473 -24697 113905
61 113905 216193 -28118 -30382 99003 116139 -11821 -6360 72368 77026 33519 70226 83911
73 83911 35538 23563 80334 61886 -8441 182 72734 79292 57377 71228 59816 -161 14904
86 14904 90007 62294 -39225 -6834 115322 101472 -15625 -7551 93306 80756 -16130 -21575
98 -21575 32611 30399 21868 63826 61512 -7331 -9314 60935 50287 -34061 -31397 45848 46486 -9938
112 -9938 2692 48607 26726 -10091 8401 10736 -36930 -33873 36219 47649 -15206 -27937 19768
125A9768J111m3498k703J8320j6774m494L7680N196m5137L378N2160j5928p5234
138f6155q13O8252R015m7874K717L8121j1353l0601J5051J5110l3444j7188L5972
151b3190J8432k8626m761L1971O11l3483n199J4350j0014o659K8178J2873l1597
164c7114j1119L6881J2024m0528k0310K7960J5039j8238j605K0944K208j1853
176b5711M405K557k0428p635K3420J3333j7012o134J9652P229j3202k305M692
189a7139j1937q853K0420J7331j5967j2701K2189J8175k1451k4819J0213J9908
201d631j310q958K760O755M322N725j363j4102q809J1217J2202n407p514Q203
215i10J2281q8o733n725m300J259R663M652p865m629J2790J4644o299j8291m125
$$ plain form
125 19768 20879 -22619 -25322 -7002 -23776 -28270 9410 14606 -30531 -27153 25007 9079 -66155
138 -66155 -66968 1284 10299 -37575 -34858 3263 -8090 -38691 -23640 -8530 -41974 -59162 -23190
151 -23190 -4758 -33384 -38145 -6174 -5563 -39046 -44245 -29895 -39909 -46568 -18390 -5517 -37114
164 -37114 -48233 -11352 672 -39856 -60166 -32206 -17167 -35405 -37010 -16066 -13858 -25711
176 -25711 -21306 -18749 -39177 -46812 -23392 -10059 -27071 -33205 -13553 -6324 -19526 -21831 -17139
189 -17139 -29076 -37929 -17509 -178 -16145 -28846 -6657 11518 -9933 -34752 -24539 -4631
201 -4631 -5941 -14899 -12139 -5384 -1062 4663 3300 -10802 -19611 -8394 3808 -1599 -9113 -910
215 -910 11371 11283 4550 -1175 -5475 -4216 5447 10099 2234 -2395 10395 25039 18740 449 -3676
230c676J2007P129n934o577N051J2114M917n687r571m113M532O015p6p330j395
245G406J1437J1908m839j5472m203R211N059o897n796M309Q661N569j215q489
259A6649q787L342R377k633j2816J83J5809Q202r143q842K61J624p19k10l021
274I276n448O009J4724N54j7039p022J1870M498j2460p893P579P689R43J122k359
289A2043q776k849R321M96j5407m886J6120J0975r882q825M378K682o105k041
303b756j85n295K92J3781N437j3906q346J0385N824j2686r814O901O719p29K068
318b310K518p376n000Q156K551j4932q912J4919J2676q350q394O594M290o339
332i909l896P62m556k393J1079Q251r275q598R519P780j1024j0940M657O758r58
$$ plain form
230 -3676 8331 15460 9526 2949 8000 20114 25031 19344 9773 5660 10192 16207 16131 8801 7406
245 7406 18843 30751 25912 10440 6237 15448 20507 13610 7814 12123 20784 26353 25138 16649
259 16649 7862 11204 20581 17948 5132 5315 21124 29326 20183 11341 11602 13226 12507 12297 9276
274 9276 3828 9837 24561 25115 8076 1054 12924 17422 4962 -2931 4648 12337 13280 14402 12043
289 12043 3267 418 9739 10235 -5172 -10058 6062 17037 7155 -1670 2708 5390 -715 -2756
303 -2756 -2941 -8236 -7944 5837 11274 -2632 -10978 -593 5231 -7455 -17269 -10368 -3649 -4378 -2310
318 -2310 208 -7168 -12168 -4012 -1461 -16393 -25305 -10386 2290 -6060 -14454 -7860 -3570 -9909
332 -9909 -13805 -13043 -17599 -19992 -8913 -662 -9937 -18535 -9016 -1236 -12260 -23200 -18543 -11785 -12743
347a2743K038L954l717l943O884L597j2957r969J1385J2252o008p123P306O191
361b853n282l577J340l958n180Q360J0034n973p944Q513J0229p814j2521K341
375a4285P333j42q86L959M47j787M758L920q881r011O234R258k808n458N281O903
391D835j494l118m92l421l525N487P367m180n961O774R653l930j0153J66N496
406C504q86j957K482K280j84L224L612n333q155K335P440k64n951Q10O477K982
422A2416k078k900k405p54J752K359k427j752L993O028j487o385j428K272R25
437H129j117p37m92N60L909K841l010n500l18L765L2m103j146M616M014j315m277
454E851k158J301J729k24k807k373K157M233J426l793l134P38J671j004l654J22
$$ plain form
347 -12743 -10705 -6751 -10468 -14411 -7527 -3930 -16887 -26856 -15471 -3219 -9227 -16350 -9044 -2853
361 -2853 -8135 -11712 -10372 -14330 -19510 -11150 -1116 -7089 -15033 -6520 3709 -4105 -16626 -14285
375 -14285 -6952 -7094 -7980 -4021 -3574 -5361 -603 3317 -5564 -14575 -8341 917 -1891 -7349 -2068 4835
391 4835 3341 223 -269 -3690 -7215 -1728 5639 1459 -4502 2272 11925 7995 -2158 -1992 3504
406 3504 2618 661 3143 5423 5239 8463 12075 6742 -1413 922 8362 8098 2147 2957 9434 12416
422 12416 10338 7438 5033 4279 6031 8390 5963 4211 8204 14232 12745 6360 4932 7204 8129
437 8129 7012 6275 5783 6343 10252 13093 10083 4583 4265 8030 8062 3959 2813 7429 11443 10128 5851
454 5851 3693 4994 6723 6499 3692 1319 3476 7709 9135 5342 2208 2946 4617 3613 -41 81
470H1L222J964j221j909r14n41M0J208j037l946p62M433L557k912m693L38K484
487f08K37l513j797J702L279N69l497l344J881M571p10n809j739L537K316k106
503e031p91J525j396j878J083J794k193k689L271L215k946m653J961M354L0k982
519g326k630J28K373L010n26m481j407M785K360m378l179L558M231k634m106J042
535i180K970K69Q4k53j824j500K793L044j842k890O14K597K15o84k37q9O58K010
553c245r8l884j462N234M314l708n437J577O721P82m731j945K403K443J2j430
569b454q45J616K518J40k806j652K070K539P57j633j399M34K106K225l09k926
585C81j618K409L451r49l209Q7M250J571l002m202J814M804R50l735k623K943
$$ plain form
470 81 3303 5267 4046 2137 1223 682 722 1930 893 -3053 -3815 618 4175 1263 -3430 -3092 -608
487 -608 -371 -3884 -5681 -3979 -700 -131 -3628 -6972 -5091 -520 -1230 -7039 -8778 -5241 -2925 -5031
503 -5031 -5822 -4297 -5693 -7571 -6488 -4694 -6887 -9576 -6305 -3090 -6036 -10689 -8728 -4374 -4344 -7326
519 -7326 -9956 -9828 -7455 -4445 -4971 -9452 -10859 -6074 -3714 -8092 -11271 -7713 -3482 -6116 -10222 -9180
535 -9180 -6210 -5941 -5857 -6110 -7934 -9434 -6641 -3597 -5439 -8329 -7715 -5118 -4903 -5587 -5824 -5913 -5255 -3245
553 -3245 -3343 -7227 -8689 -3455 859 -2849 -8286 -6709 12 794 -3937 -5882 -3479 -1036 -1024 -2454
569 -2454 -3299 -1683 835 975 -1831 -3483 -1413 1126 1883 250 -1149 -715 1391 3616 3307 381
585 381 -1237 1172 4623 3674 465 552 4802 6373 3371 -831 983 5787 6737 3002 379 3322
601C322L486Ll036j599J379J425O41j237j589J290L004L75k780k612K226K542
617F840p25j886l82K76J077K530j138l819q77M318J538l982k487L517L314k144
633E970l099N44J048r1N46n97k365k35M064J687m792k683L523K573l045k786J992
650B254J576j049K04O51k545j107L129J545m642k795M859K494l614k553L281Q53
666B541l335K78K075j847k319K765K801m280k770M320K341m734k612M055J391
681F70l103l61L107j475l202K704K379m188l076N087L037o061j688N659J401n601
697d711r45M799k53m856J794M221k580l450L668K502m782k143N329J243n800J07
713e857O402p67n947J660N609l365n269M443M523m817l305O015K701o153j978
$$ plain form
601 3322 6808 6811 3775 2176 3555 4980 5621 4384 2795 4085 7089 7464 4684 2072 4298 6840
617 6840 6115 4229 3847 4123 5200 7730 6592 2773 1896 6214 7752 3770 1283 4800 8114 5970
633 5970 2871 3415 4463 4372 4918 4321 1956 1721 5785 7472 2680 -3 3520 6093 3048 262 2254
650 2254 3830 2781 2985 3636 1091 -16 3113 4658 16 -2779 2080 4574 960 -1593 1688 2541
666 2541 -794 -516 1559 -288 -2607 158 2959 -1321 -4091 229 2570 -2164 -4776 -721 670
681 670 -2433 -2794 313 -1162 -4364 -1660 719 -3469 -6545 -1458 1579 -4482 -6170 -511 890 -4711
697 -4711 -5656 -857 -1110 -5966 -4172 49 -2531 -5981 -2313 189 -4593 -6736 -1407 -164 -5964 -5857
713 -5857 545 -222 -6169 -4509 1100 -2265 -7534 -3091 1432 -3385 -6690 -675 2026 -4127 -6105
728f105N922J340o594L85N818n05m448K609L488m442k586N407J469o610l08Q404
744C244N39q008M59P468j174p087J410O230k363m143M270L839m834k463N125J006
760C518o042l81O813m09n143K463M893l494m351M548K845o239k209P949K827p904
776c16j443P575R26p368o02N512m88m644L724L289l478k136M385R85n959j039
792a077O132L49n612J397O251k339n457K678L903m804l986N865L675n334j829
807a88N731J320o092j294M175m81l516K489K933k496j772L826J168n915j630N020
823C278O57n473J095N893j069m726J506L422l698m084L919L062l039j909M327
838C161J278m350j220K733r58l637K223L602k409k140L656K149n011k874L849
$$ plain form
728 -6105 -183 1157 -5437 -5052 766 261 -4187 -1578 1910 -2532 -5118 289 1758 -4852 -5160 3244
744 3244 3783 -4225 -3766 3702 2528 -4559 -3149 3081 718 -3425 845 4684 -150 -2613 2512 3518
760 3518 -2524 -2905 3908 3499 -1644 819 5712 2218 -2133 2415 5260 -979 -3188 4761 7588 -316
776 -316 -1759 5816 6742 -626 -1228 4284 3796 -848 2876 6165 2687 551 4936 5921 -38 -1077
792 -1077 5055 5404 -208 1189 7440 5101 -356 2322 6225 1421 -2565 3300 6975 1641 -188
807 -188 5543 6863 771 -523 3652 3171 -345 2144 5077 2581 809 4635 5803 -112 -1742 3278
823 3278 3935 -1538 -443 5450 4381 -345 1161 4583 885 -3199 720 3782 743 -1166 3161
838 3161 4439 89 -1131 1602 644 -2993 -770 2832 423 -1717 1939 4088 -923 -3797 52
853E2R88m034o0M620K62l483R09K491k595l459J598K476k111j170L644J854l470
870a488j093K203j004l472J199L551j281j978K449K384k556l115J727Q74k160
885c760r37K646J600j586M78J383j125k709K76J692r57q77J992J751q87q26Q70
902i76m98k413K7J765j12r97J882J837n57j694J1j10p79l63Q08J021J38L03R88
921B81l32j276k16M63r27j73J119Q77O08J45R4n34j143M3p9m2O40P00N32J62N01
942A443l71r53j70K8j50l6P27J291M77p21P6k07q62l75M30J40k2N74J569o6j050
963A772J30J53r61q85R48O14L58L09R91k85j502k74J006n50j267P51J345J47l35
982B465O36j7j299k39K60k15q71J272J451l29j173L38R87j698j300R87N49n21
$$ plain form
853 52 1040 -2994 -3054 1566 1828 -1655 -746 1745 -850 -4309 -2711 -235 -2346 -3516 128 1982 -1488
870 -1488 -2581 -378 -1382 -4854 -3655 -104 -1385 -3363 -914 1470 -1086 -4201 -2474 -1600 -3760
885 -3760 -4697 -2051 -451 -2037 -1559 -176 -1301 -4010 -3734 -2042 -2999 -3876 -1884 -133 -1020 -1846 -976
902 -976 -1474 -3887 -3860 -2095 -2207 -3204 -1322 515 -42 -1736 -1725 -1835 -2614 -2977 -2169 -1148 -1010 -707 281
921 281 -51 -1327 -1543 -1080 -2007 -2180 -1061 -184 424 569 663 129 -1014 -971 -1050 -1092 -452 248 780 942 1443
942 1443 1072 119 -51 -23 -173 -209 518 1809 2286 1565 1641 1434 572 197 627 767 745 1319 2888 2822 1772
963 1772 1902 2055 1094 209 1157 1771 2129 2438 3429 3144 1642 1368 2374 1824 557 1308 2653 2800 2465
982 2465 3101 3084 1785 1546 1806 1591 720 1992 3443 3114 1941 2279 3266 1568 268 1255 1804 1283
1000A283K91J277K71j545N8Q66j093j859J175J139n3n61J029M3j148n10P91o64
1018G90j518N10K093j42j241Q00Q21j568j137O02M80j198K26J787N5j927K76J657
1036A366r95k459O36J738j002n72J458J143j914q85J225P0k044j62J959M78j657
1053a617M60J717r21j726L75R86j491n50J647P41r40r1J206q11j602k19J534o30
1071a932q54J558J279j412r51J565L44k353n65J733P20q79J42J576m66j554O13
1088a436N88j273j142J683J644j616l49J544J59j464l62R21m23q67Q61J479l11
1105c64m66N26M47j444o63O74O04m46N12J240k63p23O24K80j578o97J112J183
1123E58q27j30J445N66j255j010O66M9p01K34J150O6k55Q02N1m23j021J09M13
$$ plain form
1000 1283 1574 2851 3122 1577 1635 2501 1408 -451 724 1863 1810 1249 2278 2321 1173 663 1454 790
1018 790 -728 -218 1875 1733 492 1292 2113 545 -592 10 490 -708 -482 1305 1360 -567 -291 1366
1036 1366 371 -2088 -1452 286 -716 -1288 170 1313 -601 -1486 -261 -191 -2235 -2397 -438 40 -1617
1053 -1617 -1157 560 -361 -2087 -1712 -726 -2217 -2767 -1120 -379 -1319 -1410 -204 -1015 -2617 -2836 -1302 -1932
1071 -1932 -2786 -1228 51 -1361 -2312 -747 -403 -2756 -3321 -1588 -868 -1747 -1605 -29 -495 -2049 -1436
1088 -1436 -848 -2121 -3263 -1580 64 -1552 -1901 -357 -198 -1662 -2024 -1103 -1526 -2393 -1532 -53 -364
1105 -364 -830 -304 143 -1301 -1964 -1290 -686 -1132 -620 620 357 -366 258 538 -1040 -1737 -625 558
1123 558 -269 -399 1046 1612 357 -653 13 62 -639 -405 745 811 556 1358 1409 986 -35 74 487
1142D87o63M57J002K96j21Q5J15j011j070P22O77n64K52Q46P41q00j74o1k74o71
1162B71J1Q67J18K66K96L99q99m48J03m44m62L64J032K45q00R03L14l95j635J57
1182B63M42m41K73M26O20J08m41m41m96k83L8J0q5O76O43k88J24k52l92p00n11
1203g07N9Q54J8k72N91M74k64r78n91j07L45o7j45M66P29N32o22o11r08L57n3
1224i00l33P1N56P04j9m10l35k7l96n62PN90L97N6J77J65k40q82n83N45K20r1
1246a290l51Q18R56m90p82m7qj39m32k00P35N99L17j26n66J54j28p61j86M18L86
1267a123M15j98M84L62m80p19k58L95Ok85J92P87M23j11p02j00k13L00k81p5O01
1288e80M7N71k51nL89o85m16k50M20N13o4L4N20M49p67k64jJ23J61o81Q69O88
$$ plain form
1142 487 -176 281 1283 1579 1458 1543 1658 647 -423 299 976 412 664 1510 2251 1451 1277 1216 942 271
1162 271 282 1149 1267 1533 1829 2228 1329 881 984 540 78 442 1474 1719 919 1822 2136 1741 106 263
1182 263 705 264 537 963 1583 1691 1250 809 313 30 68 78 -7 669 1312 1024 1148 896 504 -196 -707
1203 -707 -648 206 224 -48 543 1017 753 -225 -816 -923 -578 -645 -790 -324 405 937 315 -296 -1204 -847 -900
1224 -900 -1233 -1162 -606 98 79 -331 -666 -693 -1089 -1651 -1644 -1054 -657 -601 -424 -259 -499 -1381 -1964 -1419 -1199 -1290
1246 -1290 -1641 -823 133 -357 -1139 -1186 -1194 -1333 -1765 -1965 -1230 -631 -314 -440 -1006 -852 -980 -1741 -1927 -1509 -1123
1267 -1123 -708 -906 -422 -60 -540 -1259 -1517 -1122 -1116 -1401 -1209 -422 1 -110 -812 -912 -1125 -825 -1106 -1181 -580
1288 -580 -533 38 -213 -218 171 -514 -930 -1180 -760 -247 -311 -277 243 692 -75 -339 -340 -217 -56 -737 132 820
1310H20K93n71n42L65K05o05k92M46M43L17O5p4l14L12l8n25j98L18J99M14j05
1331I33J35k66J52M1k69q9Ml01P47N63o48m40K92K07k32m79n2N57L58J87j00j37
1353A163J11r7J9o03m30Q37J30k43J23L1M91n53o00L32j91J5J25K41M0n96P42
1374A087J23m40o66K88L13m40J10L79q9l00L01J65o25n95M96N42o8p39N59M65
1394H66p47j51K57j55p58R1Q09o6m42n5P45o25n37L78M69q10R3K46K81o78J01
1415f88R40m68j292N83O99l38n44N48N81o73l46M14j7r68J94P12K30q69R0Q56
1435c56O3r86N9Q08j098J85N39K99p20K46Q51l05j127j35J301o44m03L02J155
1454C4r89j30J78N98j260J5J048Q8o80R6J107p5q68j16P33n47m38Q97J08l25J9
$$ plain form
1310 820 1113 542 0 365 570 -35 -327 119 562 879 944 870 556 868 830 305 107 425 624 1038 933
1331 933 1068 802 954 995 726 637 641 340 1087 1650 1002 562 854 1061 829 350 298 855 1213 1400 1300 1163
1353 1163 1274 1177 1196 593 163 1000 1130 887 1010 1041 1532 979 379 711 520 535 660 901 941 345 1087
1374 1087 1210 770 104 392 705 265 375 754 665 365 666 831 206 -389 107 649 581 -158 401 866
1394 866 119 -32 225 70 -688 -597 212 146 -296 -351 394 -231 -768 -390 79 -731 -638 -392 -111 -789 -688
1415 -688 252 -216 -1508 -925 -226 -564 -1108 -560 21 -652 -998 -584 -601 -1569 -1375 -663 -433 -1302 -1212 -356
1435 -356 -293 -1279 -1220 -412 -1510 -1325 -786 -487 -1207 -961 -110 -415 -1542 -1677 -376 -1020 -1423 -1121 34
1454 34 -955 -1085 -907 -309 -1569 -1554 -506 -418 -1098 -1002 105 30 -838 -954 -221 -768 -1206 -309 -201 -526 -507
1475e07K96M59q77k71J070r3o15K29Q90n45n12J017O5j255J61O38N16j305J42
1494d97J145L85j020j52R05n74k71LP47k69n68J146L27j104k31J089k74r16N70
1513D41M57j14n13P83J80q01l04N14N41p09j49R06J09r65N94N61p44r20O89M45
1533A001n67k80J023J18m67o68J153j79j255L72N50j38l05N43L40o42j88N3N07
1552I71p87l26O47M09m65m25O37o4n02J47N35o22l57O23M10k93m06K03J26m56
1572Eo7M67k29n86K83P62j36q43L20K90j65n26j5N69m37j03N98j31p88K34J88
1593c10P5o61M35K67j3k27J91j17j11j92K33n9r5j39O86k46o73L84J99j03j29
1614f05J96j74J2q1K43J6m51K22M53l56j79j08L42q2J24N5p8K40k88J68j22k29
$$ plain form
1475 -507 -211 248 -629 -900 170 77 -538 -309 581 36 -476 541 606 -649 -488 150 666 -639 -497
1494 -497 648 1033 13 -139 766 192 -79 -76 671 402 -166 980 1307 203 -28 1061 787 -129 441
1513 441 898 784 271 1054 1234 433 129 643 1184 475 326 1232 1341 376 970 1531 787 -133 556 1001
1533 1001 434 154 1177 1295 828 160 1313 1134 -121 251 801 663 358 901 1241 599 411 464 971
1552 971 184 -142 505 914 449 24 661 597 95 242 777 155 -202 421 831 538 132 335 461 5
1572 5 -62 405 176 -410 -127 635 499 -344 -24 266 101 -425 -440 129 -308 -411 187 56 -732 -498 -310
1593 -310 -235 -896 -461 -194 -207 -434 -243 -360 -471 -663 -430 -489 -584 -723 -37 -283 -956 -572 -373 -476 -605
1614 -605 -409 -583 -571 -652 -409 -393 -844 -622 -169 -525 -704 -812 -470 -552 -428 -373 -451 -211 -499 -331 -453 -682
1636f82K76J94k85J90K8M8Ln5l05O12l71P5K41k61J87P5O0k68j42J0J40Np3K81
1660a7q1jL98O7p7k27q6M4L95l74L91j72k93M79k13K6J32J31j02n8p2J84Q9m31
1684A32J60L01l98K29j66J42j95KJ76K28m40M37j40Q2l16L89M7j46k07M33p0j35
1706E45K62p3j47k85M75j87l08J26K96j37k18L39K50k85k76l54M31J02k48R0L22
1727G20m59k96O29n6m28k97O47R8o13M60Nj5j38J11Rm73k17O06K6l55l0N01j0
1750D25m48m02M29J93j76m2K35m48n5K60L62o74%R9N44n27k15L17K05n24l7J79
1772c00p4k49M47n4q1k54M13K38m23j38K89j13j85j0M70k0m47M30j70k11k20N47
1794a15p4n13l84R52P7j29j03J22L9n52J68L23j31p2J82N45p71l9r0N66l50rJ55
$$ plain form
1636 -682 -406 -212 -497 -307 -279 -231 -228 -283 -588 24 -347 -272 -31 -292 -105 -30 30 -238 -380 -370 -230 -225 -298 -17
1660 -17 -98 -99 299 366 289 62 -24 20 415 41 432 260 -33 446 233 259 391 522 420 362 290 474 563 132
1684 132 292 593 195 424 258 400 205 207 383 611 171 608 468 550 234 623 670 524 317 750 680 545
1706 545 807 734 587 302 777 590 282 408 704 567 349 688 938 653 377 23 454 556 308 398 720
1727 720 261 -35 594 538 110 -187 460 558 -55 405 410 395 257 368 377 -96 -313 293 319 -36 -66 435 425
1750 425 -23 -425 4 197 21 -21 214 -234 -289 -29 333 -341 -341 -242 302 -225 -440 -123 82 -442 -479 -300
1772 -300 -374 -623 -176 -230 -311 -565 -152 86 -337 -475 -186 -299 -484 -494 -24 -44 -491 -61 -231 -442 -662 -115
1794 -115 -189 -702 -1086 -134 -57 -186 -289 -167 -128 -680 -512 -189 -320 -392 -210 335 -436 -475 -565 1 -349 -358 -203
1817b03n5j72J92M84n51J07J06N4l21J04L0P0K6l4J01j08J24J92K04o46j84N58
1839G8nk20O2N71j77m80R6L11k30O4K70K0k20k23M51l9m70k14O25J43o27N38R8
1862D22j20k15j14L80j60m35K43O04r1k67J99j04J07j75Q6m9o5J24M00ko70m1
1884E7O19l93j31j28N7J33L8j1J71r3K8J90m82K02j95K18J30o9J68m11K22M1J41
1907E02l05j19LK89o3k08J61Q0k33k11J65J81j79J89l00L37J3m98K90j82j5k9
1929a32J91J1J43j27p8J20p5J31m11j72L26r2j3K50r1N9J01j64j45k84L29j36
1951b59L04k24o8m2j51L00l42N1K69r1Q6j81r3K27J26k58R8k26K55n1l25J45J82
1974b68K29j41l72K43k1j59J16j42M45k56K27j92n9K44m37J56n0N6l3Q0o5L41
$$ plain form
1817 -203 -258 -430 -238 246 -305 -198 -92 -38 -359 -255 -225 -155 -129 -163 -62 -170 -46 146 350 -296 -480 78
1839 78 73 -147 -85 486 309 -171 -75 236 6 70 340 360 140 -83 368 329 -141 -355 270 413 -214 324 422
1862 422 302 87 -27 353 193 -242 1 605 514 247 446 342 449 274 360 311 246 370 770 768 98 57
1884 57 676 283 152 24 81 214 252 241 412 319 347 537 55 257 62 280 410 341 509 98 320 361 502
1907 502 197 78 81 370 307 99 260 340 107 -104 61 242 63 252 -48 289 302 -196 94 -88 -103 -132
1929 -132 59 70 213 86 8 128 53 184 -227 -399 -73 -165 -178 72 -19 40 141 -23 -168 -452 -123 -259
1951 -259 45 -179 -247 -289 -440 -140 -482 -431 -162 -253 -167 -348 -441 -214 -88 -346 -248 -474 -219 -270 -595 -450 -268
1974 -268 -39 -180 -552 -309 -330 -489 -373 -515 -70 -326 -99 -291 -350 -106 -543 -387 -437 -381 -414 -334 -399 -58
1996e8j02l3l29J09K55kk04N13j4m30O31n52R7m06M60M7j7J26j59J82J00r4n3
2019F7Mj87K21k57K37q9Q0p4K5R0k82k32L86L53m44K11J20L2j49M1r8Q7K53m26
2043c1L27j74M79j90m8j1l06L8J32n9r8J7k14M45K62n51K62n3K14j18L2J02j58
2066B99J4O9l7p3j79M39k34l59K53O8J95k17l01L16j26J55J7k25k6K45K27k18
2088C02k61j48L37k22J60j94R2o5J99k15J7K22k56K1O6j50J97j88K88Q9l67J51
2110G5l2K14m49o0j52L25j3L05m23q7J53L00l43q8M0N9l1J67j06R0k89R4pP2k19
2135d05r5N05l04L4O4J4K2l65K78j09k24L45L21j62j60J78k23K40k49j65N8J03
2157b99J3k3K53j42j17J21j10P4M5j32l6p9L24P2j67p3Q5p4N8k20K57J92l73J16
$$ plain form
1996 -58 -160 -193 -522 -413 -158 -160 -364 149 135 -295 336 -216 -119 -525 -65 -18 -35 91 -68 114 214 120 67
2019 67 71 -116 105 -152 85 -4 76 2 27 117 -165 -397 -11 342 -102 109 229 261 112 153 55 142 395 -31
2043 -31 296 122 601 411 363 352 46 84 216 157 59 76 -138 307 569 18 280 227 441 323 355 457 299
2066 299 313 382 345 272 93 532 298 -61 192 260 455 238 -63 253 127 282 299 74 48 293 520 302
2088 302 41 -107 230 8 168 -26 66 1 200 -15 2 224 -32 -11 55 -95 102 -86 202 291 -76 75
2110 75 43 257 -192 -252 -404 -79 -92 213 -210 -297 -144 156 -187 -275 -235 -176 -207 -40 -146 -56 -345 -251 -258 -186 -405
2135 -405 -500 5 -299 -265 -201 -187 -165 -530 -252 -361 -585 -240 81 -81 -241 -63 -286 -46 -295 -460 -402 -299
2157 -299 -286 -309 -56 -198 -315 -194 -304 -230 -185 -317 -353 -432 -108 -36 -203 -276 -191 -265 -207 -427 -170 22 -351 -235
2181b35J83L0m16J94J91j80o5N09q1m04J93K20K2m76K61J33n0k59P4J02o8M99
2203C77l49P2r2j40K87Pk05K4L20K34n82J96K16k30k07J28K46l55m3L97k0p0k81
2226g0J06K40m77K00K20m1j13M15l26l59L14K52q5j88J95L36k50m9n0j20o6n56
2248d72N87J26K1O6j72K14n73J80L33j30M8l12M21J57k61J36p6l82RN3j53k35
2270d15N69J22J19m97L91j80M7j49l0J08m7M6j1K88l93n9K2r6M5J54L36l0k65
2293G5j94M4M1r7m1J90j76l42Q26m43K01k71J88k8k54m4J21M4m7K92j29j8q9l9
2317a90L1l44M91J10r9j59r1j12K77k82K72j88r7MM53j29m4K02o2j01j00N7j54
2340b55K06p8nJ60r9k71L83l51N3o1K04Q4K70k71K8k75J21N7k3K66k60J39m5J11
$$ plain form
2181 -235 -52 -22 -438 -244 -53 -233 -298 211 130 -274 -81 139 161 -315 -54 79 29 -230 -156 -54 -122 377
2203 377 28 100 8 -132 155 162 -43 -19 301 535 -47 149 365 135 -72 56 302 -53 -96 301 281 211 -70
2226 -70 36 276 -201 -1 219 178 65 480 154 -205 109 361 276 88 283 619 369 320 270 150 84 -472
2248 -472 115 241 262 328 156 370 -203 -23 310 180 228 -84 337 494 233 369 293 -89 -80 -27 -180 -415
2270 -415 154 276 395 -102 289 109 156 7 -23 85 38 84 73 361 -32 -91 -69 -165 -120 34 370 340 75
2293 75 -119 -75 -34 -131 -172 18 -158 -500 326 -117 84 -187 1 -27 -281 -325 -204 -160 -207 85 -44 -62 -151 -190
2317 -190 -159 -503 -12 98 -1 -160 -251 -363 -86 -368 -96 -284 -381 -377 76 -53 -97 105 43 -58 -158 -101 -255
2340 -255 -49 -127 -132 28 -71 -342 41 -310 -257 -318 -114 -30 240 -31 -3 -278 -157 -100 -123 143 -117 22 -23 88
2364H8r1K12N6j03k43J51l70L60J81j66J87l49J38j5k3R3k51L0L87l02l7M8K72
2387B53l20L24m99J67RJ1L78l5k3O3j9m90J06k11O96k25j24k55L53J12j64j09
2409bQ7n5L52k60o6K31k98J13J9k89k8L05K76l90j53K18R2n9oK57j98j70J85M3
2433B04J8m14L11J48k40j3O5k80K30J11j08R6o6K97j24J01k30J55j56j25J98l29
2455a51J09M19j61l54j56J87Q7K69k15j84J69J73J22k21L76k64j40L8k14p9J7
2476a73K49J80l85k7K90Q9l27Q3J23k93K18Jj00k73J38O9L12j10j97j38K76n1
2498d6r5j14R7K25q8J14q12O74j04J27j90j72K46j6M1L4l02J68N4J19L16m03j81
2521c08R6M96k50j59q2K78k14J60j33m9n7N02j81l32l6J93L16l31j04J83L05k31
$$ plain form
2364 88 -3 209 265 162 -81 70 -300 60 241 75 262 -87 51 36 13 106 -145 -115 272 -30 -67 -19 253
2387 253 -67 257 -242 -75 -66 -55 323 288 265 328 309 -181 -75 -286 410 185 61 -194 159 271 107 -2
2409 -2 85 30 382 122 56 287 -11 102 121 -168 -196 109 385 -5 -158 60 152 93 87 344 146 -24 161 204
2433 204 222 -192 119 267 27 14 79 -201 29 140 32 128 62 359 235 336 106 261 105 -20 178 -151
2455 -151 -42 377 216 -138 -294 -107 -20 249 34 -150 19 192 314 93 469 205 65 103 -111 -190 -173
2476 -173 76 256 -129 -156 134 223 -104 -21 102 -191 27 28 -72 -345 -207 -138 174 64 -133 -271 5 -46
2498 -46 -141 -255 -158 67 -21 93 -719 -45 -149 -22 -212 -384 -138 -154 -113 -79 -381 -213 -159 -40 276 -127 -308
2521 -308 -212 284 34 -125 -207 71 -143 17 -116 -165 -222 280 99 -233 -269 -76 240 -91 -195 -12 293 62
2543F2r7k5K45m23L77j53N4j21j4RJ19k36q3L61L5j99J13j76J2N66l09Pl96J67
2567a05J99j75J05k38L28J07j44J29m24JL54m5Rk87J70N4J60j57j71L17j85K13
2589B15m06L60k32M26k5m49K25j04K24M7k42m5J72J79k5k96R4j40N24k67k06j82
2611a53j43L44J26L2m80K90k0M9m8L0l3K71k44k13N8J06l0R9l27J87L0J47M6j1
2635A13p5J8k1J09n5m4j94L29K3l10J69O2n5O3l59o9Q8L38lJ75l67K6J21k11k23
2660c52O4K75k03L06p3m25J34L83N7l34j60L23PL01k87j27M1J94n4m49k6K34J16
2683e5l8J72k00QJ55J5k54L2j65K50j5J22J59m00K96k16J13j43j82N92j40k71
2705a65K33j44K18k09j57J38N6m1O52k45m34N3l29O30k70l7L2p7R8j37M3K0J63
$$ plain form
2543 62 -35 -60 185 -238 139 -14 40 -81 -95 -86 33 -203 -286 75 110 -89 24 -152 -140 426 117 124 -272 -105
2567 -105 94 -81 24 -214 114 221 77 206 -218 -217 137 92 101 -186 -16 38 198 41 -130 187 2 215
2589 215 -191 169 -63 363 338 -111 114 10 234 281 39 -6 166 345 320 24 118 -22 502 235 29 -153
2611 -153 -296 48 174 206 -274 16 -4 45 -3 27 -6 265 21 -192 -134 -28 -58 41 -286 -99 -69 78 124 113
2635 113 38 56 35 144 89 45 -149 180 203 -107 62 124 69 132 -227 -296 -208 130 127 302 -65 -39 82 -129 -352
2660 -352 -288 -13 -216 90 17 -408 -274 109 166 -168 -328 -5 2 303 16 -111 -70 124 70 -379 -405 -171 -55
2683 -55 -93 79 -121 -113 42 57 -197 -165 -330 -80 -95 27 186 -214 82 -134 -21 -164 -346 246 106 -165
2705 -165 68 -76 142 -67 -224 -86 -30 -71 581 336 -98 -45 -374 256 -14 -51 -19 -96 2 -135 -92 -72 91
2728I1k4k9k47L0J56J53j72K44l30K71j25j15o2j35P30k25J26n51J66L86j39k71
2750g2R6k49L17M6j17k89J80R6M01l00J21m91M13l4l45K99OL4J49O5l38M1K40
2773B69J05k08J81n6j62l5N4J17l21N5Q3J5Nj7J9L4J56l31j00K17j49qJ29j29
2797g7o0M42j79k16m2J09J05L4j85J29J24k97K91l05J83j71O83p80Q0N3j44J12
2819a11J26K0J81k37M0n8j99L85R3j43k40J95J40k74j40J90o2k6Q1j5j91K14M0
2842In7j93P7K9J51j38J29Q5k57k6R2N1R6J5j5j92J42n7L3j02J84J54k30P0k67
2867b17K95l35K20j48J13m3K09J14n19J24J16J26j93K96m51L5M6Q9r4L81k80K86
2889A70k43o3R6l20K86O9r2j45K03O8J90j79O6J6j39k34L0O8K57q3j71K21l50
$$ plain form
2728 91 67 38 -209 -179 -23 130 -42 202 -128 143 18 -97 -159 -294 436 211 337 -214 -48 338 199 -72
2750 -72 24 -225 92 138 21 -268 -88 8 409 109 230 -261 152 118 -227 72 78 112 261 326 -12 29 269
2773 269 374 166 347 291 129 94 148 265 -56 -1 82 97 102 85 104 138 294 -37 -137 80 -69 -77 52 -77
2797 -77 -137 305 126 -90 -132 -23 82 116 -69 60 184 -113 178 -127 56 -115 568 -212 -132 -79 -223 -111
2819 -111 15 35 216 -21 19 -39 -238 147 240 97 -143 52 192 -82 -222 -32 -94 -120 -39 -54 -245 -31 9
2842 9 -48 -241 -164 -135 16 -122 7 92 -165 -191 -99 -48 48 63 48 -144 -2 -59 -26 -128 56 210 -20 50 -217
2867 -217 78 -257 -37 -185 -72 -115 94 208 -311 -187 -71 55 -138 158 -293 -258 -212 -123 -217 164 -116 170
2889 170 -73 -136 -40 -360 -74 -5 -97 -242 -39 29 219 40 106 122 -17 -251 -221 -153 104 21 -150 71 -279
2912b79K44R4m0j89L3K45K09n66L35o8L7j01O1r5P8j5N4m4l6j19J27J01j2l7l33
2937c16O6M23j28o7j0J47j78Q8P0k24L71j13j82o3M5j32L02q9L8j47K07K79j93
2960A94m5l35J25J35p8r6L14k38K25k73n6K77j02l9L10k54j11J28qj73J34k77
2982b43L52K58m10K44K57k26j47N1k69L5j30K43o4J34J88r8j0L8j75K16m85L49
3004A08j48j68K25K08j18J95j26q4j38K4p0J89o5n5L6J80k1Kl87J08K22p8m0k60
3028b61m1K30K5q5K27m4K40m77M8K17N9l2m22K11M9K47j64k23J83j11N9J31l7
3051B9q3Q7j45o5K41m53Q7L97k60M9k34J63j10K18l03M0nL6K82j24J11k22M4J4
3075b06M53n65P7L65j20J12o2O1k81L35j74n4J56p6K85n41K03J99j75qk15j21
$$ plain form
2912 -279 -35 59 19 -170 -137 108 317 -249 86 18 55 -46 15 -80 -2 -17 37 -7 -43 -162 -35 66 54 17 -316
2937 -316 -250 173 45 -22 -32 115 -63 25 95 -129 242 129 -53 -116 -71 -203 99 10 48 -99 108 387 194
2960 194 149 -186 -61 74 -4 -100 214 -24 201 -72 -128 149 47 8 318 64 -47 81 73 -100 34 -243
2982 -243 109 367 -43 201 458 232 85 136 -133 -98 -228 15 -49 85 273 175 165 203 28 244 -241 108
3004 108 -40 -208 17 225 107 302 176 92 -46 -22 -92 97 32 -23 13 193 172 174 -213 -105 117 39 -1 -261
3028 -261 -302 -72 -47 -132 95 51 291 -186 -138 79 138 106 -316 -105 -56 191 27 -196 -13 -124 -65 66 29
3051 29 -54 33 -112 -177 64 -389 -302 95 -165 -116 -350 -187 -297 -79 -382 -342 -347 -311 -29 -153 -42 -264 -220 -206
3075 -206 247 -318 -241 124 4 116 54 115 -166 169 -5 -59 97 21 306 -235 -32 167 -8 -16 -231 -352
3097c52J29K68L5K7n0p6K25N5l29o0JK54N0k58n8K6J49J16l9Ok48J07o7J0q4L52
3123A89k09P4j49j79L21p7J66n5k49J15J54J46l27P1K78n16O98k82k42L08l69
3144a34R7K70j39j58K04Pj10l00K43Q0L9Qp5l1m1O8j1J29M7l37K58o0k52M53M
3169B59k9k52q6J62J10j32R5k10L60n65O7K87j84L44k40L9o8j61J84n8L27l5l92
3192a78p2K04j38K45j74M5O5l0O4J24l0l9j55M9q9j01Q1p1L23j8j79K49k13j35
3216a73r7k18K91M9M04j47Lj32K2m4k91K74J59j86K62j73P4l1ml6j02j02P1Q9
3240c8j00k20K77K6q5L77k77p9P9%J16k48J26n7L14l43J22k57K06m7l19L82oj97
3264b48M01l02O0N1J69j34p2K50l10J63j09K56j81lO2q8k0K2p6J1K74j21oN4q3
$$ plain form
3097 -352 -223 45 80 107 57 -19 206 261 -68 -128 -127 127 177 -81 -139 -113 36 152 113 119 -129 -22 -89 -79 -163 189
3123 189 -20 54 -95 -274 47 -30 136 81 -168 -53 101 247 -80 -9 269 -247 451 169 -73 235 -134
3144 -134 -37 233 94 -64 140 147 37 -263 -20 60 99 107 32 1 -40 28 17 146 193 -144 114 54 -198 255 259
3169 259 230 -22 -108 54 164 32 127 -83 277 -288 -221 66 -118 226 -14 25 -43 -204 -20 -78 249 214 -178
3192 -178 -250 -46 -184 61 -113 -68 -3 -33 31 155 125 86 -69 -20 -109 -210 -129 -200 123 105 -74 175 -38 -173
3216 -173 -270 -488 -197 -148 256 109 112 -20 2 -42 -333 -59 100 -86 176 3 77 46 42 6 -96 -198 -127 -38
3240 -38 -138 -358 -81 -55 -140 237 -40 -119 -40 -40 76 -172 -46 -103 211 -132 -10 -267 -61 -108 -427 -45 -51 -248
3264 -248 153 -149 -89 -38 131 -3 -75 175 -135 28 -81 175 -6 -9 53 -35 -55 -33 -109 -98 176 55 49 103 20
3289B0l0J78l41J29K0j70N09m37J01J03k80L10j67N9K5l7J22J74k56L6j90Nj21
3312b38J57J77J14k94J29r1J65K68n77M21j55j91K66j04j99O6O8j0O4j64r9L42
3334A15K28k20q2j05J61k43L49j63J53n2m0Mj26J5l3K46j08l09J91J1J68pO8m17
3358a96M03o8l31L88o9o1P8N4k10J89k61j99K58j07J78l20L09j03k15M98l6R8
3380B77j05k53N0j20l7L08J56m92J20N3k12K43J21oj01l07L06r8l3J2J90j42m4
3403a14J56jk3n5j35J76K05l00J61k43Q5j26Q9q0J84q4j23J97L6R2l73K65P5j50
3427h6j66J21L49o07L70j33N3N4l9M0J50k34j59K49J14k37P6J77Q8l41k10M18
3449D7J07n73M10J19k29r3R1n8L74k90M9J59J6l53J64J20q2k6q3KK86qk5j77L5
$$ plain form
3289 20 -10 168 -173 -44 -24 -194 315 -122 -21 82 -198 112 -55 4 29 -8 114 288 32 68 -122 -117 -238
3312 -238 -81 96 210 -84 45 -46 119 387 -190 231 76 -115 151 47 -152 -86 -18 -28 36 -128 -227 115
3334 115 343 123 41 -64 97 -146 203 40 193 141 101 105 -21 -6 -39 207 99 -210 -19 -8 160 153 221 -196
3358 -196 207 139 -192 196 127 66 144 198 -12 177 -84 -283 -25 -132 46 -274 35 -68 -283 215 179 277
3380 277 172 -81 -31 -151 -188 120 276 -216 -96 -43 -255 -12 109 103 2 -305 1 -97 -130 -118 72 -70 -114
3403 -114 42 41 18 -37 -172 4 209 -91 70 -173 -88 -214 -125 -205 -21 -105 -228 -31 5 97 -276 -11 64 -86
3427 -86 -252 -131 218 -389 -19 -152 -99 -45 -84 -44 106 -128 -287 -38 76 -161 -85 92 180 -161 -371 47
3449 47 154 -419 -9 110 -119 -212 -121 -179 195 -95 -46 113 129 -224 -60 60 -22 -48 -131 -129 157 149 124 -53 -18
3474a8L4J03j48k7J89j8K2P6p5n5m4J38J57n90K83J2L05o8k82J32k34J6J11J93
3498B12m69K74j6J00J59m2p9j72K50J92l51J95k49K77m6m25K87l03J24OJ17m3
3520bP0j61J77MJ20j77N2L59l95P8j1K6L1j58J53L2q3J99l90m6J63p3m1r6K59
3545I0j55j76L08k24J74j24R2m6q2L5j94J58J06k7OP6o3K08L6m01J40k3O0R6M1
3570A11l06p7L78m39K75K39m32P2K29k46K04n0J51K8J09j23j44j34J54n7j74K76
3592D4j62L5o2o7M21k64n3J36QP1O4j13j13J86k18J9J25O3j31o6K25m4Lqn6j05
3618f2K21m7r6q2j05J20M83l93J30m47L22k96O6K17Nmj16j86L39j49J56J38l74
3641a60L24o0j52K6J19m02K40L3n0L02k20k37M1M7J40J79j43r4K07l8j75K18k64
$$ plain form
3474 -18 16 119 -29 -56 133 115 137 213 138 83 39 177 334 -256 27 39 344 276 -6 126 -108 -92 19 212
3498 212 -257 17 1 101 260 218 139 -33 217 409 58 253 4 281 235 -190 97 -206 -82 -76 41 -2
3520 -2 68 -93 84 88 208 31 83 442 47 125 114 140 171 13 166 198 115 314 -76 -122 41 -32 -73 -169 90
3545 90 -65 -241 67 -157 17 -107 -15 -61 -143 -108 -302 -144 -38 -65 -59 17 -46 162 198 -203 -63 -86 -26 70 111
3570 111 -195 -272 106 -333 -58 181 -251 -179 50 -196 8 -42 109 137 246 123 -21 -155 -1 -58 -232 44
3592 44 -118 -83 -145 -212 209 -55 -108 28 36 107 171 58 -55 131 -87 -68 57 120 -11 -77 148 104 107 99 43 -62
3618 -62 159 112 16 -66 -171 -51 432 39 169 -278 44 -252 -186 31 36 32 -84 -270 69 -80 76 214 -160
3641 -160 164 104 -48 -22 97 -305 -65 -32 -82 220 0 -237 -196 -149 -9 170 27 -67 140 102 -73 145 -119
3664a19J3K50o9J91n8l76l2J81M6L5Pn8L27j56j49o7K20k35j61M96j03l07K63
3687A39L4L8j71j71M69l74JJ79O6p7K52m46R1o4r5pK36m07K62K77k88P8J29k19
3711f8k5K10L4q8j62L53k43JJ31l52J17K32k17l7r7L01j72K8J41j11J38k98K03
3734A9n6J09p9n3j54J45j37R0J83k03K22r8k08K10K03j06j70P3j1J43j33o1r6
3757a68K29Kj84K74j93PLk05J54j19l8J63j45J69p3J32j18J9Q2J22l54j30M12
3780D1q0M1J0K38r5j33K50l91M0M9k8j10m8J62O7K08l26R3j94q2K49J42k02J51
3804E2J60j68j26L28k38k27K5j4L09j9K3N3j13j77J53O9o8P0j44P4P5k35L07k21
3828e2k64M33r9l3M1K89k76J08M1j33k62L13j35j71N60m92J41N6K46l31n5O4j92
$$ plain form
3664 -119 -106 144 75 266 208 -168 -200 -19 27 62 69 11 338 182 33 -34 186 -49 -210 286 183 -124 139
3687 139 173 211 40 -131 338 -36 -35 144 210 133 385 -61 30 -34 -129 -136 100 -307 -45 232 -56 22 151 -68
3711 -68 -93 117 151 63 -99 254 11 12 143 -209 -92 140 -77 -114 -211 90 -82 -54 87 -24 114 -184 19
3734 19 -37 72 -7 -60 -214 -69 -206 -116 67 -136 86 -12 -220 -10 193 87 -83 -10 -21 122 -11 -72 -168
3757 -168 61 63 -121 153 -40 -33 -30 -235 -81 -200 -238 -75 -220 -51 -124 8 -110 -91 -9 113 -241 -371 41
3780 41 -39 2 12 250 155 22 272 -119 -79 -30 -58 -168 -216 -54 13 221 -105 -12 -206 -288 -39 103 -99 52
3804 52 212 44 -82 246 8 -219 -194 -208 101 82 105 158 45 -132 21 90 22 92 -52 22 97 -138 169 -52
3828 -52 -316 117 18 -15 26 315 39 147 188 55 -207 106 -29 -200 360 -132 9 65 311 -20 -75 -11 -203
3851b03M80q8l91J52Q2k9j11K17j32J79l52O4O1k03L56k55J14j58J49j05L34j69
3873hN9k64O1M61k86O1O5j5j59q3M78j96j48p1j32M2O9m0j40J21R7J52o7m2L1
3898D6j27M6J74l15K90j37qj20Pj21K63j84J3lK29l8j77n7r0K73k15J77j68J9
3922b23J95J02j12n4K48k68J49r0J5L42m42m8J96k01L6o5K26J30k03K12k71L92
3944B66j70Q4j03l06J07O3J29l40R7K14J5j67M11n39M07j18j84K15j29o8J23r3
3966h6R0K6k08K56n1j44J59l91K31K25j43K09j41l3O4LL8J63p7q0j88J58q6j20
3990a26J52j27q6Q5J63M1k2Kl13o8L21j59J48l9J79j79K9J48o8N4J14l62J77k1
4014D3n1qQ7n5q7K43r1J34r1J4j74J35j31O9K6k24K62k49j6O3K89k25L7j14J37
$$ plain form
3851 -203 277 189 -202 -50 32 3 -108 109 -23 156 -196 -132 -71 -274 82 -173 -59 -217 -68 -173 161 -8
3873 -8 51 -213 -152 309 23 84 149 134 -25 -108 370 174 26 -45 -177 -135 -66 -106 -246 -125 -28 124 57 15 46
3898 46 -81 -35 139 -176 114 -23 -31 -151 -144 -265 -2 -186 -173 -176 53 15 -162 -219 -309 -36 -251 -74 -242 -223
3922 -223 -28 74 -38 -92 156 -112 37 -53 -38 304 -138 -186 10 -191 -155 -220 6 136 -67 145 -126 266
3944 266 96 180 77 -229 -122 -59 70 -270 -173 41 56 -111 300 -239 168 50 -134 81 -48 -116 7 -86
3966 -86 4 30 -178 78 27 -117 42 -349 -118 107 -36 173 32 -1 63 66 104 267 190 110 -78 80 -6 -126
3990 -126 26 -101 -187 -102 61 102 80 82 -231 -299 22 -137 11 -28 151 -28 1 149 81 135 249 -113 64 43
4014 43 -8 -16 71 16 -71 172 81 215 124 138 -36 99 -32 37 63 -161 101 -148 -164 -101 188 -37 0 -114 23
4039B3j01J47J09j91J40j44j06O3J60k14L34m08N11l69L57k40j00j18M1j75L32
4060E1R3l9k17L0R5j3l01K50O7j55L8j07J66J07k30N26l30j86K13k43M2L26k45
4083f2J51J15j43j90M8J43J1K75l21j32P0k03N40l43k25M67l19K99j83J40kj81
4105d5J75m02L44j15j11J00o7r4L22m6k87m8J22j33M12p6J1r1r5J94j10K00j34
4128B6KJ19q4O2j80j41N30k94q8nk6J02K49l54k7J75J80r2k66J24m3j14L48M6
4152B49k73Q8l6k05L12j14P5m5J74r9k66J0j46Q9L69kk23J79K6p1J03j90J9Q0
4176A03o1K55l26K6K88m11J37q7k9J49k5J86m37M46j17l19P5M9M51l19j39J98
4198I3m0q6q5K49L0p7m6m2p5J33k88K70j50k8L57k28R8j26l6rJ18J02k07M5M8
$$ plain form
4039 23 -78 69 178 -13 127 -17 -123 -60 100 -114 220 -188 323 -46 311 71 -29 -147 -106 -281 51
4060 51 144 105 -112 -82 13 0 -301 -51 16 -139 -101 -208 -42 65 -165 361 31 -155 58 -185 -143 183 -62
4083 -62 89 204 61 -129 -81 62 73 348 27 -105 -35 -238 302 -41 -266 201 -118 181 -2 138 136 -45
4105 -45 130 -272 72 -43 -154 -54 -121 -215 107 61 -226 -274 -152 -285 127 51 62 -29 -124 70 -40 160 26
4128 26 28 147 63 125 -55 -196 334 40 -48 -53 -79 23 272 -82 -109 66 246 154 -112 12 -31 -145 203 249
4152 249 -24 64 28 -177 135 21 96 51 225 126 -140 -130 -276 -187 182 180 -43 136 162 91 194 4 23 103
4176 103 42 297 -29 -3 285 -126 11 -76 -105 44 19 205 -232 214 97 -222 -147 -98 353 34 -105 93
4198 93 53 -33 -118 131 161 84 38 -4 -79 54 -234 36 -114 -142 215 -13 85 -41 -77 -86 32 134 -73 -28 20
4223B0r2J28J50l20j18J31k20J40Q8Q1j16n8L77K5m0j4l43k7j41N76k22K89l38
4246d4J60j11j03K64j75j12J9PK03N2l53O3J88j83k6j7K33p3Q2k41K24J0qj19
4270f0O8j67P0n1J71j57K24k05J74Q2j68J10j67M43l79j02K84l46m8J9K73k16
4292a48l79N44Q8O7N9j46j80J69k89K31L64m21J43k37L63l02L37n00J22L80l27
4313f2j18O2P0j2j16N3M9J14k11K49j61J29j36K15J8k48J67l23M15k73J06J93
4335A80l01nJ21k2J8K5j41K79k94J09J35n0%j90l2K70j32N5L41n23K10q7j74M06
4359A98n2k29J0L80l92K8L20q1l26K38n9j13l5J63J41l2n02J15N87k40m19M54
4381A54R5k57N6J34q4k24n4J66j2P2J5k48N70l45k42J87l0j35l7K17L6Pk01J82
$$ plain form
4223 20 -72 56 206 -114 -232 -101 -321 -181 -93 -12 -128 -186 191 216 176 162 -181 -208 -349 227 5 294 -44
4246 -44 116 5 -98 166 -9 -121 -102 -95 108 160 -193 -130 58 -125 -151 -168 65 -8 74 -167 57 67 59 -60
4270 -60 8 -159 -89 -140 31 -126 98 -107 67 149 -19 91 -76 367 -12 -114 170 -176 -224 -205 68 -148
4292 -148 -527 17 105 172 231 85 -95 74 -215 16 380 -41 102 -135 228 -74 263 -237 -115 265 -62
4313 -62 -180 -118 -48 -60 -176 -123 -74 40 -171 78 -83 46 -90 125 143 -105 62 -261 154 -119 -13 180
4335 180 -121 -126 -5 -27 -9 16 -125 154 -140 -31 104 54 54 -136 -168 102 -30 25 366 -157 53 -34 -208 198
4359 198 146 -83 -73 307 -85 -57 263 182 -144 94 35 -78 -113 50 191 159 -343 -228 359 119 -300 154
4381 154 249 -8 48 182 98 -126 -180 -14 -26 46 61 -187 383 38 -204 -17 -47 -182 -219 -2 34 41 -160 22
4405B2J36Lj92j60J91q2K02q8J32q3K20k98qK43j70k87J86l4L18m87L4K97j10
4428a5N3jK14m24J96k18J87J21r7J33k92j18N5K96rk85J4K44o0N0q6J28k46R2
4452f8J06m5j66j46J91R0J74P9n27K09M9L6Lj4J10k43j11K07j24K6r0J35L36l66
4476a49J77J78k12J54k56q6J82M68m21p6p6L01j50K1j77%nj96J39J15r9K65k09
4499a12J78j17P8J05mj37J28J21j90K1J9k36K38j77J75O2k41Q8P8j99j65J04R4
4522h9q3K10j48j73K82j85K71K7k85j34K94j64k2j00K36m7K05j18j61l5L84Q5
4544B50l38K55J6n28K82J00J3p6N4n8k06O38l81j29J08P4l19Q6q0J86J0J5j79
4567b07N39l25l04J83o6J22jNK01j86Lo1J01K7K00j7l20p4K56p9O9Q8q7k36J19
$$ plain form
4405 22 158 161 -31 -191 0 -82 120 32 164 81 301 3 -5 238 68 -219 -33 -67 251 -236 -202 95 -15
4428 -15 38 37 251 -173 23 -195 -8 113 16 149 -143 -261 -206 90 81 -204 -190 54 -6 44 -42 86 -160 -68
4452 -68 38 -7 -173 -319 -128 -38 136 215 -312 -103 -54 -18 -15 -29 81 -162 -273 -66 -190 -164 -254 -119 217 -149
4476 -149 28 206 -6 148 -108 -194 -12 456 35 -41 -117 184 34 55 -122 -122 -127 -323 -184 -69 -168 97 -112
4499 -112 66 -51 27 132 128 -9 119 240 50 71 90 -146 92 -85 90 152 -89 -1 77 -122 -287 -183 -89
4522 -89 -172 38 -110 -283 -1 -186 85 112 -173 -307 -13 -177 -199 -299 -63 -110 95 -23 -184 -219 165 250
4544 250 -88 167 183 -345 -63 37 50 -26 28 -30 -236 402 21 -108 0 74 -245 -159 -239 -53 -43 -28 -207
4567 -207 332 7 -297 -114 -180 -58 -59 -54 147 -39 -36 -97 4 31 231 214 -106 -180 76 -3 66 154 67 -169 -50
4592e0K18j29mj94M44j49M5q9j59k9j31K81m4p3K24m98K21j33J95K18j11j07J57
4615A03M8l29J49Q6J85k56j4N4P3N9r2j5p8J9J00j42J53j43J40J74j79j82j06
4638a93M07k80L18m73o4K56l2J32j26L40l50L88m32N5p8K72k13K76k51rk4J11
4660C0k51K41jJ4k68J02J83k55O1L75l02M6J31o1m9r9P6n2O6K3R5k02j09N60l01
4685E3P8n07N98k94LL75m01J75k40J82n0n6j43K40P2j9j09n0m4J4r2K13j83J27
4709e8K60p6ok5l23L28m05J66J30k84K92J95j07Lr6nk13K32N0j27K60J43m82J49
4733Ak83J29K13j72K14J36l57k1J32k53L42J15k83K03O3j26j26J40k0J49o27O08
4755A77l15K26o7j61J76q5P6L38l76L15k76k60M52m71J57J68L02n28L84o4n6j11
$$ plain form
4592 -50 168 39 35 -159 285 136 181 92 -67 -96 -227 54 10 -63 161 -337 -116 -249 -54 164 53 -54 103
4615 103 151 -178 -29 57 242 -14 -28 26 99 158 66 51 -27 -8 92 -50 103 -40 100 274 95 -87 -193
4638 -193 214 -66 252 -221 -285 -29 -61 71 -55 285 -65 323 -109 -54 -132 140 -73 203 -48 -57 -81 30
4660 30 -221 20 19 33 -235 -133 50 -205 -144 231 -71 -25 106 45 -4 -103 -27 -79 -13 10 105 -97 -206 354 53
4685 53 131 -376 222 -72 -69 306 -95 80 -160 22 -28 -84 -227 13 85 66 -43 -93 -137 -123 -215 -2 -185 -58
4709 -58 202 126 120 95 -228 100 -305 -139 -9 -293 -1 194 87 90 -6 -11 -224 8 58 -69 191 334 -148 1
4733 1 -282 -153 60 -112 102 238 -119 -140 -8 -261 81 196 -87 116 179 53 -73 67 47 196 -431 177
4755 177 -138 88 21 -140 36 -49 27 365 -11 304 28 -232 220 -251 -94 74 376 -152 232 168 112 1
4777Ao4R7p4nJ07k55J76O6K10j77k4j03k36K31J28l25L17o7n7J57k82M8K41l30
4801b20J29k51J89O7j33M06k02o5M2L5J16j37L50k59j74L28l82K04K08o68K30
4822a87N7J55pP1m85L46j04L05%k91O9K4p8K86k16R2J0k50J47J50k66Q6K56k35
4846f5K12rj60J2l2p0J06K01k62mK6K91j29J13l31J63j63On4K44J25j49R2j63
4870@o9J60j71L7K58j91j81R2M35n96K25o0J37k18j95K98l7J01p4O4J58p1r6j9
4894a3K86J45l78P0j0MP2r9j49L3P3k4K47l91l6m5J93K7K23k61k5M8l39M27r9
4919b1J37k09JJ5L08l75K10j27J71k83K1M0J26j39M15m31J06j87K15K07r7J38
4941B41j17k08Q4j03M22k30K6kl43L62K2k57J24mm1Q5r5l9K34j58J15l35K26j17
$$ plain form
4777 1 -63 34 -40 -45 62 -193 -17 49 259 82 58 -45 -281 -50 78 -247 70 3 -54 103 -179 -131 110 -220
4801 -220 -91 -342 -153 -86 -219 187 -15 -80 -38 -3 113 -24 326 67 -107 221 -161 43 251 -417 -187
4822 -187 -130 25 18 89 -396 -50 -154 151 151 -140 -71 -47 -125 161 -55 37 47 -203 -56 94 -172 -86 170 -65
4846 -65 147 138 -22 -10 -42 -112 -6 195 -67 -71 -45 246 117 230 -101 62 -101 -95 -149 95 220 71 163 0
4870 0 -69 91 -80 -43 215 24 -157 -65 370 -226 -1 -61 76 -142 -337 -39 -76 25 -49 15 173 102 6 -13
4894 -13 273 418 40 110 100 104 176 77 -72 -39 34 10 257 -134 -170 -215 -22 5 228 -33 -58 -10 -349 78 -21
4919 -21 116 -93 -92 -77 231 -144 66 -61 110 -173 -152 -112 14 -125 290 -141 -35 -222 -7 200 103 241
4941 241 124 -84 0 -103 319 89 115 113 -230 132 154 -103 21 17 -24 61 -34 -73 161 3 118 -217 9 -108
4965a08P5j9j98N15k06Nk12M81l50K02J41j71j52j19R6pm02M75R3K13l94K26m75
4988b91K49J81k55Ql5J93M9m3J98j39k85j29K13J64j41R3l81L54Rq9j1L55j89
5011G8K4L4k87K03k25K04k64L04J15l90N95n45L23k61l9J00J32k74Q9P7R9l79
5033b87K43P0j27J13J43k76J85q8j58R9n3K33j22j44o5rJ10NJ30j4J09j90L09
5056B16j06j57J85o6q5PJ39p5j41N5K22k88n8j29L57j58L05p0k77J12P0J35k12
5079a9K06K8k07J85k83j25K48k8o0J5J25j81L50l64j04K99n41J27M73j75n3J68
5101H4k83K04k7J51j68L66k52k76M21l32L09j2N8l32L75l46p7l8L13k84j25L11
5123D0N8l35K56r4Q8J58l13J87j50R0J05l6P5r2k90K88p5j01L5p9L06l86M43k52
$$ plain form
4965 -108 -33 -52 -250 265 59 64 -148 333 -17 185 326 155 3 -116 -20 -27 -429 46 139 352 -42 184 -291
4988 -291 -42 139 -116 -108 -143 50 99 56 254 115 -170 -299 -86 78 -63 30 -351 3 12 -77 -88 267 78
5011 78 102 136 -151 52 -173 31 -233 71 186 -204 391 -154 169 -92 -131 -31 101 -173 -84 -7 92 -287
5033 -287 -44 26 -101 12 155 -121 64 -24 -182 -83 -136 97 -25 -169 -234 -243 -133 -128 2 -12 97 -93 216
5056 216 110 -47 138 72 -13 -6 133 58 -83 -28 194 -94 -152 -281 76 -82 223 153 -124 -12 58 193 -19
5079 -19 187 215 8 193 -90 -215 33 5 -55 -40 85 -96 254 -110 -214 85 -456 -329 144 -31 -84 84
5101 84 -199 5 -22 129 -39 327 75 -201 220 -112 197 185 243 -89 286 -60 -137 -175 138 -146 -271 40
5123 40 98 -237 19 -75 13 171 -142 45 -105 -15 90 54 129 37 -253 35 -40 -141 -106 -185 121 -265 178 -74
5147g4R3j35N2K53m32J59K26nl09O50o52M05l45R4K90k34k12J35L48m29m2J01
5169f3J48k86K57j80M3Q4K18k71L53k82j38J79P8k12KL55k39l73L53k95M8L08
5191H7r5L5k38K20K66l81m7k6L25j36o6n4rJ58j29L48n94M57q7J11j68pL0K85
5215B85l90L79k50k77L8L28j75K25k82j9M83l61K59l64j39K18K14o16M95O0l19
5236b08J18K94k5j7l22N1J92j58K3k06K88r7L20l98n3j05M19o3K9k00N6K39n39
5259c62L90j37K94j67k71K62J1K72j97j8j47k3J55J7o6J9p2rj85K25lk64L10k34
5283b00K33L15j9k48Q5k46k7K49l32L1k88O26k26K78N7j31m2k61Q0K34k00r9J44
5306A3P9m05M69p7j79o0J06O6l0p7K14j72j34K11J05p1q5p9K56n7l11J0J92L70
$$ plain form
5147 -74 19 -116 -64 189 -243 -84 142 137 -172 478 -174 231 -114 -20 270 36 -176 -41 307 -122 -164 -63
5169 -63 85 -201 56 -124 -81 3 221 -50 303 21 -117 62 140 -72 -70 285 46 -327 26 -269 -221 87
5191 87 -8 27 -211 9 275 -106 -153 -179 146 10 -56 -110 -119 39 -90 258 -336 121 34 145 -23 -30 0 285
5215 285 -105 274 24 -253 -215 113 -62 163 -119 -138 345 -16 243 -121 -260 -42 172 -444 51 111 -208
5236 -208 -90 204 179 162 -160 -109 83 -75 -52 -258 30 -67 253 -145 -198 -303 116 53 82 -118 -62 177 -362
5259 -362 28 -109 185 18 -253 9 20 292 95 77 -70 -93 62 79 13 32 -40 -49 -234 -9 -12 -276 34 -200
5283 -200 33 348 329 81 166 -80 -107 142 -190 -159 -447 179 -47 231 288 157 115 -146 -66 168 -32 -131 13
5306 13 92 -313 156 79 -100 -160 -54 12 -18 -95 119 -53 -187 24 129 58 -27 -106 150 93 -218 -208 -16 354
5330C54m02O4J93j49j42J20K7m7LK09k22K28k84R1Q9J85j59j31J01J52l04L11
5352B87m68L81pl45K73P7K3k9p2J71m08K02L13k69j08j41j69L53J53o0P8j19j08
5375HL6q1l3l9qN9J08J39l09k17M22l23L89j18J18k03k9J65j29M0Q1j58J8K07
5399A43j84L27k35q4LM6Q7j06J64j80k31J63j59J65L57n66O3O4J12L32m63J52
5421c0j85K26R8J27l45N8m8k3k37L14J36j79K61l22M42m27K2R6J36k02N3k74M14
5444A11J3l86K67J21p4k46R8P6k5J38j60o0k22M39j28K68l05K23r9j41K49m00
5466b43M03p1j08L2j12J37j00Q5K1mj0J65j17k2jj2K8k09J02K92N4j19k97O6j02
5491a42J97J53l5j37O0l38L31K6k68L34R1j72N0k7N4j64j18K52j3j70j20J11O
$$ plain form
5330 354 -48 16 209 60 -82 38 65 18 21 230 8 236 -48 43 132 317 158 27 128 280 -24 287
5352 287 -181 200 193 -152 121 198 221 192 120 291 -117 85 398 129 21 -120 -289 64 217 157 235 116 8
5375 8 44 -37 -70 -109 -117 -58 50 189 -120 -337 85 -238 151 33 151 -52 -81 84 -45 -5 76 -82 -64 143
5399 143 -41 286 51 -33 -30 16 103 -3 161 -19 -250 -87 -246 -81 276 -290 -227 -163 -51 281 -182 -30
5421 -30 -215 11 109 236 -109 -51 -99 -122 -359 -45 91 -88 173 -149 293 -134 -112 -16 120 -82 -29 -303 111
5444 111 124 -262 5 126 52 -194 -96 -20 -45 93 -67 -127 -349 90 -38 230 -75 148 49 -92 157 -243
5466 -243 160 89 -19 13 -99 38 -62 23 44 40 30 195 78 56 55 43 71 -138 -36 256 310 191 -106 -40 -142
5491 -142 55 208 173 36 96 -242 89 115 -153 181 272 100 150 123 177 13 -105 147 134 -36 -156 -45 -39
5514c9K5l3k62K36K45m98K88J26n4l29J31K47j05l8K65k90J21j0Pj95K25j6J72
5537B19m73J95J64k45P5j15L79j42o4K1lL1K2J24k33j58J87j72L00m35J73p7K26
5560aJ90l38K97j01r2Q5O6j8m6jm5j57K14L2r6o2J6J2J68k04j3M4q2K68k04j69
5586b37J67r8RJ02J93j71L2k79K47j40L54m06L61j74Q9Rk47J81J87j23n4J02O8
5609A72l11K31R5l92K99K13j99k61J82j51J81j12M24m31L1j7K11j84j19J23n8
5630g3n4K72k76r8r8K95m5K8J70q2J9Oo3k49L39J27K58l97L8r9k8j38M0J40Q4
5655A16l14K10P9j50K17j67o7M9j36J69J18j6l9j41K26k71R9j18J04J82pJ51k42
5678E2k10K88l68L58j3n0O2l43L02j01oK68m68K07K9j15K00O9j67j22Q0K94m00
$$ plain form
5514 -39 -14 -47 -309 -73 172 -326 -38 88 34 -295 -164 83 -22 -60 205 -85 36 26 33 -162 63 47 219
5537 219 -254 -59 105 -140 -65 -180 199 57 -7 14 11 42 64 188 -45 -203 -16 -188 112 -323 -150 -227 -1
5560 -1 189 -149 148 47 -45 40 106 88 42 41 -4 -161 53 85 -11 -73 -57 -45 123 -81 -94 -50 -132 136 -68 -237
5586 -237 -70 -168 -159 -57 136 -35 -3 -282 -35 -175 179 -227 134 -40 49 58 -189 -8 179 56 2 104 172
5609 172 -139 92 187 -205 94 307 108 -153 29 -122 59 -53 371 -60 -29 -46 165 -19 -138 -15 -73
5630 -73 -127 145 -131 -229 -327 -32 -77 -49 121 39 58 64 1 -248 91 218 476 79 117 18 -10 -148 -108 32 116
5655 116 -198 12 91 -59 158 -9 -76 -27 -163 6 124 108 69 -72 154 -117 -18 -136 -32 150 143 294 52
5678 52 -158 130 -238 120 107 57 119 -224 78 -23 -29 239 -229 -22 7 -108 92 161 -6 -128 -48 246 -154
5701a54p0K07kk95J92J0n8K59K52n01Jk13K92K94k99K94Nj83N1j86L40k85k76
5724c25N56k94J66J10j65k1j22L07m49N52n14M58n4l81K50nn6k47k24K90M6K07
5746H5K58m23OJ83j2j77J85LJ40m11Q7j26K49j80J3M9L06p0J9l64J73j46K23j86
5770a16l1K15k95K31Kj39n2J35J83l30J92K5k84J57j9Q9J35j70J79k35J95K79
5792C46l09K61m02M04k82m06K91l6J37k95L42n2J58j28O7j66q0j43L84K3j96J46
5814F4j62P7n8j04K60r9p1R5J78m90J95K24m8l5k0p4M36n54M16j95j78J22k70
5837b91N22m80O6L44j66M2j06R6J7J94q3j75mm8QM5RK22n4k38l0J17Lo3n9m8J24
5864c6K1K68j06q4Q7l47J93J26l02J24q3K57k00j07j3J14O4Mj67J51k01K38K12
$$ plain form
5701 -154 -224 -17 -19 -314 -122 -112 -170 89 341 -160 -159 -372 -80 214 -85 209 214 31 82 -104 236 -49 -325
5724 -325 231 -63 103 213 48 27 -95 212 -237 315 -199 259 205 -176 74 69 13 -234 -458 -168 -122 85
5746 85 343 -80 -74 109 97 -80 105 108 248 -163 -76 -202 47 -133 -120 -71 235 165 184 -180 -7 -153 70 -116
5770 -116 -147 68 -227 4 6 -133 -185 -50 133 -197 -5 20 -264 -107 -126 -37 98 -72 107 -128 67 346
5792 346 37 298 -104 300 18 -388 -97 -133 4 -291 51 -1 157 29 96 -70 -150 -293 91 114 -82 64
5814 64 -98 -21 -79 -183 77 -22 -93 2 180 -310 -115 109 61 26 6 -68 368 -186 230 35 -143 -21 -291
5837 -291 231 -249 -183 161 -5 37 -69 27 44 238 155 -20 -24 -72 -64 -19 -10 212 158 -80 -110 7 10 -53 -112 -160 -36
5864 -36 -15 253 147 63 150 -197 -4 122 -180 -56 -139 118 -82 -189 -202 -88 -24 -20 -187 -36 -237 1 213
5887B13j39R5o9k7J06k25J08q8L2J17m9l1j74k52M88j27j00J74N6j0k78M6J38
5910Dn2K6M4M1K35l10j24R8J98r0j39M18l40o8M3j84rK81l84N07k83P4k2R9k1
5935D2j56j15K70P9k07K24l22Q2K19j55k23k1M55j95L5j47J48j5k73L26K7j60
5957h2rJ09P6j15K21k22j3J72N3j96J97k76j33M94q6j05m4L8j49O1L5J28O6l3
$$ plain form
5887 213 74 169 100 73 179 -46 62 -26 6 123 74 43 -131 -383 105 -22 -122 52 108 98 -180 -134 4
5910 4 -48 -22 22 63 298 -12 -136 -38 160 70 -69 349 9 -59 -16 -200 -209 72 -312 195 -88 -14 -36 63 42
5935 42 -114 -229 41 120 -87 137 -185 -103 116 -39 -262 -283 172 -23 12 -135 13 -2 -275 51 78 -82
5957 -82 -91 18 94 -21 200 -22 -35 137 190 -6 191 -85 -218 276 190 85 41 79 -70 -9 26 154 220 187
$$ [...]
8191c7
##END NTUPLES=NMR FID
##END=
