##TITLE=1H_LR-683B-CS1
 DMSO, 8 sc, 
 28.2.2020
##JCAMPDX= 6.0         $$ Bruker NMR JCAMP-DX V2.0
##DATA TYPE= NMR FID
##DATA CLASS= NTUPLES
##ORIGIN= UXNMR, Bruker Analytische Messtechnik GmbH
##OWNER= root
$$ XWIN-NMR		Version 3.5
$$ Fri Feb 28 16:21:38 2020 Russian Standard Time (UT+4h)  she@DPX200
##.OBSERVE FREQUENCY= 200.1315
##.OBSERVE NUCLEUS= ^1H
##.DELAY= (6, 6)
##.ACQUISITION MODE= SIMULTANEOUS
##.ACQUISITION SCHEME= undefined
##.AVERAGES= 8
##.DIGITISER RES= 18
##SPECTROMETER/DATA SYSTEM= spect
##.PULSE SEQUENCE= zg30
##.SOLVENT NAME= D2O
##.SHIFT REFERENCE= (INTERNAL, D2O, 0, 15.7039)
##AUDIT TRAIL= $$ (NUMBER, WHEN, WHO, WHERE, WHAT)
$$ ##TITLE= Audit trail, XWIN-NMR		Version 3.5
$$ ##JCAMPDX= 5.01
$$ ##ORIGIN= Bruker BioSpin GmbH
$$ ##OWNER= she
$$ F:/spectra/data/she/nmr/H-F/1/audita.txt
$$ ##AUDIT TRAIL=  $$ (NUMBER, WHEN, WHO, WHERE, WHAT)
(   1,<2020-02-28 16:20:32.71 +0400>,<she>,<DPX200>,
      <created by zg, POWCHK disabled, PULCHK disabled
       configuration hash MD5:
       00 E9 B6 7A A2 85 ED C7 34 08 36 98 17 FE 4E 26
       data hash MD5: 16K
       8D EA B4 E5 5B 69 33 46 06 EE 12 99 5C 14 C2 99>)
$$ ##END=
$$ 
$$ hash MD5
$$ C3 44 DF 63 BF 15 8D 5D 4A C7 84 90 F0 86 30 A6
##$RELAX= 
##$RELAX= 
##$RELAX= 
##$RELAX= 
##$RELAX= 
##$RELAX= 
$$ Bruker specific parameters
$$ --------------------------
##$DU= <F:/spectra>
##$EXPNO= 1
##$NAME= <H-F>
##$PROCNO= 1
##$TYPE= <nmr>
##$USER= <she>
##$AMP= (0..31)
100 100 100 100 100 100 100 100 100 100 100 100 100 100 100 100 100 100 
100 100 100 100 100 100 100 100 100 100 100 100 100 100 
##$AQSEQ= 0
##$AQ_mod= 1
##$AUNM= <au_zg>
##$AUTOPOS= <>
##$BF1= 200.13
##$BF2= 200.13
##$BF3= 200.13
##$BF4= 200.13
##$BF5= 200.13
##$BF6= 200.13
##$BF7= 200.13
##$BF8= 200.13
##$BYTORDA= 1
##$CFDGTYP= 0
##$CFRGTYP= 5
##$CHEMSTR= <none>
##$CNST= (0..31)
1 1 145 1 1 1 1 1 1 1 1 1 1 1 1 1 1 1 1 1 1 1 1 1 1 1 1 1 1 1 1 1 
##$CPDPRG= <>
##$CPDPRG1= <>
##$CPDPRG2= <>
##$CPDPRG3= <>
##$CPDPRG4= <mlev>
##$CPDPRG5= <mlev>
##$CPDPRG6= <mlev>
##$CPDPRG7= <mlev>
##$CPDPRG8= <mlev>
##$CPDPRGB= <>
##$CPDPRGT= <>
##$D= (0..31)
0 1.2 0 0 0 0 0 0 0 0.06 0 0.03 0 0 0 0 0.0002 0 0 0 0 0 0 0 0 0 0 0 0 
0 0 0 
##$DATE= 1582892432
##$DBL= (0..7)
120 120 120 120 120 120 120 120 
##$DBP= (0..7)
150 150 150 150 150 150 150 150 
##$DBP07= 0
##$DBPNAM0= <>
##$DBPNAM1= <>
##$DBPNAM2= <>
##$DBPNAM3= <>
##$DBPNAM4= <>
##$DBPNAM5= <>
##$DBPNAM6= <>
##$DBPNAM7= <>
##$DBPOAL= (0..7)
0.5 0.5 0.5 0.5 0.5 0.5 0.5 0.5 
##$DBPOFFS= (0..7)
0 0 0 0 0 0 0 0 
##$DE= 6
##$DECBNUC= <off>
##$DECIM= 24
##$DECNUC= <off>
##$DECSTAT= 4
##$DIGMOD= 1
##$DIGTYP= 9
##$DL= (0..7)
0 120 120 120 120 120 120 120 
##$DP= (0..7)
150 150 150 150 150 150 150 150 
##$DP07= 0
##$DPNAME0= <>
##$DPNAME1= <>
##$DPNAME2= <>
##$DPNAME3= <>
##$DPNAME4= <>
##$DPNAME5= <>
##$DPNAME6= <>
##$DPNAME7= <>
##$DPOAL= (0..7)
0.5 0.5 0.5 0.5 0.5 0.5 0.5 0.5 
##$DPOFFS= (0..7)
0 0 0 0 0 0 0 0 
##$DQDMODE= 0
##$DR= 18
##$DS= 0
##$DSLIST= <SSSSSSSSSSSSSSS>
$$ [...]
##$SUBNAM2= <"">
##$SUBNAM3= <"">
##$SUBNAM4= <"">
##$SUBNAM5= <"">
##$SUBNAM6= <"">
##$SUBNAM7= <"">
##$SUBNAM8= <"">
##$SUBNAM9= <"">
##$SW= 24.9337058887773
##$SWIBOX= (0..15)
0 0 2 0 0 0 0 0 0 0 0 0 0 0 0 0 
##$SW_h= 4990.01996007984
##$TD= 16384
##$TD0= 1
##$TE= 0
##$TE2= 300
##$TE3= 300
##$TEG= 300
##$TL= (0..7)
0 120 120 120 120 120 120 120 
##$TP= (0..7)
150 150 150 150 150 150 150 150 
##$TP07= 0
##$TPNAME0= <>
##$TPNAME1= <>
##$TPNAME2= <>
##$TPNAME3= <>
##$TPNAME4= <>
##$TPNAME5= <>
##$TPNAME6= <>
##$TPNAME7= <>
##$TPOAL= (0..7)
0.5 0.5 0.5 0.5 0.5 0.5 0.5 0.5 
##$TPOFFS= (0..7)
0 0 0 0 0 0 0 0 
##$TUNHIN= 0
##$TUNHOUT= 0
##$TUNXOUT= 0
##$USERA1= <user>
##$USERA2= <user>
##$USERA3= <user>
##$USERA4= <user>
##$USERA5= <user>
##$V9= 5
##$VALIST= <valist>
##$VCLIST= <CCCCCCCCCCCCCCC>
##$VD= 0
##$VDLIST= <DDDDDDDDDDDDDDD>
##$VPLIST= <PPPPPPPPPPPPPPP>
##$VTLIST= <TTTTTTTTTTTTTTT>
##$WBST= 1024
##$WBSW= 4
##$XGAIN= (0..3)
0 0 0 0 
##$XL= 0
##$YL= 0
##$YMAX_a= 265014
##$YMIN_a= -85426
##$ZGOPTNS= <>
##$ZL1= 120
##$ZL2= 120
##$ZL3= 120
##$ZL4= 120
##$ABSF1= 10
##$ABSF2= 0
##$ABSG= 5
##$ABSL= 3
##$ALPHA= 0
##$AQORDER= 0
##$ASSFAC= 0
##$ASSFACI= 0
##$ASSFACX= 0
##$ASSWID= 0
##$AUNMP= <proc_1d>
##$AZFE= 0.1
##$AZFW= 0.1
##$BCFW= 1
##$BC_mod= 2
##$BYTORDP= 1
##$COROFFS= 0
##$CY= 11.3945322036743
##$DATMOD= 1
##$DC= 2
##$DFILT= <>
##$DTYPP= 0
##$F1P= 16.9975609425685
##$F2P= -3.02152046262296
##$FCOR= 0.5
##$FTSIZE= 0
##$FT_mod= 4
##$GAMMA= 1
##$GB= 0.15
##$INTBC= 1
##$INTSCL= 1
##$ISEN= 128
##$LB= 0.24
##$LEV0= 0
##$LPBIN= 0
##$MAXI= 10000
##$MC2= 0
##$MEAN= 0
##$ME_mod= 0
##$MI= 1.114404
##$NCOEF= 0
##$NC_proc= 0
##$NLEV= 6
##$NOISF1= 3.799351
##$NOISF2= 2.8
##$NSP= 1
##$NTH_PI= 0
##$NZP= 0
##$OFFSET= 15.70392
##$PC= 1
##$PHC0= -9785.414
##$PHC1= 7.60082
##$PH_mod= 1
##$PKNL= yes
##$PPARMOD= 0
##$PSCAL= 0
##$PSIGN= 0
##$REVERSE= no
##$SF= 200.130013532006
##$SI= 16384
##$SIGF1= 3
##$SIGF2= 2
##$SINO= 400
##$SIOLD= 16384
##$SREGLST= <1H.CDCl3>
##$SSB= 0
##$STSI= 0
##$STSR= 0
##$SW_p= 3612.71676300578
##$SYMM= 0
##$S_DEV= 0
##$TDeff= 0
##$TDoff= 0
##$TI= <>
##$TILT= no
##$TM1= 0
##$TM2= 0
##$TOPLEV= 0
##$USERP1= <user>
##$USERP2= <user>
##$USERP3= <user>
##$USERP4= <user>
##$USERP5= <user>
##$WDW= 1
##$XDIM= 8192
##$YMAX_p= 0
##$YMIN_p= 0
$$ End of Bruker specific parameters
$$ ---------------------------------
##NTUPLES= NMR FID
##VAR_NAME=  TIME,          FID/REAL,        FID/IMAG
##SYMBOL=    X,             R,               I
##VAR_TYPE=  INDEPENDENT,   DEPENDENT,       DEPENDENT
##VAR_FORM=  AFFN,          ASDF,            ASDF
##VAR_DIM=   8192,          8192,            8192
##UNITS=     SECONDS,       ARBITRARY UNITS, ARBITRARY UNITS
##FACTOR=    0.0002004,     1,               1
##FIRST=     0,             0,               0
##LAST=      1.6414764,     0,               0
##MIN=       0,             -85426,          0
##MAX=       1.6414764,     265014,          0
$$ Real data points
##PAGE= N=1
##DATA TABLE= (X++(R..R)), XYDATA
0 0 0 0 0 0 0 0 0 0 -8 8 -8 8 -15 16 -16 24 -24 32 -40 45 -51 62 -72 81 -95 107 -123 139 -159 179 -202 228
32 228 -255 286 -320 356 -396 441 -489 545 -602 666 -737 818 -906 1004 -1114 1240 -1384
49 -1384 1550 -1744 1977 -2262 2614 -3071 3681 -4553 5905 -8296 13834 -56301 42205 98864
63 98864 -82764 -85426 32457 43756 -67848 -71950 -16178 -13948 -28764 20982 33282 -12736
75 -12736 -14210 43846 23934 -52461 -60518 -5683 8297 9717 39033 37205 -13970 -6942 49464
88 49464 26118 -54059 -30862 67070 70068 -3809 4845 74204 70639 15790 10125 23926 6275
101 6275 15017 68707 71918 18608 20385 75309 64156 -3899 -8391 43044 49239 22039 35453
114 35453 59795 43321 32044 54468 45807 -689 1755 56101 66151 27005 24853 58898 57161
127 57161 29436 30203 35183 15223 14542 49840 52841 14996 17338 60905 54838 98 -9291 30947
141 30947 39060 12270 14333 35746 27408 12076 24350 29916 3801 -6494 18741 29300 7033
154 7033 2084 23730 25975 5703 481 7823 486 -6124 9679 17698 -1419 -11912 6408 15691
168 15691 -3674 -17219 -6856 501 -6768 -8227 -2160 -5673 -9548 -3011 -3198 -17891 -23382 -8839
182 -8839 -578 -10842 -18569 -12661 -10259 -14032 -12980 -12831 -21111 -23181 -10224 -5170 -20314 -29142 -15152
197 -15152 -4802 -16156 -29123 -23421 -12353 -12553 -18060 -20348 -21285 -19712 -13920 -13964 -22345 -25419 -16528
212 -16528 -9618 -15255 -22860 -20376 -15045 -14910 -17490 -18387 -18834 -17463 -11760 -9622 -16069 -22258 -17644 -10088
228 -10088 -11035 -17692 -18436 -11694 -6824 -9433 -14539 -15890 -13167 -8684 -8297 -11235 -13057 -9811 -3839 -2908
244 -2908 -9210 -13484 -9956 -2657 -2638 -8501 -10045 -3118 2417 288 -5630 -7842 -4713 -331 1064 -2750
260 -2750 -4859 -36 7040 5661 -2625 -5286 515 5466 2679 -502 1760 5739 8054 7198 2865
275 2865 -1304 1392 7817 8293 2929 2589 9073 12406 7958 3673 3816 5524 6117 7998 8460 6571
291 6571 7453 12880 13496 6039 1814 6301 9896 7710 6716 9150 10992 10923 11671 9379 4151 2628 8216
308 8216 11345 7108 4975 10322 14431 10399 5228 4323 4995 5556 7483 8227 5844 6300 11752 12808
324 12808 4973 -784 3020 7511 4620 1807 5135 8194 8066 7528 5182 779 -1512 2164 5043
339 5043 1762 -549 5126 9442 5334 -351 -1044 311 -862 -809 853 587 404 4027 5351 -252
355 -252 -4918 -3196 -391 -2793 -4518 -1589 1439 1307 500 -268 -3677 -6876 -5329 -2526 -4037 -5944
371 -5944 -2489 1641 231 -3893 -5555 -5238 -6088 -5845 -4668 -4705 -4597 -1504 331 -3090 -7848 -7862 -4634
388 -4634 -5396 -7618 -6762 -3314 -1837 -2001 -3253 -5766 -7618 -6156 -4439 -6287 -7983 -4854 -431 -1302
404 -1302 -4583 -5777 -4812 -4925 -6106 -5902 -5068 -3793 -1723 -924 -2663 -5317 -4954 -3480 -3934 -5155 -4478
421 -4478 -2521 -998 -1346 -1792 -2954 -3393 -3190 -2688 -3353 -3563 -1988 94 609 -1047 -1856 -1721 -1384 -1584
439 -1584 -1370 -1643 -1393 -55 1816 1079 -1142 -1383 -31 502 -440 -1017 369 2343 2793 1235 -58
456 -58 4 1418 2051 928 477 1492 2812 3228 2264 1022 1508 2723 2588 1611 1550 2709 3817 3273 2362
475 2362 1671 1525 2286 3086 3039 2405 2612 3394 3831 2998 1867 2056 2757 3370 2921 2449 3107 3640 3835 2941
495 2941 1274 1286 2627 3271 2522 2506 2638 3004 2669 2493 1920 1615 1550 2216 2765 2145 1637 2692 3283 2147
515 2147 488 156 1320 1875 2171 1625 1483 1803 2535 1474 -84 -796 789 1863 834 188 1290
532 1290 2201 1334 -424 -873 -547 -82 93 97 66 -9 768 943 -465 -1254 -1188 -749 -1027 -801 -405 -229 99
553 99 -114 -384 -1596 -2406 -1327 -573 -968 -1308 -1200 -442 -200 -1260 -2225 -2104 -1899 -1513 -1653 -1170 -717 -565
573 -565 -827 -1631 -2217 -2299 -1854 -1363 -1146 -1332 -1195 -1328 -519 -926 -2029 -2500 -2086 -960 -778 -1340 -1559 -498
593 -498 -366 -972 -2182 -2102 -1324 -511 -906 -1456 -1296 -147 -327 -1057 -1556 -1515 -903 -534 -930 -1268 -537 339
613 339 26 -844 -1301 -1051 -454 -271 -295 -293 -305 49 234 -23 -826 -652 26 407 -51 2 100 526 348 9
635 9 149 -70 90 755 912 525 121 629 1134 387 -388 72 835 850 865 954 1197 1023 1256 1041 125 76
657 76 757 1365 862 528 1162 1339 1222 621 453 827 858 921 1336 1152 993 1456 1375 913 157 389 1165 1190
679 1190 584 1331 1395 1176 492 1445 479 419 763 1425 1026 826 989 1606 706 232 629 944 229 252 1107
700 1107 1272 388 709 986 565 226 151 667 358 264 1070 921 148 121 504 177 -756 -235 586 679 -212
721 -212 293 404 -15 -645 23 158 -501 -515 283 343 -433 -264 185 -63 -1141 -521 147 -243 -647 -64 263
742 263 -519 -945 -280 -80 -1122 -1049 107 -73 -368 -507 -213 -616 -889 -822 -289 -331 -855 -104 68 -344 -732
763 -732 -353 -907 -987 -770 -380 -925 -393 -195 123 -590 -1176 -555 -156 -966 -1092 -121 306 -651 -568 -67 -329
784 -329 -782 -1203 -623 -710 -761 140 309 -707 -693 -106 -96 -832 -967 231 113 -528 -450 219 6 -538 -218
805 -218 58 -695 -659 20 172 26 -8 549 -171 -416 -520 114 -311 -248 260 673 -188 -360 -202 226 -186
826 -186 -397 328 519 48 280 678 112 -32 -283 146 -98 -164 251 594 218 341 446 575 -492 -332
846 -332 606 172 -212 453 351 348 49 310 376 -48 -331 -117 731 311 86 651 303 222 -12 212 -119 -54
868 -54 284 621 287 232 428 269 276 -46 219 322 160 424 470 566 188 385 369 60 290 188 184 268 292 553
892 553 247 26 217 565 99 -37 221 69 290 322 421 283 29 51 122 -36 -79 -160 266 -65 -15 -125 5
915 5 136 -286 -136 179 139 12 282 -179 7 -192 -248 -379 -292 36 -451 142 137 -213 41 -71 -52 -65 -232
938 -232 -220 -142 -54 -33 -193 -387 167 -306 -254 -142 -615 -559 -82 -123 -230 -432 -247 -327 -64 -345 -128 -30 -445
961 -445 -9 -144 -255 -61 103 14 -170 -304 -167 -131 -397 -75 65 -279 -145 -156 -132 185 69 -181 -105 -254
983 -254 -219 77 -228 -310 -87 -388 -146 -283 -52 -70 -100 -58 114 48 48 -136 94 -44 -23 156 31 -211 -194 -69
1007 -69 59 133 15 250 -45 187 18 197 -129 -125 462 454 191 -110 361 -16 -114 -432 261 383 333 565 517
1030 517 109 -37 228 470 78 -6 230 398 -22 118 347 10 62 155 -62 263 -192 134 282 167 133
1051 133 6 139 -43 214 151 284 118 242 458 343 72 177 0 87 14 42 332 190 -250 315 87
1072 87 -8 82 425 188 -71 308 550 101 332 180 -48 231 -272 162 130 242 97 197 264 19 326 -9
1094 -9 -110 -218 -138 233 45 -93 7 166 298 -129 38 -32 28 -71 123 -180 35 -35 -142 -86 -143 -288 -155
1117 -155 26 -142 27 -258 -263 -70 -92 -107 -320 -403 -116 71 59 -159 17 -460 -421 183 -288 -196 -35 -159 -47
1140 -47 -289 -264 -162 -162 -262 -340 -100 -67 -243 -46 -271 -311 -57 28 -265 -207 -47 -80 184 -140 106 -101 -301
1163 -301 -126 -18 -163 17 4 199 -70 -99 219 -20 -26 -309 -6 -190 189 -112 -11 -14 107 -107 -121 -94 -84
1186 -84 -104 329 -85 -188 145 -175 181 -125 -47 -43 -190 -90 70 -10 -69 37 -11 110 -57 4 179 41 -103
1209 -103 30 196 280 113 9 34 52 31 -73 357 138 -112 6 -253 359 -188 -110 227 148 322 38 102
1231 102 178 278 191 226 -13 218 105 36 -37 69 176 346 71 148 278 625 126 -48 86 288 223 -43
1253 -43 -261 -63 109 -5 118 69 77 98 -129 165 24 -145 33 489 119 281 162 3 -10 90 58 181
1275 181 188 -262 67 -38 -86 204 -277 141 -9 -39 -167 78 -35 -20 -71 38 58 54 45 144 16 -84 -169 109
1299 109 -275 -84 -75 -77 -166 83 105 -83 -353 200 138 -135 -152 -139 -81 61 228 -83 -38 109 64 65 60 50 -178 -102
1325 -102 -145 -195 18 -33 84 21 169 98 -31 -116 19 -145 -233 126 -94 -365 -197 150 -230 6 -27 -205 120
1348 120 -159 65 -65 -92 -67 16 -78 -158 69 -99 180 75 -239 -107 -136 -252 78 -7 -155 -108 300 -222 -66
1371 -66 -232 -121 -10 180 -18 237 57 -71 -71 -237 269 -1 243 -160 -2 194 450 -83 54 289 81
1392 81 8 32 18 197 120 54 -253 -51 230 141 -34 -90 361 40 -45 171 -148 -448 207 241 -63 128 332
1415 332 164 -78 106 59 54 -143 -25 123 -7 -87 296 17 42 194 -78 96 17 -99 60 182 -42 -31
1437 -31 140 218 78 54 39 162 221 217 -25 170 53 222 51 -68 195 -62 -8 -127 100 209 64 161 159 26
1461 26 -5 -97 -224 -4 178 172 381 286 -142 36 -28 244 154 -198 63 381 -136 -26 -160 -56 -196 -17 -168
1484 -168 -176 93 -174 143 149 -51 -191 -133 72 112 -119 -152 -198 138 97 19 148 128 -174 -106 -27 86 -37 -76 315
1509 315 -174 -27 -370 -120 -270 -39 119 222 -129 104 -133 -122 132 -278 -72 128 141 67 -42 16 -133
1530 -133 -25 -3 92 31 -41 183 21 111 106 -59 185 63 -150 -209 -106 163 101 163 -104 -251 -47 78 -44
1553 -44 -3 -120 166 -78 -32 -23 -308 237 -111 -295 -173 -250 -300 139 -232 -465 170 202 127 -6 -365 118 -222
1576 -222 26 20 -117 75 189 -105 -35 207 110 98 -48 54 -201 106 -126 81 -71 84 33 -128 -130 86 100
1599 100 96 -90 -4 -170 -26 41 -265 346 -1 -2 -236 -42 148 -292 -98 -50 -35 211 182 54 165 -69 -171
1622 -171 20 37 -55 63 163 59 153 -108 28 13 213 -77 447 250 -181 173 44 -47 -224 -298 -83 -130
1644 -130 -205 134 72 111 140 -94 273 10 -42 4 123 111 22 -30 331 92 -63 -118 146 80 244 -195 163 33
1668 33 -43 242 87 -97 -222 -137 -59 -8 -277 121 61 -26 2 -134 -104 279 85 99 -203 -102 25 -26 6 -151
1692 -151 -370 -55 -167 13 -137 146 -151 8 -4 48 18 8 -17 -72 155 78 -71 213 -85 -289 -22 56 -342
1715 -342 -99 52 92 235 21 -147 -30 30 -17 -305 -50 -376 150 -121 147 80 223 53 11 90 51 -246
1737 -246 90 -33 -149 -16 -173 27 -251 -89 -216 -22 -77 25 143 233 -116 0 187 -190 -82 103 56
1758 56 119 61 120 109 111 50 1 9 51 -189 -104 108 5 148 133 149 197 22 -189 47 159 216 -43 -225 -81 296
1784 296 -121 -314 58 74 -56 35 -93 -161 25 -245 18 -73 -6 146 -152 151 124 -174 140 -73 100 -117
1806 -117 67 70 46 -20 -86 18 -141 150 194 -20 -96 -155 27 145 -33 52 80 236 166 0 -303 -56 25 60
1830 60 27 -106 146 34 -190 134 166 -61 -9 61 -161 -53 -367 175 203 221 91 -155 -232 -215 51 102 248
1853 248 -80 -46 80 -96 149 -490 -198 98 -36 -242 17 -73 151 277 98 84 291 -118 228 -202 -74
1874 -74 168 54 25 55 -22 70 200 152 55 61 -122 72 -234 -243 -61 -129 -132 241 93 121 -105 -75 94 89 136 91 -93
1901 -93 -158 185 -244 40 77 -41 54 6 -21 -110 -67 147 -24 -316 215 -68 157 -197 -1 25 -156 161 -163
1924 -163 -357 -125 46 332 218 170 221 204 -136 58 -115 197 -20 253 -96 -178 -372 167 57 85 22 -21
1946 -21 -86 175 237 150 240 -84 -51 137 167 335 7 -32 -140 173 -340 -79 224 -1 -95 -182 -79 195 158 -118
1970 -118 -156 5 -79 93 -247 -157 65 31 88 -185 279 4 281 329 222 -84 31 23 150 279 -154 -260 1
1993 1 -143 78 -65 -33 -11 19 -87 38 267 137 -120 -89 -121 -4 110 93 -212 -178 -4 -128 -53 224 57
2016 57 -274 -166 -34 33 -410 127 143 -273 171 -28 -43 -82 -126 -173 12 -254 -66 225 92 346 -241 300
2038 300 -110 -131 50 78 151 -248 -65 62 -24 -160 -148 -67 -297 109 16 67 222 -254 -85 38 190 -44 294
2061 294 69 -19 143 -168 61 -223 204 -138 -88 -142 31 -254 169 -86 -30 17 -63 30 -204 234 -211 105
2083 105 143 -83 -126 141 -21 166 -145 -55 54 -113 -45 19 -128 86 -108 205 149 -125 354 -128 113 161
2105 161 -112 -102 218 -432 -146 -50 -82 357 18 -49 170 -227 -81 -118 -66 9 -123 -222 10 264 -134 -163 87
2128 87 156 45 141 382 -256 -23 253 -27 -71 -171 91 -65 176 -111 -39 108 191 169 -259 -265 167 -103 -33
2151 -33 3 -123 -10 -191 -219 -11 -213 154 -23 -329 -97 63 -221 -102 180 -80 -17 284 -4 29 101 -87
2173 -87 304 138 -202 35 38 -114 29 -193 -105 -129 123 -137 74 79 -60 302 -96 -65 10 -112 43 26 -168
2196 -168 -6 -84 -54 -202 -210 102 107 -216 566 -175 -20 -47 22 116 -314 52 -44 -147 198 -143 214 12 72 182
2220 182 61 -6 -11 -77 29 217 -94 -20 -123 -49 3 -163 7 263 -87 -64 408 315 -2 -62 271 -155 8
2243 8 -256 -76 211 -49 61 -209 228 44 -68 -148 -233 95 76 27 -58 14 -96 39 209 -98 -158 -224 -15
2266 -15 51 -119 24 193 57 -4 23 159 287 -153 -362 57 52 -48 -147 -37 144 -37 -146 372 -259 166
2288 166 423 -68 164 45 248 275 227 187 -76 -56 152 65 -85 34 -64 -46 207 -289 90 -13 -68 -310 25
2311 25 -240 28 -112 -100 -154 -48 71 94 -1 10 36 -136 -11 -81 57 83 160 148 -126 120 -164 -127 -114 -91 -38
2336 -38 104 -29 -111 -229 -55 -44 74 -43 -2 106 -88 59 -262 -3 217 167 -95 253 105 78 -71 -202
2358 -202 -11 18 84 -63 -52 -35 -14 -174 -65 -198 -31 -195 -69 -84 -64 -104 -80 -112 348 -340 416 204 -56
2381 -56 -23 -34 -261 18 134 253 18 -70 -37 -184 435 46 105 84 -158 -97 6 -191 -389 225 153 25 -289
2404 -289 -46 -205 -50 80 -78 -152 122 -64 319 -89 -3 -38 206 -302 65 103 -164 -24 -151 65 -80
2425 -80 102 -103 -22 -116 74 -279 -33 -143 85 38 209 -208 -387 -420 -135 53 -67 172 260 -58 -51 0 237
2448 237 122 -62 104 -138 -219 -66 -86 61 196 56 101 59 32 -55 -191 227 103 -74 -53 4 46 34 244
2471 244 12 133 -93 38 -35 -134 87 134 -93 -143 -217 -162 39 149 194 28 -128 215 150 -131 181 -109 -73
2494 -73 -89 24 -14 -167 -16 286 -31 203 70 -149 -95 -116 165 -286 56 6 -35 46 -212 -154 -5 -201 226
2517 226 345 53 133 30 49 137 78 -210 -36 -120 -58 60 104 -135 125 1 342 -206 -109 84 -88 -94 -263
2540 -263 -106 -26 431 135 91 100 -53 117 1 50 68 -251 -20 -194 14 -51 332 155 -141 -98 -67 200 208 45
2564 45 -31 40 -147 -36 153 -188 103 146 -36 -28 122 199 81 87 32 22 17 62 -252 176 334 -74 45 154 -1
2589 -1 -18 -5 317 -1 45 142 115 291 -121 136 155 105 195 36 -153 -164 -9 28 -285 -204 -92 104 130 200 41
2614 41 204 172 -31 -99 -77 -159 -277 200 18 85 151 111 -51 -71 14 15 18 -66 -52 94 -7 32 -80 13 -135 -46
2640 -46 181 -51 -261 -163 2 29 -86 -84 106 16 167 -209 -15 -196 -55 -177 -37 -66 79 116 -78 241 -5
2663 -5 160 132 133 -12 -122 -135 -221 19 -260 -17 -25 144 140 165 -251 -77 12 -72 232 -106 175 -166 152 85 -117
2688 -117 -184 162 377 -18 68 -111 18 168 79 170 197 -84 -103 -168 -166 -154 43 10 333 37 9 377 -27 -13
2712 -13 79 -17 373 -254 -296 174 -18 -21 -103 34 -85 -194 -45 209 175 -243 52 199 -53 -64 -100 187 -28
2735 -28 243 88 171 -130 148 92 7 -5 63 -219 -108 92 -58 -5 -58 160 35 104 -164 -317 -82 -40 134
2758 134 -27 137 96 57 -45 -83 -81 -150 68 149 -100 92 99 133 133 -3 69 -92 -44 -69 -31 -239 -137 123 -43
2783 -43 109 -128 277 126 143 -13 -116 -324 33 -118 -207 140 -35 -37 -312 199 96 17 -61 63 216 33
2805 33 -174 -75 54 -19 -78 -72 12 233 -49 221 -16 123 200 189 -41 -74 -168 -7 -158 61 255 14 11 204
2829 204 193 155 -198 16 56 8 50 56 138 159 -27 305 243 15 -169 -48 169 139 96 217 60 -47 -84 145
2853 145 106 257 10 -296 245 32 90 -41 99 233 -176 51 193 -84 201 57 16 199 -210 -98 55
2874 55 -51 -2 -120 -226 27 89 -57 -64 237 98 -58 -26 237 65 -176 130 148 83 -31 -81 254 -313 65
2897 65 337 272 -200 -98 380 70 114 23 3 -76 -286 93 -79 8 -54 -80 194 -38 1 208 -58 148 -200
2920 -200 80 -194 13 24 -57 -135 38 -122 -19 171 -123 -52 -133 127 -70 -25 6 44 -189 -13 -72 10 256
2943 256 201 -88 -79 -210 -80 139 -140 68 249 -16 68 99 -334 130 35 -47 -37 38 -168 -225 -92 93 -307
2966 -307 -135 -215 -90 41 -97 -266 76 80 31 37 -320 304 -41 120 -174 -83 -307 -61 -72 -209 163 -36 -82
2989 -82 -89 -15 21 72 -231 -279 45 218 -2 -120 -194 87 -33 -85 233 55 -52 -57 -44 -179 -224 158 72 211 6
3014 6 33 48 233 204 123 -60 14 -94 -125 93 -42 114 -32 -58 177 216 -157 178 214 -36 292 276 194 -122
3038 -122 -50 17 -254 73 -29 -61 -464 -213 34 -63 -65 -409 49 -242 3 -152 107 98 -84 -33 11 0 -34 -46
3062 -46 292 193 -129 169 66 142 -168 161 -164 -173 173 63 -56 -42 -230 226 266 153 -121 -45 -116 81 -70
3085 -70 -133 -127 1 -110 -8 17 152 100 194 107 -75 106 -89 -30 16 -128 -20 60 45 -81 163 -69 -153 7
3109 7 77 109 -210 160 39 -67 8 -341 -295 -122 197 49 65 112 84 102 131 -18 -26 -399 30 -213 -234 107 110
3134 110 -128 129 -11 -121 -164 -181 164 -263 164 -260 -85 -155 -65 -242 174 -347 21 -23 -153 13 -51 -104
3156 -104 69 -35 260 45 265 -39 -94 -256 99 204 80 129 -86 -202 90 -87 -108 182 -52 -75 349
3177 349 -12 41 0 -228 -45 -24 36 -132 -41 99 145 -100 110 167 -184 -160 -143 25 13 265 18 -147 175
3200 175 -253 66 -58 11 -4 -127 144 93 -14 -72 -171 -62 17 -163 -97 136 -33 57 -86 92 148 111 33 -4
3224 -4 -121 -78 -142 44 -56 223 63 281 -22 -107 -30 5 -9 -266 -73 -77 98 36 -19 -56 -255 -155 215 -158
3248 -158 54 84 44 42 65 68 -79 105 187 38 -159 -109 278 -100 192 14 -8 -106 -65 -315 -56 -51 -7 101 -120
3273 -120 -110 22 -7 -64 -252 32 -199 -12 320 31 32 -61 -219 -122 187 -125 -184 -71 87 33 -92 -47 187
3296 187 155 -154 -126 -99 92 -27 -154 -52 -297 -255 109 33 -193 -125 9 79 -135 114 -217 193 72 -11 276
3319 276 125 -107 -59 70 -33 148 -8 -43 -87 -24 -1 -138 68 -60 -222 -55 -72 -40 57 -174 -141 183 -259
3342 -259 56 -261 -1 -184 -107 -45 -82 78 16 224 40 401 77 -49 200 -114 -209 227 -110 170 -56 278
3364 278 -12 -24 -231 -82 -50 160 -3 171 -295 -130 125 280 -362 -169 -107 -172 -31 -98 32 220 256 -43
3386 -43 -80 -9 -93 31 28 -40 113 32 139 -3 67 -120 110 -188 -216 -8 -440 33 -260 159 31 83 -79 -37
3410 -37 -114 60 -94 -265 -109 14 156 136 167 29 -98 167 40 142 50 41 -123 -312 -128 127 167 135 -20
3433 -20 -49 323 40 61 -273 190 -137 -29 -10 29 16 31 -202 65 219 25 -30 97 -69 22 155 39 157
3456 157 -13 176 -108 -41 66 77 82 -202 173 -3 -3 194 13 148 -181 -165 154 23 -143 -346 -188 -12
3478 -12 187 183 -34 21 132 -156 -149 -53 -184 45 -257 -93 -155 109 186 200 19 235 226 -5 57 -317 -50 -204
3502 -204 -274 386 58 32 67 -91 -3 60 168 -152 154 -112 -143 -305 -25 -138 106 138 -310 -151 48 -237
3524 -237 357 137 230 -40 290 -271 151 0 -79 108 -318 -113 -333 -31 -228 39 -76 326 163 -136 344
3545 344 -53 -389 -73 -154 113 -139 71 15 -49 137 310 71 -40 7 -144 -259 -36 50 235 -82 -134 -127 -93
3568 -93 319 215 21 137 -310 150 -178 8 -272 -232 -277 -15 6 -177 -71 135 -19 -96 -265 113 -62 -166
3590 -166 36 -202 152 318 -43 -18 -77 204 -189 -105 -177 -158 -89 150 39 208 127 -141 -28 -70 182 -122 141
3613 141 -73 183 12 202 93 7 -26 30 92 -67 47 34 192 1 -47 387 317 78 -58 164 194 79 -105
3636 -105 -49 224 -289 -13 -191 349 -57 -23 -4 -309 -11 -54 236 47 125 -144 21 -12 -31 114 -48 57
3658 57 76 179 -112 116 38 -130 16 141 30 -87 69 -38 216 -133 -17 -135 -8 -26 24 99 -99 158
3680 158 108 -172 140 -174 -41 -111 21 -263 382 -16 -79 -303 -252 -218 43 87 50 -88 -113 115 204 123 -213
3703 -213 184 -119 12 -3 222 194 -33 78 415 -13 248 109 75 260 -114 -88 21 80 74 23 175 119 -38
3726 -38 -244 34 -69 63 -70 97 -313 4 4 92 -47 -44 263 -42 -245 138 -58 -105 -25 129 -154 -18 56
3749 56 35 279 -211 66 -3 98 205 111 -165 206 16 116 -20 332 -295 76 -34 146 -137 407 -53
3770 -53 -122 150 219 181 38 -224 -201 32 136 -35 -175 -1 16 149 -55 24 52 164 172 -7 -315 -23 129
3793 129 200 7 81 -187 -131 -150 78 -143 -87 360 152 -74 -121 483 -169 -110 284 168 76 -72 69 71 140 277
3817 277 26 -330 -107 237 -121 87 269 244 349 259 72 11 196 0 -3 -152 -330 -139 -81 169 -147 74
3839 74 271 -39 -47 -362 2 61 -113 61 -240 -200 37 79 -120 -188 384 -21 -89 -171 2 -163 -172 89 -36 -145
3863 -145 -96 -58 119 -79 325 96 66 -98 -20 344 281 180 -38 -18 259 95 -165 -184 -229 161 -97 142 -66
3886 -66 -166 47 114 -21 38 -99 -274 -112 -48 -34 -120 73 33 -83 -173 -15 -129 69 -79 -73 29 148 -19
3909 -19 29 18 67 179 -198 148 -25 -8 171 79 133 51 369 20 -1 0 261 224 243 -39 -94 -79 182 180 -41 167
3935 167 -242 123 -2 154 247 85 124 3 101 164 -35 206 -368 -51 4 47 4 337 45 -59 154 -79
3957 -79 -455 -219 -283 -84 -59 -54 70 -201 -268 -203 -197 -95 183 -55 -311 -209 -222 -459 209 168 -282 77 -261 95
3981 95 -25 1 -367 -74 164 -94 93 -68 -138 -92 165 -90 -121 204 127 125 29 22 88 137 -157 -176 -56 232 40
4006 40 41 61 -96 -4 76 -123 -45 358 6 -150 -127 -83 -240 101 -360 106 -19 262 -89 -286 40 -87 -68
4029 -68 112 255 124 -91 -5 154 -114 -49 12 -252 132 -160 169 -198 -43 220 162 -60 -90 -67 62 186
4051 186 249 -114 -43 -62 8 16 -90 126 80 32 -211 -163 224 226 -81 224 129 27 -14 -17 -57 19 -43 60 3 392
4077 392 328 227 -223 -54 71 -153 68 72 -7 39 74 -210 -120 -64 269 -37 35 -49 -211 142 -137 44 -50 112
4101 112 -186 -66 13 -12 47 -214 235 -98 -48 -135 149 -24 109 -171 104 -145 -314 215 -85 139 0 120
4123 120 -145 -273 129 -206 -168 44 -54 -52 129 81 -110 65 -146 -38 143 -158 42 -171 -47 -186 -178 28
4145 28 -22 -37 154 -29 -57 -194 -17 207 -158 173 128 245 -389 -78 4 -5 -108 -171 23 -199 15 -13 -296
4168 -296 95 268 60 -65 94 218 -136 8 109 -6 227 87 169 165 219 252 -390 138 -19 -168 153 241
4190 241 -55 -39 -144 79 38 -53 -107 15 -28 -6 203 172 35 -110 46 -365 228 1 -121 -7 244 -137
4212 -137 -295 150 217 108 -108 245 -312 -153 -29 118 -230 203 -138 -20 -242 18 160 -6 126 195 172
4233 172 237 -268 -11 185 73 44 59 -129 -118 -105 108 256 111 -217 -21 -153 111 -46 -105 203 -34 276
4255 276 203 154 -123 222 17 59 49 106 109 -186 248 21 -228 143 -104 24 -68 100 -52 -164 127 214 72
4278 72 90 -73 -61 390 -64 -516 -117 -40 171 50 -96 197 18 19 44 -70 122 156 142 -33 -229 91 -32
4301 -32 124 -6 198 160 234 103 144 -173 -56 -198 0 222 -249 -74 -39 17 41 -24 -222 -128 50 117 24 141
4325 141 231 22 69 -65 199 160 91 73 -14 -63 -20 -130 -128 202 -117 -14 37 191 -17 27 -37 -185 -117 -112 -115 137
4351 137 21 94 -282 205 -163 -63 -34 34 -176 220 54 -53 -379 365 19 -170 167 -98 -2 201 22
4372 22 110 42 109 264 -36 -38 -22 56 379 131 29 97 30 53 19 251 343 -212 124 -80 -345 126 -104 87
4396 87 -174 -114 -287 295 77 165 116 67 -115 64 252 18 -7 -120 84 -188 136 131 162 99 -108 33 -112
4419 -112 4 -108 79 -190 -172 93 36 151 162 192 15 -21 -75 -76 -72 -98 31 -23 -185 -193 -105 23 -12 -108 -83 -225
4445 -225 -249 47 -90 -51 -107 -266 169 -214 -64 114 -72 77 113 204 263 182 141 37 52 -213 -33 85 -66
4468 -66 56 8 -35 70 38 -62 -50 105 171 -28 -89 -123 -52 -119 -31 4 -150 277 15 144 10 44 -166 -130 240
4493 240 -114 298 90 16 21 -130 -264 -26 130 -287 126 101 -119 -65 202 -120 27 101 415 7 -96 -12
4515 -12 -71 -105 -190 -200 55 51 111 13 93 -202 -29 -22 119 -90 79 -13 -108 120 0 -41 -168 45 1 -11 -18 84
4541 84 -136 61 -5 -88 229 38 27 8 26 163 -46 -188 -15 -310 -211 92 -188 169 -55 19 -200 -23 -117
4564 -117 -328 -122 -332 -53 -79 -138 104 -15 87 -85 246 -35 -138 -191 86 17 291 133 -16 -90 -201 -79
4586 -79 11 218 -177 175 -253 243 21 52 326 83 -135 4 -78 179 -108 -338 34 31 -48 -157 -11 -340
4608 -340 87 -94 -245 -12 158 -142 -39 -98 -204 142 -39 -50 -257 118 -253 82 18 58 -172 87 -108
4629 -108 211 4 45 177 191 301 -75 -177 -196 138 -60 125 105 -35 113 -144 -102 65 -184 -154 -189 -156 -56
4652 -56 162 -163 39 77 -22 -7 -64 -145 -228 -155 -26 -69 -57 64 164 322 214 -149 89 109 -69 -150 115 -23
4676 -23 54 113 214 -69 -332 29 -21 93 -345 184 -136 98 -320 118 10 107 63 -230 -27 89 -196 83
4698 83 -67 119 -223 -257 -26 2 -19 -219 50 238 169 222 -210 16 147 81 65 52 -92 -14 62 26 36 69 140
4723 140 -63 -175 -228 -347 -234 258 -10 -152 -9 135 -348 -121 -17 -3 -164 139 82 -66 134 65 -116
4744 -116 169 61 171 91 -227 204 -149 337 158 17 -94 -86 102 45 -115 -355 -207 100 233 70 80 -81
4766 -81 142 -258 -23 -288 -127 9 -72 102 -137 11 -147 -92 236 8 -374 260 -109 135 266 32 -115
4787 -115 -47 41 26 52 -60 -111 18 23 256 -138 -260 129 -43 -380 159 67 -171 -285 -78 108 -39 148 165
4810 165 -107 117 -260 150 -262 40 -184 -70 -110 -39 70 -199 -187 -27 107 -236 202 -28 -169 -76 97
4831 97 79 175 -215 -35 119 -21 -93 -234 -57 -149 193 44 -55 -84 -135 38 -109 -39 78 -63 -9 -125 42
4854 42 36 104 -164 -336 266 -94 193 -34 67 155 209 -35 -157 37 -107 114 -117 78 -85 100 8 -207
4876 -207 64 -248 -54 156 53 -29 106 -123 -17 206 2 -145 -27 -37 -214 -169 -30 91 -220 70 156
4897 156 38 312 19 -132 140 -7 -201 -83 64 -221 -62 67 226 -20 -174 6 93 -46 100 -204
4917 -204 256 285 27 208 188 63 263 351 -37 63 106 -100 -232 242 -172 3 -262 170 43 237 96
4938 96 54 152 154 80 -100 108 228 -185 97 -193 -65 84 -19 -133 -247 93 115 -1 76 222 -36 60 -135
4961 -135 -53 -17 -59 -216 -141 66 -52 -166 444 -101 -44 9 -232 178 216 -94 -53 0 -176 99 283 -35 -99
4984 -99 -337 177 -24 -282 107 77 -105 -161 -140 -186 37 14 -125 113 198 -51 -165 122 408 -153 86 -6 10
5007 10 100 -84 87 -7 245 -334 -3 86 13 164 -154 -51 14 -171 -16 28 -248 172 -31 -28 -7 48 8 224
5031 224 203 275 -64 141 146 125 74 -55 72 129 -186 -234 -188 120 64 -229 28 -97 217 8 -123 -238 -43
5054 -43 -23 99 164 -260 25 312 -73 -61 284 37 37 83 -73 -4 -74 -228 -204 -179 -61 213 41 70 63 22 288
5079 288 26 -137 -39 239 -80 349 61 200 4 46 -52 68 -166 68 212 138 32 35 -33 400 -30 -131
5101 -131 -140 73 -121 118 -243 -149 -35 -165 162 -128 -70 -82 32 -39 41 224 177 46 87 25 67 -156 -102 -218
5125 -218 -40 -154 -281 126 83 -142 -60 30 -168 -71 72 16 -78 53 -9 -178 -28 66 -104 -21 37 141 -130
5148 -130 7 116 32 208 198 22 -269 47 -14 123 -123 53 -165 -147 328 -129 -317 -121 -180 73 92 -92
5170 -92 68 -139 169 197 -21 116 -109 35 105 -228 122 -382 -52 -222 -239 211 131 190 106 22 105 146 160 -200
5194 -200 73 17 -3 120 55 83 -70 288 -202 125 206 -31 13 72 -37 143 125 -6 85 -66 178 -137 75
5217 75 -55 -114 398 41 -60 -254 225 24 185 83 324 189 191 21 125 97 287 -183 -83 134 -138 -63
5239 -63 33 -39 -261 42 -143 -96 35 -56 132 -129 240 -167 102 163 310 -202 52 -247 -65 -7 -71 201 28
5262 28 21 -119 -223 -157 61 66 140 314 153 -13 -74 -144 -64 27 -19 -168 -85 -171 24 154 -102 -72 -214 47 -77
5287 -77 -76 147 89 -142 -165 196 -186 12 132 -53 54 122 -28 69 52 0 -153 51 -292 130 158 43 -89
5310 -89 -93 -189 128 64 -166 212 49 258 -210 19 -147 -16 227 141 -74 -65 -56 -83 -178 188 25 27 -162 -189 150
5335 150 57 11 36 178 -434 67 378 20 224 -277 14 128 239 -40 -128 -41 111 95 7 -141 -16 -207
5357 -207 -106 229 51 58 150 -207 -82 -70 76 -23 -11 409 168 52 50 109 64 -139 201 -213 63 7 -277 143
5381 143 -11 86 30 -102 -222 296 107 -128 161 85 20 -98 -56 244 89 21 -150 180 7 -128 100 -12
5403 -12 136 171 -74 46 250 312 276 -341 306 -85 60 -95 11 285 191 -56 84 39 44 -329 -52 -37 -13
5426 -13 -82 -210 -30 26 28 22 188 223 -134 -82 103 -38 113 116 -240 12 132 -78 167 -26 3 51 -414 12
5450 12 20 149 269 29 412 -18 -54 34 -268 -200 -145 108 28 173 -58 -101 -77 63 191 15 -182 -135 -30 -37
5474 -37 46 98 166 -17 -73 170 -15 -13 -294 -77 -13 77 44 39 198 21 7 -7 135 167 42 76 -141 -125 126 -13
5500 -13 205 -123 -114 -151 -187 -168 248 -209 21 84 -22 7 -83 -86 201 126 -131 -59 -152 -57 -105 11 5 -154 34 36 -67
5527 -67 381 -193 -53 220 140 135 -51 177 -133 118 -365 -25 30 2 81 51 168 -20 -266 114 -130 -55 -163
5550 -163 -28 -40 -257 -53 33 -93 -39 260 -17 165 30 164 -188 -45 192 71 -30 -26 -103 166 271 -260
5572 -260 213 225 -175 -33 104 165 -6 114 270 -42 -94 -38 54 58 -199 362 18 74 56 38 34 69 -232 122
5596 122 -168 252 33 165 120 -129 -7 97 -76 11 225 80 -28 127 -179 186 148 123 143 -16 -61 272
5618 272 -125 -97 309 -63 68 -68 129 -109 150 -140 154 -157 -94 -235 64 1 -116 -147 82 -40 29 76
5640 76 156 165 394 -16 -139 102 -131 -247 -29 -302 -109 -15 -43 318 139 60 72 59 -11 -103 -53 -15 -45 -62 43
5665 43 -14 295 99 2 -105 -94 102 -61 -51 -113 281 133 -66 6 -94 3 -112 292 -118 89 -267 -253 123
5688 123 198 -182 -152 69 60 -231 191 -265 40 -109 -142 52 -15 -62 -141 -138 -6 -113 -210 38 -226 -200 -84 -306
5712 -306 -14 17 -79 19 -273 167 103 130 -241 73 281 -191 67 -62 270 -47 -310 -140 62 137 166 198 2
5735 2 29 148 -131 190 74 134 151 -20 58 -280 -161 -16 154 131 43 16 173 -130 -348 131 -72 -197 111
5758 111 37 18 180 -413 132 199 267 -63 181 7 43 81 146 -119 148 31 129 209 78 207 289 -141 -196 -219
5782 -219 -97 108 -159 276 -383 -107 11 -114 -76 95 -41 150 -67 28 -253 1 214 -183 325 -80 -108
5803 -108 -102 -89 132 257 2 381 -76 -145 125 -64 -208 -123 -16 31 50 23 -53 -154 83 -133 143 123 -146
5826 -146 -100 221 -41 -124 18 103 27 -175 104 -37 -135 11 -195 -217 32 -31 -27 146 -116 -124 -169 106 -186 -114
5850 -114 -345 63 -180 -104 -260 41 351 91 -109 -24 -37 167 102 35 122 -73 -13 115 -51 -140 127 179 -107
5873 -107 -40 -20 -1 -147 40 -51 -55 -195 -117 -219 10 -48 -1 33 -141 -133 -370 -203 -117 -121 -82 26 131 73 -13 -33
5899 -33 -120 128 265 -139 15 91 12 78 0 68 77 93 -7 -151 -43 -99 -258 -212 30 96 -30 160 172 -120 -100
5924 -100 4 -27 -136 -65 -472 -98 -22 -79 -102 70 246 223 10 -41 61 -24 -145 79 270 -9 233 117 -260
5947 -260 -64 -54 69 173 -6 -26 -139 -12 84 -211 -205 -300 43 -147 88 209 -81 193 110 -191 51 273
5969 273 -228 -113 -100 -136 -49 -56 54 -79 27 -25 75 27 17 173 -38 61 3 -101 33 119 -26 -301 -115 -155
5993 -155 -84 31 65 121 -152 84 -117 -388 274 -386 -224 -33 -52 91 -84 -33 17 45 -86 -108 -209 -227 -63
6016 -63 -69 152 162 46 90 239 -29 -35 -22 128 -56 -10 -79 310 -307 56 23 222 -150 -19 -30 157 -97 131
6040 131 14 -112 43 191 48 -39 -184 163 209 25 -78 -181 -63 120 163 211 -45 -36 19 -174 -253 224 3
6063 3 85 -217 2 -187 -179 -101 -99 303 15 36 -12 -23 -214 -36 -23 92 -68 -288 -227 -190 309 64 60 -62 84
6088 84 99 -83 -22 -116 -193 202 70 147 170 -61 -38 4 -121 -113 -17 -17 59 114 32 142 -60 -8 -91 91 -135 97
6114 97 -76 213 -83 -45 -8 -154 212 -110 61 -252 38 -61 142 -119 110 -129 -192 -213 -341 -85 -242 -44
6136 -44 -410 -81 -127 54 -11 -22 -22 -190 143 87 159 -150 364 131 59 4 -157 73 -35 256 -99 -237 -185 -48
6160 -48 -155 30 -19 90 44 8 -221 -341 367 -6 26 -37 -80 -38 109 -15 -316 120 -83 85 -29 -93 -239
6183 -239 441 -7 55 6 129 44 -241 -85 -24 268 98 217 -66 169 -209 166 346 61 -43 249 -62
6204 -62 -178 214 -147 -35 213 10 -245 -80 31 -383 2 51 79 -263 -63 -53 -156 17 -131 -52 -111 -149
6226 -149 -206 238 107 65 17 -93 149 91 -268 -51 -225 -131 -122 235 73 2 -20 77 193 16 -64 158 -67 182
6250 182 -64 -180 3 -88 12 -183 233 -134 -83 163 -102 -10 71 -31 -45 42 81 66 58 -282 -189 101 -114 -77
6274 -77 -36 -150 -136 87 -159 -94 -109 171 61 -195 -227 -137 -78 -16 76 -13 37 114 175 -210 -90 178 -65 43 -213
6299 -213 -121 131 40 -94 68 120 20 76 208 -53 377 -42 -196 -56 26 -196 68 210 -104 155 2 41
6321 41 13 182 -214 103 -115 -26 33 -141 90 133 84 7 24 -13 143 -66 229 14 -163 203 -183 144 4
6344 4 -254 158 196 292 171 -71 -159 -320 39 68 141 -104 191 -242 171 -79 -114 35 82 -85 71 -112 -109 -136
6368 -136 -42 91 214 251 -15 -184 -318 -36 -122 70 -56 -9 151 -172 -208 170 15 -115 136 -117 33 91
6390 91 8 120 -117 26 -253 67 -119 -275 -29 -70 84 167 -93 120 -223 121 -124 95 33 179 -67 -12
6412 -12 149 -44 60 49 -102 -36 -57 -51 325 -62 60 -126 94 -91 -36 -140 -53 21 189 -28 69 13 69 133
6436 133 -116 -91 -318 151 -126 -57 -110 -186 122 -20 -133 106 283 202 -208 -5 57 -133 -96 106 -52 -191
6458 -191 422 -253 161 169 29 -234 111 -189 78 -8 223 157 -3 -89 -52 117 -59 -11 -16 438 -169 -96 12
6481 12 -171 -1 176 14 -99 -306 185 -36 -166 51 -201 -183 282 12 -190 292 -59 -69 154 -120 144
6502 144 66 50 367 59 -339 100 115 -155 -52 0 -7 170 -197 47 -11 0 -87 236 -17 183 320 180 -197
6525 -197 -108 -30 270 166 -194 -101 -199 -74 -53 236 1 370 246 146 -77 -36 48 18 207 -97 13 34 -137
6548 -137 -82 -184 107 249 -109 6 -89 -216 -56 243 -177 -233 36 -52 38 -346 69 -37 53 22 -92 117
6570 117 -100 -558 117 178 212 -36 338 -188 41 45 -29 139 6 -258 215 26 27 86 -109 89 -250 65 146
6593 146 91 -59 31 -123 327 66 86 -96 148 50 -83 26 -1 -121 -57 16 -15 -103 -11 207 -119 -69 205 -161
6617 -161 117 153 141 172 -145 61 -48 133 -339 -230 -287 -108 -76 -32 63 80 -106 47 18 107 -96 -12 237 235
6641 235 -34 238 40 -79 -93 -172 123 -121 -202 -36 198 20 -34 74 90 -33 119 90 20 -40 -63 31 -53 7
6665 7 -65 150 229 122 -175 256 139 -128 122 124 179 102 -76 359 -57 -72 165 112 8 -318 14 -124 97
6688 97 -254 138 90 54 -82 -27 65 -103 -196 -347 -19 -104 256 53 62 88 95 145 -42 -107 -44 49 -4 -119 92 34
6714 34 188 129 -95 251 358 -222 49 -107 -267 -2 -224 -129 276 90 132 -52 -127 33 19 -68 -298 -224 21
6737 21 -79 221 -37 -217 110 19 -16 227 228 -26 -4 -108 36 35 105 21 -55 67 189 52 -122 -24 292 -18
6761 -18 190 300 67 11 134 159 127 55 16 -195 115 47 -239 -76 135 -136 -140 42 126 -76 -106 -39 -274 -139
6785 -139 325 49 55 98 0 26 -10 119 -314 245 137 373 -79 217 169 -34 -238 264 138 95 178 133 -81
6808 -81 -116 101 78 163 77 149 -315 -116 -152 -322 -171 -168 90 152 -53 -419 18 219 -224 122 -85 -125 121 -71
6832 -71 -176 -51 -13 -13 51 51 -199 330 100 89 -22 -307 119 -128 89 -59 6 6 -85 61 140 12 33 -140 7
6857 7 1 -63 126 -127 -441 -280 129 48 185 -45 64 -16 183 216 80 28 233 197 151 103 152 39 -341 189
6881 189 219 176 333 -78 -212 -179 245 271 -170 -195 -183 -87 226 362 93 -121 83 -111 -189 36 168 -153 23
6904 23 -157 169 -102 -191 68 56 123 205 232 66 124 -84 -115 136 -41 -90 -116 -71 52 -192 13 210 11 -25
6928 -25 68 -40 26 242 81 -148 -73 58 126 -431 191 -142 -43 126 -197 283 172 -44 -76 111 -14 -93 -9
6951 -9 77 17 -32 243 163 -43 102 140 288 6 3 9 189 41 -339 -21 -204 -119 -150 91 241 -17 -158 -21
6975 -21 127 156 -148 203 98 29 -138 -68 187 -131 -134 25 79 -93 -91 -84 3 -186 -428 20 76 39 88 -149 -22
7000 -22 -91 -145 -30 -192 320 158 311 18 76 68 -109 84 -100 135 -175 146 60 -20 156 164 207 -94 60 -51
7024 -51 -160 -92 24 -204 -232 37 -17 95 -91 -6 250 -155 165 204 -136 -23 -60 26 113 -56 98 -187 -57
7047 -57 107 56 -8 36 -162 130 1 -95 93 118 101 -19 -41 152 139 -180 110 170 -177 110 -43 -130 87 -52
7071 -52 -25 -163 -272 66 -283 -154 162 109 -47 156 0 103 -177 -73 -199 -80 -120 -251 -217 92 -26 -187
7093 -187 10 127 -52 169 -151 -13 29 232 151 51 240 27 219 59 -149 -226 234 106 -31 252 203
7114 203 133 166 -20 -87 -79 -191 -47 -218 92 236 -45 -24 70 233 -19 -26 5 212 274 -230 291 -135 -39 -90
7138 -90 269 -232 38 -82 -55 74 125 181 -253 45 74 -39 276 67 104 67 -114 -49 -135 -233 16 124 -53
7161 -53 -54 203 75 -50 58 0 228 -266 -60 61 -183 -93 -127 -46 -100 -2 -32 342 -110 98 32 -113 5 -58
7185 -58 -30 -187 164 190 75 -130 131 240 -383 -282 -114 232 261 122 59 -1 -150 322 -2 -62 301 -63
7207 -63 -87 32 19 -76 35 -125 93 405 92 131 -51 -3 127 77 -97 -81 110 -134 172 -87 -31 -8 -86 -192
7231 -192 -19 142 -297 32 109 -84 -103 167 -79 7 -223 -41 -114 131 130 5 -66 189 103 48 10 200 -94
7254 -94 37 -60 -178 13 53 209 -17 196 33 32 69 39 25 12 -292 252 -149 325 -32 167 -15 -85 -112 -166
7278 -166 56 -135 36 -153 -122 -82 -67 42 -358 64 156 -74 -3 -76 -190 50 229 -113 231 106 16 -24 -18
7301 -18 311 66 107 -153 -103 42 -1 20 261 259 78 57 261 52 218 34 -147 69 -197 -9 -124 -98 170
7324 170 -102 -100 -15 -51 -258 111 -252 54 5 -148 68 -38 40 -102 -4 77 30 65 -55 -114 63 -90 -73 31
7348 31 -167 99 21 85 20 -63 -146 -119 -18 82 -175 -223 38 -241 185 -348 -168 -100 349 80 -52 38 99 29
7372 29 -198 189 -278 172 110 -49 106 70 172 270 135 1 2 -273 26 -107 -159 -59 116 205 0 109 -56
7395 -56 85 30 227 139 72 172 -186 -42 -173 95 -95 -265 -80 -30 -133 149 -105 103 -65 46 -422 132
7417 132 -267 33 -60 -7 126 131 -60 -197 -42 244 -183 151 -16 -182 140 106 195 15 -83 -62 41 9 -91
7440 -91 54 -153 154 -72 -115 183 -67 -46 224 -143 19 247 171 97 -129 179 411 82 -149 41 -123 17
7462 17 94 -94 -103 -55 -302 -44 -159 98 -37 -20 -214 250 116 -13 -11 362 93 -99 8 -159 125 213 -126
7485 -126 -266 -108 -134 98 371 63 32 205 9 105 -86 176 -21 -17 123 -53 -79 -154 9 -68 88 -185 -22
7508 -22 229 -116 -76 -106 102 24 -48 -135 188 356 -218 64 -167 -38 52 -438 203 -239 119 23 11 316 -188
7531 -188 -149 -28 -142 266 44 140 -6 -260 317 208 -139 194 216 27 197 -78 4 68 145 84 65 15 -235
7554 -235 -12 48 -180 -336 -44 180 16 -70 -29 33 -34 84 252 307 82 124 -225 -78 -201 -59 73 247
7576 247 206 166 107 144 146 -234 271 116 -95 87 -34 131 208 -69 110 110 105 74 53 177 -17 -28 56 188 -77
7601 -77 -358 123 -212 -16 -162 -71 -77 118 -225 -214 -64 123 100 128 104 -241 233 -56 109 -122 42 220 -72
7624 -72 -16 322 -6 -66 -300 -137 -153 -148 89 -30 26 62 -219 -83 -193 -232 141 154 -42 -91 -42 -207 138 -139
7648 -139 16 213 -114 132 164 30 -40 -43 -90 158 57 127 -54 102 19 -50 64 1 269 50 -65 53 -84
7671 -84 -191 -145 100 144 -236 -78 430 -238 94 51 -174 -115 -145 -85 -15 -191 76 48 -236 -244 -96 25 -75 29
7695 29 296 -11 95 6 -20 154 38 -194 73 -9 -406 140 57 172 -263 -22 -102 -82 38 -198 -62 15 -324
7718 -324 109 -241 10 -57 66 -82 -126 -124 -105 -194 50 -188 -110 -56 -71 30 15 -11 -88 108 144 -374 102 -243
7742 -243 -103 -32 305 247 -22 158 -134 -21 -70 211 39 -153 16 88 31 123 -75 11 203 -320 -248 -89 135
7765 135 63 300 123 50 82 -36 -32 -137 171 74 111 161 -171 -31 54 36 -72 145 68 63 236 48 -328 -92
7789 -92 148 281 -110 -8 -51 -72 -49 -94 -101 -251 -143 5 129 161 16 -138 -97 63 30 196 224 53 99 202
7813 202 -111 58 -132 -269 197 -79 109 155 123 121 84 167 6 -17 -40 -85 354 -139 33 -64 -49 306 -174 -120
7837 -120 -36 217 93 404 -62 29 -27 2 395 42 -7 91 -82 170 249 -36 51 -150 113 -58 -75 94 -88
7860 -88 61 50 169 -3 -16 98 69 289 -141 205 64 138 -43 98 -94 29 52 282 21 98 -218 -111
7882 -111 -102 -306 16 -136 119 -117 114 -297 -24 43 -2 56 -154 464 -111 178 -104 -126 323 439 72 -104
7904 -104 -135 152 -148 -314 144 -293 66 177 -233 93 227 79 177 125 -6 -216 365 260 -85 286 17
7925 17 124 -221 -95 300 104 33 149 35 -161 9 37 -182 -119 -37 27 12 -92 -196 -17 -149 -132 -45 -51 138
7949 138 136 -178 -154 -10 144 250 100 126 46 -141 229 74 198 33 130 -170 -122 -115 129 248 284 -457 -355
7972 -355 -38 -33 25 -24 6 410 90 -45 -17 -205 -42 -12 -52 -5 170 -134 -33 139 -70 181 -161 138 -156
7995 -156 119 -25 144 -78 -175 223 21 -114 -112 -5 -155 -215 7 5 36 -34 -44 419 -91 113 -226 -92 76
8018 76 -33 -31 77 290 -98 -257 -82 6 -191 -12 174 -121 -182 148 -104 10 242 -58 169 291 -179 320
8040 320 -59 -26 -123 249 -68 -206 194 7 -261 -26 227 1 -221 -41 -87 304 -108 80 -33 -21 151
8061 151 177 141 131 121 -7 -2 119 -29 -91 102 -273 103 -28 -32 203 -424 214 209 350 -24 -145 -6 -38 -125
8085 -125 63 195 44 153 -118 21 64 94 2 -165 79 -134 -46 -166 214 129 -81 46 138 141 60 103 -159
8108 -159 -163 349 -93 -201 10 36 178 285 156 205 313 -180 -136 160 222 -89 -185 60 233 159 -418 133 -59
8131 -59 -238 355 46 -211 182 262 -102 42 14 -316 263 -24 61 -33 134 -43 -207 -38 -122 -183 -28 23 -517
8154 -517 67 -75 -93 -21 100 23 230 -50 -120 -131 9 -32 2 160 154 -61 -210 72 -77 230 102 -23 -245
8177 -245 -173 -190 -110 191 221 -103 19 10 129 -94 -206 49 117 77
8191G7
$$ Imaginary data points
##PAGE= N=2
##DATA TABLE= (X++(I..I)), XYDATA
0 0 0 0 0 0 0 0 8 -8 8 -8 16 -16 24 -24 32 -40 48 -56 64 -73 88 -103 119 -137 155 -179 203 -231 262 -295
30 -295 334 -374 419 -469 524 -584 649 -721 802 -887 982 -1087 1204 -1334 1478 -1639 1821
47 1821 -2030 2270 -2548 2879 -3273 3764 -4380 5191 -6309 7953 -10621 15695 -28805 134464
61 134464 265014 5687 -3749 116222 135687 7766 10891 88566 103085 64500 94063 98991
73 98991 50362 35091 85871 67538 -790 4578 80077 97351 76275 80717 74994 26988 27716
86 27716 77414 62753 -4899 25010 119022 110594 20842 19020 84850 73270 5128 1494 35467
99 35467 32919 33210 69922 63499 5045 -723 49747 39717 -24667 -22117 40049 47798 9777 12944
113 12944 37332 19052 -2707 12080 9458 -25322 -17791 36401 41406 -6562 -15991 16743 12753
126 12753 -22017 -23830 -8472 -17590 -18470 10647 10645 -28263 -30742 6815 161 -51220 -53196 -3881
140 -3881 6692 -26463 -30248 -7201 -12923 -32621 -24283 -15050 -35532 -43290 -16616 -4815 -28013
153 -28013 -35872 -15008 -13050 -36709 -41949 -28097 -28051 -33378 -20170 -12966 -31147 -41752 -23334 -14024
167 -14024 -32881 -43898 -27817 -16673 -24366 -28269 -22032 -22863 -27073 -22310 -20406 -30886 -33167 -17238
181 -17238 -9417 -21502 -29242 -20782 -15137 -19438 -20575 -18366 -22252 -22161 -10233 -5670 -19342 -26070 -11405
196 -11405 -1252 -13841 -25011 -14905 -1322 -3365 -11401 -12435 -10326 -7517 -3350 -3122 -9287 -10422
210 -10422 -891 4386 -2849 -9633 -4823 2410 1855 -1520 -1066 240 1967 5270 6263 346 -3314 2740
226 2740 10421 8134 1269 1906 9520 12861 8062 2849 3241 7991 11405 10527 7355 6924 10877 14797
242 14797 12769 6027 3603 8963 15944 14432 8084 7860 14242 17113 12361 6210 5872 11301 15196
257 15196 14027 9746 8719 12517 17025 13412 5164 4348 11817 15637 11481 7761 9910 13412 12977
272 12977 10058 5959 3439 7142 12674 11740 6302 5655 11871 12505 5836 1333 3233 6388 6784 7740
288 7740 7372 5163 5069 7834 6878 -129 -2971 3214 7340 4269 1858 3795 4982 3190 1347 -391
304 -391 -3634 -3730 2546 4732 -24 -2659 1702 4501 -1379 -6977 -6163 -3170 -1922 -569 -278 -2502
320 -2502 -3100 525 -514 -8299 -12258 -5607 -181 -2915 -5825 -3222 -360 -2729 -5729 -7589 -9544
335 -9544 -9626 -4902 -1819 -5247 -7492 -2800 -132 -5683 -11892 -10329 -6902 -6686 -6338 -4550 -4135 -5009 -3351
352 -3351 -3647 -8748 -12620 -8757 -3980 -5147 -6806 -3772 -1223 -3266 -6030 -6547 -8511 -9717 -6113 -2634
368 -2634 -3226 -5178 -2891 211 -2608 -7197 -8078 -5771 -4525 -3794 -2364 -1844 -2085 -232 528 -3867 -7675
385 -7675 -5653 -1465 -1226 -2897 -1931 1821 1857 -6 -2036 -3644 -4049 -1314 904 -14 -1402 1757 4282
402 4282 2682 -1707 -2307 -78 806 156 875 2524 3110 4410 3791 1442 -1047 321 2262 2178 1520
419 1520 2476 4595 5037 3460 2471 1679 1236 1924 2926 3181 2855 3761 5481 4621 2552 1726 2471 3093
437 3093 3415 3428 3545 3684 4297 4956 3755 1956 1959 3402 3801 3115 2229 3677 5101 4234 2483 1320 2441
456 2441 3543 3561 2110 2043 2809 3721 3714 1798 898 1701 2771 2621 1355 1403 2711 2899 1808 569 9
475 9 1019 1645 1812 1231 713 557 1191 1240 353 -454 -323 640 696 195 -171 -254 604 -66 -969 -1931 -1493 66
497 66 120 -792 -1006 -734 -575 -1571 -1804 -2022 -1912 -1881 -1277 -544 -1195 -2273 -1857 -1299 -2438 -3503 -3044 -1252
517 -1252 -916 -1214 -2337 -2388 -2028 -1911 -2515 -3595 -3587 -1943 -881 -1697 -2620 -1991 -1184 -1996 -3721 -3767 -2772 -2109
537 -2109 -1746 -1586 -2113 -1970 -1770 -2113 -3149 -3361 -2645 -1872 -1367 -1970 -1317 -1309 -1669 -1861 -2078 -2762 -2766 -1703 -554
558 -554 -889 -1483 -1499 -788 -706 -2079 -2460 -2018 -1021 -564 -737 -564 -568 -138 -485 -1192 -1689 -1209 -537 125 -293
579 -293 -33 -255 146 57 -391 -834 -1118 -403 950 906 -215 458 804 1098 401 -830 -101 929 1375 1038
599 1038 279 728 1646 1279 646 71 437 1372 1543 1120 776 1127 1482 1253 442 353 1044 1694 1370 1485
619 1485 1329 1438 1662 1307 1037 575 1100 1423 1853 1104 898 1372 1672 1190 794 699 837 1235 1668 1829
639 1829 1024 869 1273 1510 826 284 762 1623 1448 812 924 1099 889 769 859 479 441 1053 1286 893 318
660 318 493 1207 489 -214 194 688 626 771 734 395 -195 258 668 36 -578 199 672 548 -233 489 529
681 529 -186 -400 34 -68 -469 146 606 186 -641 130 446 -757 -1125 -438 378 -449 -624 486 -166 -626
701 -626 -413 -298 -866 -1197 -600 -57 -522 -699 -227 -36 -1143 -1066 -562 -516 -1176 -656 21 91 -925 -714 -261
722 -261 -607 -1305 -901 -493 -578 -695 -299 97 -1149 -1146 -367 -508 -1376 -1054 103 -301 -393 -238 153 -803 -1098
743 -1098 -561 -120 -440 -887 -42 71 -530 -917 24 -185 -878 -468 215 -463 -544 164 538 -504 -451 -278
763 -278 -46 -801 -248 380 164 -260 2 520 -323 -716 190 734 -110 -95 750 706 24 -82 134 346 -283
784 -283 76 444 235 -121 681 650 161 -239 36 363 -103 62 529 588 355 322 667 84 7 238 405 111
806 111 111 898 1051 597 51 183 493 -14 83 863 776 219 658 794 222 -126 276 153 -43 185 554 591
828 591 373 414 672 566 -407 -50 265 491 338 589 707 508 187 102 296 -36 22 511 238 137 303
849 303 472 84 -348 148 300 34 -115 117 434 357 128 192 106 56 -226 -76 176 -151 268 492 181 -341
871 -341 -114 207 -243 47 28 260 -488 215 196 -239 76 -177 -47 -465 -103 -202 21 -157 -164 -18 19 -238
893 -238 -339 -412 -147 -330 -422 -81 25 233 -275 -166 -328 -173 -170 -324 -309 -278 -28 -251 -236 -183 -228 -120 -462
916 -462 -354 -182 -137 110 -183 -201 -102 -290 71 -417 -339 -22 -85 -17 53 -255 88 28 -530 -303 -157 -26 -4
939 -4 -287 -119 -48 -9 -89 -431 43 5 94 -199 102 41 440 40 -154 -145 80 -108 -11 42 -56 66 270 60 -125
964 -125 64 -96 248 -189 249 119 -222 125 -106 -42 205 394 300 360 -27 123 68 291 -238 177 304 177
986 177 49 319 156 201 41 148 339 236 297 189 33 340 547 26 254 411 369 -31 44 478 439 156
1008 156 88 133 200 71 -55 318 299 287 230 375 -326 177 164 302 225 -2 295 126 60 199 345 -46 250
1031 250 201 -115 204 -75 146 62 379 339 211 210 -279 -9 -74 -18 130 222 224 -35 156 285 -26 -189 -123 248
1055 248 146 -270 -190 78 75 -223 -319 40 151 -67 -138 144 -97 195 26 -57 -304 -60 -132 -73 -238 26 11
1078 11 -229 -311 -368 -41 -166 -490 -162 -3 19 553 -82 -244 -354 -314 -3 15 11 -63 153 -61 -31 -258 -269 -328
1102 -328 -217 -137 -212 -143 67 49 -168 -323 -187 67 -109 -138 -29 -86 147 12 21 -34 -168 -290 11 -260 -308
1125 -308 -9 111 110 -25 -300 -8 7 -7 -130 14 -89 180 45 -64 -29 -69 20 -150 153 78 -42 193 -309
1148 -309 -260 127 11 -35 120 -267 105 -2 272 -128 63 28 -200 63 -5 76 162 232 227 183 -46 145 247
1171 247 15 -265 124 202 378 319 136 16 24 -109 -41 -280 -303 146 -83 146 360 70 169 66 -43 51 -60
1194 -60 153 115 60 305 259 67 95 -5 30 142 -47 99 173 1 223 118 -161 -106 148 -57 92 129 -212
1217 -212 -53 169 338 25 197 -30 66 60 158 113 19 -73 89 30 232 -187 -171 45 7 287 321 -20 139 -124
1241 -124 121 -27 -321 -169 116 225 151 68 141 38 22 -166 344 -5 192 -124 1 -50 254 123 -355 -123
1263 -123 -51 26 127 -20 220 33 116 -50 -103 39 -67 142 -376 -232 219 -51 3 -365 -50 34 1 -6 -39
1286 -39 -149 -92 -255 56 -289 -43 99 -156 -139 -10 38 -68 34 -23 -220 -142 -443 62 -111 -5 -84 -341
1308 -341 -171 -220 -371 109 7 90 23 -54 -21 -27 -88 -91 3 23 -225 -66 34 197 -201 53 162 -151 -1 -104
1332 -104 125 28 -218 4 -188 -298 -3 -123 -173 -26 106 109 41 72 70 195 -174 133 212 -20 108 -26 -76
1355 -76 56 -23 42 137 -76 -203 94 77 -4 147 151 57 -281 377 -125 -203 -67 -19 96 458 -48 151 46 -192
1379 -192 -150 -53 295 126 95 -42 65 243 173 251 217 -68 -174 -183 12 -63 58 -199 268 7 132 -127 -13
1402 -13 -236 -72 -168 123 -173 0 217 193 70 -310 88 158 -137 135 -159 -128 -64 -178 -39 -21 60 -183 141
1425 141 84 95 83 24 -129 -107 -178 -73 245 -39 -83 17 -188 44 -108 121 -118 -113 223 -127 -80 116 173 318
1449 318 -52 205 -123 214 283 32 -27 3 -42 87 -40 -69 -43 40 209 -83 -21 -133 -212 -75 171 -102 25
1472 25 -78 95 -188 -10 -297 -34 60 21 -277 -104 -130 -205 -143 -16 98 42 -119 -109 -46 19 108 -27 -30 -84 -160
1497 -160 298 54 -391 -400 216 -6 39 -104 -138 -87 -143 -304 -174 136 26 -17 53 -158 -158 323 35 91 56 -67
1521 -67 -24 -210 67 99 11 -191 -71 214 -188 284 -185 -94 403 110 -121 -74 36 -239 -176 -133 219 83 57
1544 57 212 142 401 -94 -189 -134 -41 -1 -66 94 -87 128 70 82 315 -117 -147 -246 -137 -137 36 -8 -283 -170 -64
1569 -64 126 -212 162 -13 94 267 308 -369 -135 125 -66 -169 -218 -58 40 -33 141 200 -10 -108 -125 58 56
1592 56 -55 -288 -153 -231 82 -85 -36 -361 -90 51 -18 -114 -224 163 -315 -46 -171 150 105 143 108 2 35
1615 35 -45 -201 -324 247 91 210 -114 -132 -150 38 111 -79 264 -19 -64 128 -196 24 89 99 -71 97 -140
1638 -140 65 -72 101 -47 -69 185 -91 82 -20 130 -296 -227 -437 -204 179 -258 97 83 -130 -240 150
1659 150 -150 -197 -21 -69 142 72 190 -63 63 95 214 256 143 338 -4 119 -176 -223 44 -5 -71 70 120
1682 120 46 143 52 196 -176 -63 57 49 -54 111 163 -141 -157 57 372 11 -27 75 -149 -16 -280 -65 282
1705 282 -216 -53 6 140 163 107 -83 134 -36 -173 -18 -130 -99 3 -17 -52 -196 -13 44 -14 163 -104 -69
1728 -69 214 -1 -19 238 -19 303 61 170 -36 -256 118 158 -167 134 -12 -152 14 -28 78 158 253 -334
1750 -334 -81 -71 32 155 1 114 -25 -49 161 -140 146 182 4 38 316 33 139 155 -56 183 -172 -226
1772 -226 -41 -423 49 -162 -308 139 110 24 -78 256 190 117 72 -163 -6 177 7 71 89 251 -71 -223
1794 -223 -96 180 86 -75 -256 -83 -135 -45 -141 -110 4 21 168 -81 -59 -34 120 34 92 -105 -179 -42 -145 -128
1818 -128 -38 95 -38 157 -61 27 -247 -248 0 -23 -287 74 -81 -273 -113 -275 0 237 -204 431 -245 -341
1840 -341 106 -27 236 37 -39 208 266 101 66 -248 49 3 275 26 152 -234 -336 192 65 71 22 -50 90
1863 90 33 38 89 253 -162 -242 -92 -33 42 53 38 77 64 212 198 134 -84 -288 3 -174 -199 -33 -189 206 429
1888 429 -115 110 170 -72 -183 51 -111 89 25 169 -166 9 -213 254 -298 -365 54 63 108 31 -180 26
1910 26 -74 12 133 -37 22 -57 109 74 -242 128 326 159 -28 24 -290 -381 -22 147 -100 -30 152 90 -171
1933 -171 -31 205 113 441 124 -57 -291 56 -56 53 128 -10 127 44 38 -17 -167 128 -195 -39 127 -224
1955 -224 126 132 -31 -142 -90 116 -65 -35 -89 32 110 -81 126 -301 -51 130 -50 -102 -38 178 -165 -82 194
1978 194 94 99 -246 -123 -65 -215 14 -146 -45 -231 188 117 24 -227 72 95 -52 99 41 60 -45 245 8
2001 8 -227 -205 273 -21 -199 23 -9 37 -232 -26 90 -112 270 -58 -250 132 -559 80 -239 38 -70 -189
2023 -189 -46 54 352 56 -398 25 -220 -256 -98 -159 -402 -144 -104 -68 -125 230 149 -105 -190 249 -105 22
2045 22 -3 -84 230 126 -151 -309 55 -82 -29 2 -200 6 -237 -422 322 126 -259 -233 16 136 -289 32
2067 32 -189 256 93 -15 -33 287 -105 249 226 81 25 -38 385 -114 66 -46 -37 -265 15 -177 -27 -71 -115
2090 -115 161 94 7 -258 -93 -191 93 -225 -254 -116 25 52 194 43 -114 182 59 35 136 100 207 -130
2112 -130 -6 194 -17 -43 -29 108 161 30 25 88 -81 99 186 142 49 -190 -153 -10 -123 -125 122 32 -73 -14 -112
2137 -112 -100 183 -57 -302 -124 206 186 126 -130 -306 -145 112 49 -77 -72 -29 -162 -69 3 39 336 -90 -137 -24
2161 -24 54 -106 -259 -109 96 152 186 8 335 -296 -25 242 180 -133 -168 224 -144 98 198 -22 -323 -32
2183 -32 -59 52 22 -130 -59 -34 314 -120 43 87 -194 -137 145 -3 119 6 241 77 -92 106 -72 47
2205 47 113 -31 240 65 -154 78 -89 219 14 216 -91 337 -104 80 -84 201 306 -111 161 -66 -43
2226 -43 -166 35 -26 172 148 158 13 250 180 21 -30 139 -258 124 -119 5 158 -95 4 -46 -39 -82 227 -245
2250 -245 112 269 -191 -262 -152 -160 57 118 10 264 -59 -74 33 6 146 -69 -334 -61 89 -28 -96 -389
2272 -389 -12 285 21 -126 7 29 -11 -174 20 90 415 111 -170 -176 128 58 115 -144 91 -155 -8 113
2294 113 -7 25 -211 -253 -99 229 -266 -67 -40 -248 -355 -15 2 -317 -54 -76 35 356 185 -214 -97 48
2316 48 -76 120 -81 -105 -280 299 -94 -135 -83 186 46 174 122 8 61 -99 -367 118 114 -310 11 -233 142
2339 142 54 12 -272 -189 185 370 -102 248 144 -48 -115 -116 -87 122 -98 -73 -152 224 -151 175 -173 -223 -199 -16
2363 -16 -195 -116 -267 283 -87 -196 199 -89 74 114 92 -41 41 -92 147 -227 -108 -114 120 -108 -160 -122 -104
2386 -104 -36 137 -110 -32 15 96 35 -272 6 -206 180 2 165 63 -179 182 57 -128 3 191 -259 -53
2408 -53 83 18 -41 40 186 -36 149 60 305 173 92 -80 157 -21 48 -107 26 -30 -51 260 -357 184 288
2431 288 178 -179 23 -75 36 172 -51 362 -73 56 -45 30 184 -137 -1 152 101 -201 -57 338 -181
2452 -181 76 -55 -46 -172 12 -74 -221 -157 92 231 246 -81 -90 59 51 6 30 131 -159 65 38 85 -76 -31 249
2477 249 -185 -79 -124 73 54 -108 -49 435 164 -133 -91 226 -39 50 -213 -23 5 -35 -15 -89 23 172 129
2500 129 166 -128 -80 -125 86 221 -23 -113 -69 -9 -239 -13 -83 158 -128 -83 -171 -38 -357 -208 13 81 161 -260
2524 -260 25 94 73 -27 -172 295 72 176 -68 -22 43 -47 18 -240 83 -45 -142 235 -48 -278 150 147 25
2547 25 -133 -8 87 -194 -185 -83 218 94 253 -192 -51 -86 75 -311 -79 45 -213 -89 16 82 96 -274
2569 -274 -176 79 157 150 240 -125 290 16 -237 -170 -144 12 -275 84 86 -458 210 77 123 -111 -246 -54 -42 150
2593 150 128 -30 -254 141 109 -129 -253 207 -141 -97 97 84 -92 257 -238 -235 -21 92 -49 -135 130 282
2615 282 149 106 182 226 42 115 24 -259 130 -330 192 225 -235 144 -107 -172 151 53 -84 -58 -58 -4 105 -69
2639 -69 -100 -82 -153 0 105 -50 -29 -127 -37 73 145 182 -135 157 182 -131 -8 -197 -244 -75 45 -152 221 -224
2663 -224 -139 -172 52 99 -13 -132 -39 107 -79 82 59 224 168 -2 -88 137 -162 39 -146 16 -21 -124 24
2686 24 -19 5 92 -5 -109 -123 -190 -9 -36 -216 -122 -76 -12 -130 353 43 -69 -75 -33 253 -146 170 98 50 -20 248
2712 248 -118 -30 -84 -80 107 131 65 -279 51 88 -99 -146 197 -10 246 4 -167 209 54 -224 173 -34 349
2735 349 -136 226 102 -50 -40 -34 115 -124 -39 -22 147 -223 -40 -38 -173 32 -117 -72 -6 -281 -150 -105 185
2758 185 -71 45 91 -237 86 150 -58 204 -8 -122 8 17 150 33 25 -207 -246 67 -27 -130 -151 162 2
2781 2 232 -31 -137 -346 196 41 -44 -153 -32 -41 -82 -30 -153 95 -202 -72 120 -15 -89 39 -135 -183 153
2804 153 -199 -49 -97 -137 170 -144 -62 234 390 -90 325 36 -61 -242 164 0 -170 154 58 -86 87 420
2826 420 -6 135 -177 -35 444 -31 10 16 -50 -244 137 -162 -31 265 -63 -24 134 -169 -15 -22 85 -199
2848 -199 -144 198 -207 -234 122 -105 253 173 -23 -73 312 79 -237 -93 -122 327 228 -125 -114 66 76 -92 58
2871 58 -5 79 34 -66 44 -15 74 197 -197 73 -410 -55 168 -148 127 -75 -16 -155 -201 226 135 61 -229
2894 -229 105 -191 -151 -54 -472 -147 -117 -8 -195 132 407 52 -228 -22 -100 -274 57 146 -109 -150 165 152
2916 152 -244 -148 58 -80 32 288 165 -64 234 134 -38 68 -99 82 115 -93 138 -376 -12 -120 4
2937 4 97 24 -186 112 -59 14 -37 -132 -62 -50 -230 235 180 -108 -46 237 -14 -13 87 34 56 143 232 -237 245 -187
2963 -187 151 33 -160 224 -123 -2 53 48 22 195 -192 -76 -57 46 248 -170 168 -212 140 135 69 50 262
2986 262 -123 -57 258 61 125 -258 170 1 63 -77 -5 -255 -48 -19 -89 37 88 124 -64 -22 -113 -127 47 -146
3010 -146 -90 130 183 139 -143 -265 175 272 -170 12 236 236 -193 -11 -36 180 -192 -126 187 75 273 153 93
3033 93 205 75 -84 20 -17 -23 68 83 67 0 -114 -69 -259 65 -26 88 56 -361 1 -52 -42 -78 -310 -6 32
3058 32 -254 -202 -230 -59 -170 117 -123 54 136 -103 223 207 123 118 -264 -340 -200 -156 177 128 61 60 4 78 -106
3083 -106 30 36 114 295 -208 -92 22 -97 -25 -54 -272 103 -30 0 99 259 40 133 4 -167 5 -52 40
3106 40 65 -59 -172 0 -31 -117 -110 385 -159 265 -95 -260 -33 -303 103 -278 -226 -183 -15 -163 23 -87 181
3129 181 15 -299 57 -194 180 161 -40 78 128 225 -22 57 170 -60 -45 -49 -117 -20 104 -62 -249 86 -192
3152 -192 -147 -132 46 17 -211 94 -87 101 -13 -163 -249 -71 149 24 106 25 91 35 197 -64 211 -51 79
3175 79 21 42 12 71 444 226 133 101 -44 407 241 -4 -68 210 157 123 -86 169 35 -156 329 -71 115
3198 115 -157 -107 -127 154 5 -266 29 32 181 117 115 108 158 -202 -151 86 -85 -230 55 -54 -123 120 122 141 59
3223 59 -25 -252 -350 -15 -95 -64 152 24 -201 18 119 67 29 -104 163 -79 381 -37 -176 252 -86 -56 76
3246 76 -69 -75 -45 41 106 217 -230 -59 -147 130 156 -39 2 370 151 -92 49 82 21 -84 -110 -34 144 133 7
3271 7 101 -111 145 -16 -56 -102 -18 30 232 -12 -132 135 51 -175 255 170 -212 -69 -27 -25 -54 27 -201 -2 54
3296 54 38 -21 252 -231 -8 -114 -309 -233 19 13 -327 -58 -76 -105 281 130 165 102 204 116 3 -52 124 -72
3320 -72 134 148 126 238 80 -90 -23 22 15 -247 -77 182 -131 -106 156 -75 -136 -101 -264 266 -83 28 -89
3343 -89 -135 53 -80 -163 158 -237 117 -144 71 117 -198 -161 63 228 2 53 -134 117 103 258 -195 279
3365 279 -175 -64 165 -221 49 -84 -199 -138 207 -243 76 -18 149 -89 -13 124 274 235 174 -152 41 -279
3387 -279 178 61 174 29 36 199 -57 224 -98 -23 -89 -82 -10 -171 -20 -70 -360 -273 121 -45 -39 142 40 -36
3411 -36 342 154 -178 -44 175 319 18 -397 -86 75 179 -485 119 275 57 -27 -112 44 165 253 -40
3432 -40 -23 117 -31 -298 -186 36 259 -363 -163 -25 -32 108 23 -212 74 101 -72 -51 -50 49 -71 -278 -82
3455 -82 -150 -79 145 -8 33 2 -30 1 12 227 219 -195 -59 15 272 223 -164 130 -76 62 190 -109 -246 -175
3479 -175 -195 103 -168 146 102 -280 140 142 -15 -116 -38 323 88 -174 -176 82 73 51 180 111 -119 -173 -296 103
3503 103 -18 -55 305 157 64 5 287 112 -40 -102 120 175 -329 -76 -118 -110 -224 7 116 287 -27 63 -113
3526 -113 -18 -274 45 25 -236 69 196 127 165 -138 -6 -248 -40 -87 52 -37 -260 -92 -42 57 -33 -15 4 -375
3550 -375 -33 -111 -108 -22 -250 80 -204 93 -77 -47 4 -11 158 178 53 -218 94 63 -143 -91 49 -195 -11
3573 -11 -64 164 60 -329 95 73 20 65 -322 -103 169 90 187 437 -31 -174 -132 41 75 -276 -206 9 -23 -241
3597 -241 138 -35 247 62 137 194 77 -12 107 95 -142 61 -136 43 -24 -351 131 166 -41 -24 75 58 80
3620 80 -77 420 25 -9 157 112 -170 -43 180 -235 107 -135 162 71 282 -159 -168 -253 -137 148 -130 -139 72
3643 72 50 -107 104 -34 -14 -218 -160 11 142 36 128 -93 98 -255 109 83 74 -23 -193 -68 -140 -85 -92 -16 -95
3668 -95 88 137 -208 -123 127 21 75 -36 -32 173 106 -150 139 12 -262 -53 -229 -60 -8 -35 -146 145 -46
3691 -46 -102 -20 -21 -10 -10 20 -135 -45 86 -186 213 -17 5 -63 -188 177 -184 -58 127 -90 70 -144 -225 -238 -14
3716 -14 149 66 -128 -113 3 -21 63 140 73 175 226 128 32 -78 29 -81 -297 53 -110 71 -22 201 11 86
3740 86 -235 195 -117 87 155 -11 180 -97 25 85 157 252 185 171 137 -63 112 40 -69 -239 -82 126 -82
3763 -82 -121 80 -39 -96 97 245 113 -58 -307 117 -373 163 33 202 278 -18 -82 7 202 189 -93 179
3785 179 -262 202 -83 -148 130 -7 90 -82 -57 266 -62 -89 -38 5 132 34 -172 16 -95 39 95 105 -78
3808 -78 7 -219 118 210 -125 84 -8 -44 -239 257 -281 -81 100 -101 -136 98 195 23 -73 62 -291 201 310
3831 310 -16 137 37 78 31 -353 -43 -74 -104 -38 134 144 39 -116 -165 153 38 -71 -296 195 -83 -324
3853 -324 -11 149 7 -24 -95 109 191 -83 -99 128 -130 -131 -33 246 69 -107 -65 -23 -64 -36 -143 76 -138 24
3877 24 -223 -99 -88 -49 -223 42 -33 27 -77 -34 -15 152 -265 72 134 -29 39 68 156 43 -253 91 120 39
3901 39 -33 -179 60 -55 101 112 -53 137 108 37 -17 -359 -106 87 -133 -248 -166 -69 -138 256 -177 -228 19
3924 19 -35 74 -215 125 -25 -47 62 -288 163 -93 -136 -172 -28 151 210 -159 -32 -186 146 -11 -83 -193
3946 -193 126 -301 38 61 217 -48 135 59 266 10 -323 -75 -186 37 -179 -28 -95 67 -122 117 -91
3967 -91 228 6 85 -58 56 5 -20 -91 165 44 -163 41 151 376 16 95 -177 -13 -20 336 71 -71 164
3990 164 15 -77 -158 7 18 63 -70 -184 4 -167 -230 -9 -40 -117 -124 -108 -18 42 -70 155 -94 -220 -179 117
4014 117 -14 250 -54 -132 10 83 -127 50 -28 -39 -75 64 10 -85 28 -100 374 104 211 -194 111 401
4036 401 -158 98 -63 -160 84 210 351 -264 -174 -152 12 51 47 -195 -150 85 -40 -180 46 292 44 -331
4058 -331 57 122 -202 -218 50 23 -142 -32 -40 -148 270 100 71 -119 89 -277 -175 -242 -10 -137 -96 69 -100
4081 -100 77 -116 330 -74 49 -40 -212 116 -61 -228 -70 -316 -133 -45 159 -65 -210 -53 211 -16 -244
4102 -244 -368 -84 -5 -230 184 101 34 91 -213 62 -141 47 -16 102 -46 -227 -128 -89 10 59 347 -67 153
4125 153 64 90 55 179 33 -126 482 -55 1 -104 168 -22 -222 -4 -203 -76 313 52 -191 -203 -175 -81
4147 -81 -150 327 178 -187 -131 -157 -262 -265 -47 93 -224 -457 58 149 -22 -10 199 -93 15 -88 133 -43 42
4170 42 34 -126 60 -142 -256 -177 -156 109 -133 110 -35 9 -86 180 248 190 188 -46 341 -241 -156 32 -138 -184
4194 -184 89 100 34 -55 78 -210 78 101 -15 -45 82 -36 17 8 -65 -66 303 -183 -49 69 48 48 186 -74 -60
4219 -60 129 34 -85 -159 91 155 -9 -210 -97 -110 -46 -192 50 -322 220 -3 -120 47 115 16 18 287 417
4242 417 -136 -122 343 -271 13 -318 165 56 -133 122 150 -40 -131 1 -25 -91 146 185 40 102 85 -138 61
4265 61 224 -115 -128 -89 -66 -185 -47 51 304 -146 95 201 -337 73 -133 157 -214 -64 -109 -10 -24 -220 26
4288 26 178 260 -130 -234 -227 -23 150 -114 141 108 48 120 58 235 -165 -20 -134 -47 224 203 -45 -143 156 94
4312 94 58 -155 -58 234 -212 53 40 83 -79 93 322 311 -9 -254 -65 -107 -268 197 334 -7 -121 -170 -49
4335 -49 -160 -39 287 -122 -22 -84 -43 -174 361 -67 -222 0 119 -109 -75 -36 40 368 -68 -90 -297 155
4357 155 -97 -39 78 -33 -5 -118 -50 -454 8 -400 -143 71 -311 185 353 -95 1 -153 21 165 117 -10
4379 -10 -27 -21 253 -179 256 -138 69 -387 130 179 -107 49 -14 -203 -75 -149 -123 179 40 33 181 -51 -135 184
4403 184 114 -65 40 -144 -115 163 21 162 19 -158 194 -184 246 -14 -184 93 70 15 -68 19 76 195
4425 195 45 28 3 -85 -219 -156 224 -17 205 -152 85 -13 65 -44 -381 -241 265 -15 134 128 -8 -13 126
4448 126 -180 82 91 267 -21 94 166 -132 141 102 -60 84 -34 46 60 -89 121 -103 -113 -141 4 87 59
4471 59 -43 35 7 -85 535 -207 -104 -57 -240 21 -189 -96 36 -2 -117 -8 -72 333 200 63 -78 -362 -144
4494 -144 -101 -325 -181 -66 143 115 -207 -6 106 61 142 -106 102 49 455 118 204 157 57 101 29 -42 33 -313
4518 -313 16 40 118 -469 -70 -58 52 -1 -5 -198 -11 186 -43 60 9 319 -83 74 -21 30 172 198 69
4541 69 93 -154 -198 -28 48 360 -24 -185 -116 -59 -85 253 17 303 -84 -126 -177 5 89 126 -25 -110 93 85 -27
4566 -27 -54 -93 -56 159 138 -102 -146 -42 -166 -34 6 -21 -156 97 -73 -100 -161 -35 182 204 -146 103 -210 -333
4590 -333 -117 34 -290 183 240 38 -30 -105 6 282 -5 -233 56 -230 -4 25 179 -55 106 262 119
4611 119 30 82 -56 39 -99 65 -71 49 -132 56 151 172 -218 -14 -229 46 -152 -218 76 -125 -91 35
4633 35 55 -143 92 149 -22 155 37 -412 148 30 9 54 -132 -53 -67 -100 -38 126 -101 5 -421 136 -9
4656 -9 121 -244 194 -28 -96 201 -56 -284 112 378 245 147 78 24 -91 -131 214 218 -187 -128 -98 53 278 -35
4680 -35 42 -70 -44 -288 117 255 209 149 -143 181 52 457 -319 -76 -87 -150 -230 43 358 -26 87 -16 66
4703 66 205 -214 98 -186 -170 134 -21 -46 213 -202 -29 126 -236 167 179 14 -22 -18 152 26 73 -324 -113
4726 -113 -5 42 53 -81 -191 -302 -16 32 -24 -12 165 -181 -109 -165 -139 210 172 68 163 147 -34 60 -9 3 -271
4751 -271 -115 69 -35 97 -54 -325 -91 -232 -61 -218 33 -69 200 116 -58 -99 -256 200 -306 216 5
4772 5 5 357 -1 145 -104 17 117 140 -88 75 106 -121 65 74 33 176 -209 -30 225 84 241 -86 137
4795 137 55 40 106 98 -197 -33 315 -7 -51 89 -204 102 10 210 8 1 -24 166 194 79 -114 129 -53 104
4819 104 6 -58 -165 -69 17 -118 27 144 -105 23 89 97 -22 -383 22 -129 44 -37 -170 -128 173 357 -59
4842 -59 -205 -169 67 125 148 -279 18 36 35 -111 -17 22 -198 -140 71 -63 27 -229 -48 71 162 219 -130 149
4866 149 265 66 241 187 3 4 3 -186 -99 -239 23 -113 69 -132 -55 90 50 102 222 77 -138 -162 -146 258
4890 258 13 -68 242 -217 -37 -213 20 219 322 102 -29 286 19 272 2 -69 64 116 -96 191 48
4911 48 150 204 95 -72 -3 24 2 93 -18 180 -178 127 -105 247 316 -62 131 -166 125 -25 9 -100 57
4934 57 45 -32 146 112 50 8 42 109 86 -66 52 286 84 -94 -157 -360 27 139 324 289 46 35 122 117 -250
4959 -250 57 215 85 77 58 88 82 160 -500 140 -125 -73 56 -11 119 -315 -114 67 65 -51 -168 -75 -116 -52 210
4984 210 -52 -268 65 128 -113 -69 -244 -69 63 4 114 -204 173 91 263 -27 372 80 -1 32 160 -181
5006 -181 64 -132 146 -39 208 163 -63 97 -26 103 101 196 -167 -189 259 -35 -19 61 -93 205 -248 -25
5028 -25 -275 -165 173 -25 89 -14 -314 25 160 -244 153 73 93 52 22 208 42 -125 201 -11 -74 553
5050 553 319 -158 141 49 257 178 -219 -115 314 -195 -98 -53 -76 188 96 -141 -41 259 -141 43 3 -73 166
5073 166 126 296 162 -2 50 -164 -385 170 -276 120 201 -452 102 9 -142 -3 268 -295 318 -20 41 154
5095 154 177 -1 32 -37 117 12 22 104 -38 -38 -92 -180 -256 -42 -199 -246 -75 9 -153 73 -6 99 -62 -163
5119 -163 -155 -195 299 443 117 -77 192 79 179 -139 -70 -140 -179 -113 91 220 -91 -49 -190 74 -10 137 59
5142 59 -1 -173 -240 -20 -246 -116 -237 54 -136 -235 -183 -121 -158 12 -76 -126 -39 26 -327 -168 100 146 40 78
5166 78 -4 -69 362 11 -2 99 -297 22 -106 51 59 229 -12 -258 14 99 31 -13 247 -221 -209 -133 -235 34
5190 34 -261 -5 78 -62 81 -73 -261 224 19 243 -113 81 281 -55 135 113 -215 -14 303 -8 -331
5211 -331 253 -36 -241 -120 121 25 -310 174 -28 -146 3 88 -118 69 214 64 42 31 171 -14 -318
5232 -318 -118 -194 -157 -84 138 282 -69 -98 -101 46 -23 -107 21 63 -13 -193 150 248 -74 -9 29 -18 -15 60 -267 24
5258 24 -98 78 54 -260 -429 68 -91 8 -23 -303 13 173 125 -18 -128 -276 -111 145 -316 82 -175 -51
5280 -51 -43 11 133 -128 -189 94 138 -130 -66 132 -194 62 -282 207 61 -226 194 -81 -105 212 -128 119 -112
5303 -112 -119 272 -56 -89 -82 2 79 -54 -78 -71 76 -20 -109 58 -16 355 -54 -331 -70 101 -188 -266 4 -182 -99
5328 -99 162 -351 120 -385 73 -42 -293 -137 -226 -197 332 2 233 -52 -160 246 87 -8 145 -80 -253
5349 -253 250 -208 -127 -188 66 -192 57 -187 -277 -162 170 16 10 234 98 -165 -171 11 175 -174 32 217
5371 217 -90 -136 125 56 133 163 214 -129 337 77 24 166 -148 271 189 -186 -87 -13 -46 -34 58 0 85 95 -68
5396 -68 -37 -58 49 36 -247 180 -42 69 -68 -32 14 -35 98 279 2 -18 115 26 201 -208 254 125 -138
5419 -138 143 -33 -197 -104 92 -141 -162 262 -35 -25 -163 -165 -96 33 242 158 -72 105 134 -136 -135 -178 133 -99
5443 -99 186 15 218 36 -155 -85 48 -115 -12 158 193 203 -113 10 20 243 48 207 127 51 117 -4 -192
5466 -192 -91 107 -253 3 332 25 50 19 238 131 14 186 -200 22 -36 -352 -116 40 63 37 -25 242
5488 242 -102 -211 15 33 15 47 -449 -236 -17 18 -112 -167 -184 -80 55 112 152 -160 -179 93 -175 114 -183
5511 -183 76 299 -175 9 -68 61 -58 -218 149 195 130 88 -148 -226 -265 -176 234 11 30 -77 -122 8 14 -119
5535 -119 -110 314 81 170 -91 -1 -31 -149 245 53 -142 60 26 -280 288 -107 20 19 311 282 173 -65 -285
5558 -285 115 179 87 -92 -44 -16 -96 -75 55 -112 129 109 -20 4 104 166 165 110 -339 131 -83 -97 -219 164
5582 164 -7 227 170 135 -65 -23 43 241 -24 -11 100 46 150 94 75 -114 -163 -83 -174 167 150 317 144 64
5606 64 33 -159 -55 154 77 -305 6 129 26 191 283 130 75 -128 -436 292 -15 -44 190 239 -78 -169 161
5629 161 231 -58 -21 -202 -32 33 178 -23 34 -114 195 250 24 -154 69 -212 -217 63 172 51 -27 142 -113
5652 -113 -139 249 54 118 76 -76 -25 -10 -153 -350 61 -374 123 -25 36 -11 87 -23 202 76 127 -15 -79
5675 -79 361 -82 154 57 -138 51 105 -92 -252 16 125 -12 106 -83 57 173 73 -138 235 -57 31
5696 31 -62 273 -145 -272 20 68 126 283 68 -112 88 32 -185 -53 63 272 -85 267 196 -343 -115 55
5718 55 141 -61 -303 197 -151 -349 -49 -106 -69 138 -80 422 319 82 -68 21 -168 105 61 -5 264 -1
5740 -1 36 -36 -267 9 243 -18 125 -135 -29 -163 165 189 38 -68 -50 -32 -90 -73 -119 -203 106 37 -37 280
5764 280 -145 -4 -90 -73 104 -299 -213 -156 -109 -63 -268 -171 142 4 -9 -98 -204 -120 0 -53 -62 84 159 126 60
5789 60 -322 -337 -19 80 -130 184 270 194 -103 7 29 102 -1 225 -29 -70 -166 344 -116 -210 19 8 154 -19
5813 -19 200 -48 171 -11 -23 -11 -90 -130 156 -148 187 -80 -97 40 -56 12 -46 2 43 62 -43 -127 -149 -40 222
5838 222 65 -41 -131 33 -54 -96 -28 -67 120 -268 133 87 -164 51 -78 120 236 -333 -21 -173 -204 -134 215
5861 215 36 168 225 -63 43 -95 209 57 67 19 51 -111 -259 19 -39 -66 -107 -108 -143 22 227 61 29 39
5885 39 -2 129 -56 -12 -41 -25 -107 110 -402 -310 -264 -239 -195 -99 -51 -34 309 66 -239 -259 -121 77 -15 -25 -144
5910 -144 123 -105 -365 6 -30 180 58 21 132 88 39 -265 -151 232 81 -266 -141 -182 294 233 -224 150
5932 150 -42 -159 62 -82 387 -23 259 -96 151 -345 47 -82 -170 264 142 132 -280 109 -131 120 -269
5953 -269 -7 173 -21 23 -108 84 17 -253 27 -168 -208 18 197 -17 -154 22 44 -63 30 161 115 -110
5975 -110 51 95 122 305 14 -25 -259 -46 -158 -111 -125 -9 239 24 -82 -149 -107 -30 27 15 -293 13 31 -84
5999 -84 -185 66 -21 -260 -46 -282 288 -276 -238 -139 -132 -157 105 -233 -84 68 66 -213 -22 158 -97 -99 -294 -171
6023 -171 27 -112 146 211 -42 -301 -132 181 -14 174 -63 -241 75 -64 129 51 1 192 -157 -54 -171
6044 -171 6 28 -191 61 -115 -65 169 -54 -180 -27 288 71 155 113 29 -211 140 -311 -112 25 85 113
6066 113 89 -52 -230 1 -115 183 95 135 24 64 -152 -243 329 -71 -39 -135 48 -109 -233 55 -226 70
6088 70 -61 220 271 21 55 169 -31 60 170 65 -244 10 188 210 72 -75 -135 -1 262 -16 -10 -17 -83 -91
6112 -91 -15 113 -424 62 10 -18 -111 -194 48 -40 18 -81 84 356 -34 -11 86 13 -63 -198 109 -45 208 98
6136 98 192 235 -166 -12 250 -45 -84 98 -104 250 72 -90 95 115 -22 271 60 -98 -62 -321 -17 -110
6158 -110 -231 193 97 130 -37 -226 102 -124 54 28 -40 -91 -136 -92 23 35 197 239 58 -243 133 159 -99
6181 -99 378 -120 -31 198 40 56 -151 -29 8 -136 15 -113 -461 160 24 -208 31 57 -37 145 83 -109
6203 -109 194 34 -69 -189 61 44 101 -69 86 7 -48 4 -279 48 75 138 -56 -104 -120 163 106 -48 91
6226 91 -22 -56 -87 2 -135 193 78 122 104 128 27 77 47 20 -28 179 291 -93 173 9 -328 -117 -236 -52
6250 -52 10 153 243 17 -72 -333 95 -163 52 200 -74 -93 48 -185 -107 81 153 -201 -242 -56 -1 -248 64
6273 64 177 27 95 48 18 107 7 -292 53 112 -102 -22 291 -207 30 -88 56 256 94 -35 -66 -130 -196
6296 -196 15 -86 -56 71 -43 55 -30 -68 43 247 205 -57 182 62 247 -20 5 91 134 -245 335 244 -82
6319 -82 166 227 136 -215 128 108 208 290 119 -102 40 68 -264 23 -29 249 -172 -34 121 163 204 -206 145
6342 145 -290 -123 155 -32 -180 -16 -184 -95 63 159 152 -80 -47 36 284 66 97 -117 20 134 351 43
6364 43 -128 272 -20 84 43 -106 -203 -282 179 -35 -176 43 -58 63 -243 110 153 250 -70 115 -226 -189
6386 -189 53 -112 -207 161 -39 85 142 -18 64 227 17 219 -35 61 42 177 18 53 -117 21 -304 -78
6408 -78 -1 125 -46 -213 88 -53 310 64 249 -431 146 -174 -204 120 232 -295 -29 -174 -210 -166 -134 -232
6430 -232 101 -240 248 31 198 -197 -137 -200 110 -97 39 -62 -225 -211 -317 -157 -19 -273 13 -56 60
6451 60 351 -30 -244 205 -131 -42 -134 -160 134 80 89 181 17 136 -99 169 47 57 187 163 -37 46 112 146
6475 146 -33 -134 168 -108 285 -140 -34 206 -139 50 244 226 58 -101 36 -13 -186 285 -1 112 141
6496 141 -279 141 -306 84 -366 22 250 72 131 49 -109 -31 -98 -135 -240 -13 -63 -132 -66 -64 -66 65 177 104
6520 104 -186 -160 95 -88 307 218 -149 -264 47 -73 -127 92 -78 -210 -168 -24 116 -65 208 -187 -54
6541 -54 -383 227 -61 47 226 -69 261 110 -119 29 -87 -48 -92 320 83 -60 235 -36 -164 -197 -65
6562 -65 -433 -266 -234 25 -199 19 43 -250 43 199 341 221 -16 72 -178 -171 299 63 -238 -97 -231 0
6584 0 416 23 -474 -97 -59 -92 -146 143 -18 -27 -186 -220 -227 -54 -83 -209 92 -18 -296 -31 33 1 -50 175 -129
6609 -129 -23 81 -171 169 107 -98 127 -311 -258 88 145 -61 91 29 111 -28 88 -75 -79 -178 -13 18 -40
6632 -40 -16 -122 179 88 76 -100 -18 -5 123 -3 65 -167 92 69 -30 -108 179 -72 37 50 -54 -35 24 184
6656 184 -163 175 16 127 74 -145 -69 -91 -175 -204 -106 -289 -9 269 156 116 251 42 157 -33 -249 187
6678 187 -373 -244 -115 -33 132 -44 36 75 -190 23 -133 122 268 -91 31 38 52 260 278 -213 -302 20 209
6701 209 210 72 -27 -132 24 173 -160 145 -9 168 -31 -101 90 -26 30 -58 22 81 13 252 -105 161 136
6724 136 -4 174 89 -21 69 -54 190 313 -185 86 87 19 319 311 -62 -92 22 -18 79 -82 -131 -183 -6 49
6748 49 -103 31 -41 20 -37 -47 148 102 -116 43 76 265 -15 62 87 171 25 154 37 207 6 173 -21
6771 -21 -289 -25 134 -31 -62 230 1 -24 22 50 -279 151 -94 -270 126 8 -44 46 -62 -156 -12 109 -153
6794 -153 -109 173 270 -173 -157 -77 -137 -32 177 -76 -33 71 235 306 208 -86 -53 -89 -21 -125 182 -115 -159 -6
6818 -6 -82 245 175 71 -179 -344 -225 -8 -142 -18 4 66 -68 38 64 229 -195 -221 12 -78 -52 221 314 0
6842 0 39 -29 -144 217 95 -118 -107 121 49 159 -223 -250 44 116 -38 -58 -163 -51 60 195 -29 154 289
6865 289 -173 171 30 44 -55 159 -17 -159 -65 -41 -49 109 159 90 63 69 65 45 -13 122 -248 -175 435 66 -116
6890 -116 -1 111 75 66 71 -52 -139 164 -152 91 77 -100 159 120 -12 -64 154 40 375 -92 116 106 -67
6913 -67 -103 70 211 -50 124 -192 -21 10 -256 68 -230 -84 68 171 -65 187 34 -211 -188 -267 -134 157
6935 157 49 47 -348 -91 176 19 -48 375 -225 105 -100 57 178 -28 79 -203 -154 -218 -111 -126 -40 37 222
6958 222 -82 -180 -37 -313 -20 182 53 173 28 -64 251 -42 13 -162 -109 252 13 206 -152 -43 72
6979 72 -159 75 168 -55 133 -138 342 -129 1 140 -64 50 -196 -225 248 199 41 31 -67 94 104 50 -5
7002 -5 -217 68 167 -91 232 -80 45 4 -87 194 26 -167 5 -161 69 91 -127 29 -115 -102 -246 109
7024 109 376 -79 -113 -15 234 129 78 5 30 -147 -133 113 -196 129 -195 28 -57 202 32 -370 264 -8
7046 -8 19 -166 179 148 -54 137 -142 -68 178 220 -221 -113 -40 -20 7 -109 -101 14 -48 -66 -194 -10 -16 -48 -1 72
7072 72 26 202 -162 -238 -137 81 151 45 -92 10 73 -306 211 170 -222 46 -36 267 33 -244 130 -101
7094 -101 137 -151 -148 9 153 7 106 19 0 18 220 72 151 48 -179 -381 30 -86 97 6 31 -216 137
7117 137 -163 109 46 -64 225 194 49 -246 -126 -15 200 151 157 66 -64 11 -209 -154 204 -400 -120 -15 -73
7140 -73 -24 -58 81 78 -3 20 71 147 116 -288 164 -109 124 -5 -164 210 -47 -244 -158 -152 41 -166 34 50 0
7165 0 -133 -30 -222 -137 166 -75 -131 257 96 -58 141 -50 1 4 -55 -66 -100 286 31 -46 51 -205 6 -34
7189 -34 8 -1 -94 -38 129 146 -279 -176 10 109 165 12 54 -72 -176 -263 142 224 -72 85 69 -10 37 44 -9 -142
7215 -142 235 48 -147 53 76 286 -87 -339 47 30 89 -19 184 40 207 -75 50 88 169 -24 189 -86
7237 -86 73 230 -239 90 131 185 -36 -121 4 178 55 -35 65 91 -194 -46 -28 88 1 -6 -28 -141 69 -94
7261 -94 202 -152 -85 26 -53 158 -45 -88 -193 291 45 422 -23 -211 66 61 -95 140 -301 102 -187 108
7283 108 -29 -230 -14 174 -88 62 306 -91 1 15 -74 -215 -132 75 -45 -94 -182 -285 78 -44 113 -284
7305 -284 130 -194 65 109 111 -119 346 -184 378 110 -27 5 482 -33 216 16 269 -30 85 -17 -102 426
7327 426 -166 120 36 77 -225 -1 27 34 -17 -50 -154 -77 -144 121 -89 -25 60 76 -184 190 -99 -79 -90 -85 -123 129
7353 129 120 -79 -46 -172 121 57 155 -213 56 -22 15 -91 154 -162 -1 -41 -318 -219 -46 305 167 156 -360
7376 -360 261 30 152 -176 59 21 -97 -169 271 50 -19 372 44 -159 25 357 171 176 5 86 225 -138
7398 -138 145 139 17 -245 -136 -71 -191 -53 -128 85 208 -342 -153 -39 -91 268 105 72 -3 -18 -42 78 88
7421 88 -82 116 -335 25 180 73 118 -107 -47 192 -267 61 -95 153 83 225 89 138 189 -19 -1 -194
7443 -194 10 -206 -280 42 209 -112 222 -298 -329 21 133 -121 -206 91 188 -84 -112 271 -201 -132 252 -78
7465 -78 -175 -275 -27 -184 -94 144 -375 37 129 -39 -110 287 -9 82 -132 73 -108 45 -315 105 5 55
7487 55 -138 147 -99 -180 -5 -239 129 361 23 -53 16 -250 -117 -3 39 -112 156 -130 33 37 158 122 -157
7510 -157 143 -140 72 -259 0 -185 222 -85 -29 41 -37 -128 -83 -205 -92 115 -10 158 -73 215 -16 369
7532 369 23 -66 29 122 309 60 -29 -130 -233 13 -27 -40 -158 -181 -128 -153 -191 -221 15 121 287 396 49 249
7556 249 -41 -34 83 49 -88 -106 -119 -91 -154 26 -25 44 225 -166 25 92 -72 192 -91 -66 202 -187 -11 -128
7580 -128 39 69 18 -249 12 -45 -88 82 -112 193 -143 -52 -30 -31 165 163 -122 19 -149 -91 168 71 -175 -166 -98
7605 -98 20 -135 -267 540 -71 -194 82 109 -35 159 -153 -219 89 252 92 152 -3 40 71 180 97 -20
7627 -20 -158 83 125 -114 78 98 153 -43 22 428 -153 116 91 12 195 75 -32 125 10 -66 -54 0 -62 87
7651 87 152 -50 92 -11 46 390 -69 -40 -81 -57 103 -4 38 65 86 -64 27 120 116 -131 124 13 60 204 58
7676 58 -94 109 11 -211 -111 -8 -3 -323 403 -45 53 54 -22 -272 270 -228 103 227 -38 208 -416 74 -10
7699 -10 -111 344 231 -88 -23 161 -20 -141 245 17 13 25 -143 44 215 251 -175 -152 -37 -35 -96 -72 -14 359
7723 359 58 76 -251 -294 -168 53 -102 -6 322 -227 -34 227 111 116 -94 -129 75 101 -29 -120 101 106 78 -59
7747 -59 -66 -91 -7 -321 221 240 -187 -6 -45 -405 153 -202 187 40 35 131 -73 98 -32 272 -112 -171 -158 32
7771 32 180 -52 -36 -30 131 66 91 135 -138 34 26 306 47 -253 -106 -4 -276 -16 -241 232 -244 272 96
7794 96 92 185 -228 29 -175 -133 150 258 -23 -170 325 -31 -222 -136 -69 -38 -73 217 -264 -71 -205 179 -103
7817 -103 26 51 -170 151 118 -98 -73 5 139 -114 176 271 128 113 -39 -35 -70 -40 -152 30 32 98 -93 9
7841 9 235 34 -132 211 2 101 -156 183 87 -65 134 216 -25 130 -198 84 144 -55 308 -171 10 -143
7863 -143 4 -56 56 110 272 -80 107 -39 -54 -10 -102 -76 187 67 104 209 -229 -145 86 8 165 -124 56
7886 56 21 -67 -84 -32 49 128 -189 -80 173 12 72 -398 299 43 80 29 -194 247 101 -279 -1 -212 -178 -134
7910 -134 49 -79 140 132 122 -98 -89 -223 -176 180 -160 87 122 226 -218 -202 101 101 35 16 -85 174 -151 -197
7934 -197 311 26 -242 103 -232 130 132 -25 -157 -244 -68 -37 182 -172 -27 8 379 -201 75 -321 -128 -161
7956 -161 -69 199 -100 354 -104 100 -128 174 204 -37 225 -108 -10 65 -114 -2 227 -233 50 377 -106
7977 -106 31 -127 -19 459 -180 181 -228 73 177 178 -36 -55 -107 -14 255 -5 -52 -148 -51 -32 -79 -227 134
8000 134 -146 -93 47 -119 -165 172 -170 165 176 86 137 31 8 -126 -47 406 -340 -4 131 -127 -67 12 11 -58
8024 -58 -79 -23 -107 -427 158 -115 31 -213 -22 -265 -356 45 178 166 157 30 228 71 208 1 -4 -24 -35 -39 -71
8049 -71 105 -152 216 -14 -200 104 186 207 259 -106 7 -303 -118 36 -10 162 204 -81 129 2 5 301 -142
8072 -142 0 222 -92 188 149 -65 72 -159 -22 107 7 -93 -28 251 166 -47 -119 -207 -140 57 25 -111
8094 -111 -245 167 -227 121 88 -219 276 35 -17 -47 199 -69 124 8 -163 201 58 -146 -131 -158 -156 61
8116 61 28 -102 197 -111 -61 -64 421 -113 -71 250 228 -403 298 278 97 -85 -413 19 18 14 -61 -9 -216 110 -115
8141 -115 179 130 23 86 92 72 -60 -26 -100 124 -318 -66 91 -53 23 48 -63 -31 -70 120 -137 -213 256 -154
8165 -154 -90 96 9 81 151 312 31 253 179 -141 -156 -49 -304 -168 34 -5 -108 -256 -96 -183 -315 120 122
8188 122 -264 0 -175
8191a75
##END NTUPLES=NMR FID
##END=
