##TITLE=1H_LR-683B-c3TFA
 CDCl3, 8 sc, 
 23.7.2019
##JCAMPDX= 6.0         $$ Bruker NMR JCAMP-DX V2.0
##DATA TYPE= NMR FID
##DATA CLASS= NTUPLES
##ORIGIN= UXNMR, Bruker Analytische Messtechnik GmbH
##OWNER= root
$$ XWIN-NMR		Version 3.5
$$ Tue Jul 23 14:31:38 2019 Russian Standard Time (UT+4h)  she@DPX200
##.OBSERVE FREQUENCY= 200.13155
##.OBSERVE NUCLEUS= ^1H
##.DELAY= (6, 6)
##.ACQUISITION MODE= SIMULTANEOUS
##.ACQUISITION SCHEME= undefined
##.AVERAGES= 8
##.DIGITISER RES= 18
##SPECTROMETER/DATA SYSTEM= spect
##.PULSE SEQUENCE= zg30
##.SOLVENT NAME= D2O
##.SHIFT REFERENCE= (INTERNAL, D2O, 0, 15.7039)
##AUDIT TRAIL= $$ (NUMBER, WHEN, WHO, WHERE, WHAT)
$$ ##TITLE= Audit trail, XWIN-NMR		Version 3.5
$$ ##JCAMPDX= 5.01
$$ ##ORIGIN= Bruker BioSpin GmbH
$$ ##OWNER= she
$$ F:/spectra/data/she/nmr/H-F/1/audita.txt
$$ ##AUDIT TRAIL=  $$ (NUMBER, WHEN, WHO, WHERE, WHAT)
(   1,<2019-07-23 14:30:30.73 +0400>,<she>,<DPX200>,
      <created by zg, POWCHK disabled, PULCHK disabled
       configuration hash MD5:
       00 E9 B6 7A A2 85 ED C7 34 08 36 98 17 FE 4E 26
       data hash MD5: 16K
       FE 72 51 CB 93 5F B1 B5 E1 9D 28 B5 59 75 6C E5>)
$$ ##END=
$$ 
$$ hash MD5
$$ 60 AC 9F 75 C1 4D 07 BD C4 D4 0A 61 A7 5D 58 97
##$RELAX= 
##$RELAX= 
##$RELAX= 
##$RELAX= 
##$RELAX= 
##$RELAX= 
$$ Bruker specific parameters
$$ --------------------------
##$DU= <F:/spectra>
##$EXPNO= 1
##$NAME= <H-F>
##$PROCNO= 1
##$TYPE= <nmr>
##$USER= <she>
##$AMP= (0..31)
100 100 100 100 100 100 100 100 100 100 100 100 100 100 100 100 100 100 
100 100 100 100 100 100 100 100 100 100 100 100 100 100 
##$AQSEQ= 0
##$AQ_mod= 1
##$AUNM= <au_zg>
##$AUTOPOS= <>
##$BF1= 200.13
##$BF2= 200.13
##$BF3= 200.13
##$BF4= 200.13
##$BF5= 200.13
##$BF6= 200.13
##$BF7= 200.13
##$BF8= 200.13
##$BYTORDA= 1
##$CFDGTYP= 0
##$CFRGTYP= 5
##$CHEMSTR= <none>
##$CNST= (0..31)
1 1 145 1 1 1 1 1 1 1 1 1 1 1 1 1 1 1 1 1 1 1 1 1 1 1 1 1 1 1 1 1 
##$CPDPRG= <>
##$CPDPRG1= <>
##$CPDPRG2= <>
##$CPDPRG3= <>
##$CPDPRG4= <mlev>
##$CPDPRG5= <mlev>
##$CPDPRG6= <mlev>
##$CPDPRG7= <mlev>
##$CPDPRG8= <mlev>
##$CPDPRGB= <>
##$CPDPRGT= <>
##$D= (0..31)
0 1.2 0 0 0 0 0 0 0 0 0 0.03 0 0 0 0 0 0 0 0 0 0 0 0 0 0 0 0 0 0 0 0 
##$DATE= 1563877830
##$DBL= (0..7)
120 120 120 120 120 120 120 120 
##$DBP= (0..7)
150 150 150 150 150 150 150 150 
##$DBP07= 0
##$DBPNAM0= <>
##$DBPNAM1= <>
##$DBPNAM2= <>
##$DBPNAM3= <>
##$DBPNAM4= <>
##$DBPNAM5= <>
##$DBPNAM6= <>
##$DBPNAM7= <>
##$DBPOAL= (0..7)
0.5 0.5 0.5 0.5 0.5 0.5 0.5 0.5 
##$DBPOFFS= (0..7)
0 0 0 0 0 0 0 0 
##$DE= 6
##$DECBNUC= <off>
##$DECIM= 24
##$DECNUC= <off>
##$DECSTAT= 4
##$DIGMOD= 1
##$DIGTYP= 9
##$DL= (0..7)
0 120 120 120 120 120 120 120 
##$DP= (0..7)
150 150 150 150 150 150 150 150 
##$DP07= 0
##$DPNAME0= <>
##$DPNAME1= <>
##$DPNAME2= <>
##$DPNAME3= <>
##$DPNAME4= <>
##$DPNAME5= <>
##$DPNAME6= <>
##$DPNAME7= <>
##$DPOAL= (0..7)
0.5 0.5 0.5 0.5 0.5 0.5 0.5 0.5 
##$DPOFFS= (0..7)
0 0 0 0 0 0 0 0 
##$DQDMODE= 0
##$DR= 18
##$DS= 0
##$DSLIST= <SSSSSSSSSSSSSSS>
##$DSPFIRM= 0
$$ [...]
##$SUBNAM2= <"">
##$SUBNAM3= <"">
##$SUBNAM4= <"">
##$SUBNAM5= <"">
##$SUBNAM6= <"">
##$SUBNAM7= <"">
##$SUBNAM8= <"">
##$SUBNAM9= <"">
##$SW= 24.9336996594482
##$SWIBOX= (0..15)
0 0 2 0 0 0 0 0 0 0 0 0 0 0 0 0 
##$SW_h= 4990.01996007984
##$TD= 16384
##$TD0= 1
##$TE= 0
##$TE2= 300
##$TE3= 300
##$TEG= 300
##$TL= (0..7)
0 120 120 120 120 120 120 120 
##$TP= (0..7)
150 150 150 150 150 150 150 150 
##$TP07= 0
##$TPNAME0= <>
##$TPNAME1= <>
##$TPNAME2= <>
##$TPNAME3= <>
##$TPNAME4= <>
##$TPNAME5= <>
##$TPNAME6= <>
##$TPNAME7= <>
##$TPOAL= (0..7)
0.5 0.5 0.5 0.5 0.5 0.5 0.5 0.5 
##$TPOFFS= (0..7)
0 0 0 0 0 0 0 0 
##$TUNHIN= 0
##$TUNHOUT= 0
##$TUNXOUT= 0
##$USERA1= <user>
##$USERA2= <user>
##$USERA3= <user>
##$USERA4= <user>
##$USERA5= <user>
##$V9= 5
##$VALIST= <valist>
##$VCLIST= <CCCCCCCCCCCCCCC>
##$VD= 0
##$VDLIST= <DDDDDDDDDDDDDDD>
##$VPLIST= <PPPPPPPPPPPPPPP>
##$VTLIST= <TTTTTTTTTTTTTTT>
##$WBST= 1024
##$WBSW= 4
##$XGAIN= (0..3)
0 0 0 0 
##$XL= 0
##$YL= 0
##$YMAX_a= 245062
##$YMIN_a= -161990
##$ZGOPTNS= <>
##$ZL1= 120
##$ZL2= 120
##$ZL3= 120
##$ZL4= 120
##$ABSF1= 10
##$ABSF2= 0
##$ABSG= 5
##$ABSL= 3
##$ALPHA= 0
##$AQORDER= 0
##$ASSFAC= 0
##$ASSFACI= 0
##$ASSFACX= 0
##$ASSWID= 0
##$AUNMP= <proc_1d>
##$AZFE= 0.1
##$AZFW= 0.1
##$BCFW= 1
##$BC_mod= 2
##$BYTORDP= 1
##$COROFFS= 0
##$CY= 11.3945322036743
##$DATMOD= 1
##$DC= 2
##$DFILT= <>
##$DTYPP= 0
##$F1P= 18.9103706918063
##$F2P= -1.10871071338519
##$FCOR= 0.5
##$FTSIZE= 0
##$FT_mod= 4
##$GAMMA= 1
##$GB= 0.15
##$INTBC= 1
##$INTSCL= 1
##$ISEN= 128
##$LB= 0.24
##$LEV0= 0
##$LPBIN= 0
##$MAXI= 10000
##$MC2= 0
##$MEAN= 0
##$ME_mod= 0
##$MI= 1.114404
##$NCOEF= 0
##$NC_proc= 0
##$NLEV= 6
##$NOISF1= 3.799351
##$NOISF2= 2.8
##$NSP= 1
##$NTH_PI= 0
##$NZP= 0
##$OFFSET= 15.70392
##$PC= 1
##$PHC0= -8863.068
##$PHC1= 16.80096
##$PH_mod= 1
##$PKNL= yes
##$PPARMOD= 0
##$PSCAL= 0
##$PSIGN= 0
##$REVERSE= no
##$SF= 200.130013532006
##$SI= 16384
##$SIGF1= 3
##$SIGF2= 2
##$SINO= 400
##$SIOLD= 16384
##$SREGLST= <1H.CDCl3>
##$SSB= 0
##$STSI= 0
##$STSR= 0
##$SW_p= 3612.71676300578
##$SYMM= 0
##$S_DEV= 0
##$TDeff= 0
##$TDoff= 0
##$TI= <>
##$TILT= no
##$TM1= 0
##$TM2= 0
##$TOPLEV= 0
##$USERP1= <user>
##$USERP2= <user>
##$USERP3= <user>
##$USERP4= <user>
##$USERP5= <user>
##$WDW= 1
##$XDIM= 8192
##$YMAX_p= 0
##$YMIN_p= 0
$$ End of Bruker specific parameters
$$ ---------------------------------
##NTUPLES= NMR FID
##VAR_NAME=  TIME,          FID/REAL,        FID/IMAG
##SYMBOL=    X,             R,               I
##VAR_TYPE=  INDEPENDENT,   DEPENDENT,       DEPENDENT
##VAR_FORM=  AFFN,          ASDF,            ASDF
##VAR_DIM=   8192,          8192,            8192
##UNITS=     SECONDS,       ARBITRARY UNITS, ARBITRARY UNITS
##FACTOR=    0.0002004,     1,               1
##FIRST=     0,             0,               0
##LAST=      1.6414764,     0,               0
##MIN=       0,             -161990,         0
##MAX=       1.6414764,     245062,          0
$$ Real data points
##PAGE= N=1
##DATA TABLE= (X++(R..R)), XYDATA
$$ [...]
2123a113J187J351J50M22P18p25j163j318j56M28O64P70O69N41M86p66j463j200
2141e18k46M45P49M18K66P91n7q68j168j228p5K21L72M44P58N45k37q28j458j031
2161b705N22m7M19M53Q69P16m65q81j034l39J54M3M66J036P54K17r2q22o44k1
2181a401J33j2P57P10J294J73m96p97l31J23j98R6L93J364Q14l56p18n08k35j42
2201F63J05k24J078Q67J45l77j148k15J4m65o03J11J120M40j4n00o45l15l80n81
2221i24m42K29J062O14p09k75l91R5p95m39j58J408K52Q5j06o24J8l36k18o36
2241b290M39Q62Q21L1j29r8k57k45n67LO60J037N24k71L80l32n80j32n88N30Q18
2262F16L82l98P70l70o9r24l25p8J74R07P50j75k0l70j45l87j159K80J075L47
$$ plain form
2123 -1113 74 1425 1575 1997 2715 1990 827 -491 -647 -219 445 1215 1884 2425 2911 2145 682 -518
2141 -518 -764 -319 430 848 1114 1905 1848 980 -188 -1416 -1491 -1270 -898 -454 304 849 612 -216 -1674 -2705
2161 -2705 -2183 -2230 -1811 -1358 -489 227 -238 -1119 -2153 -2492 -2338 -2295 -1829 -793 -39 178 86 -736 -1380 -1401
2181 -1401 -1268 -1280 -523 187 1481 1654 1158 361 30 153 -45 51 444 1808 2622 2266 1548 1040 805 663
2201 663 768 544 1622 2489 2634 2257 1109 894 908 443 -160 -49 1071 1511 1497 997 352 37 -343 -924
2221 -924 -1366 -1137 -75 539 -170 -445 -836 -741 -1536 -1975 -2133 -725 -473 -388 -494 -1118 -1100 -1436 -1654 -2290
2241 -2290 -1851 -989 -168 -137 -266 -364 -621 -866 -1433 -1430 -770 267 791 520 900 568 -12 -144 -732 -202 616
2262 616 998 600 1370 1000 931 7 -318 -396 -222 685 1435 1260 1240 870 725 338 -821 -541 534 881
2282H81K78k42L56k99l58q36q89O99M40Q76Q5k03K81P8j330m33l54M68M09L00
2302B07N97K66k05k16r47q72j86P22M78J51L59N27k66p35r96p02K31L22O62M25
2322a78O62j60l5q99j092l66O28J89N62M20O00P7O9j331r79mL71K14O43R44O62
2343I97P1l04j026n49m6M37k4Q61J208N23Q5q51j019K6k50l10O07Q44P60P01k73
2364B468j234m82k42n57r2L24J084N70L89o58l99q01m96o16l33N59J111L60j11
2383H44o52l30n63o08q66q6N42J106O39j1o30n9r55o27n49L58N59J240M51O1l1
2404a67o49n58n88k26K25J201P86O41P1K27n40m25r79J5Q36Q18M25K29N90l82
2424A550j19p75o76l72Q65N51Q11J42N49r22l54m62r15R2K33J92N01P17J21l14
$$ plain form
2282 881 1159 917 1273 974 616 -220 -1109 -410 30 906 991 788 1069 1147 -183 -616 -970 -502 -93 207
2302 207 804 1070 865 649 -298 -1170 -1356 -634 -156 -5 354 881 615 -120 -1116 -1818 -1587 -1265 -603 -178
2322 -178 484 324 289 -610 -1702 -2068 -1440 -1251 -689 -269 331 408 477 -854 -1833 -1837 -1466 -1252 -609 335 997
2343 997 1068 764 -262 -811 -857 -420 -444 417 1625 2148 2233 1382 363 389 139 -171 436 1280 2040 2741 2468
2364 2468 1234 752 510 -47 -139 185 1269 1839 2228 1570 1171 370 -126 -742 -1075 -516 595 955 844
2383 844 192 -138 -701 -1309 -2175 -2261 -1719 -613 26 15 -615 -674 -1629 -2256 -2805 -2447 -1888 -648 -197 -136 -167
2404 -167 -816 -1374 -1962 -2188 -1963 -762 24 665 736 963 423 -2 -981 -966 -130 688 1113 1342 1932 1550
2424 1550 1431 656 -20 -392 473 1024 1835 1977 2526 1604 1250 788 -127 -35 198 390 891 1608 1729 1415
2444A415j005j010m93K62M75J3N18M64R3k99j121k89n68K56M06L33K97M62O38
2463H47j104o46q20K98q8K22N57O69N07m4o10m23n86R7K10j47N87Q23K53j06m93
2484Cm48j28N5k45J22Q75Q11j79k82m37n01L6j97J89M65K60P66j39n27m28j96
2505a25K08m10m7K72R25K68l62k5k78l38j73n82N14O17O35P7l02j51k34m40M8
2526I7l77N65K97N34j01n87k05jK8p43k00P63O13N0k07m71Jk01j011QJ68M41P72
2549B33m01l24J62n70m11j27n79P52Q79L2m4j60r0j52n56k42l8N39Q68K27J11
2570A09k82L18o59j41q7L33P46L36J69p7j1j76m60J4k48O98O14M47K58l11O18
2591B208r43q86K6K16M16M39K40j51J19k37q98m24k51p3P51R2P9Q8j55n02p47
$$ plain form
2444 1415 410 -600 -1093 -831 -356 -343 175 639 732 433 -688 -977 -1545 -1289 -883 -550 -253 209 847
2463 847 -257 -903 -1723 -1425 -1513 -1291 -734 -65 442 398 -212 -635 -1221 -1124 -914 -1061 -474 349 602 496 3
2484 3 -445 -573 -518 -763 -641 234 1045 866 584 147 -354 -318 -515 -326 139 399 1165 1026 499 71 -125
2505 -125 83 -327 -374 -102 823 1091 729 704 426 88 -85 -667 -153 464 1099 1176 874 723 489 49 97
2526 97 -280 285 582 1116 1015 428 223 222 250 -493 -693 70 683 733 526 55 56 -145 -1156 -1148 -980 -539 233
2549 233 -168 -492 -330 -900 -1311 -1438 -2017 -1265 -386 -354 -398 -558 -648 -800 -1356 -1598 -1636 -1097 -229 -2 109
2570 109 -173 145 -514 -655 -742 -409 337 673 842 765 754 578 118 132 -116 582 1196 1643 1901 1590 2208
2591 2208 1265 379 405 621 1037 1476 1716 1565 1684 1447 549 125 -126 -199 552 644 723 811 656 154 -593
2612e93l95p5J27j9M12L51L14l52l96n97p17j32L92L18J15P44O30l63p30m93p00
2633b159M09L48L92M84P17K82Po55q40M3K06L92O7J099M66q4O3q44l80K1k97J37
2655a26O87Q40K45J93m02m99n78k10l62K51N22O93M17k72l51j073r8m98L94j72
2675c99O57O20N72m46n99l81n46m97J90n1N47J139k63k00m01k44l21m75p7M86
2695f89M01O19K90k15m7o56n50o81J25O86P06M35N5m65J65k16q70l92M22J08Q81
2716A12K72O1n5j57n12r17j71N51L94M09L89O5R0l33o26m98J9J09P89J41L60K42
2738G34L3M1r45k64J70j03N29P46QL60k46k7n78o33L09O8M26K20J11P82m27p06
2760F08m45o4j0K35j78K05O38o3n35l78m15k54L79J52k61k7O19j68l60o50k91
$$ plain form
2612 -593 -988 -1063 -936 -955 -543 -192 122 -230 -626 -1223 -1940 -2072 -1680 -1362 -1247 -503 127 -236 -966 -1459 -2159
2633 -2159 -1750 -1402 -1010 -526 191 473 480 -175 -1015 -972 -766 -374 -307 792 1258 1174 1237 393 13 34 -263 -126
2655 -126 561 1401 1646 1839 1437 938 360 150 -212 39 561 1254 1671 1399 1048 -25 -123 -621 -227 -399
2675 -399 258 878 1450 1004 405 24 -522 -1019 -829 -880 -333 806 543 343 -58 -302 -623 -1098 -1175 -689
2695 -689 -288 331 621 406 359 -297 -847 -1528 -1403 -717 -11 424 479 14 179 -37 -907 -1299 -877 -769 112
2716 112 384 445 390 233 -279 -1196 -1367 -816 -422 -13 376 441 531 198 -428 -926 -907 -798 -9 132 492 734
2738 734 767 808 -137 -401 -231 -334 195 941 949 1309 1063 1036 458 -175 134 202 628 848 959 1741 1314 608
2760 608 163 99 89 324 146 351 989 926 391 13 -402 -656 -277 -125 -386 -413 206 38 -322 -972 -1263
2781a263O9p2J00J26O44J42N0q99j19P0J2m76N17J34O01M12l78k22k21J07p6q4
2803h26K42P66L39M8K9k64J08k03l48N47J57N13M79m80l44J8J77j52l29J7M51
2824I45K18L38k10o50J09k14m89J17K69Q6N50k68m02k95j41k18l74j68M29O63
2844B95j78p1m59k13k38K31p24M06M07M15m7j5l18j73p3q92M22L01M41M70j00
2865a13L1k88r3j91l91O39k6N74J92k46K05jk12n71j92K18L55M28K9K19o9l5k61
2888B01p33K21L40J97M53J94l86M6j77l98o06P38j84K66O18j56L36l00m56l07
2908i3l57k7L03M07P7K38N75m86q51j63k44M30R4J86K26M85k15K3m38m99m88L22
2930d95M33j66O19N17j57p54m30n53J29L38k05M62K91N43k71l89n84l14J21M1
$$ plain form
2781 -1263 -1194 -1266 -1166 -1040 -396 -254 -204 -1103 -1222 -1152 -1140 -1616 -1099 -965 -364 48 -330 -552 -773 -666 -742 -826
2803 -826 -584 182 521 569 598 334 442 239 -109 438 595 1108 1587 1107 763 781 958 806 477 494 945
2824 945 1163 1501 1291 641 750 536 47 164 433 519 1069 801 399 104 -37 -255 -629 -797 -368 295
2844 295 117 46 -413 -626 -864 -633 -1357 -951 -544 -129 -176 -191 -509 -682 -755 -1647 -1225 -924 -483 -13 -113
2865 -113 -82 -370 -463 -654 -1045 -406 -432 142 334 88 293 292 80 -491 -683 -465 -110 318 347 566 497 462 201
2888 201 -532 -311 29 226 679 873 487 533 356 -42 -648 90 -94 172 790 634 970 670 214 -93
2908 -93 -450 -477 -174 233 310 548 1123 637 -214 -377 -621 -191 -97 89 315 800 585 608 170 -329 -817 -495
2930 -495 -62 -228 391 908 751 -3 -433 -986 -857 -519 -724 -262 29 572 301 -88 -672 -986 -865 -824
2950h24p9M28N42J21k63k36m21k41l77K51L03O48O01N2j61k58k63k88pM8p6R18
2972D18M89N4j45j79j61l33j71k32R38L61M76j59j91M1n34o62J77k47O52N87N3
2993A232j50k64k02k87q26j95M48O16j46K4M18k36o16m48n8m63K97M64J81K3R3
3014i5j63l94q54k4j47Q24J18K85K65j10K5n81n3m19N15L02K02K21L66L42m71
3035A54j78o91L72K90N03j9p5K75P33n12n35l43M4J33M41K30J40J86L01o46n90
3056B13j39L7r9J30K67L0M73k30K4p62Ql67M61J2j00M04qk90r9m93j74M43j35
3079c94j98M23M33j52m5n87p1J75j83J95k5M72J9O2m80R7Q0M7k11k9N84pL05o49
3103a39L09l46l5j10k51O58J22K99r6m84k08L66n06k15M69j89N71Q4k45k43j06
$$ plain form
2950 -824 -903 -475 67 188 -75 -311 -732 -973 -1350 -1099 -796 -148 453 505 344 86 -177 -465 -472 -424 -500 418
2972 418 907 961 816 637 476 143 -28 -260 678 1039 1515 1356 1165 1206 672 10 187 -60 592 1179 1232
2993 1232 1082 818 616 329 -497 -692 -244 372 226 250 668 432 -184 -632 -690 -1153 -856 -392 -211 -188 -95
3014 -95 -258 -652 -1506 -1530 -1677 -853 -735 -450 -185 -295 -270 -851 -904 -1323 -808 -506 -304 -83 283 625 154
3035 154 -24 -715 -343 -53 450 431 356 631 1364 852 317 -26 18 151 592 822 962 1148 1449 803 213
3056 213 74 111 12 142 409 439 912 682 706 -56 -48 -415 46 58 -42 362 354 64 -35 -528 -702 -259 -394
3079 -394 -592 -169 264 112 67 -520 -591 -416 -599 -404 -429 43 62 124 -356 -259 -179 -132 -343 -372 212 205 510 -139
3103 -139 170 -176 -211 -321 -572 86 208 507 411 -73 -281 85 -421 -636 -167 -356 215 299 54 -189 -295
3124b95L24k56J14j3j9M22L53m79k71J90L2j56l0Q4L82M7L14l23j20j45k00l01
3146c46L57N49R6l23J70J44j22l10j9k49J50K19L31j94j01j98K20k53o10K4K51
3167b14J22L59k31L19l87m98r1k93J25L08PL88j17j40Qj33n27k45K03O8O87K31
3189e1j46K02j58k79n0k76L93L60R2r4M98J33k14m93Ko0L57L18j6N50j55k5m41
3212D47j68k1J21L25m99O78K24r8k26j69o45J03P6k31O00m3LN38n92m14l14k88
3234e93Q3j29Q2N76r4L79l20l30o88O2K6N1L81pM93nk25M6k34n78K91r1N32L93
3258A01N4k00j15J05j72n24L72K75o3N92M37l97j96n6l31p7k08M07M98K23j03
3279F22q2J28q1n47l59J98L28J8L98O3Kl44j77j36o78L78M15j46N96l21R1l16
$$ plain form
3124 -295 29 -227 -113 -126 -145 277 630 151 -120 70 102 -54 -84 0 382 429 743 420 300 155 -45 -346
3146 -346 11 560 656 333 503 647 525 215 196 -53 97 316 647 453 352 154 374 121 -489 -465 -214
3167 -214 -92 267 36 355 -32 -530 -621 -914 -789 -481 -474 -86 -203 -343 -335 -468 -995 -1240 -1037 -969 -282 -51
3189 -51 -197 5 -153 -432 -482 -758 -365 -5 87 -7 491 624 410 -83 -81 -141 216 534 518 1068 913 888 447
3212 447 279 258 379 704 205 883 1107 1009 783 614 -31 72 148 -83 517 474 477 1015 423 9 -305 -593
3234 -593 -510 -639 -557 19 -75 304 -16 -346 -1034 -972 -946 -895 -514 -521 -28 -33 -258 -212 -446 -1024 -733 -824 -292 101
3258 101 155 -45 -160 -55 -227 -751 -379 -104 -167 425 862 465 269 213 -118 -195 -403 4 502 725 622
3279 622 540 668 587 40 -319 -121 207 225 623 686 688 344 167 31 -647 -269 146 0 596 275 366 50
3301E0j90k74l89O10K2K05M70j3j74j5n41j58Q4K72J67N3J44K5j32R8o81M4m63
3324g86O09K05q5K74K34r3j40n50k18j51O82j0o1l8L86m96O0l35k50K00K13M1
3346c09K12K73l5l32k09k10j09L95N0K31j37J62JO4m30o1L16q1k00O04L30K60
3368G85J2o16l61M19j32j5N09k54J56R4J48j46n23N00k99j13Q5K71O9R9j48l81
3390A59j89J33J02m13L7P4M98j60l62j58P7k72k01PM5N83k62p5j84k07J16J75
3412d77j43o5J57L57k03k3J57k77K55l05o3K94L33K07Kk85J15j7mk48K26J30J23
3435B46Q0K40j16j4j9k57P4K67J86L5P4m91J09P2l21r5%J03M81j88J29k35k09
3458A51k3n4l29R8K73r4J02n9n3j19j48j66j96l4N29m1K70K68m26l30j5o8j43
$$ plain form
3301 50 -140 -414 -803 -193 -171 34 504 491 317 302 -239 -397 -313 -41 126 179 323 348 216 314 -367 -323 -786
3324 -786 -177 28 -57 217 451 358 218 -332 -550 -701 -19 -29 -90 -128 258 -238 -178 -513 -763 -563 -350 -309
3346 -309 -97 176 141 -191 -400 -610 -719 -324 -274 -43 -180 -18 -17 47 -383 -444 -128 -209 -409 195 525 785
3368 785 797 181 -180 239 107 92 601 347 503 597 745 599 76 576 277 164 249 520 589 688 540 159
3390 159 -30 103 205 -208 -171 -97 401 241 -121 -279 -202 -474 -675 -668 -623 -40 -302 -377 -561 -768 -652 -477
3412 -477 -620 -685 -528 -171 -374 -397 -240 -517 -262 -567 -630 -336 -3 204 206 -79 36 19 15 -233 -7 123 246
3435 246 326 566 450 436 417 160 234 501 687 722 796 305 414 486 165 70 70 173 654 466 595 360 151
3458 151 128 74 -255 -157 116 22 124 65 12 -107 -255 -421 -617 -651 -122 -163 107 375 -51 -381 -396 -464 -607
3481f07L66J09n4L10l8k0J46n32j09l5K29L29K58q2R5j69j54k99RJ14J19J34l46
3504b27M40M31j97n03j88k11K20J3N13j12J90j88j60k70J06m35K37L21J51m4M71
3525E58j2p19K64m73J33K0J31QM57R2L7n86m5j60K74k68M56j96O53j22p7l30k11
3548a16J55k05J43P9O8K77J83j98k66l94k43L6K85J8rQ48l41k74l63Q7o0l09r3
3571f92M95J81j43K48j92l5j83l09k75M74L00J92k30q5K18m1m46j88R4J26L36
3592a55L61L6K17l22K7Q3k67q6J37K66K9L58J02l0j67n72J33N1J96o5J25J71J38
3615G66l67l11J30k53j23J77K04O4j07n4n8j6l20Nq3M3K07j15k5J08q9j66k12
3638e95L80l29K69K22l0j70J11j92p6j07L75l73J17L44l1N60l11l27N7r1J70K03
$$ plain form
3481 -607 -241 -132 -186 124 86 66 212 -320 -429 -464 -235 94 352 270 365 196 42 -257 -248 -134 -15 119 -227
3504 -227 213 644 447 -56 -244 -455 -235 -222 291 179 369 181 21 -249 -143 -578 -341 -20 131 87 558
3525 558 546 -173 91 -382 -249 -229 -98 -90 367 459 496 -90 -135 -295 -21 -289 167 -29 624 502 425 95 -116
3548 -116 39 -166 -23 56 124 401 584 386 120 -274 -517 -481 -196 -178 -187 661 320 46 -317 -230 -290 -599 -692
3571 -692 -197 -16 -159 89 -103 -138 -321 -630 -905 -431 -131 61 -169 -254 -36 -77 -523 -711 -617 -491 -155
3592 -155 206 242 459 137 164 247 -20 -106 31 297 326 684 786 756 589 17 150 201 397 332 457 628 766
3615 766 399 88 218 -35 -158 19 223 287 180 126 68 52 -268 -263 -346 -303 -96 -211 -236 -128 -217 -383 -595
3638 -595 -215 -544 -275 -53 -83 -253 -142 -334 -410 -517 -142 -515 -398 -54 -85 475 164 -163 -106 -197 -27 176
3660A76l12K16J2L12j49j85q8M9jK41K0J17j51J13o4q4r1J67k28j32L90Q5j62
3683B51p4M2j33l99K83j54j20O09m31j7M39k24R9m19J09j56M31N8J1j79l19K43
3705e0k2J73j28J74j00PJ01J68J63n57J36n62N09Q3NK83L2j79k34Q4j76j88K82
3728Dj09L45j92O0m2l00K52j64l93M23k6m3O96l97l31m5l4J29l70J98J28K22M0
3751E1k34K28R9l72k08K03K49j34M6K34p1M8ko3J57m30M10K88j1j11O4j35j52
3774A54k63J46N2J57J94l41L35o2K14m26k11L3k52L05L63k33J02k00J2n03j33
3795e57J00Q3J80K11j31q4K65l80k72O1Nj86M82J93J40J88l79m87J99j94K14k33
3817e82L92R4L1M92l42j95k5j49K21Q5K20O5r4K93l43O5k97k2L1l6P05k3J90k32
$$ plain form
3660 176 -136 80 92 404 255 70 -18 31 30 271 291 408 257 370 306 222 131 298 70 -62 328 413 251
3683 251 177 219 86 -313 -30 -184 -304 305 -126 -143 296 72 171 -248 -139 -295 136 194 205 26 -293 -50
3705 -50 -72 101 -27 147 47 54 155 323 486 -71 65 -497 12 95 100 383 415 236 2 86 -90 -278 4
3728 4 -105 240 48 108 66 -234 18 -146 -539 -116 -142 -185 511 114 -217 -262 -296 -167 -537 -339 -211 11 51
3751 51 -183 45 144 -228 -436 -233 16 -118 -72 162 91 139 137 74 231 -199 211 499 488 377 441 306 154
3774 154 -109 37 89 246 440 99 434 372 586 160 -51 -18 -270 35 398 165 267 67 79 -424 -557
3795 -557 -457 -374 -194 17 -114 -198 67 -313 -585 -524 -519 -705 -223 -30 110 298 -81 -568 -369 -563 -349 -582
3817 -582 -190 -96 -65 427 85 -110 -135 -284 -63 22 242 307 213 506 163 228 -69 -91 -60 -96 609 586 776 544
3841E44j95l34j59j30K60K83j51NL10k43jl38k9jj52K00O8K11o5O7k28j33j22
3864c33k66K44n8M08PJ09k70n5J23j31k09Q8M8J70J22k2L47m69M12k97j01m3J75
3887aK62kj17J73k11r1m88M23J36j6L67k29J77j16J2m61J23K7J12l7j10J91j60
3910c6L23j84j37M8m12K61J49j93K98J5k14J78l54J9J18J06p1L4K39L04o65K54
3932H0j36N2P4K16j45q0rJ82J94l32L8k10J83LP5m7L34j95j70j48J25m07L54j53
3956a22L6J55K27l0m08n1l26M31n24L92R4K98k97j36j04J80k02K21q4J24K78k63
3978a11J74j17j46J19k23j95L46l39O34j42K19l34k5L8o6O07m86L27R2q4M3l63
4000c2L44l08o3J69J40j07N17k97m24M93m53J87q8k55j10N52r9j28j56q1P6r2
$$ plain form
3841 544 349 15 -144 -274 -14 269 118 123 433 190 189 -149 -178 -179 -331 -131 -63 148 83 150 -78 -211 -333
3864 -333 -599 -355 -413 -5 2 111 -159 -214 -91 -222 -431 -343 -295 -125 -3 -25 322 -147 265 -32 -133 -176 -1
3887 -1 261 259 142 315 104 13 -475 -52 84 68 435 206 383 267 279 -182 -59 -32 80 43 -67 124 -36
3910 -36 287 103 -34 14 -398 -137 12 -181 117 132 -82 96 -258 -239 -121 -15 -86 -52 187 491 -174 80
3932 80 -56 -4 70 286 141 61 52 234 428 96 134 -76 107 110 185 138 472 277 107 -41 84 -323 31 -122
3956 -122 -86 69 296 266 -142 -193 -519 -88 -612 -220 -126 172 -125 -261 -365 -185 -387 -166 -250 -126 152 -111
3978 -111 63 -54 -200 -81 -304 -499 -153 -492 142 0 219 -115 -140 -102 -168 439 -47 280 372 288 331 -32
4000 -32 312 4 -59 110 250 143 660 363 -61 432 -21 166 78 -177 -287 265 166 38 -118 -199 -123 -215
4022b15K91j12J28l07R4J15n8k4j39K2j33k6K05k5K92l63q5J83k73J53j5R4p3
4045b71J15K33k95J26M5p2m5L82j14J43J53j22L1k14P1m25J66K64m5P6K2r3L1
4068A62L8l6k64K73km5Q5P4l94K53m64L01k92m3K51J67j36J8R7J6k80k66J39J02
4092b46J72J11R7l32J94n5j38k45L09p5J05J09K7L78m33K31j60r1j75M17K46k49
4114A97J3J28M7k61l19J94J27qK1n5N24k37J22l05j94k87J25l2R1K17K16l40J44
4137A28n37K42j86j96M71O1j45L0J66k6m2k80O1K45l7M0j15L91j82J03j88k89
4159b85K19O8OJ40j47J68Lj52N4k07J48o8J72K39O9p0l26K66k40j01J19l02l6
4182b63M97k17L97j96m48J08K28k83k31L16j5J19j64L5J90k85Nk12qK57J26L1
$$ plain form
4022 -215 76 -36 92 -215 -121 -6 -64 -88 -227 -205 -338 -364 -159 -184 108 -255 -340 -157 -430 -277 -292 -198 -271
4045 -271 -156 77 -218 -92 -47 -119 -164 218 104 247 400 278 309 95 166 -259 -93 171 126 202 224 131 162
4068 162 200 164 -100 173 171 126 211 285 -109 144 -320 -19 -311 -354 -103 64 -72 -54 43 59 -221 -487 -348 -246
4092 -246 -74 37 134 -198 -4 -59 -197 -442 -133 -208 -103 6 33 411 -22 209 49 -42 -217 200 446 197
4114 197 210 338 385 124 -195 -1 126 118 139 84 608 371 493 188 -6 -293 -168 -200 -109 108 324 -16 128
4137 128 -409 -167 -353 -549 -78 -17 -162 -132 34 8 -34 -314 -253 -8 -45 -5 -120 271 89 192 4 -285
4159 -285 -66 2 8 148 1 169 172 20 74 -133 15 -53 119 358 427 357 31 297 57 -44 75 -227 -263
4182 -263 234 17 414 218 -230 -122 106 -177 -408 -92 -107 12 -152 -117 73 -212 -207 -419 -427 -170 -44 -13
4204a3k63J75J06k27m1K4j38L55J5J42k37L81kj04l55K13n5J17J21M7K96l65p
4227A85j39J09k54L07q7j4J34K3J7p7k97L16j57J09k40J31R0N2j98k10K47k04
4249a57K50m5n3j38J35L71j61m28J29j10n6K53k27J71jJ13J0j15N0Q9k62M6p1
4272b07M94Q5l42j02k12J20l21L80K14k01K34J61l50Q0j56o3K35Q0O8j59K81k81
4294C8J00j55K22j66l36K36K86J21J5j03j83m23J71j1p3J7L78J2j8j27j15L5j13
4317a92L3L9q9K16P8K3J9O5m61K46k62K66kk46L55k96L45k3J8P4k12r4N06r2k04
4342A10l2L9J57k93j46L95k99K39K1j23J1j1J16P1m36m7J26O0L18k91K67m70q
4365b26k66OJ89J15M1Q6L53k84j6m45N66l5p1k3K7k8K67m7k54P3l95M35J02M82
$$ plain form
4204 -13 -276 -101 5 -222 -263 -239 -377 -22 -7 135 -102 279 277 173 -182 31 -24 93 214 261 557 192 185
4227 185 46 155 -99 208 121 107 241 264 281 204 -93 223 66 175 -65 66 156 208 10 -200 47 -157
4249 -157 93 48 -5 -143 -8 363 202 -226 -97 -207 -263 -10 -237 -66 -67 46 56 -59 -9 80 -182 -136 -207
4272 -207 287 372 30 -72 -284 -164 -485 -105 109 -92 142 303 -47 33 -123 -186 49 129 197 38 319 38
4294 38 138 -17 205 39 -297 -61 225 346 361 258 75 -348 -177 -188 -261 -244 134 146 128 1 -114 -79 -192
4317 -192 -159 -120 -209 7 85 108 127 192 -269 -23 -285 -19 -21 -267 88 -208 137 114 132 206 -6 -100 406 314 110
4342 110 78 117 274 -19 -165 230 -69 170 191 68 79 68 184 255 -181 -228 -102 -42 276 -15 252 -218 -226
4365 -226 -492 -486 -297 -182 -141 -55 298 14 -2 -447 119 84 13 -10 17 -11 256 209 -45 28 -367 68 170 652
4389F52l53K71j73k59k67K71l01K50k3O9J73j7m4N4m75j97J91L81j39L1K59l45
4411IK40k96J49Ml24K7N18n25K60m5K3k5l44K5l1P8k27M74k82J97J94j31k20J72
4435h0o7m6L5J05K07J73l45k6k5Q8J30J2l56K70J48j01J58R7l61J72k37p9L63
4458B35o9L43j12m60J39N9j22j25J23K8p3OK24L3k6l96L03l79K48m4J05K88l12
4481A6M9l43K24l5m6K7j33J03j49M43k63P8J87n92K52K34k73J67K61l89L19m2
4503I5j93O0r5K33J2J7k2J38k36Q3j5k63K70k12J68Q9K01j19l53J31j27N4K1J22
4527E9j46J77J19j7k97k60N38m19L15J0n1K67n57J07j22M34p7j69K28j47o3N7
4549a4Q9j39Q6k1j67K80n08O21K0j31J44q3k14K91k43q3K58j70J2L1j46J26K07
$$ plain form
4389 652 299 570 397 138 -129 142 -159 91 68 137 310 293 249 303 -172 -369 -178 203 64 95 354 9
4411 9 249 -47 102 106 -218 -191 327 -198 62 17 40 15 -329 -304 -335 -257 -484 -10 -292 -95 99 -32 -252 -80
4435 -80 -147 -193 -158 -53 154 327 -18 -44 -69 19 149 161 -195 75 223 122 280 377 16 188 -49 -128 235
4458 235 166 509 397 -63 76 135 13 -112 11 39 -34 -28 196 229 203 -193 110 -269 -21 -65 40 328 16
4481 16 65 -278 -54 -89 -135 -108 -241 -138 -287 156 -107 -29 158 -434 -182 52 -221 -54 207 -182 137 95
4503 95 -98 -38 -133 100 112 129 107 245 9 92 77 -186 84 -128 40 129 330 211 -142 -11 -138 -84 -63 59
4527 59 -87 90 209 192 -105 -365 173 -246 69 79 28 295 -262 -155 -277 157 80 -89 139 -8 -71 -14
4549 -14 75 -64 22 1 -166 114 -394 227 247 116 260 177 -37 254 11 -72 186 16 28 59 -87 39 246
4572B46L2l13m39P59k16k2l6K28m68J03K84k81l04L67j82j11J81l9O3r5Q9q9M2
4595b01J05P6J20N7r7l17J92L36l39N8P5p0nk2o8N3j47J56J01p5m5j58L43J44
4619B72k19N0J40nj00K57j31j77J52j6q3k81J18l44N09r4N7K82j78j56r3k3n4
4642a17j59L00k04R7j4k53J64K06j12P9ql90K43Q9r4R1J1k83j7L20r1k6J67K2
4666B1j15L45m09M10k84j93K29J08o6r8K22o9J13Q8j78l95M07r2MK04J31l09Q0
4689A54k3l13K22l45J97R1J53k47l5j14K37j48k7Q4q2O0J69Q1k25L2o1p2L0J36
4713d6J28J40j46k84L25n91N14j33j05K07K5P9K11k86L56j90l39j08M12r3j40
4734f4k4L78j46k66J19k63Q0K64J44n18J79L98q6j76j17m9j98K34J25j6n0L1L7
$$ plain form
4572 246 278 -35 -474 285 69 47 11 239 -229 -126 158 -123 -427 -60 -242 -353 -172 -211 -148 -243 -154 -243 -201
4595 -201 -96 -20 100 157 60 -257 -65 271 -68 -10 65 -5 -10 -32 -100 -47 -194 -38 63 -12 -57 -215 128 272
4619 272 53 103 243 238 138 395 264 87 239 223 140 -141 -23 -367 142 48 105 387 209 53 -40 -63 -117
4642 -117 -276 24 -180 -83 -97 -350 -186 20 -92 -13 -21 -411 -168 -79 -173 -82 -71 -354 -371 -51 -142 -168 -1 21
4666 21 -94 251 -158 252 -32 -225 4 112 46 -52 170 101 214 302 124 -271 136 44 48 252 383 74 154
4689 154 131 -182 40 -305 -108 -17 136 -111 -146 -260 -23 -171 -198 -114 -196 -136 33 114 -111 -79 -140 -212 -182 -46
4713 -46 82 222 76 -208 117 -474 40 -93 -198 9 34 113 324 38 394 204 -135 -243 169 76 -64
4734 -64 -88 290 144 -122 -3 -266 -186 78 222 -296 -117 281 195 19 -98 -147 -345 -111 14 -2 -52 -21 16
4757A6k37J64q7k50K45K6j71K01M5M2k97K62l51M82j20p7l5j79L11K43j34o8m2
4780a1J37PL9p6J93k30NJ27O1J98r6l18J45o0J29j61P5j02j06P0j46K95k05P4
4804D4j4J58j75n6Q8n1M0k44K79J2j53n8K07j48J08n07J83o3J09J15o7K86j38
4827d5P8j54J77J5j67JK67j62K49q7k43m4n1J51K38q0j27M51j15k96k40L16j61
4850b9K61k31j02J17Q4K80j51m03M33l70J56Q0k90K93Nk68K87j24J39m44K17K07
4872A47j69K00j32k60q7m7K22K35m8oM8j46k24K72j00j01J86J89m29K53L17m38
4894a18K92o5j77k51N43k93K44j3L0m5r8K43Mj71K9l96K90j62L12k88K8L14j12
4917A40k80J17K75n00K60R5j5l33K11o1J55m3k95J96K23l34M65l04j56K1m1M07
$$ plain form
4757 16 -221 -57 -144 -394 -149 -123 -294 -93 -48 -6 -303 -41 -392 90 -30 -107 -142 -321 -10 233 99 31 -11
4780 -11 126 133 172 96 289 59 64 191 252 450 354 36 181 121 250 89 164 62 -44 26 -120 175 -30 44
4804 44 30 188 13 -43 45 -6 34 -210 69 81 -72 -130 77 -71 37 -470 -287 -350 -241 -126 -193 93 -45
4827 -45 33 -121 56 71 -96 -95 172 10 259 172 -71 -115 -166 -15 223 143 16 467 352 56 -184 132 -29
4850 -29 232 1 -101 16 100 380 229 -174 259 -111 45 125 -165 128 133 -135 152 28 167 -277 -60 147
4872 147 -22 178 46 -214 -301 -348 -126 109 61 55 103 -43 -267 5 -95 -196 -10 179 -250 3 320 -118
4894 -118 174 109 -68 -319 224 -69 175 162 192 147 49 292 296 125 154 -242 48 -114 198 -90 -62 252 140
4917 140 -140 -23 252 -248 12 107 92 -241 -30 -91 64 21 -274 -78 145 -189 276 -28 -184 -163 -204 203
4939B03n2r5l06M91l11O0k43K89J84j12j10j57J36j35J4L07n1j04K56l05J25l00
4961b16M10k31M2L6q3q6J05j47j11L82j43K61l93q1J61j01K56r1N8r1k26M02m06
4984b93j0M39R4j73m15N15j83o8K15k03j23O9j11K26L2J11l42J49Nj90O35k22
5006A57j69J4J78M5j2P4o3l07P4K57k54q9q7J98J70k06K67j74o5L36m13J17j99
5029a51K72mq8j94M42l52L9J54M9l35L59l11n8M69m62K25n8k41o7J51J90j78j9
5052a68j43N03j67q3j95L87j04K07k63K01j88o1K48k27N5o6M1l47O42m18J47J33
5074A34j97Mj77O7O14K7o3p39M26N7k8p9m5lj54K52j04j54M50j52k64J00mL6L9
5099D3K17l26K71j59j90k23L07k32J06J36M5m5Nm0j7j8k82M32K22l51k5O1J08
$$ plain form
4939 203 151 56 -250 241 -70 -10 -253 36 220 108 -2 -159 -23 -158 -144 163 112 8 264 -41 84 -216
4961 -216 194 -37 5 41 -42 -128 -23 -170 -281 101 -42 219 -174 -255 -94 -195 61 -30 28 -63 -289 113 -293
4984 -293 -303 136 230 57 -358 157 -26 -94 121 -82 -205 -136 -247 -21 11 122 -220 -71 -66 -256 379 157
5006 157 -12 2 180 225 213 287 224 -83 -9 248 -6 -95 -182 16 186 -20 247 73 8 344 -69 48 -151
5029 -151 121 117 29 -165 277 -75 -36 118 167 -168 191 -120 -178 291 -171 54 -4 -245 -312 -161 29 -149 -168
5052 -168 -311 192 25 -58 -253 134 30 237 -26 175 -13 -74 174 -53 2 -64 -23 -370 272 -146 1 134
5074 134 -63 -59 -236 -169 445 472 409 -330 96 153 125 46 1 -2 -156 96 -8 -162 288 136 -128 -28 -32 4 43
5099 43 260 -66 205 46 -144 -367 -60 -292 -186 -50 -5 -50 -45 -85 -102 -120 -402 30 252 -99 -124 -63 45
5122D5j64K35J10l09K25o1J00j93k66O85j23m54J79p6l7K2P7%K68j78r0j09OK8
5146h0j91M74p3p6J60q8m57L88j49j85N81n70K15l6M7O9j25P3J4o4L84l33p6J34
5170C6K16l1o7k42j34K85Np5J39j38r5K47o2k2lJ39k01j1J56L0mk20J16Q7o3Q3
5196A71k13M5K41l67J47O2j29m31M99L7j51jK93m80J88M4K50k90m9J75k24q6O03
5219C34k86m10L69k90P2j7J50J68m28L23k1o8K03j7k9n4J46j8J91j60j38l1L50
5242C39o49L69l9J12j08N8Q9l17J85m1J07j21N3J45j2j24MKo1r3JL1l75L54k34
5267c25L92k71L5j24J5o7j23L57p1M13l78L35l74J56J68m38L67j64j71L20O9k9
5289I2k13J45n5J80k74K03O8q5J22r3j84N51j15o25K64n6M13l79M02n32K2J75
$$ plain form
5122 45 -119 116 226 -83 142 81 181 -12 -278 407 284 -170 9 -67 -104 -82 -5 -5 263 85 -5 -114 -108 -80
5146 -80 -271 203 130 54 214 126 -331 57 -92 -277 304 -266 -51 -87 -40 29 -96 -23 -9 -73 311 -22 -98 36
5170 36 252 221 154 -88 -222 63 68 -7 132 -6 -101 146 84 62 59 198 -3 -14 142 172 168 -52 64 151 88 171
5196 171 -42 3 244 -123 24 86 -43 -474 25 62 -89 -90 203 -277 -89 -45 205 -85 -134 41 -183 -269 334
5219 334 48 -362 7 -283 -211 -228 -78 90 -338 -15 -36 -104 99 82 53 -1 145 127 318 158 20 -11 339
5242 339 -310 59 20 132 24 82 171 -146 39 -2 105 -16 37 182 170 46 50 52 -9 -102 -101 -70 -445 -91 -325
5267 -325 67 -204 -169 -293 -278 -345 -468 -111 -182 231 -147 188 -186 -30 138 -300 67 -97 -268 52 121 92
5289 92 -121 24 -31 149 -125 78 146 61 183 90 -94 457 342 -283 -19 -75 338 -41 361 -171 -149 26
5311B6pJ83k80L96m08mL42j52k52J73p1j80P3L37k68K5L93o25J64j05R1J02K8
5334a9%j68j9P6J00R2k20R2J88j99L2N7j9N8RQ3n5J26K1l86M62l51J08j01K81
5359B48m32K21J05J1p6j30j4K50j55K05ll52J52QqR3m03L86jk78j8J47p1q2j9
5384b16M8pL45l9n1j50N0L08m09k8M8P6l8K47N0l14o7K4L36r0j93K51j69Kn9J8
5410b7L42l30K32j97R7K72l98J69k4m83K51K20j51r0j9Q0J94k76Q6q2J16J62l68
5433b24kK17Q4k3k32r7L46k56k89L04K96n54N73k7M0k21j3K36j29k18j29O13j30
5456A65j07L4j42J14RK55PJ4j76J0p2k2Pl13J94j33J32K38K5k86L4M3l4k9J90
5481A57j23J59j1j82n5J9j87R5K40j34k70R3R0j69K45L35k83j85K33K2j80K55
$$ plain form
5311 26 19 202 -78 318 -90 -94 248 96 -156 17 -54 -234 -161 176 -92 -67 326 -299 -135 -240 -149 -47 -19
5334 -19 -19 -187 -206 -130 -30 62 -158 -66 122 -77 -45 12 -7 51 60 143 88 214 235 -151 311 -40 68 -33 248
5359 248 -184 37 142 153 77 -53 -67 183 28 233 230 -122 30 38 30 123 -280 106 105 -173 -191 -44 -115 -197 -216
5384 -216 -168 -175 170 131 80 -70 -20 288 -121 -149 -101 -25 -63 184 234 -80 -147 -123 213 123 -70 181 12 14 -45 -27
5410 -27 315 -15 217 20 117 389 -9 160 136 -347 -96 124 -27 -117 -136 -56 138 -138 -52 -134 -18 144 -224
5433 -224 -226 -9 75 52 -180 -277 69 -187 -476 -172 124 -430 143 116 156 -65 -78 158 29 -189 -318 295 165
5456 165 58 92 -50 64 73 328 335 349 173 183 111 89 96 -217 -23 -156 -24 214 239 -47 -13 30 -4 -33 157
5481 157 34 193 182 0 -55 -36 -223 -128 112 -22 -292 -199 -109 -278 -33 302 19 -166 67 89 -91 164
5503A64k54k28M78m67K16K19j19k16k4N6J23K33m42K21q4K22o9l74N40l01J81
5524G5M75n11o3LR0j68kj38O06n6k93K06l77J06J4Q4j67j3n1R3n5L4j05J04J65
5549E6o6J22r4K54J08l31j81J15j01j01j83N20NP2j14l15K70j29l8j69M31L4k62
5572i7R5l5L65k90j14R4r0K08k30K09K45m94L04j87J60k22J13r4k40N71l77L25
5594B19k94o5J37k25J2N46l39k36J81R7j22j16M80l64l8P9J0J23j23R6p7R8l2
5617D7p4L0K21k14k96L30k82K92l4j88K08q7P7L5kj12L19l01K54n6N1P7ql11J63
5642A39J8M8J26r3j9l58L3m3J54K5j47K76l01K53j65j48L24l02J72j86J38j55
5664b11K19l64k0M40k1j64J17M5j03j1k4K54m54k2L52j79J16K21k76J26MJ31q7
$$ plain form
5503 164 -90 -318 160 -307 -91 128 9 -207 -231 -175 -52 181 -261 -40 -124 98 29 -345 195 -106 75
5524 75 550 39 -24 -21 69 -99 -101 -239 367 311 18 224 -153 -47 -33 51 -116 -129 -180 -87 -142 -108 -213 -109 56
5549 56 -10 112 18 272 380 49 -132 -17 -118 -219 -402 118 123 195 81 -234 36 -93 -131 -300 131 165 -97
5572 -97 -2 -37 328 38 -76 18 -72 136 -94 115 360 -134 170 -17 143 -79 34 -60 -300 271 -106 219
5594 219 -75 -140 -3 -228 -216 330 -9 -245 -64 33 -89 -205 275 -89 -127 -48 -38 85 -38 58 -19 79 47
5617 47 -27 3 224 10 -286 44 -238 54 20 -168 40 -47 30 65 63 -49 270 -31 223 167 218 295 287 -24 139
5642 139 157 205 331 238 219 -139 -106 -149 5 30 -117 159 -142 111 -54 -202 122 -180 -8 -194 -56 -211
5664 -211 8 -356 -376 64 43 -121 -4 41 -62 -73 -97 157 -297 -319 33 -146 -30 191 -85 41 45 176 89
5687H9m48K24K47k8m1K9oK66j79l44K18j5J15o0K87l37k44K35K70k36O6J42j51
5710I9j13J63j31l0j79J86j54R8J31l63M72l69J02K75m79R3K61k49K06l35K44
5731g2j6j8r2K01K78k08k85J58Q5J30l68J93L68k58Pl0j33K30k23o0P7J04N2J05
5755B25j66P2k25Q2J78k23J14k99K38k56K96k07M2j81M96m42M90n25P5K70Q3k14
5777g7m1K12j97K01l25K30l04j13K94J21l11N06k60P3J26k14K45j72j80J82K24
5798B20k11O0q3K17K2l20l2K09m9L16k51j50q7L6L01j15n0O6q1k67L53j03k29
5821b28K27l4J70l03J69n6J96j13J50l89J21J1p5p9M26j07q4M5l33M50l59K31
5843C6P5m5O9l4k24K86p4j00m6Q2J10J4j36R3j63K48k31K85k93K12q1J37J4pQ3
$$ plain form
5687 89 -359 -135 112 84 43 72 66 332 153 -191 27 12 127 67 354 17 -227 8 278 42 108 250 99
5710 99 -14 149 18 -12 -191 -5 -159 -61 70 -293 179 -190 -88 187 -292 -199 62 -187 19 -316 -72
5731 -72 -88 -106 -198 3 281 73 -212 -54 31 161 -207 -14 354 96 103 73 -60 170 -53 -113 -36 68 120 225
5755 225 59 131 -94 -12 166 -57 57 -242 -4 -260 36 -171 -129 -310 186 -256 234 -291 -216 54 137 -77
5777 -77 -118 94 -103 98 -227 3 -301 -414 -120 1 -310 196 -64 9 135 -79 166 -6 -186 -4 220
5798 220 9 69 -14 203 225 -95 -127 82 33 349 98 -52 -139 -103 198 83 33 99 18 -249 104 1 -228
5821 -228 -1 -35 135 -168 1 -55 141 28 178 -211 -90 -79 -154 -233 193 86 2 47 -286 164 -195 36
5843 36 111 66 135 101 -123 163 89 -11 -57 25 135 149 13 106 -57 191 -40 245 -48 164 83 220 234 227 310
5868C10k58j79K24R8l8k31j35O5L04m66L16k7K04J27l43p5K14k78m3R1j9R8q2
5891a23K29q3K69m56K20j37j0L5j38lJ81l2p8K3k0M4J45r4K18k80o4Q1R2J35j58
5916dN7R9m02M14N7j18l70J64K52m4m12L92J03k08J02q8J46q2L33k82q5k8RN9
5940F4kN0m93K98K92l62L13l09M73m58n0M2n5L89j55R7k22R2J1J00j83rj12j27
5964c16J72L02n3oj19N5m0J31m0j1m0k21k6K89J30n2j47Q1j06j62l7M75m96L26
5988H9q2j09JL14q2k31M4r9K68j80J16L27p59L19o9R2J21p8K32n67M76l07K89
6011A25k36L34k42K2N9J54K3k10j49J52R0j13Q3k94L15j42J00R2j36j84L65J32
6033C40k33K37m33K52R1r8j03Qj39Q3j66N2j0K11k12L5L0mL9l7L51j10j97j49
$$ plain form
5868 310 52 -127 97 195 157 -74 -209 -144 160 -306 10 -17 187 314 -29 -104 110 -168 -211 -120 -139 -41 -123
5891 -123 106 23 292 -164 56 -81 -91 -56 -194 -197 -16 -48 -126 -103 -123 -79 66 -28 190 -90 -154 -73 19 154 -4
5916 -4 53 152 -250 164 221 103 -267 -103 149 105 -307 85 188 -20 82 -6 140 58 391 109 24 -4 5 64
5940 64 62 112 -381 -83 209 -153 160 -149 324 -134 -184 -142 -197 192 37 134 -88 4 15 115 -68 -77 -189 -316
5964 -316 -144 158 105 99 -20 35 -5 126 86 75 35 -186 -212 77 207 155 8 89 -17 -179 -216 259 -237 89
5988 89 7 -102 -101 213 131 -100 -56 -155 113 -67 49 376 -383 -64 -133 -41 80 2 234 -333 143 -164 125
6011 125 -111 223 -19 3 62 216 239 29 -120 32 122 9 92 -202 113 -29 71 163 27 -157 208 340
6033 340 107 344 -89 163 254 156 53 61 -78 5 -161 -109 -119 92 -120 -85 -55 -59 -20 -57 294 184 -13 -162
6057a62J55R0M5j68j93j81K34J48l7l75O88m05L08m5j04J12k22J13k28J63K78
6078B14k24j52L04l81K29p1J03k87K60J88m2m5j45k1J3o8L66m9k1m02K25n3j11
6101a70j25L36j39K56j83L01n19m8J70L9j32J65R4l68M37m4l67Q7J92l08M41l55
6123b40K14nJ70l93J34J43j75J29n7J4L18l88K08L8j79J0l2L79j06m4p4M5j25
6146a6J5LPm8L36j36r5J99k1k55K18k35L3k27J70L31m12J32k74O40o63J33K18
6169E3n6j10l7j45L33L07q4l65J45J41l8l52J77J23k69J17J61q7rl10J70J62j23
6192i6K02j52O0n1N2l7Q9j6J3Q8p9m5j34K28l49Q2q4M53m42L36j95Q6K58j97j62
6217i2q6L69j22L7j58M8pn5J15N3l53J82p6J11K02k64K14P0k24K25j05q0l47M89
$$ plain form
6057 -162 -7 83 128 -40 -233 -414 -180 -32 -69 -444 244 -161 147 102 -2 110 -112 1 -227 -64 214
6078 214 -10 -162 142 -239 -10 -81 22 -265 -5 183 141 96 -49 -70 -57 -125 241 192 171 -231 -6 -59 -170
6101 -170 -295 41 -98 158 -25 276 -243 -291 -121 -82 -214 -49 45 -323 114 70 -297 -210 -18 -326 115 -240
6123 -240 -26 -31 139 -254 -120 23 -152 -23 -80 -66 252 -136 72 110 -69 -59 -91 288 182 138 64 109 -16
6146 -16 -1 2 9 -39 297 161 66 265 244 -11 207 -28 5 -222 -52 279 -133 -1 -275 365 -298 -165 53
6169 53 -3 -113 -150 -295 38 345 261 -104 41 182 144 -208 -31 92 -177 -60 101 14 5 -305 -135 27 -96
6192 -96 106 -46 14 -37 15 -22 67 51 64 152 73 28 -106 122 -227 -145 -229 224 -218 118 -77 9 267 70 -92
6217 -92 -178 191 69 106 -52 -4 -11 -66 49 102 -251 -69 -145 -34 168 -96 118 188 -36 189 84 4 -343 146
6241A46K9j53J75m3L8j65j53J32R1J77n38M64k08J47l25J21j43J69J62m4j36k79
6263c36M01J45K77m90L7r3J58j60p4R2J1P4m05L56j84K68L7j23r8J24l1o6K41
6286A61m60K73p6k81Q1M67j13o9K29j90Mk00L4J67j7N6l1j63K34M6P1M3j54J72
6310B84l92k8j57J78J9K28K2j42J8j05L06k7k58L93m49J83k70M64n36N52j87j26
6332c0m6R6J80j48qK16k07p2l3j7r7Q7j15K48k10K30n1p6k0M4J70j91n3K08l3
6357G2N7k18j02J31lQ4J55L9rj47j17k2J77j29j09j05K16P3o4j92J38J13J2l7
6381A3J42j63j91J09MR7J12k80K92k10J46l1J45j98j21j7L6l8L40k58Q8J54l23
6404a52M07m48P9j57M3L6J10J91K60j68k29K9j6K82l12%J50j25J21j05R1R3k23
$$ plain form
6241 146 175 22 197 154 192 27 -126 6 97 274 -264 200 -8 139 -186 -65 -208 -39 123 79 -57 -336
6263 -336 65 210 487 -3 34 -59 99 -61 -135 -43 -32 42 -363 -7 -191 77 114 -9 -107 17 -14 -80 161
6286 161 -299 -26 -102 -383 -302 165 52 -17 212 22 26 -174 -140 27 10 66 35 -128 106 152 223 266 112 284
6310 284 -108 -136 -293 -115 -96 132 154 12 30 -75 231 204 -54 339 -110 73 -197 267 -269 283 96 -30
6332 -30 -76 20 200 52 44 260 53 -19 -52 -69 -166 -79 -194 54 -156 74 23 -53 -73 -29 141 -50 -103 105 72
6357 72 129 -89 -191 -60 -63 21 176 215 206 59 -58 -80 97 -32 -141 -246 -30 43 -21 -213 -75 38 50 13
6381 13 155 -8 -199 -90 -86 11 123 -157 135 -75 71 40 185 -13 -134 -151 -115 -153 187 -71 17 171 -152
6404 -152 255 -193 -114 -271 -228 -192 -82 109 369 201 -28 1 -15 267 -45 -45 105 -20 101 -4 87 180 -43
6427d3K05q7Q4J46k05j69k30J59M27l12O7K51k71n2M52m47K86j32l8k33J6L0J39
6450D3p4N0J48j98j76K07J66l00J79r1M17l59j85K22k50L28k36L26m39M7N79k71
6472A33m7j65K48j21j39J30m4J88n41M23L74m80K19K4K6J69m74J96l7PJ70o3l85
6495a89L13j45l3n6K9N0j57K03K18k39K5j21k80L66J25l10L19k49j84M49l44K53
6517D3l27J94m5m7J24j00L7J48m2ML33k30m7M3J01l48L54l62M9O6K76n03K62j50
6541a67O0J74J7R5j64j42j3L1L35k96J57n7l44M99l5J10j25k49j54J80J62l90
6563c16L22Q0j56O6R6n1l6n8r0P5j10K57j12R8j61J10J47J12m92N57p8j12r6k33
6587a81L20k13N8k48L00P3k76J84k64L28m43K57n4K00q5L01l44K20l24J04J00
$$ plain form
6427 -43 162 75 159 305 100 -69 -299 -140 287 -25 42 293 22 -30 422 -25 261 129 91 -142 -126 -96 43
6450 43 -31 19 167 -31 -207 0 166 -134 45 -46 371 12 -173 49 -201 127 -109 217 -222 -175 404 133
6472 133 86 -79 169 48 -91 39 -5 183 -358 65 439 -41 178 202 228 397 -77 119 82 89 259 196 -189
6495 -189 124 -21 -54 -110 -81 -31 -188 15 233 -6 19 -102 -382 -16 109 -201 118 -131 -315 134 -210 43
6517 43 -284 -90 -135 -182 -58 -158 -121 27 -15 -11 322 92 45 88 189 -159 195 -167 -118 -52 224 -279 -17 -167
6541 -167 -107 67 84 179 15 -127 -140 -109 226 -70 87 30 -314 185 150 260 135 -114 -268 -88 74 -316
6563 -316 6 86 -70 -4 92 41 5 -53 -143 -68 -178 79 -33 65 -96 14 161 273 -219 338 260 148 52 -181
6587 -181 139 -74 -16 -264 36 109 -167 17 -247 81 -362 -105 -159 41 -44 257 -87 133 -191 -87 13
6608A3K02k40K8n4j31q2J61oK06j10k05L32l86L75n03K14J54J52k45K16j00l76
6630c85L58K81k67K6N4j1m0M7j73J20K86j68k00k1j3j7J95M9j31K8J93M3j89j67
6654a02J18K61l7l14j82N62N6l52J18k37K04j46J25K00k98o9KN6q2r9p6J49K66
6677A23j84j01N0J90O3j41j49k46N31N9j92K50n00J60Q4N6j13O5k97J67R9o3J80
6700I1j32J22l25O16j62m77Q6L71j4rQ2k57J22K48j44k08k62L72j15P5J24k03
6722AR0j95Q5J7J13l2o8j7r4NJ58p8o7K22k10J35l2j41J89n4O9Kj45koQ6r7l4
6750a00K31k82Q4K58j86Q9q8l05K37M8r4n9J63j01k7n5M50j71n92Q09k48R5m02
6773b46L68M72n48J87k31J2l03M28j90l1K83L79q69L55j97L18l29p9M19m18L29
$$ plain form
6608 13 215 -25 3 -51 -182 -264 -103 -109 97 -13 -218 114 -272 103 -400 -186 -32 120 -125 91 -9 -385
6630 -385 -27 254 -13 13 67 56 16 63 -110 10 296 128 -72 -93 -106 -123 72 121 -10 18 211 254 65 -102
6654 -102 16 277 240 -74 -256 306 362 10 128 -109 95 -51 74 274 -24 -93 -91 -35 -117 -216 -292 -143 123
6677 123 -61 -162 -112 78 141 0 -149 -395 136 195 3 253 -247 -87 -3 53 -60 5 -292 -125 -26 -89 91
6700 91 -41 81 -244 372 210 -267 -181 190 176 167 249 -8 114 362 218 10 -252 120 5 80 204 1
6722 1 91 -104 -19 -2 111 79 11 -6 -100 -95 63 -15 -82 140 -70 65 33 -108 81 27 96 98 -47 -49 -55 31 -66 -100
6750 -100 131 -151 -67 191 5 94 6 -299 -62 -14 -108 -167 -4 -105 -132 -187 263 92 -500 309 61 156 -246
6773 -246 122 594 46 233 2 14 -289 139 -51 -82 201 580 -289 66 -131 187 -142 -221 198 -220 109
6794A09j90J35J63o7N9k16J46m16J52mM42l00Q1k63Q1k0l7N4J82j31J3N4N8j04
6818a9k64O73n55P4mJ82J94k17j9p1R7nk04J95J36k41k91J39L11Q4j48J05l97
6841b45K87q4Q5L35l61R0J3r0M6j08P6j46N4p3J67J20j38p7j02L67l06R5k18M4
6865a69J69j75m2K54O8J57l32K43n7p4J16j50J91l17J08Q8p2r8J78R6m99P12n34
6888a39O5n2l2K87k13K40r4J1k54L74j49nj46l1K53j15j30K31j74nJ45J09q8l58
6912b70L84l76L1L28J9k1j64J61l15K31J57m46L19rm1J79m04L55%m15K12M98m75
6935f2J39j71K02k15m8q7J96o1j4K32J02N9l81K97j21k01Q6oP2K1N7O4k08R5k67
6960b20K12k34L3M2J09j20M17k53M62n67J90k75J56j69N82o1j91Pj99L30l19J45
$$ plain form
6794 109 -81 54 217 150 209 -7 139 -277 -125 -129 313 13 94 -169 -88 -108 -145 -91 91 -40 -27 27 85 -19
6818 -19 -283 390 -165 -91 -95 87 281 64 45 -26 71 66 -138 57 193 -48 -339 -200 111 195 47 152 -245
6841 -245 42 -42 43 378 17 107 120 30 76 -32 44 -102 -48 -121 46 166 28 -49 -151 216 -90 5 -213 -169
6865 -169 0 -175 -217 37 105 262 -70 173 116 42 158 8 199 -118 -10 78 6 -92 86 182 -317 395 -139
6888 -139 -74 -126 -158 129 -84 156 62 73 -181 193 44 39 -107 -138 115 0 -130 101 -73 -78 67 176 88 -270
6912 -270 114 -262 -231 97 116 95 -69 92 -223 8 165 -281 38 29 -12 167 -237 118 118 -297 -85 413 -62
6935 -62 77 -94 108 -107 -155 -242 -46 -107 -121 111 213 272 -109 188 67 -134 -48 -54 18 39 96 160 -48 47 -220
6960 -220 -8 -242 -209 -167 -58 -178 239 -14 448 -119 71 -204 -48 -217 365 304 113 120 -79 251 -68 77
6982G7j9L6l02K85r6j1J41Q3n47L67L97l54k19L71l54K49j86J21R0l93K67j6L5
7005B2j45q3K69M2m8j49K3Q1k20J46J71M8j57p4K60m09M5L20k06LL8J53l43L28
7029A15K4l84k7J49K65j19J4p9K80k81J80j66J17k7kk56j3K83jK52m05N7M9j41
7053a16K79j4l40K30o2M6J0LK78k70r9Q0r4j59k30N89j66K12l17L23k47K19J86
7076C41m05j6j23L05j35k1n5J00j5Q0M7k31M06n24K45K61j67l2R4l98J39P2J04
7099G2jk29L50MrJ2no5j97K83k73n9L21j77K4j58L76j12k38J81j4j56l1J79O8
7124A46R3m43q3M34j70k25L00k33J37J83k17J37k06J29j93K9L1L91l52J97k07
7145a22J13J08Ok73J01K14j83j55K48qm2J0nk9j24Q9Q4J9k1O2j24J31m2o0N0n5
$$ plain form
6982 77 58 94 -208 77 -19 -30 111 194 -353 14 411 57 -162 209 -145 104 -82 39 129 -264 3 -13 22
7005 22 -123 -206 63 105 57 -92 -69 12 -208 -62 109 157 0 -74 186 -223 -178 142 -64 -61 -23 130 -213 115
7029 115 139 -245 -272 -123 142 23 37 -42 238 -43 137 -29 88 61 59 -197 -210 73 72 324 -81 -24 25 -116
7053 -116 163 149 -191 39 -23 23 33 36 314 44 -55 25 -69 -228 -458 131 -35 177 -140 183 -64 155 341
7076 341 -64 -80 -203 102 -33 -54 -109 -9 -24 56 103 -128 278 -246 -1 260 93 61 155 -243 -104 -32 72
7099 72 71 -158 192 196 187 199 194 129 -68 215 -58 -117 204 27 51 -107 269 157 -81 100 86 -70 -101 78 146
7124 146 239 -204 -287 147 -23 -248 52 -181 -44 139 -78 59 -147 -18 -211 -182 -151 240 -112 85 -122
7145 -122 -9 99 105 -168 -67 147 -36 -191 57 49 7 17 12 -17 -141 -52 32 51 30 92 -32 99 57 -3 47 -8
7171hM34m21r7K72j40nK28j92k01L44k25n3L00o4l42K54m9r8j85J46J67j95j09
7194b39P4k5K50j8r3j52K10j9P5l0m96N62O8p7j48K09o8k82J60L73j5j10l47K65
7218A27k17K36j5k14J07l64M00Nj84L08Jk19J43j36q5J62j00J93m1o5q5pK44n34
7242c40O18k65Q1qk33K78l51r5J15m5L16k47K9M33k58K12l76J32l1R2r8n8r0N97
7266D08m13j23P7mN3l4L74o80L14K83l28L30o0m8j32j95K10m5r6J35n9k2J8J23
7290H6j16j06J62j46K76p5l9J86k58J47n7k08K9J95j42K16l52L05k70J27j53M66
7312B73k92N3k1Q4k01k60M19k04J88n2R1Q3k88J79j99P8Q8j53N15k91n83O88j29
7335F6m42M22L9j12K16j80o2j88L17q3n0k2j62L42L3J97l52q2Rj09O17m38jm2
$$ plain form
7171 -8 426 5 -92 180 40 35 263 71 -130 214 -11 -64 236 172 -170 84 35 -63 -248 -102 65 -130 -239
7194 -239 -165 -190 60 42 -51 -203 7 -12 63 33 -463 99 167 90 -58 151 83 -199 -39 334 319 209 -138 127
7218 127 -90 146 131 -83 24 -340 60 65 -119 189 190 -29 114 -22 -107 55 -45 148 107 42 -43 -50 194 -340
7242 -340 278 13 94 86 -147 131 -220 -315 -200 -245 71 -176 -147 286 28 240 -136 -4 -35 57 -41 -99 -189 408
7266 408 -5 -128 -51 -55 -2 -36 338 -342 -28 255 -73 257 197 149 17 -178 32 -13 -109 26 -33 -55 -37 86
7290 86 -30 -136 26 -120 156 81 42 228 -30 117 60 -148 -119 76 -66 150 -202 103 -167 -40 -193 273
7312 273 -19 34 13 97 -104 -364 55 -149 39 -13 78 161 -127 52 -147 -69 19 -134 381 90 -493 195 66
7335 66 -376 46 85 -27 189 9 -53 -241 76 -7 -57 -79 -241 101 134 331 -21 -103 -94 -203 414 -24 -25 -67
7359f7K06m81L21j59J98M8j5j07K4m1J89J78j36k35K74k6j20J45k01n3N1J92o8
7382A17n7J42j81l9J50n8q8j95L68J41k32RJ52k28J47J30l26Q7J2k51K67j0N2
7405A09N6j03R1r1j67J51j51k76M62j92K84k06o4q1L48j68j80kL4J82O5o3P4j55
7429d3M8j6Q0m9m1j4n4J44n8K29m60O8k9J49R7O4j26j04J44J17j53J9n5L0l7J05
7455E5ML0k59o1L10J51j59j07p6j99M63n0M0l67l2J92j30L4J74j9j6j02p4L84
7479A86m15L49j35J1J09k63J61m5O8M4n1j7k01j9L83k12j98R0K97j45k64M88l
7502B18p2O4j99j59K99j77J65r8O9k54L20j01M42k50m42J02M3n1K7j26j01J71
7524a10L07k94k5M12j52j79L7o4N4J03j11j17j51K32l9J16K36k20O6J04j6k46
$$ plain form
7359 -67 139 -342 -21 -180 18 66 51 -56 -32 -73 116 294 158 -77 197 171 51 196 -5 -58 -7 185 117
7382 117 60 202 21 -18 132 74 -14 -209 159 300 68 77 229 1 148 278 -48 39 51 -200 67 57 109
7405 109 165 62 153 62 -105 46 -105 -381 81 -111 173 -33 -97 -178 170 2 -178 -180 -146 36 101 38 112 -43
7429 -43 5 -11 69 20 -21 -35 -89 55 -3 226 -234 -166 -195 -46 51 115 -11 -115 29 146 -7 12 -43 -13 -50 55
7455 55 59 89 -170 -231 79 230 71 -36 -112 -311 152 102 142 -225 -257 -65 -195 -161 13 -6 -22 -124 -198 186
7479 186 -229 120 -15 -4 105 -158 3 -42 26 70 19 2 -199 -218 165 -47 -245 -155 142 -3 -267 221 218
7502 218 146 210 11 -148 151 -26 139 41 110 -144 176 75 517 267 -175 -73 -30 -81 -54 -180 -281 -110
7524 -110 197 -97 -122 290 138 -41 -4 -68 -14 89 -22 -139 -290 -58 -97 19 255 35 101 205 189 -57
7546e7J93l52M13km53M73k07j52L88k05l7k04K19L02n30K74N6m24N81k65K18k47
7568a8q7J2K14kk65L73j30k43M03l31M95l84j49J75o2j81L00j26L25j57J29k37
7590E4K08k58K35k64J3k21K48K07m90M79r5n3j09Q9Q6j11rj09J34M9N1m12L92
7613A14j30l6M69m95k9MJ97o2j02k77L09j2L37j32k2rn6j53n4Q0R8j0q4O9qJ86
7639A92m26J27K55M7k28K40j93J15m53M55K0l37N3j87N37k69o9K86M8l77K53J4
7661A03l55K41k78K74n2M2q8K56jk49J36J66j55l52M01j51R5M0j07k0j73J94j35
7684a68j82L53J10l89L53k11J04R8j97r9K92nL6j5j84j15N5N9K27k27rL37l5m7
7708A41l97L95l66M44k67J90k20j20K58j83R2j61J7J10k12L43M1k59o8L51n3k27
$$ plain form
7546 -57 136 -216 197 195 -258 215 8 -144 244 39 2 -202 17 319 -211 63 119 -305 276 11 229 -18
7568 -18 -105 -93 121 119 -146 227 97 -146 257 -74 421 37 -112 63 1 -180 120 -6 319 162 291 54
7590 54 262 4 239 -25 -12 -233 15 222 -268 211 116 63 -46 43 129 18 9 -100 34 83 134 -278 114
7613 114 -16 -52 417 -78 -107 -103 94 32 -70 -347 -38 -50 287 155 133 124 68 -85 -139 -59 39 29 -55 14 6 192
7639 192 -234 -107 148 195 -33 207 14 129 -324 131 151 -186 -133 -320 217 -52 -121 165 213 -164 89 103
7661 103 -252 -11 -289 -15 -67 -25 -113 143 142 -107 29 195 40 -312 89 -62 33 73 -34 -54 -227 -33 -168
7684 -168 -350 3 113 -276 77 -134 -30 68 -129 -228 64 59 95 80 -104 -219 -164 -105 122 -105 -114 223 188 141
7708 141 -256 139 -227 217 -50 140 -80 -200 58 -125 -33 -194 -177 -67 -279 64 105 -154 -222 129 76 -151
7730a51K86r3j4K52k72O9K70l17J02k72o4K96k09L62l77J74R2r8o8K13l77K8K90
7753A22j60k13M29l15K65K6j53N9j55Q1K24m28L39j20m1kJ35l0J02N3k10k29N63
7776C42n7j04l33r5L76j97N4o4K09J67k00j64K58k73K0K8J78L3m12M47J1k05O9
7799H8l21L44M9q9k8P0k01K93j28j90k36L07L4J00k23J43n7m4K25l21l1M3K76
7822A03k0n20M22J75K3m7ok14J44j65M54k79n0k7Q8j94j70K08J93k61K69j38j22
7845a34j5J26J43n9j91L36k57J07p4jJ57l76L35j45l1n9j33J75M07o23K43K2J8
7868b9m23M42r9R9k57J7L25r9K24k89K77m01R9N8N7k3Jl6K35j81J2n3J90m72L07
7893a9j24k22K70O4K5J74r8K5J48L6k90Q0j76l4K67Q0n4j83q8J5K85l21L5K31
$$ plain form
7730 -151 135 42 28 280 8 77 347 30 132 -140 -204 92 -117 245 -132 42 134 36 -32 181 -196 -168 122
7753 122 -38 -251 178 -137 128 154 1 60 -95 -14 210 -218 121 1 -40 -42 93 63 165 218 8 -221 342
7776 342 285 181 -152 -247 129 -68 -14 -78 131 298 98 -66 192 -81 -61 -33 145 178 -234 213 224 19 88
7799 88 -233 111 160 71 43 113 -88 205 77 -113 -349 -42 -8 92 -131 12 -45 -89 136 -185 -216 -173 103
7822 103 83 -437 -15 160 183 136 130 -84 60 -105 349 70 20 -7 81 -113 -283 -75 118 -143 126 -12 -134
7845 -134 -149 -23 120 61 -130 206 -51 56 -18 -19 138 -238 97 -48 -79 -138 -271 -96 311 -312 -69 -47 -29
7868 -29 -452 -10 -109 -10 -267 -250 75 -24 200 -89 188 -213 -114 -56 1 -22 -21 -57 178 -3 9 -44 146 -326 -19
7893 -19 -143 -365 -95 -31 -6 168 70 95 243 279 -11 69 -107 -141 126 206 152 -31 -119 -104 181 -140 -105 126
7917A26J65k61j96O4J13j33K62j66k86K86J2l5L70o80K67J58m49L93R9l6k98m1
7939b66J19J35J06l53J51J53k47L28k28K80q8p3P3o6k59K39k12M45l69K87K0k12
7961c7j38L56k35LK49k59L32l36J87j70k9M51k49p5k7k12J25j81L73q3K03r4k40
7984h6n4Q6L42m90j47K51O2J63p05P52Nl56K30J49k03Q7k92J19J71k6l3M65o24
8007a34M00n57M69J86m42K75k23P9K22o39N35j70J76k62j83M77m8k61J40r4L76
8028C22n06K19K2Ko6n0p6Q8N7j15R9J8o4K04k87L1r1L04L4j05N5Q0k69J06O9m45
8054c64O16k00r9j59L77q1J0O1k23J17j52J90k6J03J90l23p4n3J56k3J2m1j91
8077a77M39l8k07j89r8K13R4l1l2J30Pj62j17n6K07J29k10o1L06j04L5j10J66
$$ plain form
7917 126 291 30 -166 -102 11 -122 140 -26 -312 -26 -14 -49 321 -359 -92 66 -383 10 109 73 -225 -266
7939 -266 -147 -12 94 -259 -108 45 -202 126 -102 178 90 17 90 24 -235 4 -208 237 -132 155 175 -37
7961 -37 -175 181 -54 -51 198 -61 271 -65 122 -48 -77 374 125 50 23 -189 -64 -245 128 45 248 154 -86
7984 -86 -140 -54 288 -202 -349 -98 -36 127 -578 174 179 -177 53 202 -1 86 -206 -87 84 58 25 490 -134
8007 -134 266 -291 178 364 -78 197 -26 53 275 -364 171 1 177 -85 -268 209 161 -100 40 -54 322
8028 322 -184 35 57 59 -7 -57 -133 -45 12 -103 -4 14 -50 154 -133 -102 -193 111 145 40 95 175 -94 12 81 -364
8054 -364 252 52 -47 -206 171 90 100 161 -62 55 -97 93 67 170 360 37 -37 -90 66 43 55 14 -177
8077 -177 262 224 17 -172 -270 -57 37 6 -26 104 111 -51 -168 -224 -17 112 -98 -159 147 43 78 -32 134
8100A34m60J39J90j9k27L19j14k08K77Q6j47p8k1j94N74k16K08n7m58n1M42l93
8122b74K99r3J39k30K94n7J72k53j60M22R3j91j25J59K91n56r1N02l47R8j82k40
8144c30O66m50q6L25l90L14L4K80k18j66J57k42RK08k10O1J90m12M07k77K8p5
8166a77M40k96k20J89K65j18ll75M23K34l80J32k24K90r2l46K31K0J73J47l8m18
8188a43R9j00o2
$$ plain form
8100 134 -326 -187 3 -16 -243 76 -38 -246 31 117 -30 -108 -129 -323 251 35 243 186 -272 -323 119 -274
8122 -274 25 -68 71 -159 135 78 250 -3 -163 259 352 161 36 195 486 -70 -161 341 -6 92 -90 -330
8144 -330 336 -114 -200 125 -265 49 83 363 145 -21 136 -106 -97 111 -99 -38 152 -260 147 -130 -102 -177
8166 -177 263 -33 -253 -64 201 83 80 -295 128 362 -18 114 -110 180 88 -258 -27 -7 166 313 275 -143
8188 -143 -44 -144 -206
8191b06
$$ Imaginary data points
##PAGE= N=2
##DATA TABLE= (X++(I..I)), XYDATA
0@%%%%%%%KkQj6J6j6K4l2L8m6N2o0P2q8J04j19J36j57J79k05K34k65L01l38L80
32B02m28M79n37N99o67P43q24R12j010J117j237J373j521J686j873K082k322K600
50A374k925L314l782M364n115O118p541R733j3582K2334p7596N809J65941J6000
64A24446r5924j38829n1683J7636Q5122R3409M6289n1668r0961p5373k0442L9261
76a18717J00849Q8748N342p8512q7058m6272J1276O2190Q2194M5495r480m5833
88A0222n4677l8732J5968O5030N5070J458k5569k3624j8712n436K8909M2744J5233
101F7884j8118k7822k4764p021K7710M7517K5564j1331k6011k7655k6115n511
113e673K6254L7204J9177m012k2321l3658k1181P460J8214M244j272N283l226
$$ plain form
0 0 0 0 0 0 0 0 0 2 0 8 -8 8 -8 16 -16 22 -24 28 -32 40 -48 56 -63 73 -84 95 -110 124 -141 160 -178 202
32 202 -226 253 -284 315 -352 391 -433 479 -531 586 -651 722 -799 887 -986 1096 -1226 1374
50 1374 -1551 1763 -2019 2345 -2770 3348 -4193 5540 -8042 14292 -63304 -57495 108446 124446
64 124446 28522 -110307 -161990 -144354 -59232 34177 80466 28798 -62163 -137536 -157978 -118717
76 -118717 -17868 70880 76222 -2290 -89348 -135620 -124344 -62154 20040 65535 56055 10222
88 10222 -44455 -83187 -67219 -2189 52881 54339 28770 5146 -13566 -19002 9907 52651 67884
101 67884 49766 21944 -2820 -9841 17869 65386 90950 79619 53608 25953 -162 -5673
113 -5673 20581 57785 76962 72950 50629 16971 -4210 3250 21464 25708 24436 29719 26493
126B6493j9804j2208R176J1258n030j3826j3715r682K459J4980R845m739p552
139a2345n338j4340k1365l907K0659K1813M015q182r502p160n365k647PO445J3634
154b3578Q125n228j0210K312R016P85q089l093O331Q446N427K813M467O368K780
169F672o961j0919L08J3223J3605L675m1L980L216o071r486j991Q342J0484N144
184C3180j980j424K624K183m579q490j459P676N155k468l521K737L801l552j0763
199A9120r039k71N202K332k940k645K337O08r141j3649m623N762M260k233l069
214g989R18O83m443r273q330j551N820L917l768k960M057M594n976j1006l437
229c8744N820N193O7J087M920N537O19o063p261n27Q444P179L20K139Q675O681
$$ plain form
126 26493 6689 -5519 3657 14915 9885 -3941 -17656 -27338 -24879 -9899 -54 -4793 -12345
139 -12345 -17683 -32023 -53388 -57295 -36636 -14823 -10808 -18990 -28492 -35652 -41017 -43664 -43657 -37212 -23578
154 -23578 -15453 -20681 -30891 -28579 -19563 -18778 -26867 -29960 -23629 -15183 -9756 -6943 -2476 3892 6672
169 6672 -289 -11208 -10900 2323 15928 19603 19562 23542 26758 20687 11201 9210 17552 28036 33180
184 33180 31200 29776 32400 34583 30004 21514 20055 27731 32886 30418 26897 29634 33435 29883 19120
199 19120 10081 9810 15012 17344 14404 11759 14096 14704 5563 -8086 -12709 -6947 -2687 -4920 -7989
214 -7989 -7071 -6388 -10831 -20104 -28434 -29985 -24165 -20248 -24016 -26976 -22919 -18325 -24301 -35307 -38744
229 -38744 -32924 -27731 -27664 -26577 -21657 -16120 -15501 -21564 -28825 -29352 -20908 -13729 -13409 -11270 -2595 4086
245D086l492p910k357N191O921L802K691N193P951M056n635q442r20N725M736
260B1596o2K279Q338O153k583r265q131j69K593M77q83L675Q090K955q226j1438
276A5399n972l45j470k930L90N642N811j569r824j0884m202k18l526m664K870
291a5492R829M629n456r004n938k151k976m079j40P614R797M057n437p453k784
306b4984ql437m462M163J2489J0300J458m312k794m98k305m467p63Q025J2224
321F29Q687J23k558j591q1m252o565R40J0833J1936L878j164m1J12m225p765n464
338C432L114R638Q254J962j424J47p86p351j0577m663N299Q114L484N6O87N47
354A9933m128r810j0245k804N968N808J250j01K868O96p061j1453p615M9M974
$$ plain form
245 4086 594 -7316 -9673 -4482 2439 6241 8932 14125 22076 26132 20497 12055 11135 16860 21596
260 21596 21534 23813 32151 38304 35721 26456 18325 18156 20749 21226 20343 24018 32108 35063 26837 15399
276 15399 9427 9082 7612 4682 5072 10714 16525 14956 5132 -5752 -9954 -10172 -13698 -18362 -15492
291 -15492 -5663 -1034 -6490 -15494 -21432 -23583 -26559 -30638 -30778 -23164 -13367 -9310 -14747 -22200 -24984
306 -24984 -24992 -28429 -32891 -28728 -16239 -5939 -4481 -8793 -11587 -12085 -14390 -18857 -19620 -11595 629
321 629 9316 9439 6881 5290 5209 957 -5608 -4668 6165 18101 21979 20815 20774 20886 16661 8896 3432
338 3432 6546 16184 24438 26400 24976 25123 24337 16986 6409 1746 7045 15159 18643 18699 19386 19933
354 19933 15805 5995 -4250 -7054 -1086 4722 5972 5871 8739 9435 2374 -9079 -16694 -16645 -11671
369a1671L535R21K264L872M62r161j1202m400L383L834J235L236N781M437k424
384e898q489q169j664L634K909J989M176Q163N430m970q981l540J335J834J170
399a1071L466P589Q267K202m551p223k059K163J270p22M371R720P365j053o277
414A3457l982j41n91j707M78N625Q355M202l421n988k861k93k525l910Q98O424
430A4020O437l0n379m877j271k555m879m593K501O660L528k624n277k719j331
445b389m458o110k191M482O126P86l453l456m39j450n345n190J251O486M628o31
461a1353k273k23J084k159n058j672M531O663L837r45o23K631J246l545l737J143
477a0453O473O050J113n0J584K627p03m096j636L038O447L545j77n41J948J452
$$ plain form
369 -11671 -8136 -7215 -4951 -1079 -617 -9778 -20980 -25380 -21997 -18163 -16928 -13692 -7911 -3474 -5898
384 -5898 -14387 -22556 -24220 -20586 -17677 -15688 -11512 -3349 2081 -2889 -11870 -15410 -14075 -12241 -11071
399 -11071 -7605 -16 8251 10453 5902 -1321 -3380 -1217 53 -669 3702 13422 20787 19734 13457
414 13457 9475 9334 8743 7036 7514 13139 21494 25696 22275 16287 13426 13133 10608 6698 7596 14020
430 14020 20457 20427 15048 10171 8900 6345 1466 -3127 -626 6034 9562 6938 1661 -1058 -2389
445 -2389 -6847 -12957 -15148 -10666 -4540 -3754 -7207 -10663 -11102 -12552 -17897 -23087 -21836 -15350 -10722 -11353
461 -11353 -13626 -13849 -12765 -14924 -19982 -21654 -17123 -10460 -6623 -7568 -8191 -5560 -4314 -7859 -11596 -10453
477 -10453 -3980 2070 3183 3133 4717 7344 6641 2545 909 3947 10394 13939 13762 13221 15169 16621
493A6621l339m990l17M976M382o37r94O44J231j733n826m135P71L633K052j326
509A1013j790R00O53m876p195k688K726K759j89k132K99J670k355o094n191o03
525a3093L475K251p82n98K005J578l634o733l254K872L938J399l68K035L409M4
541e456m702n331l54M212L397Q14J514M048L159j385n213l764J617M076K120R74
557b74L208N291K093m346n425j442K415K274L33K094N224M347o98n656m598q75
573C965J726O72j90L042N659L097l419p043l032j75l23j488R25M993N006J50m594
590H971n905l272k82j738k035J828O482M603k401n825l986j652k399l616m62L887
606g802O607K689k515m610k570j804l433l522J325O304N700J662k582k226j645
$$ plain form
493 16621 13282 8292 7975 12951 17333 16696 15702 16346 17577 15844 10018 5883 6654 10287 12339 11013
509 11013 9223 10123 10776 5900 -1295 -3983 -1257 1502 1313 -819 -520 1150 -1205 -7299 -12490 -13093
525 -13093 -9618 -7367 -8149 -8747 -6742 -5164 -8798 -15531 -18785 -15913 -11975 -10576 -10944 -8909 -5500 -5456
541 -5456 -10158 -15489 -15843 -11631 -8234 -7420 -5906 -1858 1301 -84 -5297 -9061 -7444 -3368 -1248 -274
557 -274 2934 8225 10318 5972 547 -895 1520 3794 4127 6221 11445 15792 15094 9438 4840 3965
573 3965 5691 6363 6173 9215 14874 17971 14552 7509 4477 4302 3979 2491 3416 8409 13415 13565 8971
590 8971 3066 -206 -488 -2226 -4261 -2433 4049 8652 6251 426 -3560 -5212 -7611 -11227 -11689 -7802
606 -7802 -1195 1494 -1021 -5631 -8201 -10005 -13438 -16960 -15635 -9331 -3631 -1969 -4551 -6777 -8422
621h422j885m498k502L785P283N422L12j415q4p03l923m146j79N076P227M433
637E781L27l35O21j445m679m370J627O436N549K272P85J221q8l554n334l983K272
654C103N895L698R41J324J616j521o607o033k048K539L347K017Q08J581P46k855
670H551p156o620n45K735J290j51K677L254k71n611o427m301L43J768R87O19L385
687e473M266j343o058n325p81R38O30M83L080N132L376j161n610l554N67J811
703i022k25Q84N363O489J263k878l126j586M48P68j26J645N033O303M97m185l152
720D393M60K27k355j08L813N200K296j115l291k431p99p22j979j274L938N124
736A1377J74l618k448j28k001l021k245J290L785K780j267k799j816l6j991m475
$$ plain form
621 -8422 -10307 -14805 -17307 -13522 -6239 -817 -505 -1920 -2004 -2707 -6630 -10776 -10955 -5879 1348 5781
637 5781 6108 5773 6394 4949 270 -4100 -2473 3963 9512 11784 12569 13790 13702 10148 4814 831 3103
654 3103 8998 12696 13637 14961 16577 15056 8449 2416 368 2907 6254 8271 9079 10660 11406 8551
670 8551 1395 -5225 -5770 -3035 -1745 -1896 781 4035 3764 -1847 -8274 -12575 -12232 -10464 -9477 -8858 -5473
687 -5473 -1207 -2550 -8608 -13933 -14714 -13776 -13146 -12663 -9583 -4451 -1075 -2236 -7846 -11400 -10833 -9022
703 -9022 -9247 -8363 -3000 3489 4752 1874 -1252 -2838 -2390 -1622 -1748 -103 4930 11233 11730 7545 4393
720 4393 4853 5080 2725 2617 6430 11630 13926 12811 9520 7089 6290 5568 3589 2315 6253 11377
736 11377 11551 7933 5485 5357 3356 335 -1910 -620 3165 5945 4678 1879 63 27 -1964 -6439
752f439j076K951L702P41j717q52p05j049k882l090M15L963L841j047k023J221
768d046N23k411l231q51K648L264J936J35j257N57O82j769l312m70M504L730M19
785A051j172J199Q92j114k966j507J919L646K466k53m46P15R94j867l560l40K735
802B392L230R29m35L19J269j020l479k765Q23L337K145m35k48P19O98k474m151
819H54k084K086K695P88q72J81J109o11l630m464l64K598J795k39m71J595N36
836A502k530m744k809J206K444Q75l12Q64K508K56m311m312r29J892J913L21J141
853e025K723K197j098m294l016M28K091R33J505K050M008J756k623m253j464J200
869b882J672N33J611M344L178n4k957l232q52N38K88P25J812M860L240j963m463
$$ plain form
752 -6439 -7515 -4564 -862 -121 -1838 -2690 -3395 -4444 -7326 -10416 -10001 -6038 -2197 -3244 -5267 -4046
768 -4046 -3523 -5934 -9165 -10016 -7368 -4104 -2168 -2033 -3290 -2733 -2051 -3820 -7132 -7602 -3098 632 1051
785 1051 -121 1078 1970 856 -2110 -3617 -1698 1948 4414 4161 3715 4430 5424 3557 -3 -343 2392
802 2392 5622 6551 6116 6435 7704 6684 3205 440 1263 4600 6745 6310 6062 6781 7479 5005 854
819 854 -1230 856 3551 4339 3467 3648 4757 4146 516 -3948 -4312 -1714 81 -158 -629 966 1502
836 1502 -1028 -5772 -8581 -7375 -4931 -4056 -4368 -3504 -996 -740 -5051 -9363 -10292 -8400 -6487 -6166 -5025
853 -5025 -2302 -105 -1203 -5497 -8513 -8085 -5994 -5061 -3556 -1506 2502 4258 1635 -2618 -4082 -2882
869 -2882 -1210 -677 934 5278 8456 8402 5445 2213 1361 1899 2187 2912 4724 9584 12824 10861 6398
886F398k403n03r95j061Q54L531M044Q10k638l754k656j005j641j755J213M307
902B746L273p15l108k869j598k081k807r50K233M481K792r56k557j954j658k535
918h263k741K58L973M283K143q28j959q78j269l051k059J490M827M295J382n88
934A015n4o12k839l389o05K895M499L409M18J85M26r32l742l231j12L366M046
951D743J442P70R52K04k144m740k752Q84L283K085O56Q62K067p91l512m998j816
968b805J365K516Q50O66K286J436j621m779l835p71J628J200Q81J517K150J219
984C903k572m514l041O68R72K46Q00L072K899k18l425l448j386M43L1P42J649
1001c179L118K486j008l108k973k2L08n08N53K780L214J619j572k781j407K3n74
$$ plain form
886 6398 3995 3492 2497 1436 2290 5821 9865 10675 8037 4283 1627 622 -1019 -2774 -1561 2746
902 2746 6019 5304 2196 -673 -2271 -4352 -7159 -8109 -5876 -1395 1397 441 -2116 -4070 -5728 -8263
918 -8263 -11004 -10746 -6773 -2490 -347 -1175 -3134 -4012 -5281 -8332 -10391 -8901 -4074 221 1603 1015
934 1015 961 349 -2490 -5879 -6484 -3589 910 4319 4737 4922 5348 4416 674 -2557 -2669 697 4743
951 4743 6185 6955 7907 8111 5967 1227 -1525 -641 2642 4727 5383 6245 8312 7521 4009 -989 -2805
968 -2805 -1440 1076 1926 2592 4878 6314 4693 -86 -3921 -4692 -3064 -1864 -983 534 2684 3903
984 3903 1331 -3183 -6224 -5556 -4584 -4338 -3538 -466 2433 2215 -1210 -4658 -6044 -5601 -5570 -4828 -3179
1001 -3179 -61 2425 1417 -1691 -4664 -4686 -4378 -4886 -4333 -1553 1661 3280 1708 -1073 -2480 -2457 -3031
1018c031l86N39M131L085j87k125j526m61o75n42o02J875L570K626r27k199j045
1035B120K44p22k153J87L237K701O41j067j330q86l67j237j642O00L053J960k99
1052E040j945o90j44j519k589m56J833K192P16m24j961r07J64j940k216k60K499
1069b607K477q19j506P1l44j039k314r03J191K555J666n65j181N59J5j637k231
1086f612K93K851K403P02n66N7O08l03j655j326J027L321J899J69o58J144L78
1103C732j455k142n82K273K301J244J26r5N66q28k427j776L60K186J733m13J59
1120D962O26l69k022k917k014J532J986R04l10l11J180j047l224l458j88J804
1136b866J575J81Q2R19L13j455l243k666M81K079J452J47R20K119Jk545l238j033
$$ plain form
1018 -3031 -3417 -2878 1253 4338 4151 2026 500 39 -636 -1178 -1780 95 3665 6291 5364 3165 2120
1035 2120 2364 1642 -511 -324 2913 5614 6255 5188 3858 2972 2605 1368 -274 326 3379 5339 5040
1052 5040 3095 2405 2261 742 -1847 -2303 -470 1722 2438 2014 53 -854 -690 -2630 -4846 -5106 -2607
1069 -2607 -130 -949 -2455 -2384 -2728 -3767 -6081 -6984 -5793 -3238 -1572 -2137 -3318 -2759 -2744 -4381 -6612
1086 -6612 -6319 -3468 -1065 -363 -929 -872 -264 -567 -2222 -3548 -2521 800 2699 2868 2210 3354 3732
1103 3732 2277 135 -447 1826 4127 5371 5497 5402 5968 5140 2713 937 1297 3483 5216 4803 4962
1120 4962 5588 5219 3197 280 -1734 -202 1784 2688 2378 2067 3247 2200 -1024 -4482 -4670 -2866
1136 -2866 -1291 -1110 -1028 -109 204 -1251 -4494 -7160 -6679 -4600 -3148 -3001 -2081 38 39 -2506 -5744 -6777
1154f777J211J665O66J163K149J930n97l136j963n99J383R31J014J987K504J349
1170D880j290l000k001J74M67R33N72L045K688M10k923k673j192o0l00k63K132
1187A599L172K120j075k543k429p94p33j179L82K696L274R73j575k235j986q49
1203a182j410j270J355L254K624K80j591j812j619r66k102p48K044L783J971n09
1219B102j190j335j096j889k139J57K324L427J339l31p70n81j553k184k040K74
1235e485L672K546R71m46Kl63k209l119j005J651L290J801O27L59N72j199k299
1252f34k740o37K521K626J085M87J152O31j498l245k373N10K707J503P53J487
1268D335R87L13k635k800j496P59J603R17O84J355J271n38l004k763o96R92O11
$$ plain form
1154 -6777 -5566 -3901 -3235 -2072 77 2007 1410 -1726 -3689 -4288 -2905 -1974 -960 1027 3531 4880
1170 4880 3590 590 -1411 -1237 -770 163 735 3780 6468 6878 3955 1282 90 30 -270 -533 1599
1187 1599 4771 6891 5816 3273 844 50 -683 -1862 -1480 1216 4490 5463 3888 1653 -333 -1182
1203 -1182 -2592 -3862 -2507 747 3371 3651 2060 248 -1371 -2337 -4439 -5187 -3143 640 2611 2102
1219 2102 912 -423 -1519 -3408 -5547 -5390 -3066 361 1700 1369 599 18 -1535 -3719 -5759 -5485
1235 -5485 -1813 733 1704 1258 1260 897 -1312 -4431 -5436 -3785 -495 1306 1933 2292 2864 1665 -634
1252 -634 -3374 -4011 -1490 1136 2221 2708 3860 4491 2993 -252 -2625 -2115 592 2095 2848 4335
1268 4335 5322 5635 3000 200 -1296 -537 1066 1983 2667 4022 5293 4755 1751 -1012 -1708 -716 -105
1285a05P3J193J763R44j801l176k132j6M27R9M69J604J569N49k242k652j403J75
1303d662K38r9R18K358J459l35j879k306K14P1j45N69J415K456J556j168j774
1320a114q23j23N38n67O91K315K693K21j662p54n76K99o52l39J215K242K256p59
1338E101j580o66k5p35j013n43J880K190L88j705j328r1k99q33j694K61J990J287
1356B585j30j792r26K62j004j733q91J712J757O46j310r20J31m59j151j336J46
1373d413J844J761L02j144l56J54o50j400m55J521K098Q31j45l90j86R6j099j315
1391b946L25K127J951K87k59J10M9q83j112j049O73K192J201J14n34K82j01j326
1409A101j933m88J823J678M94K75m53J53q74j358j853j95J941J166N92m19P30
$$ plain form
1285 -105 -32 1161 2924 3868 2067 -1109 -3241 -3257 -2830 -2731 -2262 -658 911 1460 -782 -3434 -4837 -4662
1303 -4662 -4424 -4523 -3605 -1247 212 -123 -2002 -4308 -4094 -4023 -4168 -3599 -2184 272 1828 660 -1114
1320 -1114 -1937 -2060 -1522 -2089 -1398 917 3610 3831 2169 1415 839 1138 486 147 1362 3604 5860 5101
1338 5101 3521 2855 2830 2095 1082 539 2419 4609 4997 3292 1964 1873 1574 741 -953 -692 1298 2585
1356 2585 2455 663 -263 -1 -1005 -2738 -3629 -1917 -160 486 -824 -1744 -1613 -2072 -3223 -4559 -4413
1373 -4413 -2569 -808 -506 -1650 -2006 -1852 -2502 -3902 -4357 -2836 -738 93 -52 -442 -628 -532 -1631 -2946
1391 -2946 -2621 -494 1457 1744 1485 1595 1644 761 -351 -1400 -727 1465 2666 2780 2246 2528 2427 1101
1409 1101 -832 -1320 503 2181 2675 2950 2497 2650 1776 418 -1435 -1630 311 1477 2069 1650 2380
1426B380J44j747k107j337O20J787J220L22K10N01j20k259k472k38J433R53Q89
1443A79M14J172L51j517k129j858k01J560Q44N34Q17J638K20k099k838j095Q08
1460c200Q07N72Q79J908J279m69k364k573n70J047M23O96J470K120J226j861k153
1477g63j296n59N36L93N52K446K246O21k041k089j055K87r5m24J600K744K008
1494E111p16j073j939j354k72K5k22J455K760J693j442j906p78j052j241r65J046
1511h70J828K015P88j424j465j150j004k220n65J506K291J521j13r62o14j035
1527a473j699j754j64J441K402J479l37p14P3j017k061j643N07K470K036P89K77
1544F12J39l52j218j591j356J182K430J622N02L59P92k33k163k009n3J419J482
$$ plain form
1426 2380 2524 777 -1330 -2667 -2047 -260 960 1282 1492 1993 1873 -386 -2858 -3096 -1663 -710 179
1443 179 593 1765 2116 599 -1530 -3388 -3589 -2029 -1185 -651 166 1804 2024 -75 -2913 -4008 -3200
1460 -3200 -2393 -1821 -942 966 2245 1776 -588 -3161 -3731 -2684 -2261 -1565 -95 2025 3251 1390 -763
1477 -763 -2059 -2618 -2082 -1689 -1137 1309 3555 4176 2135 46 -1009 -722 -817 -1241 359 3103 5111
1494 5111 4395 3322 1383 29 -243 -218 -440 1015 3775 5468 4026 2120 1342 290 -951 -1916 -870
1511 -870 958 2973 3761 2337 872 -278 -1282 -3502 -4067 -2561 -270 1251 1138 176 -438 -1473
1527 -1473 -3172 -4926 -5090 -3649 -1247 232 -105 -819 -746 -1763 -3824 -5467 -4960 -2490 -454 335 612
1544 612 751 399 -819 -2410 -3766 -2584 -154 1468 1970 2329 3121 2888 725 -1284 -1337 82 1564
1561A564J231O12M33P00q16k228k114J53J694Q12J89R63J115k55j723k336j389
1578a395Q0J329N83L23P02J052j18k345k197n51N13L81K0O89J199O21o76j639
1596a429j772k92M84O71L6J014J853L25j480j856l79K44l0L85P85J271J856j48
1614A538j689j408R0K93k2l05J357K155L49p68j017o85k20J41m49K05J224K237
1632C026Lj650q73J94k44m81p86R44J596Q56m22j116o28m74J28o20m61J357J904
1651B253J33j203n59m96n1r11m23O71J115J229l96r64k48m10J90j274k59R65J978
1670A340K28n30q48l93j46q31o05Q8J454J164j93p30n10J69p68j443j2Q83J428
1689b55N96j3o48k64k42q00j029j31J391J223P15l92l03J17q19q40o92L33J745
$$ plain form
1561 1564 2795 3407 3840 4540 3724 1496 -618 -465 1229 2041 2230 3193 4308 4053 2330 -6 -1395
1578 -1395 -1315 14 597 920 1622 2674 2556 211 -1986 -2537 -2024 -1643 -1623 -934 265 886 210 -1429
1596 -1429 -3201 -3493 -3009 -2338 -2302 -1288 565 890 -590 -2446 -2825 -2581 -2611 -2226 -1441 -170 1686 1538
1614 1538 -151 -1559 -1469 -1176 -1198 -1503 -146 2009 2358 1590 573 -112 -332 -191 -640 -435 789 3026
1632 3026 3029 1379 506 700 456 -25 -811 133 1729 2585 2163 1047 419 -55 73 -547 -1008 349 2253
1651 2253 2386 1183 624 128 77 -834 -1257 -586 529 1758 1362 398 150 -260 -70 -1344 -1603 -638 1340
1670 1340 1568 1038 190 -203 -349 -1180 -1785 -1697 -243 921 728 -2 -512 -343 -1111 -2554 -2566 -1683 -255
1689 -255 341 328 -320 -584 -826 -1626 -2655 -2786 -1395 -172 543 151 -152 -35 -854 -1694 -2386 -2053 -308
1708c08J269J57n73P11r8j220r63m08J410J367Q82q7L55J77k93j727j318K52J319
1727I04J342O39k33N03p2j269j752j126P03R33R03J17J62J038p41j448k155n99
1745b151O57Q10K80K98Q40K69p01j965j558k60Q46P92R8J153J041J9j414j702
1763b648j257K37N05P93R17R69J573K3j824j421k41K23K61N75J479J434J199m33
1781B364j902p68m01JK39M02J979J648P59j154j824n48l82o80L37N39K005J369
1799C983j67j237j258o07r91m27p50J523J914J072o28q23j437o13j184j042M23
1816b249J167J937Q33n43q86p08j075j302n40O34J411J974J65l27q38l89j044
1833a780q91p21J298J848P20K13l14L47r86j138j202kJ099J696Q40L92R0j83p05
$$ plain form
1708 -308 961 1118 545 1256 1158 -62 -1025 -1433 -23 1344 2226 2139 2494 2671 2378 651 -667 -415 904
1727 904 2246 2885 2652 3155 3083 1814 62 -1064 -361 572 1475 1592 1754 2792 2051 603 -1552 -2151
1745 -2151 -1494 -684 -404 -106 734 1003 302 -1663 -3221 -3481 -2635 -1843 -1745 -592 449 468 -946 -2648
1763 -2648 -3905 -3668 -3163 -2370 -1453 -484 1089 1112 -712 -2133 -2374 -2151 -1890 -1315 164 1598 2797 2364
1781 2364 462 -306 -707 -706 -467 -65 1914 3562 4321 3167 1343 795 413 -267 70 609 2614 3983
1799 3983 3816 2579 1321 714 -277 -704 -1454 69 1983 3055 2427 1604 167 -446 -1630 -2672 -2249
1816 -2249 -1082 855 1688 1145 259 -449 -1524 -2826 -3366 -2732 -1321 653 818 491 -347 -736 -1780
1833 -1780 -2671 -3392 -2094 -246 474 687 373 720 -266 -1404 -2606 -2608 -1509 187 1027 1419 1509 1326 621
1852F21j826r72M73J575Q44L65L93N52r5j383k079l20R99P80J025M87M81L69l16
1871A973j858j382J34N26P58P08N60P66j40q46j375r07L72N08L23M62R39P99m14
1890A906r15j526l77L65K44q3O92J149N73j71j783j063R1j56L00k03J009R26M91
1909A469j451r64p09k9J47k07M72R36P16n78o17q06l85j10K78k41N38J305O46
1928D10k00j194m52P8j41JJ35J015J310J01o57m20k6k37K00n39P69J346N64n7
1948B006p40q2o0n18m8O1R03J182M2n47r11K16m24n46k61J43J064P52j51n75q94
1969F12q8n36o34k77M55P47M31k78q48l79k09o25o68o8P31J416l31l08l09l31
1989a497j54j194k76P46J080Q84R8k96k65o4k83j111J60J007J404M17J15p8k78
$$ plain form
1852 621 -1205 -2177 -1704 -129 715 1080 1473 2025 1930 547 -1532 -1852 -853 -73 952 1439 1920 2289 1973
1871 1973 115 -1267 -1133 -607 151 859 1419 2185 2045 1199 -176 -1083 -711 -203 120 582 1521 2320 1906
1890 1906 991 -535 -912 -547 -303 -386 306 1455 2028 1857 74 -989 -898 -1054 -754 -957 52 978 1469
1909 1469 18 -946 -1655 -1684 -1537 -1744 -1272 -336 380 -198 -815 -1621 -2006 -2116 -1838 -2079 -1541 -236 410
1928 410 210 -984 -1436 -1358 -1499 -1498 -1363 -348 962 1063 406 -14 -40 -277 -77 -616 153 1499 2063 2006
1948 2006 1266 1184 1124 606 558 619 1522 2704 2746 2199 1288 1504 1080 534 273 416 1480 2232 2081 1506 612
1969 612 524 -12 -646 -923 -468 279 710 432 -416 -795 -1004 -1629 -2297 -2365 -1634 -218 -549 -857 -1166 -1497
1989 -1497 -1651 -2845 -3121 -2375 -1295 -411 -313 -609 -874 -938 -1221 -2332 -2172 -1165 239 656 771 693 415
2008D15j91p86o31N83J073J251J85k1M57n11j014j098m09O58J339O39M52n6j61
2027B174l16j104j336j84J035O79N23J13L90k3q12j653j041J94N82Q05L37M09
2045G72M35k88r89j644o50J78J164L76P28N66P79q32j234j189n77N96L74P02R44
2064B11Q17K70o18j705q44k45M62K65P37J293R87j94q96j369n27Qn8K79R24J165
2084I62P59o2j097j303m61q9k5J46J236J457N20l06j189r78o81J9m23P86J575
2103H46J269ln07o07n66q86o42L91N39J241J341j14m98q04p31l91j019M33R76
2122B68J816l5j08m27o17n77j153p61O18J010R33J60J9m32n82j211j183l97O05
2141b054J130O89L97k89J15m88j492r52k40R70R17P52K83J48R2o25j078j123N57
$$ plain form
2008 415 224 -562 -1193 -610 463 1714 1899 1878 2335 1824 810 -288 -697 -39 1300 1939 2391 2335 2174
2027 2174 1858 754 -582 -766 269 948 1471 1584 1974 1951 1139 -514 -1555 -1361 -779 26 363 772
2045 772 1207 919 -70 -1714 -2364 -2186 -1022 -646 82 648 1427 595 -639 -1828 -2405 -1809 -1435 -733 211
2064 211 1028 1298 680 -1025 -1869 -2114 -1652 -1387 -650 643 1630 1436 540 -829 -1356 -1348 -1406 -1127 -203 962
2084 962 1721 1659 562 -741 -1202 -1291 -1316 -1170 66 1523 2043 1737 548 -430 -1111 -1092 -1515 -729 846
2103 846 2115 2112 1605 998 432 -454 -1096 -705 -166 1075 2416 2302 1804 1000 269 -122 -1141 -708 268
2122 268 2084 2049 1941 1514 897 320 -833 -1594 -976 34 967 1127 1146 714 132 -1079 -2262 -2659 -2054
2141 -2054 -924 -235 162 -127 -12 -500 -1992 -2944 -3184 -2214 -1297 -545 -262 -114 -22 -647 -1725 -2848 -2291
2160b291R12N49L51P45N62O4q65j139n68J173L07P70L97R31M94n70q75q41l80
2179b74Q39K67O77N79M33L04n62r20q00l40M39J95L28P28K41J2j183o95n20rJ17
2200a44K06K31K15O47m62r63o52p14%L34oM26N54J23k47j245m35RK72p7J37Q80
2222i11P24O4o72o51k12N2M81m82O49J209J98j24o05k65m2O2j17L55N10Q29O24
2243A676r49n61N1J13m9l60O90N96N15k7o01l30j05m02r9J87N04O08M23o88o65
2264E27j0k01n89m05O05N63O58J09l35p06l48l24o34M2R44J030J57n59l81l8l54
2285b49o29m60L48N95P76K58l42l65q2m82j140k03P84J019M23L8p1P1n13o82q83
2306a789K21L81J133J87L76l58m94P2r53n77J57P91Q89K37N25l87k59q9j089p69
$$ plain form
2160 -2291 -1379 -830 -479 266 828 892 27 -1112 -1680 -507 -200 570 967 1898 2392 1822 947 106 -274
2179 -274 565 832 1509 2088 2521 2825 2263 1343 543 203 642 837 1165 1893 2134 2146 963 268 -252 -261 -144
2200 -144 62 293 508 1155 693 -270 -922 -1636 -1636 -1302 -1308 -882 -328 -205 -452 -1697 -2132 -2123 -1851 -1928 -1791 -911
2222 -911 -187 -123 -795 -1446 -1658 -1606 -1125 -1607 -958 251 449 325 -280 -545 -587 -525 -642 -287 223 1052 1676
2243 1676 727 166 217 330 281 -79 611 1207 1722 1695 1094 764 659 257 158 345 849 1457 1880 1192 527
2264 527 517 316 -273 -678 -73 490 1148 1257 922 216 -132 -456 -1090 -1048 -104 926 1083 524 143 105 -249
2285 -249 -878 -1338 -990 -395 381 639 297 -68 -150 -632 -1772 -1975 -1191 -172 251 289 218 289 -224 -906 -1789
2306 -1789 -1568 -1187 -54 133 509 151 -343 -271 -1224 -1801 -1644 -853 36 273 798 411 152 63 -1026 -1795
2326a795P64J266J47N47J89K94k15j042o17j31L96Q68M44N69J41K73m79j138r23
2345d42J74Q47K20M42M79L07J84q79j128o78l03O23L90L78R34K84k79j324j281
2364a052l12m1P4Q11K52P26N25j088r83q40l33K48j85M13M68J295L06o48j100
2383a464n00k04l1M79M45R84Q52k86m57m01p74K48j71L86Q52J341M99l52n47m84
2403D15l34l21m20P61J449L63M64j7p59j72p84m44l75K75J630N28R6n44k33q87
2423F91m82q09j05N22J063L52j47m00l47l56j084q65N92N20Q39J58K48j92n23
2442c25p91o58p26L93N69P81O07j17K69k40r23o57L2L91O52M13L91J7L61l87q12
2463g60k14o8M69N22M49J29O69m54l28n61l59j76N68N63J79L27M28q4p07q88j6
$$ plain form
2326 -1795 -1031 235 382 929 1118 1412 1197 155 -462 -593 -197 671 1115 1684 1825 2098 1619 481 -442
2345 -442 -268 579 799 1241 1720 2027 2211 1332 204 -474 -777 -154 236 614 1548 1832 1553 229 -1052
2364 -1052 -1364 -1405 -1331 -520 -268 458 983 -105 -1088 -1928 -2261 -2013 -2198 -1785 -1317 -22 284 -364 -1464
2383 -1464 -1964 -2168 -2199 -1720 -1275 -291 561 275 -182 -583 -1357 -1109 -1280 -894 -42 1299 1798 1446 899 415
2403 415 81 -240 -660 101 1550 1913 2377 2360 1601 1429 645 201 -174 101 1731 2259 2355 1811 1578 691
2423 691 209 -600 -705 -183 880 1232 1085 685 338 -18 -1102 -1967 -1375 -855 -16 142 390 198 -325
2442 -325 -1116 -1774 -2500 -2107 -1538 -757 -150 -267 2 -238 -1161 -1818 -1786 -1395 -743 -330 61 78 439 52 -760
2463 -760 -974 -1042 -573 -51 398 527 1196 742 414 -147 -506 -682 -114 449 628 955 1383 1299 592 -296 -312
2484c12K44M63j56L65M93q2Q7n45r13J45L86l6L61N06J51K9n95n43k95L08k0n9
2506a8J53N14L94m13l26q45L34mJ6K01R0L95J43q2q65l00J98m8k44K60N09J48
2528B10j14n01n43j75J96l42O05J19M59k19o8k18o81p8K12J44N9N17O61k68k06
2549b31n73Q5k77K68R5l2O51O66K00n13j40k26N2k25P1N37P55L41l7n32l48J77
2571G64n67K56L82K87P35j96k62j39n31N4o06j79P13M15O4R3k83o70J12o83l34
2592e75k21K85P27J89n95l4j06n17o01r9nJ64R94O4R0p32R2p75l59k21N26R97
2614g12J10K14j46N1J27o41m26J49J82Q52R40k37L56o8m01n70m01K39O34N53K33
2635A038O84j91J2q37o62j25M06O87L46l8P23p0m02q77l00n54K23J12M52L75N12
$$ plain form
2484 -312 -68 395 239 604 1097 1015 1102 557 -356 -211 175 139 500 1006 1157 1186 591 48 -247 61 41 -18
2506 -18 135 649 1043 630 304 -541 -207 -211 -195 6 96 491 634 552 -313 -613 -415 -463 -707 -447 62 210
2528 210 96 -405 -948 -1123 -927 -1269 -664 -545 -86 -305 -373 -591 -1272 -1350 -1138 -994 -935 -418 243 -25 -231
2549 -231 -804 -719 -996 -728 -633 -665 -14 652 852 339 199 -27 25 -200 -129 408 1163 1504 1467 935 587 764
2571 764 197 453 835 1122 1857 1661 1399 1260 729 783 177 -2 711 1126 1190 1283 1000 330 442 -241 -575
2592 -575 -796 -511 216 405 -190 -224 -330 -847 -1448 -1547 -1552 -1388 -394 -330 -240 -972 -880 -1655 -2014 -2235 -1709 -712
2614 -712 -602 -388 -534 -483 -356 -997 -1423 -1274 -1092 -240 700 463 819 751 350 -220 -621 -382 252 805 1038
2635 1038 1722 1531 1543 706 44 -81 325 1012 1358 1320 2043 1973 1571 694 394 -160 63 175 627 1002 1514
2656A514n36j58p69p40j76L84Q3K37N91M25o6q93n85j93k76n8L73K39J029Oj48
2677B83r28k35l67q1Q7M46M48O12K98k7q68j03l41m35k6M77R74K40J50j49o84
2698b29l82O5m11L33J43J006L57P0o46p3o84K7q27N10L48J150M75l16r6l38p37
2719b55k6n21L79P07K19P19m23J18k98m72q33K6O32O29P21P3k21j35n35l44o27
2740d67J71K86O97L03j2o8j54j65q42m07R8L77L12M43m4j2l67m61p03k58L90M49
2762d34J09m1J75L4j52o65k74k46M16L1M23L01r7M0j67n68k61MP10p8K69N63J74
2785B66K22p02k36j15J25L45J94M98K52M11l96j88l49L1j3J5N67K87L31k35J17
2806A427o85q7l37K18M02m46M52M13k77l96k04n19J73k79L06M5M74k75n05m43
$$ plain form
2656 1514 978 820 51 -689 -865 -481 -398 -161 430 855 789 -104 -689 -882 -1158 -1216 -843 -604 425 431 283
2677 283 -645 -880 -1247 -1328 -1241 -795 -347 265 563 536 -332 -435 -776 -1211 -1237 -760 214 454 604 455 -229
2698 -229 -611 -546 -957 -624 -481 525 882 952 306 233 -451 -424 -1251 -741 -393 757 1232 916 820 482 -255
2719 -255 -281 -802 -423 284 503 1222 799 917 619 147 -686 -660 -28 601 1322 1395 1174 1039 504 160 -467
2740 -467 -296 -10 687 990 978 910 756 591 -251 -658 -560 -183 129 572 528 516 149 -312 -1015 -1273 -883 -434
2762 -434 -325 -366 -191 -157 -309 -974 -1248 -1494 -1078 -1047 -624 -323 -420 -380 -547 -1115 -1376 -1372 -662 -740 -471 92 266
2785 266 488 -214 -450 -565 -440 -95 99 597 849 1260 864 676 327 358 345 360 927 1214 1545 1310 1427
2806 1427 742 655 318 536 938 492 944 1357 1080 684 480 -39 134 -145 161 206 680 405 -100 -543
2826e43j11j95QL2m5K26O63m27%m76l38n6k27R4P18J01L23J50m65k89L6j22L50
2849e93j6J96O60P4j02p07j6M32j34m88N06P22J20R0r1o62J92j87j57J69Q85J
2871H94J46L6k33l81l04Q8l17n6O07L87L46l45n21M1l88l98j24J95J100M9rl66
2893D47k66J8l35m24m7L86O40K36j35k44j01m84j48n08M17L76L65M09l80rjm03
2915a91m32l06M22K42M39L72j89J46o33m88l91J19q7N83L06L07L2j98l14k64m15
2936i40J67NL40M09M53m7j61n3p99l57J06K67P47r8O53L37l17p03k04k76K97L41
2958A67K13L20M56J26k78n14l23l09L73Q2K89M62M95j87l30n93m58N7l55L47J42
2979A82M86M33q2n50n95j78m50P4L14j63R03R6k87n20l25k87j43j80L24M25L51
$$ plain form
2826 -543 -654 -849 -841 -809 -854 -628 35 -392 -392 -868 -1206 -1262 -1489 -1395 -677 -576 -253 -103 -568 -857 -821 -943 -593
2849 -593 -609 -413 247 321 219 -488 -504 -72 -206 -694 -188 534 654 744 653 -9 183 -4 -161 8 893 894
2871 894 1040 1076 843 462 158 246 -71 -127 480 867 1213 868 347 388 0 -398 -522 -327 773 822 813 447
2893 447 181 199 -136 -560 -607 -221 419 655 520 276 175 -309 -457 -965 -548 -172 193 602 222 213 212 -191
2915 -191 -623 -929 -507 -265 174 546 357 503 -130 -618 -1009 -890 -977 -394 -88 219 251 53 -261 -525 -940
2936 -940 -773 -768 -428 -19 434 387 226 173 -626 -983 -877 -610 137 39 692 1029 712 9 -195 -471 -174 167
2958 167 380 700 1156 1282 1004 490 167 -142 231 313 602 1064 1559 1372 1042 449 -9 48 -307 40 182
2979 182 668 1101 1019 469 -126 -304 -754 -680 -366 -529 374 470 183 -337 -662 -949 -1092 -1272 -948 -523 -172
3000a72J13k45m81m08r9mn6N31P27J58J33l68j05k69j07l25O6P48P53j4p3j45
3022C58L53j6p18j64q8M93Q21j07P9M4j9m13m71J10L19K06L64l25PN65r61O0o69
3045a72k97N38P3N67k39q1L89p18k55m89J55L85l6N4k1J93J02m46p80J67J89j31
3067h53M16M08r2J84l94k43p0k06J05K12L29K76o8r7j24j65M00n64N03n7R3J54
3089A47K5M38o03j41LQL52l85k00O82L4j8m11l34L90J9k29O4M55K30P9k94k98
3112A3j11q4p4L8K14J82K04j2l7n62R8P5J39J34J45M10j55k43k43K45l95Q7J9
3135H7q1M22j2J50k75j88k55n4P7M3q6L04J78L0k89m71J45J66l52J08M1N78k20
3158D6L6n66l82L71j77J22k36P10j19M2k6n30M19m27o7J83J93L11M7K71k36K48
$$ plain form
3000 -172 -59 -304 -785 -1193 -1292 -1296 -1352 -821 -94 64 197 -171 -276 -545 -652 -977 -911 -163 590 576 503 358
3022 358 711 695 -23 -187 -275 218 1039 932 1011 1055 1036 623 152 262 581 787 1151 826 833 1398 437 497 -172
3045 -172 -469 69 142 709 470 389 778 60 -195 -684 -529 -144 -180 -126 -147 46 148 -298 -1078 -911 -722 -853
3067 -853 -437 -29 -121 63 -331 -574 -644 -850 -745 -533 -204 72 4 -93 -217 -382 18 -546 -43 -100 -7 147
3089 147 172 610 7 -134 -131 -123 229 -156 -356 326 360 342 -69 -403 -13 6 -223 -159 296 526 605 311 13
3112 13 -98 -182 -256 -218 -4 178 382 370 333 -229 -131 -56 83 217 362 772 617 374 131 376 -19 68 87
3135 87 6 428 416 566 291 103 -152 -206 -129 -86 -172 132 310 340 51 -420 -275 -109 -461 -353 -312 266 46
3158 46 82 -484 -866 -495 -672 -550 -786 -76 -195 -153 -179 -709 -290 -717 -784 -601 -408 -97 -50 221 -15 233
3180B33n05k37PJ72L76M78J32p2N7l43K87l94J95k13K92Q80k47o3l34J86l99j66
3202C22l49K96N96O0j74jkl85m52k80O5K31M13%o8L5j18o86j22j25J34L03M6J13
3226a48k38M35k91n78l06k14M42Q2M02J57j19J80m8o28J08R8J02J30O37j9K96
3247D80o0j50l18k19j32L70K65K79K20K73m31j74k58l72M55k33K94L41M04l37
3267F97O6k66l29k59M2J6J47J70J80J36j02l52m6o61L46j69K92L54J00o4Qk69
3289C7n00K27m01K79K66K07M2J08l23j75k13J00l19J51J67O31K20l12j55j64j51
3310b78k17l8N2N44J30N6r7k33N3k65j24J83L5K31L56l39l06R2J10j88m18l6L97
3333c00J90L69j37K28k85J59o13J19k32M73l6N38j13j24K63l24k83k02O77j61
$$ plain form
3180 233 -272 -509 -502 -330 46 524 656 584 641 298 585 191 386 173 465 1345 1098 1035 701 887 488 322
3202 322 -27 269 865 925 751 750 748 363 -89 -369 -304 -73 340 340 272 307 189 -497 -619 -744 -610 -307 -261 -148
3226 -148 -386 49 -242 -820 -1126 -1340 -898 -816 -414 -257 -376 -196 -244 -872 -764 -666 -564 -434 203 184 480
3247 480 420 270 -48 -267 -399 -29 236 515 735 1008 577 403 145 -227 228 -5 289 630 1034 697
3267 697 763 497 168 -91 -49 -33 114 284 464 600 498 146 100 -561 -215 -384 -92 262 362 298 306 37
3289 37 -463 -236 -637 -358 -92 115 157 265 -58 -233 -446 -346 -665 -514 -347 284 504 192 37 -127 -278
3310 -278 -495 -533 -481 63 193 249 152 -81 -28 -293 -417 -234 -199 32 388 49 -257 -165 -55 -243 -661 -697 -300
3333 -300 -110 259 122 350 65 224 -389 -270 -502 -29 -65 473 360 236 499 175 -108 -310 367 206
3353B06O2K57J54k20k37%k98QM86M1J1J94L40l36k82j21k45J99J0P5M2O5K9k70
3377A70k97k8J15j60L22jm32L87j16q5m74M0q6J72J44j85j77K20J39O3m09p1J08
3400f41J32l7L89k02K01L3q0j50K20Q0k35R5L56R5J20k22M6j31M7K21k78L78J63
3423F00K73k78j86J01l84J92K2J13j40K40K34n1m83r9o4j70J08PK41J05k44K00
3445C37m47J37k47N1j30J90J54j00K47n70kj57M8J24L9oJ9N89n39j85j36J6J94
3468c74k06O4L4O06L81l69j66l41K45p4j6o6K25O51k49K47l25m43j98O78n15J96
3490a5M59L3j54K55n56J80m26K0J11R0M23l3m2k67K1r5l49q7K08K27k6J25j34
3513c2J69n1l89j48J2M55j2J62Q5J81j50j95q8m99K82J90K94O9L39j99j60K0l60
$$ plain form
3353 206 268 525 679 459 222 222 -76 -68 418 459 470 664 1004 668 386 265 20 219 229 304 346 411 440 170
3377 170 -127 -155 -40 -200 122 121 -311 76 -40 -125 -599 -559 -645 -473 -329 -514 -691 -471 -332 -269 -678 -749 -641
3400 -641 -509 -546 -157 -359 -158 -125 -205 -355 -135 -55 -290 -195 161 256 376 154 200 69 116 337 59 437 600
3423 600 873 595 409 510 126 318 340 453 313 553 787 736 253 154 90 -80 28 35 276 381 137 337
3445 337 -110 27 -220 -169 -299 -109 45 -55 192 -378 -380 -537 -489 -365 -326 -332 -313 276 -263 -448 -584 -568 -374
3468 -374 -580 -516 -482 124 505 136 -30 -371 -126 -200 -216 -282 -57 594 345 592 267 -176 -374 304 -211 -15
3490 -15 444 477 323 578 22 202 -224 -204 -93 -3 420 387 345 78 99 4 -345 -432 -224 3 -23 102 -32
3513 -32 137 86 -303 -451 -439 16 4 166 251 432 282 87 -1 -500 -218 -28 266 335 674 475 315 335 -25
3536b5k05J81j70J91K95k77M92l43No85j07M15L0J92K6K46j77l30m1N5k79K81
3558b30P0P7R7L05K2k54m31P9m12K24O0L43j68K59j39r9J64m94J35L8R9L78M27
3581E50J21m40j27R3k49j61K50L7L05m6J77K20l45M0l13o2l3K76n0L80n7o9j96
3604C01m14Qn2O7J35K12J20o6j58l84%l44K30k76J12K31L78k35K3J06j66m47j1
3627f30K14R4RM45j01j38k11r7L74k10J81k25M51j92J30K53j90n09L46p6M0L27
3649B85M8q8J91K06l91L6m15L02K8M9n6N58k87l03n0j67j6M07J01m84K01j45M
3672A4j23K74q28L97J50K12j48j63J86J49m66K17J22l10K84J68q0L3k17K96n38
3693c71L0L35k04L09j27q4J40k7l4J02j93O9k9J12K36o8k0J22k48m19L29rK30
$$ plain form
3536 -25 -230 -49 -219 -28 267 -10 482 139 144 -541 -648 -233 -203 -11 15 261 84 -246 -287 -232 -511 -230
3558 -230 -160 -83 14 319 341 87 -344 -265 -677 -453 -393 -50 -218 41 -98 -197 -33 -527 -392 -354 -255 123 550
3581 550 671 231 104 197 -52 -213 37 74 379 333 510 730 385 425 112 50 17 293 243 623 566 497 301
3604 301 -113 -105 -157 -90 45 257 377 311 153 -231 -231 -575 -345 -621 -509 -278 100 -135 -112 -6 -172 -619 -630
3627 -630 -416 -322 -313 132 31 -107 -318 -415 -41 -251 -70 -295 156 -36 94 347 157 -352 -6 -82 -42 285
3649 285 333 245 436 642 251 287 -128 174 202 251 195 753 466 163 113 -54 -70 337 438 -46 155 10 14
3672 14 -109 165 -663 -266 -116 96 -52 -215 -29 120 -346 -129 -7 -317 -33 135 55 88 -129 167 -371
3693 -371 -341 -6 -210 99 -28 -112 28 1 -33 69 -124 -55 -84 28 264 196 176 298 50 -369 -40 -49 181
3716A81j26j0L93o5j09n81J6qJ10J26K3J6nL43l23l12j23J95K3J80m1R0K40k75
3740d2k11K5j49L17p4Q8M50p8J08j8k19j16R4k0p6J72K65L4M4k32M4j98O9k02
3764G5J33Q3K56j80j81j88k3j25K22j91K49N1p5K80k34j81r7k77k06M75pL56k12
3787CN6k85j98K40J68m73j35L07J6L53k9L5P4m03j28L69k52K98M9K06j66j7k7
3810F1M8k11j30L39J47o6L17l35J29L26n23k15j72N12J25m8M39j64R3o38p9l12
3832c57L64K5L06N0r9k00P0l10o6k80K92N1l0j88J48K94r6m82r7R1J52P9j43K79
3856a47p3M96l34n7m4k95M11l01K60L51l64l0K39l09j91M44j15rK5K04K25l6j52
3879A98p1l7j66k8J82K43OM1qk67J6j86J09k5l58N27o8K4K4R5k69m36M12m90K56
$$ plain form
3716 181 55 45 438 373 264 -317 -301 -309 -199 -73 -50 -34 -39 304 -19 -331 -454 -259 -236 -56 -97 -7 233 -42
3740 -42 -253 -228 -377 -60 -134 -46 404 326 434 416 197 81 175 155 79 251 516 550 594 362 406 208 277 75
3764 75 208 291 547 367 186 -2 -25 -150 72 -119 130 181 106 386 152 -29 -126 -403 -609 -134 -141 215 3
3787 3 59 -226 -424 -184 -16 -489 -624 -317 -301 52 23 58 132 -271 -399 -30 -282 16 65 271 105 88 61
3810 61 109 -102 -232 107 254 188 505 170 299 625 102 -113 -285 227 352 304 743 579 672 34 -45 -357
3832 -357 7 32 338 388 289 89 159 -151 -217 -497 -205 -154 -184 -372 -224 70 -26 -508 -605 -514 -362 -283 -426 -147
3856 -147 -220 276 -58 -115 -159 -454 -43 -344 -84 267 -97 -127 112 -197 -388 56 -59 -68 -43 161 386 350 198
3879 198 127 90 -76 -104 78 321 327 368 360 93 109 -77 32 7 -351 176 108 132 156 251 -18 -454 -42 -532 -276
3904b76K64J11j17K42k57j84k51j79L35o7M17J61l83M31j32Q9j67L9l68M13JL48
3926D70m28N07k45k97k42K7J96j00N61k03j79k1n0K6j38O9K50j90k4l3K85l42
3948a01K60O1n29J96j58L6K03p7L2j78J54j25k24J28K20k57M69l81L54k04j99
3969c20L04l74L33O9J92j26Q2K43j62K5k41rL07j43J20k80K68L46n30k17J96J75
3991B58k06J89L0l42K12n2Q2k07j03n4K17O4J86k0K7k75j77R4oJ2m42K50M47m33
4015b49k03j24L18k13L35j50l0K42R8j82n6K2r0P7j63J78j73N00j66J92o9k28
4037a34J06L99k76P1m8K56J00l84J51k44M06n8n05K26L05J70m06R2J77o05j38
4058c39L15Ll36M68l12L79k82L45l19q4j43L99K0j61J06k7P8m43K3m0p4J84O3
$$ plain form
3904 -276 -12 99 -18 224 -33 -217 -468 -647 -312 -379 38 199 -184 247 115 204 37 76 -292 121 122 470
3926 470 42 549 304 7 -235 -208 -12 -112 449 246 67 46 -4 22 -116 -47 203 13 -11 -44 241 -101
3948 -101 159 220 -309 -113 -271 -235 -32 -109 -77 -255 -101 -226 -450 -322 -102 -359 110 -271 83 -121 -320
3969 -320 -16 -390 -57 12 204 78 160 403 241 266 25 16 323 180 300 20 288 634 104 -113 83 258
3991 258 52 241 271 -71 141 89 171 -36 -139 -193 24 88 274 254 281 6 -171 -77 -83 -71 -513 -263 184 -249
4015 -249 -452 -576 -258 -471 -136 -286 -316 -74 24 -158 -214 -192 -282 -205 -368 -190 -363 137 -29 163 94 -134
4037 -134 -28 371 95 166 118 374 474 90 241 -3 403 345 -160 66 371 541 135 227 404 -201 -339
4058 -339 -24 -21 -357 111 -201 178 -104 241 -78 -162 -305 94 114 -47 59 32 110 -333 -310 -350 -424 -240 -177
4081a77j23Q24o71O6R6k08k34M21j82K90M8j02L62n15J76j11j84K61N5JN6O2j83
4104B8P9L39m49k3J1P9J44n9l7j0j11K04n68J31J42j34J23K08j95K28j90j16k13
4127c89J74J53n6J56k64m1O04l61j34o5j46K07J08J10K13m12M49n6j46j66K18
4148A56k36L33m9J8J78j16r6l59J55K47l58K01p8K59J75l63K5k2j89k4J84N4M4
4171A39J12j98j42j31L04m01J26o8J58j19J00J16l56J77L6j4J22m04M74o9o1O7
4193c2j58J78m05K42o6K75o0Q6p9J97j75l6k5Q3k8j0N68j98J53m22L25j90j38
4216H5R1j76J84qL62m43K7j59%K71k61kN3K05M5k22Q8j10q1J44m61K70J1l87L09
4241a65J97j66J84k74k20J14L37j0l57R7R3J86j72j73K04k7K16j07J98k28N7O2
$$ plain form
4081 -177 -300 524 -147 -81 15 -193 -427 -6 -188 102 150 48 410 -105 71 -40 -224 37 92 93 149 211 28
4104 28 107 446 -3 -26 -15 64 208 149 112 102 -9 195 -373 -242 -100 -234 -111 97 -98 130 -60 -176 -389
4127 -389 -215 -62 -118 38 -226 -267 337 -24 -158 -223 -369 -162 -54 56 269 -143 306 250 104 -62 156
4148 156 -80 253 204 222 400 284 188 -171 -16 231 -127 74 -4 255 430 67 92 70 -119 -143 41 95 139
4171 139 251 53 -89 -220 84 -317 -191 -259 -101 -220 -120 -4 -360 -183 -147 -161 -39 -443 31 -38 -99 -32
4193 -32 -190 -12 -417 -175 -241 34 -26 60 -19 178 3 -33 -58 25 -3 -13 555 357 510 88 413 223 85
4216 85 176 0 184 176 538 95 122 -37 -37 234 -27 -29 24 229 274 52 140 30 -51 93 -368 -98 -87 -474 -165
4241 -165 32 -134 50 -224 -444 -330 7 -3 -360 -263 -170 16 -156 -329 -125 -152 64 -43 155 -73 -16 46
4263D6K13j1l79N1M4J75j56M07l17j15L93j65k85j05J20K9M66n96M84j74j91k79
4285c45K18J69n0l3J46n1Kj66K7MJ94k86j09L21o1P8o3j04l12J69qL2l3L10J0
4310E9J8j84L06j05k92J81k20J05L10R5l64r8M90k44J82l07l5M30nP4p1k19j61
4333e5J36jj46PJ52J38O8l15r3K79k86p2Q2k5J14K08k92j3J13J10l58K2J97k03
4357b33K52K91k73J33J12n23j29L06J26j87K87j06LrL34l34k5r7J23O8J22r9J51
4380B93M2j24j50j47N06n96J36L09k44J04o2J05j35j68K02r3o6K67K00k89j83
4401i3j4K44k03j19k01M88R2m39J3K4K5j51j10M8J70K81l6j27j4k19J92m2r0J92
4425h9K88m73M63P8Q4l78M4m35L39K30j92J08kJ43K37o88L56J8k31m9M59J22j8
$$ plain form
4263 46 259 248 -131 -80 -36 139 -17 390 73 -42 351 186 -99 -204 -84 -55 411 -185 299 125 -66 -345
4285 -345 -127 42 -8 -41 105 54 56 -110 -83 -79 115 -171 -280 41 -20 58 -5 -109 -421 -252 -260 -228 -261 49 59
4310 59 77 -107 199 94 -198 -17 -237 -132 178 273 -91 -189 301 57 239 -68 -103 327 322 396 325 106 -55
4333 -55 81 80 -66 -59 93 231 299 -16 -109 170 -116 -188 -106 -131 -17 191 -101 -114 -1 109 -249 -227 -30 -233
4357 -233 19 310 37 170 282 -241 -370 -64 62 -125 162 56 59 50 384 50 25 -72 51 119 241 142 293
4380 293 335 211 61 -86 420 -176 -40 269 25 129 67 172 37 -131 71 -22 -88 179 379 90 -93
4401 -93 -107 137 -66 -185 -386 102 194 -245 -232 -208 -183 -334 -444 -396 -226 55 19 -108 -122 -341 -149 -191 -281 -89
4425 -89 199 -274 189 267 351 -27 17 -418 -79 151 -41 67 65 208 445 -243 113 131 -100 -149 310 432 414
4448D14k51K1o6j65j03P5n2L6K90o4P7J1k47j64p4r8K98k22L73k33J71l47M55
4471A35j18j83m9m5N1M23l05K8j11j96K60K69n21M18J21pJ22k09R1lk08j36K22
4494D9J73j04k08N85m41J23j93M3K63n61M52j05O7J43k09j08N7j38J37J35J37
4515B97j99P5n04L38p7m3P9l89J51J58o2l2N64m65l40M19k23J07Q4L36K1r7J3
4538B11o2k90o8J59K3J3O3J09j67L8n7K36j31K61j56lJ21l44J83j19K69J23l65
4561D7j12K72j28Qj33mn7q0Q7j46L08j23q3k10J70M03k68Q8m82L96l67L73k30
4584b71J46P5Q3j44k88M61q7K67k86R1k27j7L30o2j95j39M10K17l05p2L31J24
4606D42k60l23M57o8l40J68K10j34M1m8j49N3M0kj05J71k52K52k62J61k7o0k62
$$ plain form
4448 414 163 184 118 -47 -150 -75 -127 -91 199 135 212 223 -24 -188 -262 -360 -62 -284 89 -144 27 -320 135
4471 135 17 -166 -215 -260 -209 214 -91 -63 -174 -370 -110 159 -362 56 177 170 292 83 174 171 -37 -173 49
4494 49 222 118 -90 495 54 177 -16 27 290 -271 181 76 143 286 77 -31 26 -112 25 160 297
4515 297 98 173 -331 7 -70 -113 -34 -423 -272 -114 -176 -208 356 -109 -449 -30 -253 -146 -62 274 295 198 211
4538 211 149 -141 -209 -50 -27 -14 49 158 -9 29 -28 208 77 338 182 179 300 -44 139 20 289 412 47
4561 47 -65 207 79 87 -46 -50 -107 -187 -100 -246 62 -61 -144 -354 -184 219 -49 39 -443 -47 -414 -41 -271
4584 -271 -125 -50 33 -111 -399 62 -25 242 -44 47 -180 -197 133 71 -124 -263 147 364 59 -13 318 442
4606 442 182 -141 316 248 -92 76 286 152 193 145 -4 49 89 87 -18 153 -99 153 -109 52 25 -35 -297
4629b97K52j06j61J88Jq5M62m50j54r3J22p4J82J0j4K7K42m22O64n39l1K74j61
4652a63O12n24L08m8k32K6N8j50R3j10N9J69O7m04J93L41k82j62K03N19j14k61
4674A98m5J2j31p4K03N9j07R5J83j61j56j9k68j16N4K38n6J8O8j40K00J80n55
4697c20l8M14j01j8Q3K5q2j66L97p53N08j00k55O46j36K60l96J79J1j14O1q3j36
4720a14N9P0j83M12K7j61K5R4j53k00J57j52L18pN7l47O4K5k41nrK22J02P7l66
4745b29M6K77o5l51K90K00l45M7O1P7l7m3J00k97J08M99j25k97J82O5R4k73j63
4768a79J69J5K25L4k6k2K3j81M8M6r0J82J08r8J89n60J79J52j73O3j11R1L2p4
4792D2J00j98j10L60j89j04J04J73r5j82J1o3j3Q0l52N52o3k01k1lK84r6l0k84
$$ plain form
4629 -297 -45 -151 -312 -124 -123 -208 254 -196 -350 -443 -321 -395 -213 -203 -217 -190 52 -370 294 -245 -276 -2 -163
4652 -163 449 -75 233 185 -47 -21 37 -113 -20 -130 -71 98 165 -239 -46 295 13 -149 54 573 459 198
4674 198 153 165 34 -40 163 222 115 210 393 232 76 57 -211 -327 -273 -35 -91 -73 -5 -145 55 235 -320
4697 -320 -358 56 -45 -63 20 45 -37 -203 194 -559 -51 -151 -406 240 104 364 -32 147 158 44 105 22 -114
4720 -114 -55 15 -168 244 271 110 135 229 76 -124 33 -119 199 192 249 -98 -34 -9 -250 -255 -264 -42 60 137 -229
4745 -229 -183 94 29 -322 -32 168 -177 -130 -69 8 -29 -72 28 -269 -161 338 213 -84 98 163 257 -16 -179
4768 -179 -10 5 230 264 238 216 239 58 106 152 62 244 352 254 443 -117 62 214 41 104 -7 84 116 42
4792 42 142 -56 -166 194 5 -99 5 178 83 -99 -88 -151 -164 -84 -436 116 53 -148 -169 -172 112 16 -14 -298
4816b98J60l74R8L09N4K33j01j14O3J85K9k56K27L9l80L15p4J77r8n3j5n4oJ11
4840A77oj47K39o3j24K7Mp6M5P5j66Q6l2J1k1j4j62J92l22K71o4K18k43n1J38
4865hj32k1q1K52k39k68K18L23P3m27m6L70R4l60K13L00l15J81j26J55k9m3j67
4888h3K06P1k79J03J34n8j37J20l9J55L75m11p3j2l3J90r5j54N5rK30k01J70j34
4912I1k6j33k60K43l14L22K87l19pJ19m86K97r6M4K68K63o78K50K47l8k21R2j55
4935b10J46J18k19J1K70P5j93J6j87O0K53m22L84J64m5k83J45j0p5k55m8J84L5
4958h6J20j96K53k71M27m28L92l75J21M54j26k04j00m1K7M9n0k80K66J33J54q5
4980A54j08J16k54J95l41M7O9N16j89j08r1J98k56j16N17l69J85j28l6j69K48
$$ plain form
4816 -298 -138 -512 -414 -105 -51 182 81 -33 30 215 244 -12 215 254 -126 189 115 292 194 141 126 72 66 177
4840 177 171 24 263 200 76 103 107 31 76 151 -15 71 39 50 29 15 -147 45 -277 -6 -70 148 -95 -146 -8
4865 -8 -140 -161 -242 10 -229 -497 -279 44 117 -310 -356 14 108 -252 -39 261 -54 127 1 156 127 84 -83
4888 -83 123 194 -85 18 152 94 -43 77 38 193 568 157 84 72 39 229 134 -20 35 26 256 55 225 91
4912 91 65 -68 -328 -85 -399 -77 210 -109 -116 3 -483 -186 -282 -238 30 293 -385 -135 112 74 -147 -55 -210
4935 -210 -64 54 -165 -154 116 191 -2 14 -173 -113 140 -282 102 266 221 -62 83 73 -2 -257 -305 -121 -86
4958 -86 34 -162 91 -180 247 -181 211 -164 -43 411 285 81 -19 -60 -33 16 -34 -314 -48 85 239 154
4980 154 46 162 -92 103 -238 -191 -122 394 205 97 6 204 -52 -168 349 -20 165 37 1 -168 80
5001H0J53k17p7M7K61l37L56O5q9lJ51k48j71jO3m0K2J14j68J95R6j72j85J07
5025Bj19J30J66j21rm3j96j6L23k43k7j8K7J47l54L09P3k38n5R9j12j6J55R4j37
5050a79L20p6L8p6J67m27J83N97m05K35m15J25m3K4j65J9J50J46Q3m25K82j47
5072A1j58J45J69j29j30J33k78L77o5j14J39k64M30j45k89J35N1M6j27J31p7l15
5094c24K97J26j89L4k16j38K67L39j11o1j99K52k92M05j59k49J70K95k37k31K21
5115@j12L20%k03Q1P4k91L90om79L40J16m38O29l71n6n0o8L0J16L54k90l95L16
5139GJ89l20K75l33J53j32J35Q6L3l06Q9J70M7Jo0J9J99n9q4k25L99n17K14J72
5163A52j61l8M43m64k15L78j06J2k05J0L75Np4J83o1j81N5j2J81j85k02k27M27
$$ plain form
5001 80 233 16 -61 -14 247 -90 266 331 242 239 390 142 -29 -30 33 -7 15 129 -39 156 252 80 -105 2
5025 2 -117 13 179 58 49 6 -190 -206 117 -126 -153 -171 -144 3 -351 -42 31 -207 -262 -163 -275 -291 -136 -42 -179
5050 -179 141 65 103 27 194 -233 -50 547 142 377 -38 87 44 68 -97 -78 72 218 301 -124 158 11
5072 11 -147 -2 167 38 -92 41 -237 140 75 -39 100 -164 266 121 -168 -33 18 64 -63 68 -9 -324
5094 -324 -27 99 -90 -56 -272 -410 -143 196 85 24 -175 77 -215 190 31 -218 -48 247 10 -221 0
5115 0 -112 208 208 5 86 160 -131 259 253 -226 114 230 -208 421 50 -6 -56 -124 -94 22 376 86 -309 7
5139 7 196 -124 151 -182 -29 -161 -26 60 93 -213 -124 46 93 94 34 53 252 193 109 -116 283 -234 -20 152
5163 152 -9 -47 396 -68 -283 95 -11 1 -204 -194 181 186 112 295 234 53 108 96 277 92 -110 -337 90
5186I0K41j01l67j2K12R9q3J08l18j56M03m35K13k57K14Q0n2L1k0n3J46k11J08
5209a20J31K37l93l4R5J79j23J71J14k3k17J9J08k9k38O50j32k26p5jk83J14L52
5232B76m04L85m9l6J1N7l73L89k26j20J40l3J66n02L28kJ68k37N7J69p5O2k07
5255e6l7o2J2J18j10KP3j87o4K63K28j94r4j61J7J2K47O5lj61K05r6q5J90k92
5280a70K42j40k79M69K6q0Q6j74o9L8L55n32N22k04L73m64j04J98k90JO7j42N56
5303B85k9R8l02P0m0n3o3j91qK4K6N2L19K94o63M12l82J81Op0q2J72LJ82m05K28
5329F4m93J36N59k70k92M00J8m22M15Lk30j23K87r9K04j55j91K12j37j32J66Q2
5351BJ28m8K49k58m2R1k18J71L5n4l2jJ82k81K01L1k67J26j2l56L17j30K97l35
$$ plain form
5186 90 331 230 -137 -149 63 162 79 187 -131 -287 116 -319 -106 -363 -149 -69 -121 -90 -110 -163 -17 -228 -120
5209 -120 11 248 -145 -179 -84 95 -28 143 257 234 17 36 144 115 -123 527 395 169 94 93 -190 -76 276
5232 276 -128 257 208 172 183 240 -133 256 30 -90 50 17 183 -319 9 7 175 -62 -5 164 89 151 -56
5255 -56 -93 -155 -143 -25 -135 -133 -60 -247 -311 -48 180 -14 -108 -269 -252 -240 7 72 69 -92 113 17 -68 122 -170
5280 -170 72 -68 -347 122 148 68 154 -20 -89 -51 304 -228 294 90 463 -1 -105 93 -197 -196 -129 -271 285
5303 285 256 354 52 122 82 29 -34 -225 -233 -209 -183 -131 188 482 -181 231 -151 30 36 -34 -116 56 59 241 -164 64
5329 64 -429 -293 266 -4 -296 104 122 -300 115 118 -112 -235 52 -47 157 2 -189 23 -114 -246 -80 2
5351 2 130 82 331 73 31 122 -96 75 110 56 24 23 205 -76 125 156 -111 15 3 -353 -36 -166 131 -204
5375b04K16k13Rr8L66k51N11k53k07K30k16J80k91K35K34k13J92R5k49J58N8j53
5397A36o0J36l61J33R6m9k18L14l60M66j37o3r4Q0j44K72j37K7J03J56k91L8o7
5420b4J48r7n13M28J03j24m11M65K96m77L97l25J75p6m1n9J49k47M37k04q0J15
5442C5J34k09j65L44J19j91k43J96K28k57j2J80j29K32l31J28jJ63n02R5n3J13
5464a26J43j08N9Kr1K35j46j67N05n64J34J7j16K10k60K90j85o1K30p9lj27K65
5487E7j75p7J17m5J16M4j7k93Q4J92k28K83j65L7K59j82r3K60j42j51K1L25j25
5510A02j75N73o97J75L82j45l03K68kl6l55L12j32K46o6j33k9P4O2r4r5qJ92j15
5534AL5j11k2L01k59J54O7k33j37Q7o1j46%J16M2K9j20K85k87L42K3l54M42m4
$$ plain form
5375 -204 12 -201 -192 -290 76 -175 336 83 -124 106 -110 70 -221 14 248 35 227 322 73 231 289 136
5397 136 76 212 -149 -16 80 31 -187 127 -233 233 96 33 -61 19 -125 147 10 37 140 296 5 43 -24
5420 -24 124 27 -486 -58 45 -79 -490 -25 271 -206 191 -134 41 -35 -76 -135 14 -233 204 0 -80 35
5442 35 169 -40 -205 139 258 67 -176 20 248 -9 -21 159 30 262 -69 59 58 221 -281 -186 -239 -126
5464 -126 17 -91 -32 -30 -121 114 -32 -199 306 -258 -124 -107 -223 -13 -273 17 -168 -229 1 -78 -81 -208 57
5487 57 -118 -195 -78 -123 -7 37 20 -273 -189 3 -225 58 -107 -70 189 7 -86 174 32 -119 -98 227 102
5510 102 -73 500 -197 -22 360 215 -88 180 178 142 -213 99 -33 213 147 14 -15 59 121 27 -68 -76 116 1
5534 1 36 -75 -97 204 -55 99 166 -67 -204 -117 -178 -324 -324 -208 -166 -137 -257 28 -259 83 106 -248 194 150
5558A50j82l6L4K62k44j46mj30K54L89l03J57j81R4j87n10O50k6j66K42J8J72
$$ plain form
5558 150 -32 -68 -34 228 -16 -162 -166 -296 -42 347 44 201 20 114 -73 -583 67 41 -125 117 135 307
$$ [...]
8191B8
##END NTUPLES=NMR FID
##END=
