##TITLE=1H_LR-683A2-C1
 CDCl3, 8 sc, 
 23.7.2019
##JCAMPDX= 6.0         $$ Bruker NMR JCAMP-DX V2.0
##DATA TYPE= NMR FID
##DATA CLASS= NTUPLES
##ORIGIN= UXNMR, Bruker Analytische Messtechnik GmbH
##OWNER= root
$$ XWIN-NMR		Version 3.5
$$ Tue Jul 23 14:16:17 2019 Russian Standard Time (UT+4h)  she@DPX200
##.OBSERVE FREQUENCY= 200.13155
##.OBSERVE NUCLEUS= ^1H
##.DELAY= (6, 6)
##.ACQUISITION MODE= SIMULTANEOUS
##.ACQUISITION SCHEME= undefined
##.AVERAGES= 8
##.DIGITISER RES= 18
##SPECTROMETER/DATA SYSTEM= spect
##.PULSE SEQUENCE= zg30
##.SOLVENT NAME= D2O
##.SHIFT REFERENCE= (INTERNAL, D2O, 0, 15.7039)
##AUDIT TRAIL= $$ (NUMBER, WHEN, WHO, WHERE, WHAT)
$$ ##TITLE= Audit trail, XWIN-NMR		Version 3.5
$$ ##JCAMPDX= 5.01
$$ ##ORIGIN= Bruker BioSpin GmbH
$$ ##OWNER= she
$$ F:/spectra/data/she/nmr/H-F/1/audita.txt
$$ ##AUDIT TRAIL=  $$ (NUMBER, WHEN, WHO, WHERE, WHAT)
(   1,<2019-07-23 14:12:12.96 +0400>,<she>,<DPX200>,
      <created by zg, POWCHK disabled, PULCHK disabled
       configuration hash MD5:
       00 E9 B6 7A A2 85 ED C7 34 08 36 98 17 FE 4E 26
       data hash MD5: 16K
       30 EE 6C 4B A3 3A 56 43 A2 33 68 D3 A8 30 E8 56>)
$$ ##END=
$$ 
$$ hash MD5
$$ A9 1F 08 43 E7 6B 22 1C 64 24 B7 AA F1 64 6D 42
##$RELAX= 
##$RELAX= 
##$RELAX= 
##$RELAX= 
##$RELAX= 
##$RELAX= 
$$ Bruker specific parameters
$$ --------------------------
##$DU= <F:/spectra>
##$EXPNO= 1
##$NAME= <H-F>
##$PROCNO= 1
##$TYPE= <nmr>
##$USER= <she>
##$AMP= (0..31)
100 100 100 100 100 100 100 100 100 100 100 100 100 100 100 100 100 100 
100 100 100 100 100 100 100 100 100 100 100 100 100 100 
##$AQSEQ= 0
##$AQ_mod= 1
##$AUNM= <au_zg>
##$AUTOPOS= <>
##$BF1= 200.13
##$BF2= 200.13
##$BF3= 200.13
##$BF4= 200.13
##$BF5= 200.13
##$BF6= 200.13
##$BF7= 200.13
##$BF8= 200.13
##$BYTORDA= 1
##$CFDGTYP= 0
##$CFRGTYP= 5
##$CHEMSTR= <none>
##$CNST= (0..31)
1 1 145 1 1 1 1 1 1 1 1 1 1 1 1 1 1 1 1 1 1 1 1 1 1 1 1 1 1 1 1 1 
##$CPDPRG= <>
##$CPDPRG1= <>
##$CPDPRG2= <>
##$CPDPRG3= <>
##$CPDPRG4= <mlev>
##$CPDPRG5= <mlev>
##$CPDPRG6= <mlev>
##$CPDPRG7= <mlev>
##$CPDPRG8= <mlev>
##$CPDPRGB= <>
##$CPDPRGT= <>
##$D= (0..31)
0 1.2 0 0 0 0 0 0 0 0 0 0.03 0 0 0 0 0 0 0 0 0 0 0 0 0 0 0 0 0 0 0 0 
##$DATE= 1563876732
##$DBL= (0..7)
120 120 120 120 120 120 120 120 
##$DBP= (0..7)
150 150 150 150 150 150 150 150 
##$DBP07= 0
##$DBPNAM0= <>
##$DBPNAM1= <>
##$DBPNAM2= <>
##$DBPNAM3= <>
##$DBPNAM4= <>
##$DBPNAM5= <>
##$DBPNAM6= <>
##$DBPNAM7= <>
##$DBPOAL= (0..7)
0.5 0.5 0.5 0.5 0.5 0.5 0.5 0.5 
##$DBPOFFS= (0..7)
0 0 0 0 0 0 0 0 
##$DE= 6
##$DECBNUC= <off>
##$DECIM= 24
##$DECNUC= <off>
##$DECSTAT= 4
##$DIGMOD= 1
##$DIGTYP= 9
##$DL= (0..7)
0 120 120 120 120 120 120 120 
##$DP= (0..7)
150 150 150 150 150 150 150 150 
##$DP07= 0
##$DPNAME0= <>
##$DPNAME1= <>
##$DPNAME2= <>
##$DPNAME3= <>
##$DPNAME4= <>
##$DPNAME5= <>
##$DPNAME6= <>
##$DPNAME7= <>
##$DPOAL= (0..7)
0.5 0.5 0.5 0.5 0.5 0.5 0.5 0.5 
##$DPOFFS= (0..7)
0 0 0 0 0 0 0 0 
##$DQDMODE= 0
##$DR= 18
##$DS= 0
##$DSLIST= <SSSSSSSSSSSSSSS>
##$DSPFIRM= 0
$$ [...]
##$SUBNAM2= <"">
##$SUBNAM3= <"">
##$SUBNAM4= <"">
##$SUBNAM5= <"">
##$SUBNAM6= <"">
##$SUBNAM7= <"">
##$SUBNAM8= <"">
##$SUBNAM9= <"">
##$SW= 24.9336996594482
##$SWIBOX= (0..15)
0 0 2 0 0 0 0 0 0 0 0 0 0 0 0 0 
##$SW_h= 4990.01996007984
##$TD= 16384
##$TD0= 1
##$TE= 0
##$TE2= 300
##$TE3= 300
##$TEG= 300
##$TL= (0..7)
0 120 120 120 120 120 120 120 
##$TP= (0..7)
150 150 150 150 150 150 150 150 
##$TP07= 0
##$TPNAME0= <>
##$TPNAME1= <>
##$TPNAME2= <>
##$TPNAME3= <>
##$TPNAME4= <>
##$TPNAME5= <>
##$TPNAME6= <>
##$TPNAME7= <>
##$TPOAL= (0..7)
0.5 0.5 0.5 0.5 0.5 0.5 0.5 0.5 
##$TPOFFS= (0..7)
0 0 0 0 0 0 0 0 
##$TUNHIN= 0
##$TUNHOUT= 0
##$TUNXOUT= 0
##$USERA1= <user>
##$USERA2= <user>
##$USERA3= <user>
##$USERA4= <user>
##$USERA5= <user>
##$V9= 5
##$VALIST= <valist>
##$VCLIST= <CCCCCCCCCCCCCCC>
##$VD= 0
##$VDLIST= <DDDDDDDDDDDDDDD>
##$VPLIST= <PPPPPPPPPPPPPPP>
##$VTLIST= <TTTTTTTTTTTTTTT>
##$WBST= 1024
##$WBSW= 4
##$XGAIN= (0..3)
0 0 0 0 
##$XL= 0
##$YL= 0
##$YMAX_a= 117470
##$YMIN_a= -229900
##$ZGOPTNS= <>
##$ZL1= 120
##$ZL2= 120
##$ZL3= 120
##$ZL4= 120
##$ABSF1= 10
##$ABSF2= 0
##$ABSG= 5
##$ABSL= 3
##$ALPHA= 0
##$AQORDER= 0
##$ASSFAC= 0
##$ASSFACI= 0
##$ASSFACX= 0
##$ASSWID= 0
##$AUNMP= <proc_1d>
##$AZFE= 0.1
##$AZFW= 0.1
##$BCFW= 1
##$BC_mod= 2
##$BYTORDP= 1
##$COROFFS= 0
##$CY= 11.3945322036743
##$DATMOD= 1
##$DC= 2
##$DFILT= <>
##$DTYPP= 0
##$F1P= 18.9103706918063
##$F2P= -1.10871071338519
##$FCOR= 0.5
##$FTSIZE= 0
##$FT_mod= 4
##$GAMMA= 1
##$GB= 0.15
##$INTBC= 1
##$INTSCL= 1
##$ISEN= 128
##$LB= 0.24
##$LEV0= 0
##$LPBIN= 0
##$MAXI= 10000
##$MC2= 0
##$MEAN= 0
##$ME_mod= 0
##$MI= 1.114404
##$NCOEF= 0
##$NC_proc= 0
##$NLEV= 6
##$NOISF1= 3.799351
##$NOISF2= 2.8
##$NSP= 1
##$NTH_PI= 0
##$NZP= 0
##$OFFSET= 15.70392
##$PC= 1
##$PHC0= -8863.425
##$PHC1= 16.40096
##$PH_mod= 1
##$PKNL= yes
##$PPARMOD= 0
##$PSCAL= 0
##$PSIGN= 0
##$REVERSE= no
##$SF= 200.130013532006
##$SI= 16384
##$SIGF1= 3
##$SIGF2= 2
##$SINO= 400
##$SIOLD= 16384
##$SREGLST= <1H.CDCl3>
##$SSB= 0
##$STSI= 0
##$STSR= 0
##$SW_p= 3612.71676300578
##$SYMM= 0
##$S_DEV= 0
##$TDeff= 0
##$TDoff= 0
##$TI= <>
##$TILT= no
##$TM1= 0
##$TM2= 0
##$TOPLEV= 0
##$USERP1= <user>
##$USERP2= <user>
##$USERP3= <user>
##$USERP4= <user>
##$USERP5= <user>
##$WDW= 1
##$XDIM= 8192
##$YMAX_p= 0
##$YMIN_p= 0
$$ End of Bruker specific parameters
$$ ---------------------------------
##NTUPLES= NMR FID
##VAR_NAME=  TIME,          FID/REAL,        FID/IMAG
##SYMBOL=    X,             R,               I
##VAR_TYPE=  INDEPENDENT,   DEPENDENT,       DEPENDENT
##VAR_FORM=  AFFN,          ASDF,            ASDF
##VAR_DIM=   8192,          8192,            8192
##UNITS=     SECONDS,       ARBITRARY UNITS, ARBITRARY UNITS
##FACTOR=    0.0002004,     1,               1
##FIRST=     0,             0,               0
##LAST=      1.6414764,     0,               0
##MIN=       0,             -229900,         0
##MAX=       1.6414764,     117470,          0
$$ Real data points
##PAGE= N=1
##DATA TABLE= (X++(R..R)), XYDATA
$$ plain form
0 0 0 0 0 0 0 0 0 -8 8 -8 8 -16 16 -24 24 -32 40 -48 56 -64 78 -88 104 -120 138 -159 181 -207 234 -264
30 -264 297 -334 375 -418 466 -522 580 -644 715 -793 879 -972 1076 -1191 1321 -1464 1626
47 1626 -1809 2021 -2268 2555 -2901 3324 -3855 4543 -5479 6830 -8964 12854 -22294 95451
61 95451 41981 -107097 64858 96788 -24727 -41527 104147 90862 -20529 -21311 42974 -13012
73 -13012 -57793 -8014 2110 -83582 -80870 7047 19086 -40218 -38878 -38053 -101576 -123898 -53524
86 -53524 -26305 -59709 -37429 8159 -44975 -115305 -80429 -23770 -44705 -59739 -24636 -25941
98 -25941 -51880 -9030 37935 -12986 -65069 -16687 19767 -30463 -38169 50236 93336 40321
110 40321 1895 6452 2052 13845 56534 58054 27019 54897 95556 43207 -11542 48639 99650
$$ packed form
0@%%%%%%%qJ6j6J6k4L2m0M8n6P2q8J04j20J42j66J92k24K58k97L40l88M41m98
30b64N61o31P09p93Q84r88J102j224J359j508J672j851K048k267K512k785L090
47A626l435L830m289M823n456O225p179Q398j0022J2309j5794K1818l5148J17745
61I5451n3470j49078J71955L1930j21515j6800J45674j3285j11391p82O4285n5986
73a3012m4781M9779J0124q5692K712Q7917J2039n9304J340Q25o3523k2322P0374
86e3524K7219l3404K2280M5588n3134p0330L4876N6659k0935j5034L5103j305
98b5941k5939M2850M6965n0921n2083M8382L6454n0230p706Q8405M3100n3015
110D0321l8426M557m400J1793M2689J520l1035K7878M0659n2349n4749O0181N1011
$$ plain form
123 99650 27002 -20746 54262 88686 18327 16986 96919 64847 -48733 -34426 57142 30904
135 30904 -33991 22510 80002 1501 -65542 -12895 11379 -50368 -44436 27256 -247 -79079
147 -79079 -40680 32644 -21800 -97207 -48661 5047 -52234 -88957 -20124 19808 -29082 -52308
159 -52308 -26889 -41646 -69556 -34236 6510 -13646 -27433 4914 4970 -36196 -30069 11125 5127
172 5127 -18266 6747 32235 10025 3876 39360 39808 -1278 -3201 29613 30287 20779 45460 60327
186 60327 32737 18899 31972 20347 1721 31262 61496 33789 9636 35386 41421 2497
198 2497 -3144 28449 16664 -15511 8366 37045 3301 -19388 17971 17619 -45067 -51055 10022
211 10022 9749 -40138 -20316 26666 -13199 -70258 -36199 2650 -38816 -60093 -3887 13428
$$ packed form
123I9650p2648m7748P5008L4424p0359j341P9933l2072j13580J4307R1568k6238
135C0904o4895N6501N7492p8501o7043N2647K4274o1747N932P1692k7503p8832
147g9079L8399P3324n4444p5407M8546N3708n7281l6723O8833L9932m8890k3226
159e2308K5419j4757k7910L5320M0746k0156j3787L2347N6m1166O127M1194n998
172E127k3393K5013K5488k2210o149L5484M48m1086j923L2814O74r508K4681J4867
186F0327k7590j3838J3073j1625j8626K9541L0234k7707k4153K5750O035l8924
198B497n641L1593j1785l2175K3877K8679l3744k2689L7359l52o2686n988O1077
211A0022k73m9887J9822M6982l9865n7059L4059L8849m1466k1277N6206J7315
$$ plain form
223 13428 -41989 -49602 113 -8341 -57605 -42326 618 -16684 -38991 -1391 21811 -15606
235 -15606 -30648 -7 -3208 -32999 -12591 30584 21425 -2759 16631 28919 -1178 -11433
247 -11433 18765 25802 7107 19265 44839 32896 13224 26021 32409 8309 2203 25204 31240
260 31240 20322 30551 41967 22376 2331 9330 10231 -3887 4468 26305 19524 2048 9324
273 9324 12245 -13146 -24396 -5506 -2887 -22193 -13811 10212 -1178 -26604 -18059 -9623 -34941
286 -34941 -46804 -18389 -3998 -23824 -22918 37 -10328 -41685 -36063 -13150 -22618 -33795 -9180
299 -9180 8464 -9444 -18566 -1250 -2715 -24993 -20133 4853 4784 -4155 12634 27585 11003 -3089
313 -3089 7987 12368 540 6535 29124 31849 20306 24635 30651 16310 4237 15199 23111
$$ packed form
223A3428n5417p613M9715q454m9264J5279M2944j7302k2307L7600K3202l7417
235a5606j5042L0641l201k9791K0408M3175r159k4184J9390J2288l0097j0255
247a1433L0198P037j8695J2158K5574j1943j9672J2797O388k4100o106K3001O036
260C1240j0918J0229J1416j9591k0045O999R01j4118Q355K1837o781j7476P276
273I324K921k5391j1250J8890K619j9306Q382K4023j1390k5426Q545Q436k5318
286c4941j1863K8415J4391j9826R06K2955j0365l1357N622K2913r468j1177K4615
299i180J7644j7908r122J7316j465k2278M860K4986o9q939J6789J4951j6582j4092
313c089J1076M381j1828N995K2589K725j1543M329O016j4341j2073J0962P912
$$ plain form
326 23111 16826 18697 32618 31201 16555 13014 14638 4858 -2144 7284 14937 9967 9174 13735 5340
341 5340 -9582 -12936 -9368 -14087 -14779 -4719 -755 -9341 -13333 -12332 -21520 -32119 -27405 -18183 -19994
356 -19994 -20351 -9997 -7924 -20230 -25873 -20986 -22915 -27644 -18908 -5424 -5470 -8316 -2146 -1426 -12638
371 -12638 -16560 -6397 -394 -1200 6525 18410 16938 8839 8714 9591 4458 5010 15668 22502 22395
386 22395 25820 29509 22080 11939 12203 14243 11592 14315 24045 27956 21609 17421 15112 6313 -2119
401 -2119 -414 5069 5702 6354 11114 9386 -994 -8736 -11655 -15719 -18857 -13913 -6752 -5697 -7503
416 -7503 -8427 -13381 -22069 -27529 -26213 -23537 -19524 -12604 -8020 -9104 -12002 -15452 -20496 -24103 -21053
431 -21053 -13229 -7736 -3098 2859 4305 -424 -5717 -6887 -5970 -4365 2150 10845 16278 17687 17655 14270
$$ packed form
326B3111o285J871J3921j417j4646l541J624r780p002R428P653m970p93M561q395
341E340j4922l354L568m719o92J0060L964q586l992J001r188j0599M714R222j811
356a9994l57J0354K073j2306n643M887j929m729Q736J3484m6k846O170P20j1212
371a2638l922J0163O003q06P725J1885j472q099j25Q77n133N52J0658O834j07
386B2395L425L689p429j0141K64K040k651K723R730L911o347m188k309q799q432
401b119J705N483O33O52M760j728j0380p742k919m064l138M944P161J055j806
416g503r24m954q688n460J316K676M013O920M584j084k898l450n044l607L050
431b1053P824N493M638N957J446m729n293j170R17J605O515Q695N433J409l2l385
$$ plain form
447 14270 7977 4384 6449 10708 14782 21052 26445 26426 20436 14546 10471 6738 6041 9249 14914 18764
463 18764 19502 16788 10733 3870 -1870 -5046 -5410 -2209 2952 6133 4881 40 -4908 -11168 -18081
478 -18081 -20517 -16567 -10488 -7838 -7384 -6088 -8003 -15548 -22434 -23365 -20103 -16857 -13304 -7280 -3335
493 -3335 -4824 -8314 -11698 -15227 -16872 -12427 -5380 -1553 2061 7891 9442 1791 -5405 -3266 983
508 983 970 3882 13661 20555 16429 10840 11325 9585 4391 4139 10847 15925 15999 17564 20017 15996 7891
525 7891 4397 4105 2977 4476 11249 14814 11333 7008 5389 -2 -8290 -8715 -920 2161 -2235 -2696
541 -2696 1718 43 -9723 -14746 -12011 -10550 -13184 -12525 -6464 -3023 -5567 -9453 -12408 -16581 -18423
556 -18423 -13792 -7851 -5889 -5178 -2232 -2889 -9816 -14128 -7946 -3059 -5443 -5154 2844 7045 1106 -1387
$$ packed form
447A4270o293l593K065M259M074O270N393j9n990n890m075l733o97L208N665L850
463A8764P38k714o055o863n740l176l64L201N161L181j252m841m948o260o913
478a8081k436L950O079K650M54J296j915p545o886r31L262L246L553O024L945
493c335j489l490l384l529j645M445P047L827L614N830J551p651p196K139M249
508I83j3K912R779O894m126n589M85j740n194k52O708N078P4J565K453m021q105
525G891l494k92j128J499O773L565l481m325j619n391q288m25P795L081m396m61
541b696M414j675r766n023K735J461k634O59O061L441k544l886k955m173j842
556a8423M631N941J962P11K946o57o927m312O182M887k384K89P998M201n939k493
$$ plain form
572 -1387 5198 4859 -4239 -4332 7486 12302 7857 10012 16558 11612 -155 -212 8667 10236 8721 14593
588 14593 17952 9587 3429 8543 9979 2065 1522 10793 11017 1856 3302 13306 9587 -4506 -7233
603 -7233 45 -1436 -6723 767 10360 3884 -9448 -10220 -6478 -11579 -13401 -4273 1885 -5753 -11779
618 -11779 -6485 -4846 -12973 -14871 -7028 -7541 -15517 -12072 1275 2022 -8150 -9481 -4455 -10131 -18402
633 -18402 -8678 7628 6683 -1655 892 4316 -5136 -10869 390 10595 4578 -439 8793 14255
647 14255 5878 2504 10593 10584 -684 -1822 10709 16782 12449 14233 17606 8341 -4817 -2352 9286
662 9286 10794 7146 12407 15965 5677 -4483 505 6669 122 -6007 579 5258 -2163 -4308 5706
677 5706 5995 -10733 -19045 -9968 -5815 -12210 -7178 6956 2747 -15209 -19511 -10958 -12714 -17974 -7827
$$ packed form
572a387O585l39r098r3J1818M816m445K155O546m946j1767n7Q879J569j515N872
588A4593L359q365o158N114J436p914n43R271K24r161J446J0004l719j4093k727
603g233P278j481n287P490R593o476j3332p72L742n101j822R128O158p638o026
618a1779N294J639q127j898P843n13p976L445J3347P47j0172j331N026n676q271
633a8402R724J6306r45q338K547L424r452n733J1259J0205o017n017R232N462
647A4255q377l374Q089rj1268j138J2531O073m333J784L373r265j3158K465J1638
662I286J508l648N261L558j0288j0160M988O164o547o129O586M679p421k145J0014
677E706K89j6728q312R077M153o395N032J4134m209j7956m302Q553j756n260J0147
$$ plain form
692 -7827 2648 -6222 -15835 -6135 787 -10494 -16026 -3639 -1187 -14605 -12129 9516 14325 -2383
706 -2383 -5900 4927 -759 -14213 -3843 19097 18059 4060 6504 14674 5231 -3884 7226 18420
720 18420 9933 3474 12456 18183 10327 8103 15958 12142 -2713 -3504 10120 14475 8257 10060 14976
735 14976 4994 -11147 -10233 2869 4990 -1825 90 5038 -2075 -12795 -9841 -2018 -5933 -14759
749 -14759 -12608 -6865 -8518 -10033 -3423 -2092 -13308 -20774 -15294 -11784 -14168 -7057 5967 1339
763 1339 -15420 -16304 -3591 -4498 -14027 -4736 11176 4050 -11277 -2463 14131 6945 -6761 579
777 579 11258 1616 -3904 13870 25769 12262 1555 9911 9950 -2286 2338 22873 22122 6331
791 6331 7059 16578 7716 -4616 6112 18487 6959 -5873 4914 15178 4544 -3832 5027
$$ packed form
692g827J0475q870r613R700O922j1281n532J2387K452j3418K476K1645M809j6708
706b383l517J0827n686j3454J0370K2940j038j3999K444Q170r443r115J1110J1194
720A8420q487o459Q982N727p856k224P855l816j4855p91J3624M355o218J803M916
735A4976r982j6141R14J3102K121o815J915M948p113j0720K954P823l915q826
749a4759K151N743j653j515O610J331j1216p466N480L510k384P111J3024m628
763A339j6759q84J2713r07r529R291J5912p126j5327Q814J6594p186j3706P340
777E79J0679r642n520J7774J1899j3507j0707Q356L9j2236M624K0535p51j5791
791F331P28R519q862j2332J0728J2375j1528j2832J0787J0264j0634q376Q859
$$ plain form
804 5027 5127 -10512 -14951 -1755 4163 -1749 -1805 831 -8308 -19425 -14895 -6294 -7598 -9950 -4932
819 -4932 -3511 -12017 -15528 -8312 -5179 -11784 -15065 -9138 -4546 -6903 -6096 759 3147 -6594 -14497
834 -14497 -8950 511 912 72 7686 12011 2595 -5642 586 8011 4571 2799 11448 13379 4722
849 4722 5450 16068 13313 755 2378 12578 7832 -757 11514 24006 11422 -3086 3599 8861
863 8861 -3418 -5991 10808 15549 -511 -4576 6741 3197 -11178 -7610 4433 -1764 -12543
876 -12543 -4583 4839 -3133 -10337 -3480 -3602 -17162 -17306 -2902 -299 -8609 -5965 894 -6205 -16830
891 -16830 -12673 -3042 -4774 -7997 -2595 831 -3561 -5120 -875 -1179 -5242 -4423 -481 820 1308 5032
907 5032 8278 5334 1126 -621 -89 2472 5785 7644 9221 10423 7119 2638 3254 7079 5034 2106
$$ packed form
804E027J00j5639m439J3196N918n912n6K636r139j1117M530Q601j304k352N018
819d932J421q506l511P216L133o605l281N927M592k357Q07O855K388r741p903
834a4497N547R461M01q40P614M325r416q237O228P425l440j772Q649J931q657
849D722P28J0618k755j2558J623J0200m746q589J2271J2492j2584j4508O685N262
863H861j2279k573J6799M741j6060m065J1317l544j4375L568J2043o197j0779
876a2543P960R422p972p204O857j22j3560j44J4404K603q310K644O859p099j0625
891a6830M157R631j732l223N402L426m392j559M245l04m063Q19L942J301M88L724
907E032L246k944m208j747N32K561L313J859J577J202l304m481O16L825k045k928
$$ plain form
923 2106 6991 11346 5898 2107 8219 10621 453 -4687 3764 6216 -812 674 10259 7099 -4846
938 -4846 -4613 1919 -3286 -9564 -400 6031 -2259 -8484 -526 903 -9789 -11105 -1507 -2290 -10831
953 -10831 -6855 2053 -2240 -9912 -5037 -1373 -9846 -12371 -2744 1631 -4752 -4921 1744 -1668 -9523
968 -9523 -5838 1215 -1867 -4730 2375 5701 -785 -2673 3493 3584 -2796 -1146 5046 5063 2449 6315
984 6315 8468 4318 1890 4006 3981 2678 5657 9236 7101 5319 6720 5341 1318 2693 5705 3465
1000 3465 2158 5885 7419 1680 164 3685 1447 -4550 -2078 3490 1090 -3308 1202 2734 -4937
1015 -4937 -8520 -3034 -2394 -7973 -5981 1217 -1779 -8633 -6354 -2810 -8111 -11641 -5309 -2397 -6938
1030 -6938 -6291 -183 -2315 -8806 -6473 -1956 -5901 -8038 -846 3627 -1216 -2416 2957 1662 -4846
$$ packed form
923B106M885M355n448l791O112K402j0168n140Q451K452p028J486R585l160j1945
938d846K33O532n205o278R164O431q290o225P958J429j0692j316R598p83q541
953a0831L976Q908m293p672M875L664q473k525R627M375o383j69O665l412p855
968i523L685P053l082k863P105L326o486j888O166R1o380J650O192J7k614L866
984F315K153m150k428K116k5j303K979L579k135j782J401j379m023J375L012k240
1000C465j307L727J534n739j516L521k238n997K472N568k400m398M510J532p671
1015d937l583N486O40n579J992P198k996o854K279L544n301l530O332K912m541
1030f938O47O108k132o491K333M517l945k137P192M473m843j200N373j295o508
$$ plain form
1045 -4846 -2598 4131 3019 455 5821 9564 4527 1409 5724 6013 1449 3049 9169 8860 5378
1060 5378 8513 10512 5385 1857 4546 5431 2498 4746 8864 6945 2975 3753 3726 -1335 -2879 952
1076 952 1727 -1739 -427 2933 -583 -5638 -4758 -3690 -7686 -8785 -3986 -2209 -5858 -5792 -3007 -6134
1092 -6134 -11502 -9555 -6040 -7611 -7919 -3261 -1634 -5490 -6023 -3577 -5117 -8010 -4873 -124 -1332
1107 -1332 -1364 3024 3630 -518 -1594 1595 1322 -105 4006 8484 6693 5054 7858 7688 2490 2295
1123 2295 7220 7813 5240 7338 11123 8989 4740 5286 5712 2718 1919 5244 6048 3928 4228 5437
1139 5437 2085 -2397 -1985 -753 -2521 -2932 -100 214 -2883 -3613 -3446 -5696 -8697 -7482 -5132 -6086
1155 -6086 -5794 -3592 -3593 -6606 -7568 -7173 -7894 -8459 -5011 -2676 -3638 -3808 -1391 -1766 -5109 -4955 -2416 -1522
$$ packed form
1045d846K248O729j112k564N366L743n037l118M315K89m564J600O120l09l482
1060E378L135J999n127l528K689Q85k933K248M118j919l970P78k7n061j544L831
1076I52P75l466J312L360l516n055Q80J068l996j099M799J777l649O6K785l127
1092f134n368J947L515j571l08M658J627l856n33K446j540k893L137M749j208
1107a332l2M388O06m148j076L189k73j427M111M478j791j639K804j70n198j95
1123B295M925N93k573K098L785k134m249N46M26k994p99L325Q04k120L00J209
1139E437l352m482M12J232j768m11K832L14l097p30J67k250l001J215K350r54
1155f086K92K202jl013r62L95p21n65L448K335r62j70K417l75l343J54K539Q94
$$ plain form
1173 -1522 -1293 1410 3391 3178 2522 3284 1644 -28 2389 5374 4864 4985 7929 8562 4624 3073 5653
1190 5653 5552 2777 3651 8024 7698 4736 4816 6228 3193 357 1065 2770 2088 1881 4132 3168 -525
1207 -525 -1908 -992 -2434 -4747 -3215 251 -807 -3594 -3287 -1892 -4143 -7151 -6400 -4262 -4805 -5414
1223 -5414 -3235 -1565 -3229 -5082 -5581 -5104 -5681 -4944 -2638 -433 -812 -1146 -1448 -2359 -2794 -1801 114
1240 114 -239 -320 1822 4421 3187 292 1298 3752 1532 -1016 2050 6283 6183 3709 4107 4824 2301
1257 2301 13 2253 4472 3642 3407 5258 4576 1263 591 2608 1986 -739 276 2838 2271 222
1273 222 1289 2548 -666 -4738 -3363 89 -860 -2966 461 2796 -1748 -6097 -4887 -1114 -2865
1288 -2865 -4839 -2240 674 -2037 -4119 -1684 -888 -4237 -5196 -2325 -2200 -4176 -1644 3270 1306 -4031
$$ packed form
1173a522K29K703J981k13o56P62j640j672K417K985n10J21K944O33l938j551K580
1190E653j01k775Q74M373l26k962Q0J412l035k836P08J705o82k07K251r64l693
1207e25j383R16j442k313J532L466j058k787L07J395k251l008P51K138n43o09
1223e414K179J670j664j853m99M77n77P37K306K205l79l34l02r11m35R93J915
1240A14l53q1K142K599j234k895J006K454k220k548L066M233j00k474L98P17k523
1257B301k288K240K219q30k35J851o82l313o72K017o22k725J015K562n67k049
1273B22J067J259l214m072J375L452r49k106L427K335m544m349J210L773j751
1288b865j974K599K914k711k082K435P96l349r59K871J25j976K532M914j964n337
$$ plain form
1304 -4031 -3378 -267 -2687 -4563 745 5290 778 -2690 1154 3233 -1809 -3418 3157 4757 -766
1319 -766 -1535 5029 6083 743 813 3959 1338 -2594 964 6385 4340 1731 4604 4749 -1555 -3521
1335 -3521 2455 5989 1199 -449 3607 4161 -1157 -1813 2850 2281 -2331 -2965 992 1378 -1154 -93
1351 -93 2826 -513 -5867 -5620 -1164 -602 -2259 -703 1163 -1910 -6236 -4722 -1522 -2150 -4512 -1824
1367 -1824 197 -3809 -5244 -263 2720 -3472 -7052 -1485 737 -4141 -3053 4809 5284 -2650 -4550
1382 -4550 1080 1151 -3251 1029 8059 3820 -3339 1066 6448 1664 -1848 4555 7858 -166 -2058
1397 -2058 6218 8591 1678 609 6045 3134 -4242 -81 8843 6055 -659 1520 5238 -1479 -5847
1412 -5847 481 5747 768 -3682 84 1410 -3444 -4389 959 -25 -5857 -6201 -1793 -1310 -3920 -2449
$$ packed form
1304d031O53L111k420j876N308M545m512l468L844K079n042j609O575J600n523
1319g66p69O564J054n340P0L146k621l932L558N421k045k609K873J45o304j966
1335c521N976L534m790j648M056N54n318o56M663n69m612o34L957L86k532J061
1351i3K919l339n354K47M456N62j657J556J866l073m326J514L200o28k362K688
1367a824K021m006j435M981K983o192l580N567K222m878J088P862M75p934j900
1382d550N630P1m402M280P030m239p159M405N382m784l512O403L303q024j892
1397b058Q276K373o913j069N436k911p376M161Q924k788o714K179L718o717m368
1412e847O328N266m979m450L766J326m854r45N348r84n832l44M408M83k610J471
$$ plain form
1428 -2449 675 -2751 -8459 -7370 -2321 -1453 -2833 -1596 455 -2890 -6926 -4194 627 -176 -3332
1443 -3332 -1098 2537 -510 -2986 1238 5865 1795 -3154 281 4239 1705 797 7045 8266 527
1458 527 -1934 4144 5334 760 3057 9893 6509 -1849 508 7249 3470 -1830 2854 6940 42
1473 42 -3971 3789 7525 -412 -4203 1518 870 -6792 -5096 3923 3441 -4365 -3979 -196 -4360 -9433
1489 -9433 -3833 1689 -2927 -7150 -2846 71 -5694 -6956 -808 -53 -6368 -7237 -1182 1074 -2458
1504 -2458 -1111 2012 -307 -5690 -4567 1346 2446 915 2008 4126 1946 -1923 135 4686 3952
1519 3952 1579 2374 5397 3767 1825 4532 6880 3432 -819 1218 4526 3009 1668 5896 7293
1534 7293 414 -3606 1110 2764 -940 -857 4303 2885 -3811 -3453 1898 389 -5550 -3627 1082 -2977
$$ packed form
1428b449L124l426n708J089N049Q68j380J237K051l345m036K732M821q03l156
1443c332K234L635l047k476M224M627m070m949L435L958k534r08O248J221p739
1458E27k461O078J190m574K297O836l384q358K357O741l779n300M684M086o898
1473D2m013P760L736p937l791N721o48p662J696R019m82p806L86L783m164n073
1489i433N600N522m616m223M304K917n765j262O148P55o315q69O055K256l532
1504b458J347L123k319n383J123N913J100j531J093K118k180l869K058M551p34
1519C952k373P95L023j630j942K707K348l448m251K037L308j517j341M228J397
1534G293o879m020M716J654l704Q3N160j418o696L58N351j509n939J923M709m059
$$ plain form
1550 -2977 -6700 -1549 3064 -2203 -6928 -3033 -2196 -7324 -6198 962 2060 -4273 -4489 261 -2128
1565 -2128 -6925 -3340 2909 -3 -4314 -942 3472 284 -2119 1216 2642 -1583 -2478 2592 4710
1580 4710 2098 2223 4746 3182 -953 -729 3588 4662 2931 3059 4538 3087 730 893 3131 2433
1596 2433 -124 960 2965 2417 436 1235 2867 392 -3032 -2467 687 400 -1341 192 1804 -1424
1612 -1424 -4636 -2780 -865 -2860 -2941 32 298 -3432 -3366 -302 -1466 -4727 -3660 -644 -1395 -3998
1628 -3998 -926 2080 -733 -3804 -1896 -172 -3030 -2973 1427 3367 -163 -1245 1786 1276 -2263 -1055
1644 -1055 2712 1980 -396 1378 4077 2205 104 1297 2125 724 -646 2102 3749 2429 1584 2683
1660 2683 1975 -565 -634 1687 2069 1345 1056 2370 2087 8 -1099 115 371 -654 -546 673 932
$$ packed form
1550b977l723N151M613n267m725L895Q37n128J126P160J098o333k16M750k389
1565b128m797L585O249k912m311L372M414l188k403L335J426m225q95N070K118
1580D710k612J25K523j564m135K24M317J074j731J28J479j451k357J63K238o98
1596B433k557J084K005n48j981P99J632k475l424N65L154k87j741J533J612l228
1612a424l212J856J915j995q1K973K66l730O6L064j164l261J067L016p51k603
1628c998L072L006k813l071J908J724k858N7M400J940l530j082L031n10l539J208
1644a055L767p32k376J774K699j872k101J193Q28j401j370K748J647j320q45J099
1660B683p08k540o9K321L82p24k89J314k83k079j107J214K56j025J08J219K59
$$ plain form
1677 932 182 -202 -183 -1128 -2917 -2065 -600 -194 -898 -340 294 -1239 -3130 -2377 -1738 -2456 -2201 -594 150
1696 150 -1366 -1982 -826 -1453 -3285 -3146 -755 -363 -1500 -326 1082 119 -2169 -1670 -354 -956 -1153
1713 -1153 1149 2163 1143 703 1289 775 -707 374 1948 2047 1471 2475 3541 2555 1076 1094 1669
1730 1669 1423 1161 2223 2979 3102 2489 1585 1550 656 228 357 1021 1600 1392 959 908 -1 -1058 -1196 -1359
1750 -1359 -1188 -1146 -584 -199 -967 -1651 -2221 -2495 -3582 -3462 -2367 -2038 -2017 -1921 -1523 -2269 -3642 -3534 -2880 -2806
1770 -2806 -2364 -1322 -521 -972 -1295 -702 -1308 -1933 -1558 -445 458 828 1415 1808 1470 1023 1047 1116 1021 1904
1790 1904 3410 4013 3354 3312 3481 2641 1981 1981 2436 3446 3571 3983 3206 2877 2373 1648 375 266 1073 1739
1810 1739 1270 956 707 -3 -744 -1764 -2336 -2574 -1433 -1049 -1222 -1967 -2253 -2363 -3743 -4226 -3634 -3426 -3356
$$ packed form
1677I32p50l84J9r45j789Q52J465M06p04N58O34j533j891P53O39p18K55J607P44
1696A50j516o16J156o27j832J39K391L92j137J174J408r63k288M99J316o02j97
1713a153K302J014j020m40N86n14j482J081J574R9n76J004J066r86j479J8N75
1730A669k46k62J062P56J23o13r04l5q94m28J29O64N79k08m33n1r09j057j38j63
1750a359J71M2N62L85p68o84n70k74j087J20J095L29K1R6L98p46j373J08O54P4
1770b806M42J042Q01m51l23N93o06o25L75J113R03L70N87L93l38m47K4O9r5Q83
1790A904J506O03o59m2J69q40o60%M55J010J25M12p77l29n04p25j273j09Q07O66
1810A739m69l14k49p10p41j020n72k38J141L84j73p45k86j10j380m83N92K08P0
$$ plain form
1829 -3356 -2512 -1889 -2811 -3111 -3110 -3024 -3469 -3893 -1873 -854 -884 -1070 -209 -655 -1243 -678 -405 -217 322 1916
1849 1916 2841 2027 1590 2550 2547 1058 1558 3265 3724 3536 3931 4796 3405 2511 2790 2681 2310 2216 3318
1868 3318 3594 3154 2263 2111 752 76 -335 272 531 396 580 366 -859 -1852 -2146 -2445 -2439 -2972 -1970
1887 -1970 -1596 -1878 -2452 -2770 -3355 -3595 -4090 -3864 -3027 -2260 -2291 -1964 -1644 -2451 -3454 -3032 -2028 -1744 -1345
1906 -1345 -274 965 255 -619 167 244 -529 -369 1570 2487 1594 2091 3577 2848 959 1108 2822 2087
1924 2087 1270 3350 4683 3512 2028 2433 2141 616 44 2285 3066 1623 1848 2581 1558 -556 -286
1941 -286 670 -629 -1418 -1 1250 -292 -1052 -708 -919 -2894 -3642 -1481 -604 -1506 -1553 -644 -1115 -3017
1959 -3017 -3765 -2386 -1783 -2759 -1984 -250 -743 -1696 -1437 -550 -1535 -2606 -1784 -75 -182 -218 784 1774
$$ packed form
1829c356Q44O23r22l00JQ6m45m24K020J019l0j86Q61m46n88N65K73J88N39J594
1849A916R25q14m37R60lj489N00J707M59j88L95Q65j391q94K79j09l71r4J102
1868C318K76m40q91j52j359o76m11O07K59j35J84k14j225r93k94k99On33J002
1887a970L74k82n74l18n85k40m95K26Q37P67l1L27L20q07j003M22J004K84L99
1906a345J071J239p10q74P86P7p73J60J939R17q93M97J486p29j889J49J714p35
1924B087q17K080J333j171j484M05k92j525n72K241P81j443K25P33j023k114K70
1941b86R56j299p89J417J251j542p60L44k11j975p48K161Q77r02m7R09m71j902
1959c017p48J379O03r76P75J734m93r53K59Q87r85j071Q22J709j07l6J002R90
$$ plain form
1977 1774 8 -1523 -1016 834 13 -108 2203 3341 1194 -25 1618 2049 289 -335 2406 2926
1993 2926 1024 1387 3504 2894 -260 -104 1597 737 -647 1796 3725 2083 -319 582 1380 -1055
2009 -1055 -1722 1206 1951 -225 -841 1315 1034 -1816 -1730 361 -788 -2711 -1744 1556 981 -1723 -1070
2026 -1070 -202 -2338 -4233 -1766 895 -505 -1440 -287 189 -2652 -3476 -1046 -35 -2117 -2020 395
2042 395 447 -1661 -1296 1170 311 -3054 -2387 323 903 -346 999 2904 480 -2463 -932 1809 834
2059 834 -50 2677 3745 987 -974 1554 3115 377 -347 2183 2647 669 1102 4235 3145 -192
2075 -192 -459 1486 694 -1081 1596 4406 2221 -1639 -476 718 -1089 -2217 529 2210 -975 -2676
2091 -2676 -542 648 -2060 -3145 -761 -988 -3953 -3271 557 869 -2513 -2615 -1055 -2637 -5243 -3074
$$ packed form
1977A774j766j531N07J850q21j21K311J138k147j219J643M31j760o24K741N20
1993B926j902L63K117o10l154J56J701q60j384K443J929j642k402R01P98k435
2009a055o67K928P45k176o16K156k81k850Q6K091j149j923R67L300n75k704O53
2026a070Q68k136j895K467K661j400r35J153M76k841q24K430J011k082R7K415
2042C95N2k108L65K466q59l365O67K710N80j249J345J905k424k943J531K741r75
2059H34q84K727J068k758j961K528J561k738p24K530M64j978M33L133j090l337
2075a92k67J945p92j775K677K810k185l860J163J194j807j128K746J681l185j701
2091b676K134J190k708j085K384k27k965O82L828L12l382j02J560j582k606K169
$$ plain form
2107 -3074 1059 118 -2495 -509 550 -2270 -3895 -796 1675 -968 -2211 761 2085 -416 -455 2837
2123 2837 2241 -1254 -1246 2650 3711 1510 2673 4684 2081 -1461 400 3837 2431 1034 3380 4589
2139 4589 1469 -597 2087 3812 451 -694 1832 2434 -268 -286 2834 1900 -1890 -2720 -815 -1038
2155 -1038 -2134 -507 2155 144 -3725 -3128 -1600 -2645 -3772 -1597 -96 -2511 -4095 -1677 -306
2170 -306 -2533 -3918 -1926 -1145 -3466 -3244 661 1692 -1302 -2268 71 -708 -2785 -983 3073 2765
2186 2765 158 353 2681 1262 -904 1679 4049 2268 -175 2739 4592 2397 732 3653 3442
2201 3442 -240 -603 3172 4270 1460 1464 3799 1609 -2590 -1080 2275 1329 -1188 570 1787 -341
2217 -341 -2781 -877 785 -1586 -3507 -1566 -380 -2461 -2612 -52 -432 -4093 -4322 -2129 -1902 -3203
$$ packed form
2107c074M133r41k613J986J059k820j625L099K471k643j243K972J324k501l9L292
2123B837n96l495QL896J061k201J163K011k603l542J861L437j406j397K346J209
2139D589l120k066K684J725l361j145K526O02k702j8L120r34l790q30J905k23
2155a038j096J627K662k011l869N97J528j045j127K175J501k415j584K418J371
2170c06k227j385J992P81k321K22L905J031k994r66K339p79k077J802M056l08
2186B765k607J95K328j419k166K583K370j781k443K914J853k195j665K921k11
2201C442l682l63L775J098k810MK335k190m199J510L355r46k517J758J217k128
2217c41k440J904J662k371j921J941J186k081j51K560l80l661k29K193K27j301
$$ plain form
2233 -3203 -1549 613 -751 -3444 -2739 -966 -1580 -2204 -727 942 -260 -1633 312 1740 196 -993
2249 -993 360 1185 338 -160 2385 3890 1820 350 1161 1855 340 833 3568 4010 1559 942 2899
2266 2899 1690 -215 761 3051 1746 -727 949 2841 1189 -744 246 1161 -1425 -2444 469 1230
2282 1230 -693 -1407 354 -671 -3586 -3047 62 -379 -2292 -1582 528 -1373 -3262 -1653 -217 -1936
2298 -1936 -3085 -1121 258 -1152 -1383 522 469 -2142 -2259 -140 4 -837 565 2469 1248 -442
2314 -442 -12 989 481 -312 838 2103 1381 954 1755 2034 829 97 524 917 1267 803 1784 2270 1354
2333 1354 217 210 292 -81 -1 1336 2059 558 -178 380 354 -1059 -1393 -121 167 -1042 -681 920 286
2352 286 -1444 -1269 -378 -1395 -2581 -534 1126 -300 -1045 -361 -251 -2051 -2611 -232 -59 -1159 -548
$$ packed form
2233c203J654K162j364k693P05J773o14o24J477J669j202j373J945J428j544j189
2249i93J353Q25q47m98K545J505k070j470Q11O94j515M93K735M42k451o17J957
2266B899j209j905R76K290j305k473J676J892j652j933R90R15k586j019K913P61
2282A230j923p14J761j025k915N39L109m41j913P10K110j901j889J609J436j719
2298a936j149J964J379j410k31J905n3k611j17K119J44q41J402J904j221j690
2314d42M30J001n08p93J150J265p22m27Q01K79j205p32M27L93L50m64R81M86r16
2333A354j137pQ2l73Q0J337P23j501p36N58k6j413l34J272K88j209L61J601o34
2352B86j730J75Q91j017j186K047J660j426p45O84J10j800n60K379J73j100O11
$$ plain form
2369 -548 1048 209 -1543 -887 287 -991 -1711 -201 1131 120 -191 762 824 -859 -939 112 590 370
2387 370 539 1669 761 119 547 287 -77 62 738 1391 933 953 1091 794 342 252 91 197 618 1236
2407 1236 1169 1055 569 -20 -556 -444 -114 -22 273 968 532 302 42 135 -606 -1353 -807 -54 -332 -499 -24
2428 -24 18 -1237 -1513 -866 -882 -1466 -916 -132 -123 -1435 -913 -356 -1683 -2001 -1204 -106 -670 -369 325 382 -893
2449 -893 -899 -262 -563 -797 31 1221 825 697 1033 916 36 -343 696 1002 759 1896 2025 1371 1146 959
2469 959 964 398 526 1452 1982 1606 1239 1646 915 -26 211 154 -232 149 645 601 -107 151 -229 -1353 -1262
2490 -1262 -1283 -659 -1138 -333 -267 -951 -1343 -1471 -1801 -2402 -1855 -874 -977 -1288 -1204 -599 -1319 -2037 -1443 -777 -1123
2511 -1123 -1108 316 416 -422 -52 304 -215 -622 183 1027 1027 904 1767 1679 1089 778 1038 1423 815 1649 2214
$$ packed form
2369e48J596q39j752O56J174j278p20J510J332j011l11R53O2j683q0J051M78k20
2387C70J69J130r08o42M28k60l64J39O76O53m58K0J38k97m52r0j61J06M21O18
2407A236o7j14m86n89n36J12L30R2K95O95m36k30k60R3p41p47N46P53k78j67M75
2428b4M2j255k76O47j6n84N50P84Rj312N22N57j327l18P97J098n64L01O94N7j275
2449h93oO37l01k34Q28J190l96j28L36j17q80l79J039L06k43J137J29o54k25j87
2469I59Nn66J28R26N30l76l67M07p31r41K37n7l86L81M96m4p08K58l80j124R1
2490a262k1O24m79Q05O6o84l92j28l30o01N47R81j03l11Q4O05p20p18N94O66l46
2511a123J5J424J00q38L70L56n19m07Q05Q44%j23Q63q8n90l11K60L85o08Q34N65
$$ plain form
2532 2214 1919 1704 1860 1381 1127 651 977 1396 1294 1341 1622 995 166 -216 -281 -434 -698 -296 42 -229
2552 -229 -545 -122 -1198 -1555 -1719 -1508 -1318 -1315 -1182 -986 -1316 -1655 -2022 -2300 -2413 -2167 -1471 -1427 -898 -480 -1020
2573 -1020 -1328 -1199 -1080 -1096 -329 250 476 398 609 838 195 45 306 917 816 933 1841 2330 1370 1755
2593 1755 1600 1130 531 1425 2198 1618 1498 2230 2187 815 301 677 911 293 268 1324 1014 -129 -259
2612 -259 -59 -760 -1669 -916 -275 -1089 -1425 -579 -621 -1481 -2126 -1570 -1590 -2104 -1869 -643 -639 -1381 -1164 -1348 -1199
2633 -1199 -1865 -1242 -733 -416 -845 -462 -122 -287 -858 -609 44 204 -20 543 1562 1405 664 891 1124
2652 1124 607 181 1121 1975 1346 1066 1635 1698 493 559 1559 1134 408 979 1676 1405 473 186 967 399
2672 399 -751 -245 706 179 11 207 355 -995 -1687 -339 -135 -1189 -1071 -4 -8 -1782 -1450 -164
$$ packed form
2532B214k95k15J56m79k54m76L26M19j02M7K81o27q29l82o5j53k64M02L38k71
2552b29l16M23j076l57j64K11J90LJ33J96l30l39l67k78j13K46O96M4N29M18n40
2573a020l08J29J19j6P67N79K26p8K11K29o43j50K61O11j01J17R08M89r60L85
2593A755j55m70n99Q94P73n80j20P32m3j372n14L76K34o18k5J056l10j143j30
2612b59K00p01r09P53O41q14l36Q46m2q60o45N56k0n14K35J226Mp42K17j84J49
2633a199o66O23N09L17m29L83L40j65n71K49O53J60k24N63J019j57p41K27K33
2652A124n17m26R40Q54o29k80N69O3j205O6J000m25p26N71O97k71r32k87P81n68
2672C99j150N06R51n27j68J96J48j350o92J348K04j054J18J067mj774L32J286
$$ plain form
2690 -164 -999 -2197 -1297 -390 -718 -1419 -631 229 -678 -1698 -1030 -74 -501 -735 621 839 -394 -768 149
2709 149 165 -801 -510 1121 1304 -113 95 1292 885 -160 250 954 455 -564 887 2071 1281 205
2727 205 744 1002 -29 -791 779 2076 773 -221 792 1100 -755 -808 847 970 -707 -176 1110
2744 1110 438 -864 -78 608 -113 -1616 -841 579 299 -836 2 773 -1044 -2161 -723 379 -722
2761 -722 -833 504 471 -1063 -1593 348 -44 -1443 -1029 105 64 -1327 -109 1108 36 -1631 -958
2778 -958 90 -368 -847 571 1665 -32 -1141 171 777 -636 -456 1269 1310 -424 -455 1477 1407 1
2796 1 69 984 628 -644 517 2364 1571 211 664 1431 106 -622 872 2579 904 -51 957 1132
2814 1132 -534 -969 1074 1046 -747 -1069 528 836 -882 -704 826 -438 -2472 -1523 454 -278 -1400
$$ packed form
2690a64q35j198R00R07l28p01P88Q60r07j020O68R56m27k34J356K18j233l74R17
2709A49J6r66K91J631J83j417K08J197m07j045M10P04m99j019J451J184p90j076
2727B05N39K58j031p62J570J297j303r94J013L08j855n3J655J23j677N31J286
2744A110o72j302P86O86p21j503P75J420k80j135Q38P71j817j117J438J102j101
2761g22j11J337l3j534n30J941l92j399M14J134m1j391J218J217j072j667O73
2778i58J048m58m79J418J094j697j109J312O06j413J80J725M1j734l1J932p0j406
2796AO8R15l56j272J161J847p93j360M53P67j325p28J494J707j675r55J008J75
2814A132j666m35K043k8j793l22J597L08j718J78J530j264k034R49J977p32j122
$$ plain form
2831 -1400 -601 373 -1348 -3004 -1171 -4 -1192 -1759 -241 -31 -1496 -1647 -387 331 -1304 -1233 25
2848 25 300 -952 -19 1360 535 -1210 -780 1084 551 -250 1108 2381 1212 -355 460 1978 612
2865 612 339 1598 2027 451 -11 2199 2304 386 429 1585 1107 -226 270 2276 1349 -278 -2 696
2883 696 -358 -1506 465 936 -202 -1256 -326 -155 -1197 -1751 -388 -250 -1913 -2247 -805 -396 -1753
2900 -1753 -1517 -519 -1049 -2595 -2140 -119 -267 -1302 -714 -28 -819 -2421 -835 444 92 -663 499
2917 499 1163 46 -666 1096 1669 124 -67 1522 1561 824 1127 2082 1846 125 557 1331 1429 658 1667
2936 1667 2527 894 -119 612 1647 566 -228 808 1478 -113 -817 340 871 -598 -1060 -254 -300
2953 -300 -1427 -1089 171 -175 -1696 -1653 -531 -1173 -2058 -1124 37 -667 -1715 -1100 -484 -875 -1557 -756
$$ packed form
2831a400P99R74j721j656J833J167j188n67J518K10j465j51J260P18j635P1J258
2848B5K75j252R33J379q25j745M30J864n33q01J358J273j169j567Q15J518j366
2865F12k73J259M29j576m62K210J05j918M3J156m78j333M96K006r27j627K76O98
2883F96j054j148J971M71j138j054R30J71j042n54J363J38j663l34J442M09j357
2900a753K36R98n30j546M55K021j48j035N88O86p91j602J586J279l52p55J162
2917D99O64j117p12J762N73j545j91J589L9p37L03R55k36j721M32P74R8p71J009
2936A667Q60j633j013P31J035j081p94J036O70j591p04J157N31j469m62Q06m6
2953c00j127L38J260l46j521M3J122o42q85R34J161p04j048O15O16l91o82Q01
$$ plain form
2971 -756 -85 -1062 -1570 260 378 -474 -794 306 253 -763 -609 1194 1398 540 406 999 735 -476 274
2990 274 1541 1433 389 888 1517 1128 242 953 1553 448 142 880 1354 593 344 1060 741 30 -543
3009 -543 495 659 60 30 717 37 -1285 -760 140 -438 -1310 -481 -140 -472 -1278 -336 -42 -1451 -1488 -758
3029 -758 -681 -881 -1042 141 -240 -835 -795 75 -353 -661 -168 619 203 -322 -114 287 -86 -402 -45 622
3049 622 217 98 582 861 301 209 347 399 120 -104 1013 983 93 135 579 566 -325 206 583 424 -154
3070 -154 502 582 392 -306 -110 150 -52 -373 -55 579 330 -507 164 450 -648 -639 -142 163 -315 -170 269
3091 269 153 -655 -502 17 -151 -534 -209 547 -92 -526 78 1 -435 -695 -61 73 -257 -120 217 4
3111 4 -508 -532 -265 -98 -786 -276 212 97 -225 -165 9 -418 -298 -332 71 67 31 340 378 -97 -145 -236 244 206
$$ packed form
2971g56O71r77n08J830J18q52l20J100n3j016J54J803K04q58j34N93k64j211P50
2990B74J267j08j044M99O29l89q86P11O00j105l06P38M74p61k49P16l19p11n73
3009e43J038J64n99l0O87o80j322N25R00n78q72Q29L41l32q06R42K94j409l7P30
3029g58P7k00j61J183l81n95M0Q70m28l08M93P87m16n25K08M01l73l16L57O67
3049F22m05j19M84K79n60r2J38N2k79k24J117l0q90M2M44j3q91N31L77j59n78
3070a54O56Q0j90o98J96K60k02l21L18O34k49q37O71K86j098RM97L05m78J45M39
3091B69j16q08J53N19j68l83L25P56o39m34O04p7m36k60O34J34l30J37L37k13
3111Dn12k4K67J67o88N10M88j15l22O0J74m27J20l4M03ml6L09L8m75m8r1M80l8
$$ plain form
3135 206 58 461 390 299 468 339 241 440 -102 275 502 369 486 755 209 516 -113 360 136 222 -75
3156 -75 169 423 340 -69 -80 12 -351 -437 -118 -10 -159 -59 -154 -351 -740 -575 -242 -881 -528 -361 -12 -374
3178 -374 -427 -248 -709 -557 -895 -562 -444 -459 212 -97 -434 -267 -275 183 -155 -24 365 273 225 425 465 276
3200 276 358 649 401 229 485 671 940 586 536 553 704 395 423 604 339 735 576 203 230 154 154 -87 -101
3223 -101 194 -349 203 -184 -213 -373 -432 -538 -442 -503 -402 -304 -803 -987 -783 -718 -1137 -568 -440 -938 -615 -215
3245 -215 -243 -695 -621 -480 -207 -671 -349 336 240 -4 59 220 290 -17 172 824 426 229 692 912 286 540
3267 540 461 311 437 365 1026 882 442 623 743 498 110 358 523 139 -54 -29 440 -171 -82 -149 -347 -578
3289 -578 -520 -501 -432 -127 -366 -800 -657 -714 -699 -806 -653 -378 -617 -454 62 -302 -726 -362 -62 -350 -280 -384
$$ packed form
3135B06j48M03p1r1J69j29r8J99n42L77K27j33J17K69n46L07o29M73k24Q6k97
3156g5K44K54q3m09j1R2l63q6L19J08j49J00r5j97l89J65L33o39L53J67L49l62
3178c74n3J79m61J52l38L33J18j5O71l09l37J67qM58l38J31L89r2m8K00M0j89
3200B76Q2K91k48j72K56J86K69l54n0J7J51l09K8J81k65L96j59l73K7p6%k41j4
3223a01K95n43N52l87k9j60n9j06R6o1J01R8m99j84K04O5m19N69J28m98L23M00
3245b15k8m52P4J41K73m64L22O85r6k44O3J61P0l07J89O52l98j97M63K20o26K54
3267E40p9j50J26p2O61j44m40J81J20k45l88K48J65l84j93K5M69o11Q9o7j98k31
3289e78N8J9O9L05k39m34J43n7J5j07J53K75k39J63N16l64m24L64L00k88P0j04
$$ plain form
3311 -384 43 -64 -176 121 188 77 48 542 126 96 290 725 528 -90 603 339 648 325 871 602 326
3332 326 464 492 623 -12 641 948 318 -175 43 454 142 -352 -176 309 -358 -692 -210 388 -645 -646 -216
3353 -216 -279 -1034 -668 -133 -344 -704 -580 -3 -407 -973 -346 -7 -523 -772 -210 74 -106 -427 -46 85
3373 85 -214 -350 18 479 107 -26 762 830 -211 94 722 634 478 282 942 359 147 603 859 519 81
3394 81 30 559 376 -380 242 746 28 -476 47 613 -428 -473 147 533 -783 -636 217 -109 -838 -595
3414 -595 122 -483 -1258 -530 240 -235 -751 -7 247 -848 -851 167 671 -251 -612 59 209 -295 -415 689
3434 689 727 -54 3 718 439 -356 118 994 439 -691 36 653 264 -62 395 792 255 -317 218 730
3454 730 402 85 505 528 -393 -774 489 420 -333 -216 308 453 -428 -520 206 388 -833 -292 356 -173
$$ packed form
3311c84M27j07j12K97O7j11k9M94m16l0J94M35j97o18O93k64L09l23N46k69k76
3332C26J38K8J31o35O53L07o30m93K18M11l12m94J76M85o67l34M82N98j033jM30
3353b16o3p55L66N35k11l60J24N77m04n66O27L39n16k49N62K84j80l21L81J31
3373H5k99j36L68M61l72j33P88O8j041L05O28q8j56j96O60n83k12M56K56l40m38
3394H1n1N29j83p56O22N04p18n04N23N66j041m5O20L86j316J47Q53l26p29K43
3414e95P17o05p75P28P70m75n16P44K54j095lJ018N04r22l61O71J50n04j20J104
3434F89L8p81N7P15k79p95M74Q76n55j130P27O17l89l26M57L97n37n72N35N12
3454G30l28l17M20K3r21l81J263o9p53J17N24J45q81r2P26J82j221N41O48n29
$$ plain form
3474 -173 -682 -11 548 -36 -925 -3 442 -231 -604 135 588 -591 -953 306 543 -420 -278 430 255
3493 255 -523 -503 833 259 -822 126 663 -521 -823 84 842 23 -407 38 172 -423 -715 99 697
3512 697 -867 -571 311 347 -598 -334 844 140 -956 -640 597 250 -312 -172 900 -209 -649 164
3530 164 719 58 -289 495 240 -434 -537 656 797 104 -113 547 599 -87 -66 878 696 -276 -74 617
3550 617 168 -256 -80 548 -45 -767 -112 145 -67 -424 245 643 -621 -1148 11 242 -717 -497 268
3569 268 0 -1109 -807 164 487 -763 -538 161 -349 -973 -171 509 103 -644 -145 219 -634 -494 595
3588 595 810 -132 -711 306 732 -68 84 808 724 -285 -54 581 980 58 381 1137 500 -142 -64 764
3608 764 532 17 395 607 -75 -553 170 415 -102 -453 113 233 -621 -417 256 262 -1004 -990 32 -465
$$ packed form
3474a73n09O71N59n84q89R22M45o73l73P39M53j179l62J259K37r63J42P08j75
3493B55p78K0J336n74j081R48N37j184l02R07P58q19m30M45J34n95k92Q14N98
3512F97j564K96Q82L6r45K64J178p04j096L16J237l47n62J40J072j109m40Q13
3530A64N55o61l47P84k55o74j03J193J41o93k17O60N2o86K1R44j82r72K02O91
3550F17m49m24J76O28n93p22O55K57k12l57O69L98j264n27J159K31r59K20P65
3569B68k68j109L02R71L23j250K25O99n10o24Q02O80m06p47M99L64q53J40J089
3588E95K15r42n79J017M26q00J52P24q4j009K31O35L99r22L23P56o37o42P8Q28
3608G64k32n15L78K12o82m78P23K45n17l51N66J20q54K04O73Oj266J4J022m97
$$ plain form
3628 -465 -618 -521 7 -276 -1178 -716 -233 -524 -773 -233 -324 -670 -866 -322 331 -448 -742 157 43 -872 -240
3649 -240 770 551 -86 55 497 262 -131 412 1022 560 176 406 1007 297 586 667 968 406 -147 617
3669 617 885 154 224 639 505 -299 -171 645 524 -114 -376 383 -12 -472 -269 21 32 -636 -498 89 -705
3690 -705 -862 -311 -151 -435 -767 -316 -312 -260 -822 -106 54 -785 -944 -307 45 -576 -474 239 -8 -479 -245
3711 -245 506 232 -333 265 145 93 -73 402 694 378 277 570 337 743 317 827 627 290 69 755
3731 755 219 -70 268 550 284 180 -39 154 100 80 0 59 -412 -335 69 290 -368 -668 -126 -345 -576 -557
3753 -557 -123 -260 -396 -645 -333 -159 -460 -404 -50 -270 -466 -588 -368 -221 -332 -237 -177 -99 -403 -152 121
3774 121 222 105 145 113 181 -82 -9 263 209 112 506 380 -103 231 565 355 -143 -36 172 388 2 36
$$ packed form
3628d65j53R7N28k83r02M62M83k91k49N40r1l46j96N44O53p79k94Q99j14r15O32
3649b40J010k19o37J41M42k35l93N43O10m62l84K30O01p10K89Q1L01n62n53P64
3669F17K68p31P0M15j34q04J28Q16j21o38k62P59l95m60K03K90J1o68J38N87p94
3690g05j57N51J60k84l32M51MN2n62P16J60q39j59O37L52o21J02P13k47m71K34
3711b45P51k74n65N98j20n2j66M75K92l16j01K93k33M06m26N10k00l37k21O86
3731G55n36k89L38K82k66j04k19J93n4k0q0N9m71P7M04K21o58l00N42k19k31J9
3753e57M34j37j36k49L12J74l01N6L54k20j96j22K20J47j11R5O0P8l04K51K73
3774A21J01j17M0l2O8k63P3K72n4r7L94j26m83L34L34k10m98J07K08K16l86L4
$$ plain form
3796 36 434 480 27 230 399 21 -137 -4 227 -117 -421 198 90 -459 -131 -5 -99 -198 41 4 99 -294
3818 -294 -186 162 -12 -46 91 0 104 -368 19 -144 6 -230 -129 273 -256 -284 -65 325 346 -144 -49 -158
3840 -158 -4 -29 -37 91 273 202 19 -92 136 -136 37 148 -107 337 12 -71 -102 255 156 135 209 75 -51
3863 -51 42 -52 331 70 -162 103 137 95 68 105 23 132 364 240 378 495 257 294 442 434 355 -154 203 6
3887 6 -74 116 107 130 -36 43 -136 -379 -79 -104 -75 -112 -307 -323 -184 -465 -241 -103 -386 -236 -88 -571 -329 -327
3911 -327 -188 -434 -333 -537 -402 -171 -69 -133 148 82 -263 -161 63 12 71 99 375 226 143 176 392 352 518
3934 518 344 -31 543 328 435 226 328 375 262 442 45 245 427 277 409 120 64 223 -101 -112 215
3955 215 -272 -154 -137 -149 -115 -117 -211 -424 -460 -581 -381 -173 -481 -313 -680 -615 -642 -422 -524 -398 -316 -456 -116
$$ packed form
3796C6L98M6m53K03J69l78j58J33K31l44l04O19j08n49L28J26r4r9K39l7R5l93
3818b94J08L48j74l4J37r1J04m72L87j63J50k36J01M02n29k8K19L90K1m90R5j09
3840a58J54k5qJ28J82p1j83j11K28k72J73J11k55M44l25q3l1L57r9k1P4j34j26
3863e1R3r4L83k61k32K65L4m2k7L7q2J09K32j24J38J17k38L7J48qp9n09L57j97
3887Fq0J90rK3j66P9j79k43L00k5K9l7j95j6J39k81K24J38k83J50J48m83K42K
3911c27J39k46J01k04J35K31J02o4K81o6l45J02K24n1N9K8K76j49q3L3K16m0J66
3934E18j74l75N74k15J07k09J02M7j13J80l97K00J82j50J32k89n6J59l24j1L27
3955B15m87J18J7j2L4kr4k13l6j21K00K08l08J68l67O5k7K20j02J26Q2j40L40
$$ plain form
3978 -116 8 -440 -124 -59 -88 -319 -211 154 132 422 93 365 474 139 331 282 345 215 704 693 545 340
4000 340 807 427 407 681 724 544 475 356 612 678 -58 -92 368 412 -449 367 188 -204 -140 20 -351 -541
4022 -541 -706 -104 -406 -270 -346 -701 -395 -530 -524 -509 -465 -592 -365 -552 -580 -521 -424 -321 -719 -561 -323 -47 -142
4045 -142 -150 -202 275 -108 -101 174 277 92 317 574 563 213 579 562 774 110 133 588 455 372 453 650 396
4068 396 503 260 368 109 402 161 496 -133 2 242 154 -184 -336 116 -8 -319 -308 152 -334 -607 -60
4089 -60 -288 -504 -721 -362 187 -379 -414 -618 -178 -679 -629 -158 81 -352 -247 -354 169 -271 -212 36 86 -166
4111 -166 58 378 59 -133 228 415 268 -230 244 348 218 -264 183 119 131 90 131 574 -17 -74 341 400
4133 400 -380 170 175 304 -397 25 419 -296 -370 55 568 -350 -537 47 402 -86 -474 0 35 -270 -562
$$ packed form
3978a16J24m48L16O5k9k31J08L65k2K90l29K72J09l35J92m9O3j30M89j1j48k05
4000C40M67l80k0K74M3j80o9j19K56O6p36l4M60M4q61Q16j79l92O4J60l71j90
4022e41j65O02l02J36p6l55L06j35OJ5M4j27K27j87k8N9R7J03l98J58K38K76r5
4045a42qn2M77l83PK75J03j85K25K57j1l50L66j7K12o64K3M55j33q3Q1J97k54
4068C96J07k43J08k59K93k41L35o29J35K40q8l38j52M52j24l11J1M60m86k73N47
4089f0k28k16k17L59N49n66l5k04M40n01N0M71K39m33J05j07N23m40N9K48N0k52
4111a66K24L20l19j92L61J87j47m98M74J04j30m82M47o4J2m1M1M43n91n7M15N9
4133D00p80N50NJ29p01M22L94p15p4M25N13r18j87N84L55m88l88M74L5l05k92
$$ plain form
4154 -562 -42 -336 -316 -219 100 -335 -257 -445 77 -6 -519 -22 302 -155 -496 -43 284 -8 -238 -173 18 -194
4176 -194 -108 382 371 -328 -98 286 440 -149 -224 268 352 -281 -141 248 60 65 -155 308 101 -418 -192 458
4198 458 6 -30 231 516 -151 -52 230 508 199 -426 301 361 0 -172 305 412 -76 -220 385 267 -106
4219 -106 137 524 76 -350 -159 500 -124 50 354 134 -55 -559 291 -247 -371 -224 1 50 -309 -461
4239 -461 -79 74 -714 -611 92 -292 -580 10 29 -71 -157 -187 -78 -532 -112 -36 256 -418 -426 210 127 -270
4261 -270 -228 396 488 -391 -5 527 9 -15 255 324 350 -109 202 672 474 325 427 583 -129 -178 584 348
4283 348 275 -99 142 329 -157 -123 178 467 -175 -121 86 122 -53 -240 -62 -273 -548 -251 -372 -314 -641 -329
4305 -329 173 -563 -788 -300 268 -518 -567 94 -349 -585 -405 -44 -15 -302 -622 206 267 -349 -124 168 -5
$$ packed form
4154e62N20k94K0R7L19m35P8j88N22q3n13M97L24m57l41M53L27k92k30O5J91k12
4176a94Q6M90j1o99K30L84J54n89p5M92Q4o33J40L89j88Nk20M63k07n19K26O50
4198D58m52l6K61K85o67R9K82K78l09o25P27O0l61j72M77J07m88j44O05j18l73
4219a06K43L87m48m26J91O59o24J74L04k20j89n04Q50n38j24J47K25M9l59j52
4239d61L82J53p88J03P03l84k88N90J9j00q6l0J09m54M20P6K92o74qO36q3l97
4261b70M2O24R2q79L86N32n18k4K70O9K6m59L11M70j98j49J02J56p12m9P62k36
4283C48p3l74K41J87m86L4L01K89o42N4K07L6j75j87J78k11k75K97j21N8l27L12
4305c29N02p36k25M88N68p86m9O61m43k36J80L61K9k87l20Q28O1o16K25K92j73
$$ plain form
4326 -5 -263 -78 277 252 -199 508 748 273 166 368 473 63 358 641 517 80 -17 764 880 187 120 108
4348 108 163 -315 -234 560 78 13 -224 183 21 -267 -169 -127 -297 -639 -343 -43 -623 -651 -559 -38 -584 -776
4370 -776 -443 -408 -515 -363 138 -535 -593 -230 113 -55 -474 25 223 -118 25 25 223 108 -169 358 536
4391 536 251 346 575 549 246 400 671 911 213 260 525 315 69 249 271 149 169 255 446 23 -258 124
4413 124 249 -113 -404 1 52 -381 -209 301 45 -529 -239 -139 -382 -701 -447 -244 -408 -683 -353 -401 -261
4434 -261 -832 -559 -5 -223 -351 -235 -8 42 -206 -23 312 -146 -429 143 70 103 -183 284 136 22 288
4455 288 388 411 503 362 399 214 101 283 151 336 -6 401 316 353 -6 339 82 -102 83 150 244 -54
4477 -54 -140 -35 -242 -373 -277 -156 315 -105 -97 75 27 -460 -104 -147 -303 -284 -349 -228 -252 -478 -131 -310 -257 -283
$$ packed form
4326ek58J85L55k5m51P07K40m75j07K02J05m10K95K83j24m37r7P81J16o93o7j2
4348A08N5m78Q1P94m82o5k37M07j62k88R8M2j70l42K96L00n80k8R2N21n46j92
4370g76L33L5j07J52N01o73n8L63L43j68m19M99J98l41J43%J98j15k77N27J78
4391E36k85R5K29k6l03J54K71K40o98M7K65k10k46J80K2j22K0Q6J91m23k81L82
4413A24J25l62k91M05N1m33J72N10k56n74K90J00k43l19K54K03j64k75L30m8J40
4434b61n71K73N54k18j28J16K27N0k48J83L35m58k83N72p3L3k86M67j48j14K66
4455B88J00K3R2j41L7j85j13J82j32J85l42M07q5L7l59L45k57j84J85O7R4k98
4477e4q6J05k07j31R6J21M71m20QJ72m8m87L56m3j56J9o5J21k4k26L47j79N3k6
$$ plain form
4501 -283 -17 -188 -106 -26 12 -17 -28 -305 -138 -216 -90 -103 -118 129 -131 -252 143 358 -13 -64 336 -19 175
4524 175 339 636 63 -81 -24 77 14 256 14 72 404 177 -68 216 -56 -108 226 -184 127 -25 74 122
4546 122 -248 109 204 -295 -176 -169 -84 55 -61 68 156 -235 -6 -199 8 -96 -133 41 -2 -2 -56 -220 40
4569 40 -371 159 358 -124 -214 -74 -32 -296 -354 -15 -33 188 -157 -36 -211 -285 -365 -35 -12 172 -205 102 -361
4592 -361 -42 23 147 228 113 -66 34 123 -226 103 14 289 159 365 451 21 197 111 365 158 136 377
4614 377 75 331 83 315 212 148 16 -86 122 355 -13 236 -441 143 287 -167 31 -39 216 -210 -5
4635 -5 -235 -286 -471 -85 -219 -151 -504 -251 -71 -394 -138 -255 -104 51 -109 -148 -186 -46 -56 -574 55 -94
4657 -94 -212 -112 81 94 316 59 -172 332 127 52 320 486 213 149 233 207 168 357 355 395 469 468 334 304 62
$$ packed form
4501b83K66j71Q2Q0L8k9j1k77J67p8J26j3j5K47k60j21L95K15l71n1M00l55J94
4524A75J64K97n73j44N7J01o3K42k42N8L32k27k45K84k72n2L34m10L11j52R9M8
4546A22l70L57R5m99J19PQ5J39j16J29Q8l91K29j93K07j04l7J74m3%n4j64K60
4569D0m11N30J99m82r0J40M2k64n8L39j8K21l45J21j75p4q0L30K3J84l77L07m63
4592c61L19O5J24Q1j15j79J00Q9l49L29q9K75j30K06Q6m30J76q6K54k07k2K41
4614C77l02K56k48K32j03o4j32j02K08K33l68K49o77N84J44m54J98p0K55m26K05
4635ek30n1j85L86j34O8l53K53J80l23K56j17J51J55j60l9l8J40j0n18O29j49
4657i4j18J00J93J3K22k57k31N04k05p5K68J66k73o4Q4k6l9J89kM0P4jj34l0k42
$$ plain form
4682 62 396 -37 -27 -27 568 24 -152 18 -144 -51 -121 -36 25 -229 67 -344 -625 -152 -454 -399 -193 -347 -571
4705 -571 -317 -335 -699 -392 -232 -232 -542 -592 -123 -73 -322 -72 21 -210 -362 -47 -82 -71 -78 242 434 444 -30 107
4729 107 -30 144 114 214 114 114 93 331 311 431 37 246 444 49 327 191 107 333 100 81 189 -169
4751 -169 -119 74 40 -112 -281 1 -312 -190 -315 22 -332 -520 -124 -192 -488 -539 -215 -415 -499 -296 -79 -109
4773 -109 -605 -327 8 107 -505 3 -9 -162 -128 -17 -133 -36 234 297 203 176 -16 122 124 191 -149 394 337 -32
4797 -32 105 322 335 115 -46 511 318 86 -30 360 231 -338 92 265 126 -149 7 125 -204 -455 -3
4818 -3 311 -206 -212 -75 9 -168 -262 -99 -209 -353 -291 116 -295 -520 -321 228 -233 -311 -278 211 -263 -248 234
4841 234 -2 -43 -309 38 231 -92 -286 -87 189 135 -38 -14 45 -203 -225 403 177 -131 384 331 2 121
$$ packed form
4682F2L34m33J0%N95n44j76J70j62R3p0Q5O1k54K96m11k81M73l02N5K06j54k24
4705e71K54j8l64L07J60%l10n0M69N0k49K50R3k31j52L15l5J1pL20J92J0m74J37
4729A07j37J74l0J00j00%k1K38k0J20l94K09J98l95K78j36q4K26k33j9J08l58
4751a69N0J93l4j52j69K82l13J22j25L37l54j88L96o8k96n1L24k00q4K03K17l0
4773a09m96K78L35R9o12N08j2j53L4J11j16R7K70O3r4k7j92J38KO7l40N43n7l69
4797c2J37K17J3k20j61N57j93k32j16L90j29n69M30J73j39k75J56J18l29k51M52
4818cL14n17oJ37Q4j77r4J63j10j44O2M07m11k25J99N49m61p8L3M89m74J5M82
4841B34k36m1k66L47J93l23j94J99K76n4j73K4N9k48k2O28k26l08N15n3l29J19
$$ plain form
4863 121 470 310 -242 -47 134 183 134 16 272 203 -94 -156 190 109 43 -176 108 91 -363 -330 38 -226 -394
4886 -394 151 -47 16 -301 -301 90 270 -410 13 -122 -215 -276 195 306 -109 -134 15 214 -276 -123 396 311
4908 311 -83 -32 -30 -30 -145 243 314 -408 -308 -105 321 34 -123 92 -12 -309 -613 127 9 32 -33 181 -64
4931 -64 -133 -76 -56 249 -22 35 26 -180 -251 245 181 111 -170 -116 287 -188 -97 267 133 184 -211 201 80 82 231
4956 231 363 320 -275 152 160 223 -13 -192 98 -196 -301 66 369 -94 -119 -199 177 -284 -246 -160 117 -158 -637
4979 -637 -65 -230 -283 -196 -137 162 -368 -193 -8 -123 -44 -390 148 -28 -531 -59 195 86 -371 -45 384
5000 384 267 -150 59 265 165 -56 249 485 -246 103 215 494 -234 6 435 -62 201 153 440 238
5020 238 -218 -334 29 -128 257 440 -127 8 -327 142 96 112 -393 172 -165 -221 -317 166 -17 -360 162
$$ packed form
4863A21L49j60n52J95J81M9m9j18K56o9k97o2L46q1o6k19K84j7m54L3L68k64j68
4886c94N45j98O3l17%L91J80o80M23j35r3o1M71J11m15k5J49J99m90J53N19q5
4908C11l94N1K%j15L88P1p22J00K03M26k87j57K15j04k97l04P40j18K3o5K14k45
4931f4o9N7K0L05k71N7rk06p1M96o4p0k81N4M03m75R1L64j34N1l95M12j21KJ49
4956B31J32m3n95M27QO3k36j79K90k94j05L67L03m63k5q0L76m61L8Q6K77k75m79
4979f37N72j65n3Q7N9K99n30J75J85j15P9l46N38j76n03M72K54j09m57L26M29
5000C84j17m17K09K06j00k21L05K36p31L49J12K79p28K40M29m97K63m8K87k02
5020B38m56j16L63j57L85J83n67J35l35M69m6J6n05N65l37n6r6M83j83l43N22
$$ plain form
5041 162 -71 7 -409 111 12 63 -303 -505 -545 -142 -411 -268 74 -166 -141 17 -135 -151 -224 262 137 2
5063 2 -10 444 167 309 -147 202 438 -41 273 215 419 93 -85 573 115 16 124 219 24 101 206 33
5085 33 143 11 -257 3 -29 25 -172 180 -146 -281 115 -261 -464 -132 -367 -189 -93 217 232 -215 -275 -172
5107 -172 142 129 -266 -226 94 -38 -162 146 136 -48 -9 71 149 -135 70 186 64 33 96 262 172 -12 193
5130 193 421 70 33 13 282 412 48 148 155 111 187 -78 294 -97 74 -18 76 -87 -351 -16 -580 -4 -183
5153 -183 84 94 -202 -67 70 -269 -152 -29 -74 -195 -98 -91 -67 173 -110 -61 -37 5 -179 -80 -135 44 -184 -28
5177 -28 142 -169 26 232 21 144 -90 60 -94 95 113 -88 252 127 -161 35 343 -165 158 282 -44
5198 -44 -225 40 -115 41 156 132 -21 -27 83 24 -280 -274 -44 58 229 -194 -45 -125 215 218 -88 -164 -17 134
$$ packed form
5041A62k33P8m16N20r9N1l66k02m0M03k69J43L42k40K5J58j52j6p3M86j25j35
5063Bj2M54k77J42m56L49K36m79L14n8K04l26j78O58m58r9J08R5j95P7J05j73
5085C3J10j32k68K60l2N4j97L52l26j35L96l76k03L32k35J78R6L10J5m47o0J03
5107a72L14j3l95M0L20j32j24L08j0j84L9Q0P8k84K05J16j22l1O3J66r0j84K05
5130A93K28l51l7k0K69J30l64J00Pm4P6k65L72l91J71r2R4j63k64L35n64N76j79
5153a83K67J0k96J35J37l39J17J23m5j21R7PK4K40k83M9K4M2j84R9n5J79k28J56
5177b8J70l11J95K06k11J23k34J50j54J89J8k01L40j25k88J96L08n08L23J24l26
5198d4j81K65j55J56J15k4j53oJ10n9l04OK30J02J71m23J49q0L40Ll06p6J47J51
$$ plain form
5222 134 -23 -156 -56 -176 -17 -40 -73 217 136 64 80 49 307 100 -4 -16 197 -67 9 197 -35 -282 -179
5245 -179 21 151 10 191 -57 125 9 -59 104 337 151 -61 258 -112 47 165 -6 7 73 -71 -222
5266 -222 -101 -155 -162 -72 84 142 -18 -109 -209 -222 -132 -163 -44 219 -198 -254 -252 30 -6 280 86 153 188 102 72 144
5292 144 -88 -139 -21 96 116 215 111 199 -43 92 262 69 331 -178 92 32 35 -205 -30 103 150 46 -127
5315 -127 188 -73 -300 34 -38 -25 -122 96 47 -328 -64 -239 -344 -316 36 50 -108 78 155 103 -17 -106 -153
5338 -153 92 149 30 101 133 -38 64 129 330 226 121 275 18 -78 -161 -115 264 77 232 10 -88 175 -14
5361 -14 99 246 -360 136 69 365 -67 31 66 -155 -151 49 204 -182 -71 -198 -40 266 216 -139 -372 -312 -162
5384 -162 23 78 67 46 -172 -42 -267 -249 4 154 -276 144 153 121 -15 416 346 1 -160 -29 163 237 54
$$ packed form
5222A34j57j33J00j20J59k3l3K90q1p2J6l1K58k07j04j2K13k64P6J88k32k47J03
5245a79K00J30j41J81k48J82j16o8J63K33j86k12L19l70J59J18j71J3O6j44j51
5266b22J21n4pR0J56N8j60r1j00j3R0l1J19K63m17n6KK82l6K86j94O7L5q6l0P2
5292A44k32n1J18J17K0R9j04Q8k42J35J70j93K62n09K70o0Lk40J75J33M7j04j73
5315a27L15k61k27L34p2J3r7K18m9l75K64j75j05K8L52J4j58J86P7n2j20q9m7
5338a53K45N7j19P1L2j71J02O5K01j04j05J54k57r6q3M6L79j87J55k22r8K63j89
5361a4J13J47o06M96o7K96m32R8L5k21MK00J55l86J11j27J58L06n0l55k33O0J50
5384a62J85N5j1k1k18J30k25J8K53J50m30M20Rl2j36M31p0l45j61J31J92P4j83
$$ plain form
5407 54 160 178 -149 -30 348 159 -44 320 -9 229 -133 -106 -38 92 -63 -138 193 -80 61 56 -56 165
5429 165 15 92 -51 -85 -243 127 108 -68 25 163 -196 125 -36 -179 -1 -171 -203 -67 -175 -107 27 204
5451 204 -306 157 -89 49 -41 0 -60 395 378 -11 -17 104 26 25 -104 -239 226 115 115 -86 -212 150 199 144
5475 144 201 -9 488 52 22 0 -49 215 195 368 150 75 -436 -346 152 -221 -48 -115 -231 -174 -11 176 -356
5498 -356 -171 2 -79 -145 -214 110 -76 -31 18 -121 -116 -195 -75 229 13 25 -125 75 3 -59 367 123 76 -64
5522 -64 118 183 -295 -66 -129 19 191 -5 77 15 224 68 81 242 159 25 -19 41 68 -128 159 -69 -178
5545 -178 -32 74 342 -72 -54 104 76 -304 -328 155 -195 -187 -22 72 -159 -155 -277 53 -459 397 -65 227 -75
5568 -75 -398 214 -98 120 -14 41 78 129 74 300 140 -8 223 364 177 -152 53 85 -73 -155 -220 296 110
$$ packed form
5407E4J06J8l27J19L78j89k03L64l29K38l62K7O8J30j55p5L31k73J41nj12K21
5429A65j50P7j43l4j58L70j9j76R3J38l59L21j61j43J78j70l2J36j08O8J34J77
5451B04n10M63k46J38r0M1o0M55j7l89oJ21p8jj29j35M65j11%k01j26L62M9n5
5475A44N7k10M97m36l0k2m9K64k0J73k18p5n11R0M98l73J73o7j16N7J63J87n32
5498c56J85J73q1o6o9L24j86M5M9j39Np9J20L04k16J2j50K00p2o2M26k44m7j40
5522f4J82O5m78K29o3J48J72j96Q2o2K09j56J3J61q3j34m4O0K7j96K87k28j09
5545a78J46J06K68m14J8J58k8l80k4M83l50QJ65R4k31Mj22L30n12Q56m62K92l02
5568g5l23O12l12K18j34N5L7N1n5K26j60j48K31J41j87l29K05L2j58q2o5N16j86
$$ plain form
5591 110 -571 88 -1 -95 97 109 49 57 47 176 171 -115 -345 -94 41 131 -145 -17 72 -187 -57 81 -3 -72
5615 -72 112 -29 -161 -113 4 217 -107 -7 278 36 26 -173 204 138 -226 25 -84 21 109 284 79 275
5637 275 60 -56 306 -87 134 -88 193 -108 229 139 18 -83 -43 202 1 -122 169 108 -169 -143 -73 -30
5659 -30 -97 -37 -492 102 -55 22 -53 97 362 -286 -9 -60 -103 -285 -143 182 141 0 23 -29 160 -124 -35 205
5683 205 26 150 78 114 47 -173 11 179 -23 86 163 -150 74 127 305 220 -28 -28 -59 180 -34 347 -59
5706 -59 -192 106 175 -76 -101 71 87 -80 -394 -376 91 -47 -327 -196 -116 -24 -510 139 229 -209 -247 -92 -23
5729 -23 -7 -170 -59 -148 -116 -17 245 37 -32 169 -187 237 -236 -12 32 115 112 156 -115 513 99 151 92 8 -43
5754 -43 302 388 -65 96 -156 218 80 -10 -233 -1 -97 -163 89 121 -146 -127 -77 -16 -117 143 194 -113 -173 -135
$$ packed form
5591A10o81O59q9r4J92J2o0Qj0J29nk86k30K51J35R0k76J28Q9k59J30J38q4o9
5615g2J84j41j32M8J17K13l24J00K85k42j0j99L77o6l64K51j09J05Q8J75k05J96
5637B75k15j16L62l93K21k22K81l01L37r0j21j01M0K45k01j23K91o1k77K6P0M3
5659c0o7O0m55N94j57P7p5J50K65o48K77n1m3j82J42L25m1j41K3n2J89k84Q9K40
5683B05j79J24p2L6o7k20J84J68k02J09P7l13K24N3J78q5k48%l1K39k14L81m06
5706e9j33K98O9k51k5J72J6j67l14J8M67j38k80J31Q0R2m86O49R0m38l8J55O9
5729b3J6j63J11q9L2R9K62k08o9K01l56M24m73K24M4Q3lM4k71O28m14N2n9q4n1
5754d3L45Q6m53J61k52L74j38r0k23K32r6o6K52L2k67J9N0O1j01K60N1l07o0L8
$$ plain form
5778 -135 -102 -165 -12 -195 -106 -66 -53 87 -26 -182 -268 -278 -391 -73 -163 88 34 -112 -38 13 111 -280 -61 -120
5802 -120 158 -7 51 29 232 -36 -189 263 -178 -155 128 153 164 -32 29 328 -49 48 -225 198 -36 243
5824 243 -125 202 -32 292 201 -295 -180 -163 75 16 -195 -420 -104 188 -224 -130 -80 -211 -313 -37 -188 -227
5846 -227 -131 -56 -371 -25 -95 141 416 -58 -102 63 225 -19 485 28 -175 -172 345 248 11 71 158 181 -146
5869 -146 -70 28 -266 80 35 -135 3 2 -47 79 13 2 -147 13 -202 -15 82 87 -22 -41 63 -180 -193 -244 505
5894 505 -35 -281 -48 82 -62 -157 -402 111 20 208 200 -144 -96 115 249 33 49 -66 256 -42 62 -20
5916 -20 247 227 267 127 28 15 -188 -193 281 -4 -89 113 -167 -57 -8 -27 -298 -69 -17 42 -42 -139 23 -98 339
5941 339 -69 -172 -32 -225 3 -143 157 -78 -1 -18 30 -148 276 147 81 240 -39 114 117 17 82 24 103
$$ packed form
5778a35L3o3J53j83Q9M0J3J40j13j56q6j0j13L18r0K51n4j46P4N1R8l91K19n9
5802a20K78j65N8k2K03k68j53M52m41K3K83K5J1j96O1K99l77R7k73M23k34K79
5824B43l68L27k34L24r1m96J15J7K38n9k11k25L16K92m12R4N0j31j02K76j51l9
5846b27R6P5l15L46p0K36K75m74m4J65J62k44N04m57k03LN17r7k37O0Q7K3l27
5869a46P6R8k94L46m5j70J38jm9J26o6j1j49J60k15J87R7Nj09j9J04k43j3n1P49
5894E05n40k46K33J30j44r5k45N13r1J88ql44M8K11J34k16J6j15L22k98J04q2
5916b0K67k0M0j40r9j3k03nM74k85q5K02k80J10M9j9k71K29N2N9q4r7J62j21M37
5941C39m08j03J40j93K28j46L00k35P7j7M8j78M24j29o6J59k79J53Lj00O5n8P9
$$ plain form
5964 103 118 -137 66 -56 58 -6 193 -154 207 120 50 311 182 32 -170 65 63 -55 167 -11 62 81 -143
5987 -143 6 51 -49 -476 139 -378 -32 95 25 -188 58 110 -395 -92 -147 -356 -440 -225 -29 163 -108 -346
6009 -346 156 23 69 106 -55 263 -36 -102 -83 289 100 261 244 120 42 49 41 36 119 -55 9 133 66 -125 24
6034 24 -209 -13 -134 38 -28 137 -169 -4 -257 -98 28 -49 65 -193 258 -299 -29 93 -65 -299 -135
6055 -135 -105 -56 -123 -283 -59 91 -250 37 311 21 -378 -118 10 2 105 87 -48 -279 -65 -147 -50 47 15
6078 15 -237 118 72 127 114 -64 46 197 195 93 -68 196 -3 114 -288 100 -104 -164 113 366 363 18 -302
6101 -302 -109 -4 -145 -427 -15 56 -90 -33 9 -119 4 26 -90 -87 -406 -273 -61 -359 -74 -129 -166 -222 -136
6124 -136 -75 -210 95 94 45 67 -247 42 -244 43 -96 -118 41 -381 -46 55 -301 81 286 -54 128 -78
$$ packed form
5964A03J5k55K03j22J14o4J99l47L61q7p0K61j29j50k02K35kj18K22j78P3J9k24
5987a43J49M5j00m27O15n17L46J27p0k13K46N2n05L03n5k09q4K15J96J92k71k38
6009c46N02j33M6L7j61L18k99o6J9L72j89J61j7j24p8PqnQ3j74O4J24o7j91J49
6034B4k33J96j21J72o6J65l06J65k53J59J26p7J14k58M51n57K70J22j58k34J64
6055a35L0M9o7j60K24J50l41K87K74k90l99K60J28qJ03j8j35k31K14q2R7R7l2
6078A5k52L55m6N5j3j78J10J51kj02j61K64j99J17m02L88k04o0K77K53ll45l20
6101c02J93J05j41k82M12P1j46N7M2j28J23K2j16Ll19J33K12k98K85n5l7n6Q6
6124a36O1j35L05jm9K2l14K89k86K87j39k2J59m22L35J01l56L82K05l40J82k06
$$ plain form
6146 -78 233 115 189 124 -119 94 -269 67 -210 -111 224 263 -433 138 56 90 58 -48 -128 -89 25 33 97 -313
6170 -313 -9 -9 349 -71 -212 94 105 -352 -112 -203 -190 -143 -74 50 23 110 227 141 -183 161 207 3 -32 -143
6194 -143 136 294 -136 -149 -68 309 -104 -156 165 324 298 63 -101 -88 250 -16 261 132 31 98 -21 -69
6216 -69 -31 256 108 19 -324 -245 60 -58 87 94 190 -180 -163 20 -104 159 -34 216 -26 -287 -10 -135 -35
6239 -35 29 36 -154 -217 -21 114 -36 -11 -123 286 -46 -303 294 65 -136 49 341 -78 1 -317 -28 -143
6261 -143 -84 -21 -12 -133 76 7 97 37 -195 -44 171 294 -147 63 -126 106 -204 -134 299 -181 -172 -35 -161
6284 -161 -306 -16 -67 67 32 -137 8 -171 61 -210 -91 10 -150 -22 -252 -5 -10 26 -3 -211 -195 -167 97
6307 97 149 122 124 -55 134 -160 -91 279 -58 211 364 -179 -29 -206 265 -416 -268 -344 -62 -139 -161 188 176
$$ packed form
6146g8L11j18P4o5k43K13l63L36k77R9L35L9o96N71q2L4l2j06q0L9J14QO4m10
6170c13L04%L58m20j41L06J1m57K40r1J3M7O9J24k7Q7J17q6l24L44M6k04l5j11
6194a43K79J58m30j3Q1L77m13n2L21J59k6k35j64J3L38k66K77j29j01O7j19m8
6216f9L8K87j48q9l43P9L05j18J45PR6l70J7J83j24K63j93K50k42k61K77j25J00
6239c5O4Pj90o3J96J35j50K5j12M09l32k57N97k29k01J85K92m19P9l18K89j15
6261a43N9O3Rj21K09o9R0o0k32J51K15J23m41K10j89K32l10P0M33m80RJ37j26
6284a61j45K90n1J34l5j69J45j79K32k71J19J01j60J28k30K47nL6k9k08J6K8K64
6307I7N2k7Kj79J89k94O9L70l37K69J53n43J50j77M71o81J48p6K82p7k2L49j2
$$ plain form
6330 176 74 -239 92 128 316 -117 140 6 158 -99 -52 153 40 -8 -260 -116 -101 -429 24 52 -291 -44
6352 -44 -38 -120 -401 148 -113 71 132 160 278 126 48 -75 85 -60 79 -243 -196 -168 128 -126 236 31 -186
6375 -186 -169 313 -2 -97 151 -41 -181 -111 45 -6 15 62 211 -72 -427 -151 -45 77 -351 -14 84 -110
6397 -110 -88 -89 136 -205 -13 -52 -61 -74 82 -140 75 -208 -113 101 -146 -130 229 71 -266 -82 447 146 -158
6420 -158 275 136 -116 62 135 334 269 -8 -137 -28 157 48 -80 121 -71 -111 -38 -125 39 220 -41 293
6442 293 73 -229 -29 -210 -210 38 103 172 -360 79 -126 -33 128 32 182 -177 -413 -23 62 16 -152 -31 106
6465 106 -36 54 136 -31 -161 -141 -28 -36 -112 -199 64 -26 -195 156 -8 114 227 -25 -47 -117 67 96 -31 204
6489 204 135 -62 -445 -59 15 -26 151 70 -129 58 -153 -371 -114 37 369 -208 158 -152 27 -206 360
$$ packed form
6330A76j02l13L31L6J88m33K57j34J52k57M7K05j13m8k52J44J5l28M53K8l43K47
6352d4Oq2k81N49k61J84O1K8J18j52p8j23J60j45J39l22M7K8K96k54L62k05k17
6375a86J7M82l15r5K48j92j40P0J56n1K1M7J49k83l55K76J06J22m28L37R8j94
6397a10K2jK25l41J92l9rj3J56k22K15k83R5K14k47J6L59j58l37J84N29l01l04
6420a58M33j39k52J78P3J99o5k77j29J09J85j09j28K01j92m0P3q7J64J81k61L34
6442B93k20l02K00j81%K48O5O9n32M39k05R3J61r6J50l59k36L90Q5m6j68J21J37
6465A06j42R0Q2j67j30K0J13qp6q7K63r0j69L51j64J22J13k52k2p0J84K9j27K35
6489B04o9j97l83L86P4m1J77q1j99J87k11k18K57J51L32n77L66l10J79k33N66
$$ plain form
6510 360 -309 52 52 -37 -4 -57 -242 -76 132 85 -104 212 -142 156 180 -306 17 -198 173 -90 171 -112
6532 -112 -211 399 66 -64 -340 205 -9 154 412 -86 134 102 -14 285 -135 159 175 -112 40 -234 -143
6553 -143 -112 84 88 95 67 121 -76 -29 62 -273 -29 13 -89 -391 -26 -26 74 -348 -118 -224 338 -361 42 0
6577 0 66 344 -117 46 -195 248 204 64 148 50 -8 -225 -82 59 -106 -374 -65 24 -37 279 54 -139 123
6600 123 10 101 3 71 60 172 -442 184 -20 -373 158 162 73 -51 176 25 -40 -171 132 -54 -165 310 -242
6623 -242 -11 17 26 140 130 -1 -312 -37 -69 219 30 54 -239 -171 -22 -181 -206 -292 63 -10 27 46 12 -239
6647 -239 159 -73 -80 -52 136 -242 -19 -131 226 76 356 68 -267 163 -56 -174 -362 346 -178 -8 -20
6668 -20 -343 114 86 -185 271 -205 -273 -22 -89 -215 91 13 64 -234 -22 -56 100 60 272 162 -40 -316 41
$$ packed form
6510C60o69L61%q9L3n3j85J66K08m7j89L16l54K98K4m86L23k15L71k63K61k83
6532a12r9O10l33j30k76N45k14J63K58m98K20l2j16K99m20K94J6k87J52k74R1
6553a43L1J96MPk8N4j97M7R1l35K44M2j02l02L65%J00m22K30j06N62o99M03m2
6577@O6K78m61J63k41M43m4j40Q4r8n8k17J43J41j65k68L09Q9o1L16k25j93K62
6600A23j13R1r8O8j1J12o14O26k04l53N31Mq9j24K27j51o5j31L03j86j11M75n52
6623b42K31K8RJ14j0j31l11K75l2K88j89K4k93O8J49j59k5q6L55p3L7J9l4k51
6647b39L98k32pK8J88l78K23j12L57j50K80k88l35M30k19j18j88P08n24J70j2
6668b0l23M57k8k71M56m76o8K51o7j26L06p8N1k98K12l4J56m0K12j10k02k76L57
$$ plain form
6691 41 -69 243 -73 -117 156 53 147 -217 149 -125 166 368 -141 -62 43 -5 -201 -131 -133 86 -13 93 -247
6714 -247 -122 39 60 -186 126 257 -72 287 -132 254 -229 88 374 18 60 -417 -204 -60 -17 -189 -333
6735 -333 185 -65 -147 85 -297 39 54 136 27 -19 256 40 -129 61 519 53 223 80 377 -80 -19 -58
6757 -58 -49 30 1 -171 238 41 163 16 54 32 128 211 26 -101 1 199 -285 -175 229 60 181 -33 54
6780 54 189 21 -236 -351 -99 135 58 93 -139 -27 91 -105 -138 -116 -334 -182 -45 164 114 -185 29 -140
6802 -140 91 -79 -43 249 -49 20 279 -123 200 -241 -113 314 323 199 254 -89 87 52 98 420 -196 -48
6824 -48 85 22 240 -297 -523 146 39 295 56 219 -261 107 192 -124 205 -152 -68 -10 -155 52 -153 -260
6846 -260 -187 -254 132 11 95 -79 -246 -122 -81 -207 -143 152 -35 -71 211 223 181 36 253 -143 137 5 -190
$$ packed form
6691D1j10L12l16m4K73j03R4l64L66k74K91K02n09P9J05m8j96P0kK19r9J06l40
6714b47J25J61K1k46L12J31l29L59m19L86m83L17K86l56M2m77K13J44M3j72j44
6735c33N18k50q2K32l82L36J5Q2j09m6K75k16j69J90M58m66J70j43K97m57O1l9
6757e8RP9k9j72M09j97J22j47L8k2R6Q3j85j27J02J98m84J10M04j69J21k14Q7
6780E4J35j68k57j15K52K34p7L5k32J12J18j96l3K2k18J52J37K09n0k99K14j69
6802a40K31j70L6K92k98O9K59m02L23m41J28M27Rj24N5l43J76l5M6L22o16J48
6824d8J33o3K18n37k26O69j07K56k39J63m80L68Q5l16L29l57Q4N8j45K07k05j07
6846b60P3o7L86j21Q4j74j67J24M1j26O4K95j87l6K82J2m2j45K17l96K80j32j95
$$ plain form
6869 -190 14 -131 8 1 248 90 6 -184 -390 219 218 -63 -56 152 61 151 -194 138 119 364 152 410 -9
6892 -9 -28 429 -153 -1 -147 151 -109 -3 206 -345 -296 -175 -414 -99 -60 20 96 -140 -57 -83 48 -4 -7 184
6916 184 20 162 -53 135 82 -42 37 350 154 -130 93 116 46 57 32 102 -8 79 200 396 -130 -102 -49
6939 -49 173 -70 -54 -121 55 -159 191 6 -87 -307 65 352 -136 3 -112 -32 -70 53 -163 75 157 -9
6961 -9 -102 310 61 91 -175 82 -13 256 -42 -191 -282 134 115 -14 -111 92 276 163 86 34 -150 -19 171
6984 171 -49 -269 -144 -25 48 -58 -179 200 -14 -50 31 -48 -178 11 19 -260 237 64 206 221 -24 56 -199
7007 -199 68 62 -172 -280 56 -115 -33 40 -188 -188 -108 -97 -114 -256 71 -46 160 -235 188 111 68 -104 -210 13
7031 13 -199 168 -221 -126 -212 -2 -96 -139 -187 -288 -119 317 -70 143 194 74 104 237 335 -89 -10 -334 -25
$$ packed form
6869a90K04j45J39pK47j58q4j90k06O09jk81PK08r1R0l45L32j9K45k12K58m19
6892ij9M57n82J52j46K98k60J06K09n51M9J21k39L15L9Q0P6k36Q3k6J31n2lJ91
6916A84j64J42k15J88n3j24P9L13j96k84K23K3p0J1k5P0j10Q7J21J96n26K8N3
6939d9K22k43J6o7J76k14L50j85r3k20L72K87m88J39j15Q0l8J23k16K38Q2j66
6961ir3M12k49L0k66K57r5K69k98j49r1M16j9j29r7K03J84j13p7n2j84J31J90
6984A71k20k20J25J19P3j06j21L79k14l6Q1p9j30J89Qk79M97j73J42J5k45Q0k55
7007a99K67ok34j08L36j71Q2P3k28%Q0J1j7j42L27j17K06l95M23p7m3j72j06K23
7031A3k12L67l89R5q6K10r4m3m8j01J69M36l87K13N1j20L0J33R8m24P9l24L09
$$ plain form
7054 -25 126 -338 -276 -56 126 -239 -232 -9 -116 -72 -40 154 191 102 120 21 50 -298 -183 -220 172 -110 -68 48
7078 48 -173 74 20 36 -123 -19 -182 169 -362 44 230 -99 -17 294 -51 -249 42 -160 2 36 178 -518
7100 -518 191 245 -137 -36 60 -121 -143 147 -68 400 -42 70 -156 -194 -141 176 15 -94 -97 -257 -162 157 62
7123 62 325 283 91 28 139 208 141 360 -256 -86 -105 -47 98 -104 202 -115 118 275 -184 44 -56 197
7145 197 47 326 40 224 -44 153 -69 66 94 222 133 -349 -259 238 -105 169 174 -14 237 356 2 222
7167 222 93 -123 145 -45 111 84 42 -220 -25 123 208 -165 155 -262 -31 -98 32 13 -115 140 -140 -39
7189 -39 131 59 -71 -168 -127 -130 167 -336 76 -20 36 -172 251 29 -259 41 -203 -265 -48 148 60 88 19 -56
7213 -56 -335 -41 42 108 227 31 28 -21 248 228 -182 312 111 -91 -74 -117 -40 83 100 47 202 -115 -274 253
$$ packed form
7054b5J51m64O2K20J82l65PK23j07M4L2J94L7q9J8r9K9l48J15l7L92k82M2J16
7078D8k21K47n4J6j59J04j63L51n31M06J86l29Q2L11l45j98K91k02J62L4J42o96
7100e18P09N4l82J01R6j81k2K90k15M68m42J12k26l8N3L17j61j09lj60R5L19r5
7123F2K63m2j92o3J11O9o7K19o16J70j9N8J45k02L06l17K33J57m59K28j00K53
7145A97j50K79k86J84k68J97k22J35K8J28q9m82R0M97l43K74Nj88K51J19l54K20
7167B22j29k16K68j90J56k7m2k62J95J48Q5l73L20m17K31o7J30j9j28K55k80J01
7189c9J70p2j30r7M1lK97n03M12r6N6k08M23k22k88L00k44o2K17J96q8K8o9p5
7213e6k79K94Q3O6J19j96lm9K69k0m10M94k01k02J7m3P7J23J7n3J55l17j59N27
$$ plain form
7237 253 -491 -114 -296 -80 -137 276 -5 -14 -13 -122 10 -228 220 -48 -10 10 -165 -33 144 -300 -145 284
7259 284 -87 -25 58 -90 -127 -254 -27 215 17 -19 76 -44 -64 122 -1 209 1 149 115 -86 -74 -37 -67
7282 -67 1 -73 -77 128 -12 233 -141 -91 -23 49 101 -93 70 200 104 334 -11 48 -273 -208 22 152 -43 28
7306 28 -125 -140 -17 20 -63 -213 -64 -148 -19 -78 -159 106 -213 -231 -86 43 -191 -149 -144 166 -319 304 97 -166
7330 -166 67 240 60 90 17 6 -28 -59 90 -32 330 112 -254 -305 156 -332 -281 -69 -106 -435 -22 35 108
7353 108 -156 -66 350 -142 183 -21 -259 -248 -94 -15 -107 32 70 -27 62 -127 143 -133 -268 62 -122 45
7375 45 45 345 61 89 101 308 146 -70 7 148 7 -113 98 149 65 -96 -88 27 -113 186 -222 26 -178
7398 -178 -17 -105 8 -214 -199 70 -130 76 -34 92 -285 -65 -14 147 -205 -85 120 166 -328 -77 134
$$ packed form
7237B53p44L77j82K16n7M13k81rJj09J32k38M48k68L8K0j75J32J77m44J55M29
7259B84l71O2Q3j48l7j27K27K42j98l6R5j20k0J86j23K10k08J48l4k01J2L7l0
7282f7O8p4mK05j40K45l74N0O8P2N2j94J63J30r6K30l45N9l21O5K30J30j95P1
7306B8j53j5J23L7q3j50J49q4J29n9q1K65l19j8J45J29k34M2NL10m85O23k07k63
7330a66K33J73j80L0p3j1l4l1J49j22L62k18l66n1M61m88N1K12l7l29M13N7P3
7353A08k64R0M16m92L25k04k38J1J54P9r2J39L8r7Q9j89K70k76j35L30j84J67
7375D5%L00k84K8J2K07j62k16P7J41j41j20K11N1q4j61QJ15j40K99m08K48k04
7398a78J61q8J13k22J5K69k00K06j10J26l77K20N1J61l52J20K05M6m94K51K11
$$ plain form
7419 134 -28 105 -121 -162 -199 -304 58 212 41 -149 31 194 171 208 304 167 -155 88 -116 192 181 -94
7441 -94 164 -441 64 132 -77 -382 267 49 -33 140 139 85 -116 -42 -123 303 -83 76 -96 228 -147 -200 77
7464 77 -146 -76 -26 262 -289 -49 72 60 -135 -108 -39 133 -25 82 102 -52 223 44 22 -1 49 -251 -238 60
7488 60 86 37 155 196 38 156 361 30 91 48 -37 -84 -35 -57 95 141 104 98 -167 -210 106 -228 17 -141 242
7513 242 -118 -304 -196 -42 -9 -241 -169 -284 217 3 33 -53 134 -8 213 207 -133 240 -95 -170 -178 -68 -2
7536 -2 -45 130 15 -26 -105 -128 1 102 106 127 -99 36 263 -30 32 182 94 -59 -57 333 284 -288 -9 128 80
7561 80 217 5 -229 105 -25 -61 34 -48 124 119 -276 47 153 198 194 5 60 39 -23 -116 -110 -106 -186 -120 -160 -166 -276
7588 -276 -388 74 -71 -28 85 3 -117 24 -67 -153 94 44 127 -428 17 20 -80 -128 -50 -184 191 -36 182
$$ packed form
7419A34j62J33k26m1l7j05L62J54j71j90J80J63k3L7R6j37l22K43k04L08j1k75
7441i4K58o05N05O8k09l05O49k18q2J73jn4k01P4q1M26l86J59j72L24l75n3K77
7464G7k23P0N0K88n51K40J21j2j95K7O9J72j58J07K0j54K75j79k2k3N0l00J3K98
7488F0K6m9J18M1j58J18K05l31O1m3q5m7M9k2J52M6l7ok65m3L16l34K45j58L83
7513B42l60j86J08J54L3k32P2j15N01k14L0q6J87j42K21ol40L73l35p5qJ10O6
7536bm3J75j15m1p9k3J29J01MK1k26J35K27k93O2J50q8j53KL90m9n72K79J37m8
7561H0J37k12k34L34j30l6R5q2J72nl95L23J06M5mj89N5k1o2r3OMq0O6m0oj10
7588b76j12M62j45M3J13q2j20J41r1q6K47n0Q3n55M45Lj00m8P8j34L75k27K18
$$ plain form
7611 182 422 170 -54 -188 -151 25 340 -37 -252 263 17 16 -181 -141 84 -211 212 -143 87 -441 196
7632 196 9 -213 143 -66 -102 208 -225 367 -24 -271 -90 -181 23 111 340 -147 63 -53 -242 -14 -251
7653 -251 106 -75 -39 65 200 323 299 24 -78 18 174 -237 6 316 -114 -60 23 -135 176 -5 162 161
7675 161 73 -67 -116 108 -48 116 187 219 -9 -95 -118 -9 -226 -126 -87 -231 -342 90 211 -57 134 238
7697 238 94 -216 -120 -147 -59 10 -116 -88 -163 -306 196 86 -92 112 -130 -87 51 68 65 190 100 33 -377 62
7721 62 14 263 -94 145 147 -271 -209 -66 129 -28 -64 -2 -7 84 96 -174 47 41 87 4 -168 270 -153 -84 51
7746 51 120 -292 -168 -366 -396 279 -79 151 218 -329 3 -55 55 173 -120 40 10 -134 -220 -49 15 1 -30
7769 -30 -31 -296 -22 -222 116 282 168 -124 -42 65 98 230 264 298 180 -80 -86 49 75 -112 -46 120 85 -110
$$ packed form
7611A82K40k52k24j34L7J76L15l77k15N15k46jj97M0K25k95M23l55K30n28O37
7632A96j87k22L56k09l6L10m33N92l91k47J81r1K04Q8K29m87K10j16j89K28k37
7653b51L57j81L6J04J35J23k4k75j02R6J56m11K43L10m30N4Q3j58L11j81J67j
7675A61q8j40m9K24j56J64P1L2k28q6k3J09k17J00L9j44j11M32J21k68J91J04
7697B38j44l10R6k7Q8O9j26K8p5j43N02j10j78K04k42M3J38J7lJ25r0o7m10M39
7721F2m8K49l57K39Km18O2J43J95j57l6O2nR1J2k70K21oM6q3j72M38m23O9J35
7746E1O9m12J24j98l0O75l58K30O7n47L32n8J10J18k93J60l0j44q6J71O4j4l1
7769c0jk65K74k00L38J66j14k92Q2J07L3J32L4L4j18k60oJ35K6j87O6J66l5j95
$$ plain form
7793 -110 -98 465 198 -84 17 -9 -201 -285 169 118 234 137 321 100 62 -230 84 -250 49 55 -82 -304 30
7816 30 -119 -19 105 -42 -24 -144 -4 62 135 67 293 243 131 76 95 189 -114 -7 -30 -62 -246 271 134 80
7840 80 -60 222 -93 -385 -88 179 -38 -33 -143 107 273 249 -296 -85 -40 -66 148 163 224 -180 -62 -102 257
7863 257 200 14 86 -111 -378 108 -134 -93 -124 18 -132 -94 -380 -11 81 -45 -111 51 -11 83 -15 -114 -116 -192 464
7888 464 193 -48 -266 13 103 17 60 176 -70 -64 104 -136 69 -55 -134 17 4 110 -72 -72 -233 121 178
7911 178 -1 35 -234 202 19 -114 -169 -173 -5 -48 77 -206 82 187 48 -225 -18 -2 -235 136 -31 340
7933 340 134 80 -108 19 143 24 -140 -155 -225 -109 181 -263 62 147 -151 203 123 209 371 98 -125 -197
7955 -197 20 157 -56 161 -70 -311 160 116 -137 -185 232 183 -255 54 215 17 -127 -114 198 -63 -84 67
$$ packed form
7793a10J2N63k67k82J01k6j92q4M54n1J16r7J84k21l8k92L14l34K99Oj37k22L34
7816C0j49J00J24j47J8j20J40O6P3o8K26n0j12n5J9R4l03J07k3l2j84N17j37n4
7840H0j40K82l15k92K97K67k17Nj10K50J66k4n45K11M5k6K14J5O1m04J18m0L59
7863B57n7j86P2j97k67M86k42M1l1J42j50L8k86L69R2j26o6J62o2R4r8r9kp6O56
7888D64k71k41k18K79R0q6M3J16k46OJ68k40K05j24p9J51j3J06j82%j61L54N7
7911A78j79L6k69M36j83j33n5mJ68m3J25k83K88J05j39k73K07J6k33L71j67L71
7933C40k06n4j88J27J24j19j64j5p0J16K90m44L25Q5k98L54q0Q6J62k73k23p2
7955a97K17J37k13K17k31k41M71m4k53m8M17m9m38L09J61j98j44J3L12k61k1J51
$$ plain form
7977 67 119 -187 5 -166 186 -63 -31 151 -102 -192 -157 -67 163 118 -57 41 -5 13 21 71 -292 158 56 -180
8001 -180 -130 169 83 -93 -210 -139 245 -263 143 139 -214 182 -11 -121 -11 -36 8 244 -100 141 -5 -3 -80
8024 -80 101 -16 -215 -249 178 -297 -54 -64 -66 99 -236 60 -104 221 284 130 -82 206 300 -405 51 16 -141
8047 -141 205 78 -38 168 -135 27 -229 117 -262 -86 153 -7 247 187 56 -64 25 -203 -242 75 -42
8068 -42 -67 53 74 -49 29 11 -83 -71 -62 -281 213 -189 148 -122 21 -115 -230 134 -152 -130 104 -117 28
8091 28 -111 -103 -36 -432 32 -234 206 115 -71 83 -224 172 131 -90 -471 -161 -116 -93 108 99 -247 268 12
8114 12 146 159 -45 -160 88 63 95 -51 -136 -283 34 69 -148 -102 -36 51 -172 -95 87 89 65 61 185 10 5 51
8140 51 -228 -311 34 -184 -7 7 23 303 15 -72 49 -36 22 -183 325 -111 -168 -391 -199 -16 -113 2 -57
$$ packed form
7977F7N2l06J92j71L52k49L2J82k53r0L5R0K30m5j75R8m6J8QN0l63M50j02k36
8001a80N0K99q6j76j17P1L84n08M06ml53L96j93j10J10k5M4K36l44K41j46Kp7
8024h0J81j17j99l4M27m75K43j0kJ65l35K96j64L25O3j54k12K88R4p05M56l5j57
8047a41L46j27j16K06l03J62k56L46l79J76K39j60K54o0j31j20Q9k28l9L17j17
8068d2k5J20K1j23P8j8r4J2Rk19M94m02L37k70J43j36j15L64k86K2K34k21J45
8091B8j39QO7l96M64k66M40r1j86J54l07L96m1k21l81L10M5K3K01rl46N15k56
8114A2J34J3k04j15K48k5L2j46q5j47L17L5k17M6O6Q7k23P7J82Kk4mJ24j75nM6
8140E1k79q3L45k18J77J4J6K80k88q7J21q5N8k05N08m36n7k23J92J83r7J15n9
$$ plain form
8163 -57 -97 194 -111 -64 163 -172 -270 -56 64 21 19 70 -136 -85 237 -204 -141 145 70 217 75 66 -118 -113 -28
8188 -28 -139 -373 -197
$$ packed form
8163e7m0K91l05M7K27l35r8K14J20m3kN1k06N1L22m41O3K86p5J47j42rj84NQ5
8188b8j11k34J76
8191a97
$$ Imaginary data points
##PAGE= N=2
##DATA TABLE= (X++(I..I)), XYDATA
$$ plain form
0 0 0 0 0 0 0 0 0 0 -8 8 -8 8 -8 16 -16 16 -24 28 -32 39 -47 54 -61 71 -79 92 -105 118 -134 153 -170 192
32 192 -214 240 -267 295 -330 365 -406 450 -498 552 -610 676 -748 832 -925 1031 -1155 1299
50 1299 -1469 1678 -1934 2261 -2696 3304 -4213 5723 -8680 16648 -82229 -229900 -30242 42847
64 42847 -85203 -114693 25729 15407 -116165 -120110 -31635 -62788 -112844 -59043 -25653 -90188
76 -90188 -84254 8468 16744 -61647 -70859 -43728 -70957 -72148 10994 47567 2438 91 37238
89 37238 -4091 -61059 -10236 64071 44578 13829 45223 55675 27577 51284 87166 37004
101 37004 -14894 36358 85598 42263 25281 96773 117470 37117 -13511 10544 28638 35420
113 35420 62539 57050 15267 20945 49776 2604 -50604 2957 53636 -16045 -67956 4923
$$ packed form
0@%%%%%%%%qJ6j6J6j6K4l2L2m0N2o0P1q6J01j15J32j50J71j97K23k52K87l23L62
32A92m06M54n07N62o25O95p71Q56r48J050j162J286j424J580j757J956k186K454
50A299k768L147l612M195m957O000p517R936j4403K5328r8877j47671J99658P3089
64D2847j28050k9490J40422j0322j31572l945Q8475l1153n0056N3801L3390o4535
76i0188N934R2722Q276p8391r212K7131k7229j191Q3142L6573m5129k347L7147
89C7238m1329n6968N0823P4307j9493l0749L1394J0452k8098K3707L5882n0162
101C7004n1898N1252M9240m3335j6982P1492K0697q0353n0628K4055J8094O782
113C5420K7119n489m1783N678K8831m7172n3208N3561N0679o9681n1911P2879
$$ plain form
125 4923 44752 -30980 -54604 13195 -9956 -111816 -87784 19364 3057 -73947 -34653 21502
137 21502 -51971 -117899 -51267 -1100 -53105 -57909 10906 -4721 -79827 -45288 32246 -13131
149 -13131 -86135 -31394 39007 -8245 -47037 20673 61452 1873 -31627 5642 13358 -6939
161 -6939 25563 66158 39800 11415 36150 41256 4349 9416 53408 49940 18251 34921 58693
174 58693 33431 15416 41465 40711 -518 -2651 35566 37779 15825 25610 32964 -295 -20619
187 -20619 -3244 -2525 -18026 3502 26633 -5534 -37808 -15233 -3536 -38663 -45533 -9907 -12461
200 -12461 -44468 -26153 3867 -26893 -54693 -21543 -11294 -60607 -60755 5413 12147 -41839 -31967
213 -31967 14790 -16077 -67991 -28145 24405 -8701 -34515 16942 37627 -18480 -31004 22651
$$ packed form
125D923L9829p5732k3624O7799k3151j01860K4032J07148j6307p7004L9294N6155
137B1502p3473o5928O6632N0167n2005m804O8815j5627p5106L4539P7534m5377
149a3131p3004N4741P0401m7252l8792O7710M0779n9579l3500L7269P716k0297
161f939L2502M0595k6358k8385K4735N106l6907N067M3992l468l1689J6670K3772
174E8693k5262j8015K6049p54m1229k133L8217K213k1954R785P354l3259k0324
187b0619J7375P19j5501K1528K3131l2167l2274K2575J1697l5127o870L5626k554
200a2461l2007J8315L0020l0760k7800L3150J0249m9313j48O6168O734n3986R872
213c1967M6757l0867n1914L9846N2550l3106k5814N1457K0685n6107j2524N3655
$$ plain form
225 22651 24216 -22985 -7558 42895 29788 -124 28327 50176 10810 -9377 24578 33051
237 33051 5787 21138 59840 43985 7476 18456 32967 6894 -4498 26978 36707 12293
249 12293 13909 33645 18066 -8853 -274 10003 -9699 -16444 8215 14971 -3197 -5051 1948
262 1948 -17405 -36926 -24808 -13549 -22276 -17255 999 -7748 -30723 -26756 -18406 -35719 -42421
275 -42421 -17571 -7789 -24410 -19956 1876 -8862 -34956 -25974 -7969 -22245 -28710 2935 19732
288 19732 -2578 -8966 11870 5227 -21733 -11340 19635 16195 3016 22263 37681 15868 1243
301 1243 18097 21847 3645 9332 35517 35213 19183 26295 35703 16494 -651 12087 21688 11171
315 11171 13472 31142 27236 6992 3961 8958 -3594 -13764 -1030 9584 822 -3196 5112
$$ packed form
225B2651J565m7201J5427N0453j3107k9912K8451K1849l9366k0187L3955Q473
237C3051k7264J5351L8702j5855l6509J0980J4511k6073j1392L1476R729k4414
249A2293J616J9736j5579k6919Q579J0277j9702o745K4659O756j8168j854O999
262A948j9353j9521J2118J1259q727N021J8254q747k2975L967Q350j7313o702
275d2421K4850R782j6621M454K1832j0738k6094Q982J8005j4276o465L1645J6797
288A9732k2310o388K0836o643k6960J0393L0975l440j3179J9247J5418k1813j4625
301A243J6854L750j8202N687K6185l04j6030P112R408j9209j7145J2738R601j0517
315A1171K301J7670l906k0244l031M997j2552j0170J2734J0614q762m018Q308
$$ plain form
328 5112 -594 -18787 -23156 -16790 -20590 -23879 -12843 -4702 -12741 -19155 -16676 -22784 -34065 -30967
342 -30967 -20128 -18579 -17884 -8867 -5857 -15766 -20454 -16225 -18327 -22040 -11762 1926 1972 -960 6190
357 6190 7460 -4101 -7649 2389 7022 5591 14817 26461 23165 14450 16354 17439 8292 7243
371 7243 20086 27103 23437 24710 30232 23056 10669 8771 12013 9793 10192 19232 21870 14885 10517
386 10517 8927 -531 -10118 -7656 -1520 -2524 -1936 3583 1891 -9444 -16614 -17964 -21951 -25755 -19455
401 -19455 -10370 -9834 -12730 -11838 -15430 -25180 -29374 -25549 -21515 -19110 -11332 -4335 -5267 -10393 -12078 -14582
417 -14582 -18083 -16265 -7920 -57 4898 9343 10866 6722 1875 -24 -107 2243 9303 18504 22306
432 22306 22351 22158 19221 11634 6942 8919 13255 17086 21933 26066 24954 19076 13054 7978 2578 1604
$$ packed form
328E112n706j8193m369O366l800l289J1036Q141q039o414K479o108j1281L098
342c0967J0839J549O95R017L010r909m688M229k102l713J0278J3688M6k932P150
357F190J270j1561l548J0038M633j431R226J1644l296q715J904J085r147j049
371G243J2843P017l666J273N522p176j2387j898L242k220L99R040K638o985m368
386A0517j590r458r587K462O136j004N88N519j692j1335p170j350l987l804O300
401a9455R085N36k896Q92l592r750m194L825M034K405P778O997r32n126j685k504
417a4582l501J818Q345P863M955M445J523m144m847j899q3K350P060R201L802
432B2306M5j93k937p587m692J977M336L831M847M133j112n878o022n076n400r74
$$ plain form
448 1604 6096 11513 13081 13419 11686 5791 -3972 -9918 -11039 -10517 -7943 -3966 -229 -532 -5330 -11387
464 -11387 -17828 -22468 -22462 -19895 -15381 -10570 -6785 -6619 -11358 -17393 -20787 -21586 -21100 -17167 -8628 -1292
480 -1292 -549 -2472 -4046 -6371 -10999 -12642 -7457 1061 6487 9339 12511 12696 7921 2962 1808 2847
496 2847 5419 11966 18517 20407 19111 18670 15772 6824 1843 6505 13673 14202 14901 19615 20174 10479
512 10479 1807 1431 2722 -130 173 7388 9902 5707 2188 680 -4949 -12313 -13226 -9356 -7051 -5341
528 -5341 -900 -479 -7941 -14218 -14933 -16585 -19550 -16017 -5889 -3112 -8715 -10985 -7137 -9083 -16532
543 -16532 -17430 -10201 -4751 -5879 -3973 1361 3053 -1787 -6482 -6258 -5419 -2876 3760 9851 10372 7661
559 7661 7643 6099 796 -510 7582 13815 11008 9037 14372 16316 8175 4480 9805 10561 2913 3369
$$ packed form
448A604M492N417J568L38j733n895r763n946j121N22K574L977L737l03m798o057
464a1387o441m640OK567M514M811L785J66m739o035l394p99M86L933Q539P336
480a292P43j923j574k325m628j643N185Q518N426K852L172J85m775m959j154J039
496B847K572O547O551J890j296m41k898q948m981M662P168N29O99M714N59r695
512A0479q672l76J291k852L03P215K514m195l519j508n629p364r13L870K305J710
528e341M441M21p462o277p15j652k965L533J0128K777n603k270L848j946p449
543a6532q98P229N450j128J906N334J692m840m695K24Q39K543O636O091N21k711
559G661j8j544n303j306Q092O233k807j971N335J944q141l695N325P56p648M56
$$ plain form
575 3369 14415 17596 9152 6326 9759 4214 -6123 -3888 6818 8739 3320 4540 5197 -4278 -10571
590 -10571 -4627 -1185 -7404 -8457 -152 45 -9231 -10062 -1613 -5336 -18371 -18185 -6831 -4944 -9967
605 -9967 -4991 2345 -6203 -18971 -16820 -7677 -8126 -8715 188 5335 -4035 -10503 -3798 20 -6367
620 -6367 -6405 2559 4560 -1700 1097 13185 11281 -927 -2692 4832 3427 -836 9174 22719 17590
635 17590 4020 4090 8824 2846 -1113 10919 19817 11507 3197 10373 13911 4269 -768 6045 7219
650 7219 -2674 -2809 9814 13375 3930 -448 332 -6508 -15924 -9390 4095 4590 -3160 -3106 -1547 -11416
666 -11416 -19297 -11852 -2930 -8320 -14324 -7370 -1641 -8669 -12167 -4558 -3919 -18036 -22340 -7825 647
681 647 -4225 -3032 6577 710 -16285 -16386 -1885 2047 -2410 4862 14005 4224 -6006 3333 11888
$$ packed form
575C369J1046L181q444k826L433n545j0337K235J0706J921n419J220O57r475o293
590a0571N944L442o219j053Q305J97r276q31Q449l723j3035J86J1354J887n023
605i967M976P336q548j2768K151R143m49n89Q903N147r370o468O705L818o387
620f367l8Q964K001o260K797J2088j904j2208j765P524j405m263J0010J3545n129
635A7590j3570P0M734n978l959J2032Q898q310q310P176L538r642n037O813J174
650G219r893j35J2623L561r445m378P80o840r416O534J3485M95p750N4J559r869
666a1416p881P445Q922n390o004O954N729p028l498P609O39j4117m304J4515Q472
681F47m872J193R609n867j6995j01J4501L932m457P272R143r781j0230R339Q555
$$ plain form
696 11888 1844 -3798 9150 14502 3001 4739 22911 23168 2888 -2556 9928 9010 -1224 8613
710 8613 27881 21468 1357 865 9990 3471 -5477 5489 15413 5748 -3994 3266 7975 -1462 -7146
725 -7146 -1023 -3208 -14986 -13046 2163 5217 -5709 -8802 -5567 -13329 -24660 -18203 -1994 -376
739 -376 -9374 -10236 -5734 -10648 -18746 -13212 -3127 -5825 -12807 -9201 -334 -993 -3650 658 1403 -7745
755 -7745 -11596 -1395 6782 5707 8628 16377 9527 -6281 -4152 11587 13248 4071 9921 22842
769 22842 14379 -1397 6267 21764 13793 -2348 4913 17355 8823 1419 15099 22830 4873
782 4873 -8628 731 5376 -4210 -899 15177 11591 -8794 -10828 484 -5029 -16086 -6447 6232
796 6232 -6131 -19046 -8111 2869 -8455 -18728 -10057 -6687 -18011 -19449 -3216 2941 -6504
$$ packed form
696A1888j0044n642J2948N352j1501J738J8172K57k0280n444J2484r18j0234R837
710H613J9268o413k0111m92R125o519q948J0966R924r665r742P260M709r437n684
725g146O123k185j1778J940J5209L054j0926l093L235p762j1331O457J6209J618
739c76q998q62M502m914q098N534J0085k698o982L606Q867o59k657M308P45r148
755g745l851J0201Q177j075K921P749o850j5808K129J5739J661r177N850J2921
769B2842q463j5776P664J5497p971j6141P261J2442q532p404J3680P731j7957
782D873j3501R359M645r586L311J6076l586k0385k034J1312n513j1057R639J2679
796F232j2363j2915J0935J0980j1324j0273Q671L370j1324j438J6233O157r445
$$ plain form
809 -6504 -10253 -7251 -12429 -18265 -10116 1703 810 -3841 -299 1200 -5200 -6900 1689 6386 208
824 208 -2040 5563 10321 7389 6395 11000 10903 2062 -2490 5995 16191 15179 10415 12936 14037 4774
840 4774 -2608 5250 13626 9400 4567 10436 11176 1305 -223 8365 5388 -7545 -5770 5950 2121
855 2121 -6413 1580 10297 -3922 -19551 -10996 -845 -9695 -13030 2239 5330 -12178 -17892 -4939
869 -4939 -4707 -17155 -13234 802 -3569 -14117 -6747 4008 -4251 -13139 -5578 -2480 -11173 -9436
883 -9436 5788 8641 -2042 -2273 4765 -619 -9346 -1983 9911 8328 2857 6709 9780 4671 2088
898 2088 6367 6870 3224 4423 8999 9862 8123 9053 9430 4920 504 957 3390 6451 8431 7696 5791
915 5791 4144 609 -3385 -1631 2472 820 -2521 973 4222 -1682 -7061 -2027 543 -8696 -12495
$$ packed form
809f504l749L002n178n836Q149J1819q93m651L542J499o400j700Q589M697o178
824B08k248P603M758k932r94M605r7q841m552Q485J0196j012m764K521J101r263
840D774p382P858Q376m226m833N869P40r871j528Q588k977j2933J775J1720l829
855B121q534P993Q717j4219j5629Q555J0151q850l335J5269L091j7508n714J2953
869d939K32j2448L921J4036m371j0548P370J0755q259q888P561L098q693J737
883i436J5224K853j0683k31P038n384q727P363J1894j583n471L852L071n109k583
898B088M279N03l646J199M576Q63j739R30L77m510m416M53K433L061J980p35j905
915E791j647l535l994J754M103j652l341L494L249n904n379N034K570r239l799
$$ plain form
930 -12495 -3142 1573 -5892 -6688 1214 -1913 -13627 -12375 -2892 -4883 -10478 -2545 4078 -5153 -11801
945 -11801 -3755 270 -8828 -9672 1346 2429 -6094 -3176 6027 1858 -6975 -2373 4086 -1876 -4292
960 -4292 6266 10647 2068 270 6566 3895 -2622 1540 9510 6680 2450 7612 10686 3157 85
975 85 6485 7103 1191 1710 8487 7490 2919 4567 5947 1317 -1566 1146 2766 1282 2621 4618
991 4618 1229 -2172 -1685 -2138 -5076 -3852 15 -1834 -4224 -1424 -822 -6601 -8582 -4377 -4545 -9535
1007 -9535 -6639 -240 -2554 -7513 -4540 -2474 -8651 -11097 -3826 -822 -5536 -4379 2302 -41 -7215
1022 -7215 -4666 677 -2602 -5079 1775 5807 952 248 5869 4344 -2014 140 6221 4411 1973
1037 1973 7965 11744 5231 2375 7239 6724 897 2969 10170 8526 4396 7261 9684 3636 -691
$$ packed form
930a2495R353M715p465p96P902l127j1714J252R483j991n595P933O623r231o648
945a1801Q046M025r098q44J1018J083q523K918R203m169q833M602O459n962k416
960d292J0558M381q579j798O296k671o517M162P970k830m230N162L074p529l072
975H5O400O18n912N19O777r97m571J648J380m630k883K712J620j484J339J997
991D618l389l401M87m53k938J224L867j849k390K800O02n779j981M205j68m990
1007i535K896O399k314m959K973K066o177k446P271L004m714J157O681k343p174
1022g215K549N343l279k477O854M032m855p04N621j525o358K154O081j810k438
1037A973N992L779o513k856M864n15n827K072P201j644m130K865K423o048m327
$$ plain form
1052 -691 3588 4730 556 1131 6282 4811 -244 438 1855 -3511 -6881 -2909 -782 -3570 -3194 257
1068 257 -2585 -7843 -7214 -5838 -8786 -9675 -4417 -2964 -6226 -6214 -3463 -6145 -10898 -8316 -4752 -6515
1084 -6515 -6960 -963 596 -3347 -4184 -844 -2552 -6296 -2326 3204 2386 1597 5328 6370 2216 847
1100 847 4056 4210 2284 5749 10050 8430 6207 8627 8556 3438 2777 6333 6915 5285 7863 10239
1116 10239 6461 3093 4062 3616 -847 -942 4097 4418 604 700 3003 -156 -5500 -5062 -3084 -4981 -5678
1133 -5678 -2346 -1568 -4615 -5777 -5126 -7681 -10644 -8588 -5696 -5780 -6195 -3585 -3453 -6495 -7642 -5665
1149 -5665 -6629 -7098 -4401 -606 -945 -1362 400 76 -2371 -2647 -175 778 1188 4647 6489 4601 3654
1166 3654 5138 4855 2059 3012 6371 7448 6222 7725 8332 6456 4742 4279 3718 2931 4584 7094
$$ packed form
1052f91M279J142m174N75N151j471n055O82J417n366l370L972K127k788L76L451
1068B57k842n258O29J376k948q89N258J453l262J2K751k682m753K582L564j763
1084f515m45N997J559l943q37L340j708l744L970N530q18p89L731J042m154j369
1100H47L209J54j926L465M301j620k223K420p1n118o61L556N82j630K578K376
1116A0239l778l368R69m46m463r5N039L21l814R6K303l159n344M38J978j897o97
1133e678L332P78l047j162O51k555k963K056K892q4m15K610J32l042j147J977
1149e665r64m69K697L795l39m17J762l24k447k76K472R53M10L459J842j888r47
1166C654J484k83k796R53L359J077j226J503O07j876j714m63n61p87J653K510
$$ plain form
1182 7094 5724 3915 4898 4178 -11 -1950 855 1751 -1287 -1093 2356 1107 -3321 -3923 -2683 -4252
1198 -4252 -7200 -4990 -2266 -3093 -4191 -2998 -3882 -7569 -8091 -5639 -5497 -6565 -4028 -993 -1923 -5322
1214 -5322 -4548 -2693 -4073 -5385 -3101 -214 122 -356 936 1829 311 -1706 -640 1325 1761 2606
1230 2606 4694 5575 4600 2824 2309 2468 2328 3338 5297 5170 4219 5128 6170 3679 1060 1897 4287
1247 4287 2607 414 2859 6154 4077 -373 -322 1039 -1133 -3271 -3 2354 795 -1195 -162
1262 -162 -1161 -4096 -4426 -2424 -1696 -4139 -3173 -530 -1165 -3963 -3459 -1978 -4670 -7038 -4034 -2 -788
1279 -788 -3324 -980 671 -3384 -6940 -4113 733 -6 -2357 259 2386 -344 -2427 -79 1713
1294 1713 -1325 -1615 1659 2846 569 2296 5807 3079 -2481 -1419 3518 2300 153 4669 8027
$$ packed form
1182G094j370j809R83p20m189j939K805Q96l038J94L449j249m428o02J240j569
1198d252k948K210K724q27j098J193q84l687n22K452J42j068K537L035r30l399
1214e322P74J855j380j312K284K887L36m78J292Q93j518k017J066J965M36Q45
1230B606K088Q81r75j776n15J59j40J010J959j27r51R09J042k491k619Q37K390
1247D287j680k193K445L295k077m450N1J361k172k138L268K357j559j990J033
1262a62r99k935l30K002P28k443R66K643o35k798N04J481k692k368L004M032p86
1279g88k536K344J651m055l556K827M846p39k351K616K127k730k083K348J792
1294A713l038k90L274J187k277J727L511k728n560J062M937j218k147M516L358
$$ plain form
1309 8027 2804 -1939 1692 4633 372 -1513 4665 6173 -165 -1267 4743 5404 -771 -1823 1918
1324 1918 722 -2685 775 5209 2619 -2469 -380 493 -4235 -5571 1159 4117 -1716 -4380 -451
1339 -451 -10 -4810 -5338 -670 -595 -5335 -5001 -248 393 -2694 -2522 -496 -3174 -7126 -4997 496 1663
1356 1663 -1346 -866 543 -1657 -4935 -2522 1865 1650 -810 1018 2945 -88 -1582 2993 5565
1371 5565 -315 -3622 2286 6020 1503 990 7051 7048 -1301 -3017 4115 5485 1070 3267 8763 3561
1387 3561 -3649 98 6604 1504 -2449 2935 5874 -1294 -4090 3894 5543 -2490 -4709 964 -565
1402 -565 -6661 -2561 5488 1858 -6781 -4850 -368 -4783 -8710 -1798 3570 -2677 -7731 -3381 -708
1417 -708 -4778 -5462 -215 -272 -5750 -5354 3 1183 -2061 -1612 1409 -1410 -5277 -2523 3848 4407 1478
$$ packed form
1309H027n223m743L631K941m261j885O178J508o338j102O010O61o175j052L741
1324A918j196l407L460M434k590n088K089Q73m728j336O730K958n833k664L929
1339d51M41m800n28M668P5m740L34M753O41l087J72K026k678l952K129N493J167
1356A663l009M80J409k200l278K413M387k15k460J828J927l033j494M575K572
1371E565n880l307N908L734m517n13O061lq349j716P132J370m415K197N496n202
1387C561p210L747O506n100l953N384K939p168k796P984J649q033k219N673j529
1402e65o096M100Q049l630q639J931M482m415l927O912N368o247n054M350K673
1417g08m070o84N247n7n478L96N357J180l244M49L021k819l867K754O371N59k929
$$ plain form
1434 1478 1614 3379 530 -2100 1254 6742 5499 1140 2716 5931 3676 308 4191 7789 3107
1449 3107 -2015 1736 6850 3801 1506 5776 5570 -2255 -4475 2425 4359 -822 -412 5019 1266
1464 1266 -7253 -4630 2474 -359 -6308 -2691 1869 -4361 -8137 -1053 2947 -5512 -9506 -2879 -1701
1479 -1701 -7603 -5723 3346 1976 -6829 -6855 -692 -2695 -6929 -978 4813 109 -4934 -441 3297
1494 3297 -1185 -2725 2971 4539 -1701 -1692 5140 6998 2563 1535 4647 2630 -1718 509 7104 7274
1510 7274 4052 2830 4981 2369 -968 1208 5372 4543 1078 1025 3264 2091 -545 649 2582 -1182
1526 -1182 -4675 -1955 2082 257 -2374 5 555 -5683 -8667 -2953 332 -3183 -4232 362 -830
1541 -830 -7133 -6641 -448 -1252 -6549 -4520 855 -1604 -5259 -775 3624 -1578 -6344 -1680 1324 -2663
$$ packed form
1434A478J36J765k849k630L354N488j243m359J576L215k255l368L883L598m682
1449C107n122L751N114l049k295M270k06p825k220O900J934n181M10N431l753
1464A266q519K623P104k833n949L617M560o230l776P084M000q459l994O627J178
1479a701n902J880R069j370q805k6O163k003m234N951N791m704n043M493L738
1494C297m482j540N696J568o240RO832J858m435j028L112k017m348K227O595J70
1510G274l222j222K151k612l337K176M164q29l465n3K239j173k636J194J933l764
1526a182l493K720M037j825k631K379N50o238k984N714L285l515j049M594j192
1541h30o303M92O193q04n297K029N375k459l655M484M399n202m766M664L004l987
$$ plain form
1557 -2663 -1569 5352 5610 -1667 -2170 3229 2376 -2261 1639 7388 4060 -575 2305 6562 2945 -103
1573 -103 3138 4743 666 117 4804 6257 2460 376 2634 1109 -2298 -863 2902 3730 670 -339
1589 -339 914 -491 -3043 -2380 -129 -715 -2697 -2198 -112 -991 -2771 -2631 -961 -3396 -5829 -3792
1605 -3792 -119 -227 -2763 -1892 -541 -3389 -5847 -2657 273 -1066 -1894 941 1135 -2230 -2826 1227
1621 1227 929 -2255 -1176 2759 1859 -463 1511 4445 800 -2182 308 3246 1147 512 4240 5099
1637 5099 823 -369 2432 2208 -598 269 4134 3364 389 971 3619 1342 -1455 -210 1662 309
1653 309 -892 1520 2871 410 -1496 -397 -637 -2543 -2120 20 1235 -806 -1240 -572 -1036 -3190
1669 -3190 -2936 -1683 -1007 -1668 -1448 -73 -410 -1446 -2417 -1867 -2104 -2734 -1998 221 148 -713 -413 -357 -1620
$$ packed form
1557b663J094O921K58p277n03N399q53m637L900N749l328m635K880M257l617l048
1573a03L241J605m077n49M687J453l797k084K258j525l407J435L765Q28l060j009
1589c39J253j405k552O63K251n86j982M99K086q79j780J40J670k435k433K037
1605c792L673j08k536Q71J351k848k458L190K930j339q28K835J94l365n96M053
1621A227k98l184J079L935r00k322J974K934l645k982K490K938k099o35L728Q59
1637E099m276j192K801k24k806Q67L865p70k975N82K648k277k797J245J872j353
1653C09j201K412J351k461j906J099k40j906M23K140J215k041m34O68m64k154
1669c190K54J253O76o61K20J375l37j036r71N50k37o30P36K219p3q61L00N6j263
$$ plain form
1688 -1620 -2976 -1509 74 -151 -314 1320 1643 -279 -441 187 398 -815 41 2321 2420 1349 1447 2641
1706 2641 1496 -727 430 2317 1965 1926 3099 3486 1674 845 1056 1258 109 947 2290 2640 1447
1723 1447 1716 2285 325 -740 -856 -165 404 -231 518 1200 335 -1248 -1972 -1986 -2512 -2333 -1577 -708 -903
1742 -903 -1656 -1891 -2570 -2953 -3623 -3513 -2259 -2030 -1604 -1245 -1502 -1616 -2625 -2489 -2210 -2361 -1491 -38 597
1761 597 -121 -109 219 -165 -1053 -423 712 1648 2048 2205 3087 2188 1629 1911 2060 1652 2421 3827 3860 2877
1781 2877 3482 3155 2060 1422 1557 1990 1918 2679 3198 2779 1617 577 488 -142 -868 -327 -132 242 171 -428
1801 -428 -1552 -2217 -2686 -2995 -3080 -2890 -2016 -1716 -2362 -2968 -3329 -3754 -4440 -3958 -3714 -3164 -1853 -1476 -1681 -2446
1821 -2446 -2359 -2385 -2513 -2129 -1037 -16 35 1279 1378 425 -50 622 1317 775 1427 3229 3935 3494 2678 3074
$$ packed form
1688a620j356J467J583k25j63J634L23j922j62O28K11j213Q56K280R9j071R8J194
1706B641j145k223J157J887l52l9J173L87j812q29K11K02j149Q38J343L50j193
1723A447K69N69j960j065j16O91N69o35P49O82q65j583p24j4n26J79P56Q69j95
1742i03p53k35o79l83o70J10J254K29M26L59k57j14j009J36K79j51Q70J453O35
1761E97p18J2L28l84q88O30J135R36M00J57Q82q99n59K82J49m08P69J406L3r83
1781B877O05l27j095o38J35M33p2P61N19m19j162j040q9o30p26N41J95L74p1n99
1801d28j124o65m69l09q5J90Q74L00o46o06l61m25o86M82K44N50J311L77k05p65
1821b446Q7k6j28L84J092J021N1J244R9r53m75O72O95n42O52J802P06m41q16L96
$$ plain form
1841 3074 3144 1989 2430 3409 3426 3569 4413 4481 2657 2058 2478 2434 1142 1236 2672 2895 1596 1301 1063 -129
1861 -129 -1447 -1272 -552 -1407 -1229 -383 -439 -2353 -2715 -2979 -3432 -4036 -3379 -2729 -2398 -2616 -2247 -2813 -3912
1880 -3912 -4025 -3599 -2887 -2948 -1933 -861 -848 -1370 -1467 -1780 -1668 -1217 -771 -478 1280 1956 1167 918 1389 728
1900 728 399 842 2481 2869 2895 3637 4021 2579 1509 1916 2967 1724 2385 3627 3824 2479 2276 3113
1918 3113 1755 -298 290 1978 1380 169 1441 2334 -84 -2067 -1351 -457 -2315 -2152 -300 262 -1723
1935 -1723 -2171 -1328 -2226 -3998 -3165 -1875 -2203 -2938 -1370 -560 -1946 -3273 -2707 -1773 -3136 -3293 -907
1952 -907 533 -518 -986 -228 -677 -2050 -1904 44 1078 549 850 2172 1581 395 332 1385 989 105
1970 105 1128 2967 3234 1692 2216 2459 970 -706 780 2673 2123 1469 2506 2828 441 -1046 787
$$ packed form
1841C074P0j155M41R79J7J43Q44O8j824n99M20m4j292R4J436K23j299k95k38j192
1861a29j318J75P20q55J78Q46n6j914l62k64m53o04O57O50L31k18L69n66j099
1880c912j13M26P12o1J015J072J3n22r7l13J12M51M46K93J758O76p89k49M71o61
1900G28l29M43J639L88K6P42L84j442j070M07J051j243O61J242J97j345k03Q37
1918C113j358k053N88J688n98j211J272Q93k418j983P16Q94j858J63J852N62j985
1935a723m48Q43q98j772Q33J290l28p35J568Q10j386j327N66R34j363j57K386
1952i07J440j051m68P58m49j373J46J948J034n29L01J322n91j186o3J053l96q84
1970A05J023J839K67j542N24K43j489j676J486J893n50o54J037L22k387j487J833
$$ plain form
1987 787 1734 -72 -317 1628 2363 -17 -326 1201 480 -2435 -2200 -53 -193 -1292 414 1931 -590
2004 -590 -3276 -2220 -401 -1951 -2844 16 935 -1485 -2638 -646 -547 -2987 -2745 -216 -178 -2653 -1437
2021 -1437 1392 523 -2467 -1867 -502 -1738 -2988 164 2720 1034 -894 3 542 -1373 -1561 1081
2037 1081 2431 8 -449 2320 2426 95 -99 2118 1742 -1249 116 3306 3228 1123 1873 2920 638
2054 638 -1908 249 3544 2128 527 1926 2938 -118 -1958 907 1903 -332 -1271 1182 1611 -622
2070 -622 -967 1543 552 -3202 -3203 -334 -178 -2265 -59 1763 -892 -4571 -3391 -478 -1827 -3004 -569
2087 -569 1032 -2149 -3518 -1403 123 -2393 -3117 -479 -114 -2295 -1833 1768 1928 -1755 -2064 530
2103 530 -241 -1940 1041 4356 2693 -795 347 2580 452 -796 2690 4760 1441 -559 2939
$$ packed form
1987G87R47j806k45J945P35k380l09J527p21k915K35K147j40j099J706J517k521
2004e90k686J056J819j550q93K860R19k420j153J992R9k440K42K529L8k475J216
2021a437K829q69k990O00J365j236j250L152K556j686j928Q97N39j915j88K642
2037A081J350k423m57K769J06k331j94K217l76k991J365L190p8k105P50J047k282
2054F38k546K157L295j416j601J399J012l056j840K865R96k235r39K453M29k233
2070f22l45K510r91l754jK869J56k087K206J822k655l679J180K913j349j177K435
2087e69J601l181j369K115J526k516p24K638L65k181M62L601J60l683l09K594
2103E30p71j699K981L315j663l488J142K233k128j248L486K070l319k000L498
$$ plain form
2118 2939 4280 1185 613 3184 2761 -812 30 4030 4221 1349 564 2355 54 -3031 -796 3121
2134 3121 1977 -1040 179 1401 -2247 -3678 -728 848 -2162 -3838 -859 -168 -2859 -3182 -210
2149 -210 -1057 -4529 -4885 -1464 -1052 -2864 -1547 849 -1434 -4875 -3166 -265 -684 -2107 -74 1668
2165 1668 -908 -2260 196 2407 173 -1125 1119 2385 890 358 4287 4504 939 -472 2009
2180 2009 2410 563 2039 5405 4307 739 491 3198 1829 -316 1512 3956 1879 -888 1345
2195 1345 3082 580 -1965 987 1165 -2630 -2589 1072 1934 -1815 -2382 -636 -2114 -5406 -3356 631
2211 631 -168 -3790 -2502 -296 -2747 -4635 -2206 -243 -2519 -3658 -896 420 -1741 -1997 506 337
2227 337 -2902 -2725 479 1484 -175 1084 2453 1240 -1064 -510 2217 2022 879 2337 3703 2108
$$ packed form
2118B939J341l095n72K571m23l573Q42M000J91k872p85J791k301l085K235L917
2134C121j144l017J219J222l648j431K950J576l010j676K979O91k691l23K972
2149b10q47l472l56L421M12j812J317K396k283l441J709K901m19j423K033J742
2165A668k576j352K456K211k234j298K244J266j495n32L929K17l565j411K481
2180B009M01j847J476L366j098l568k48K707j369k145J828K444k077k767K233
2195A345J737k502k545K952J78l795M1L661Q62l749n67J746j478l292K050L987
2211F31p99l622J288K206k451j888K429J963k276j139K762J316k161k56K503j69
2227C37l239J77L204J005j659J259J369j213k304N54K727j95j143J458J366j595
$$ plain form
2243 2108 637 2313 3375 1774 446 1643 3202 1914 1111 2813 3210 742 -1096 118 1113 -349
2259 -349 283 2354 1629 -1128 -1804 -272 -349 -2902 -1702 516 -570 -3008 -1655 684 -1228 -3376
2275 -3376 -2171 -719 -2642 -3437 -450 1177 -1840 -2750 -1031 -1052 -3475 -2248 666 771 -1682 -672
2291 -672 1134 -493 -2044 -178 1674 282 -1107 1304 2850 788 258 2037 1779 -509 -449 1844
2307 1844 2618 1320 1770 2938 1491 -478 199 1310 1459 860 1395 2193 1010 559 579 782 -201 -1077
$$ packed form
2243B108j471J676J062j601j328J197J559j288q03J702L97k468j838J214R95j462
2259c49O32K071p25k757o76J532p7k553J200K218j086k438J353K339j912k148
2275c376J205J452j923p95K987J627l017r10J719k1k423J227K914J05k453J010
2291f72J806j627j551J866J852j392j389K411J546k062n30J779k58k288O0K293
2307A844P74j298M50J168j447j969O77J111J49n99N35P98j183m51K0K03r83q76
$$ [...]
8191b0
##END NTUPLES=NMR FID
##END=
