##TITLE=1H_LR-683A-H
 D2O, 8 sc, 
 18.9.2019
##JCAMPDX= 6.0         $$ Bruker NMR JCAMP-DX V2.0
##DATA TYPE= NMR FID
##DATA CLASS= NTUPLES
##ORIGIN= UXNMR, Bruker Analytische Messtechnik GmbH
##OWNER= root
$$ XWIN-NMR		Version 3.5
$$ Wed Sep 18 14:23:55 2019 Russian Standard Time (UT+4h)  she@DPX200
##.OBSERVE FREQUENCY= 200.1315
##.OBSERVE NUCLEUS= ^1H
##.DELAY= (6, 6)
##.ACQUISITION MODE= SIMULTANEOUS
##.ACQUISITION SCHEME= undefined
##.AVERAGES= 8
##.DIGITISER RES= 18
##SPECTROMETER/DATA SYSTEM= spect
##.PULSE SEQUENCE= zg30
##.SOLVENT NAME= D2O
##.SHIFT REFERENCE= (INTERNAL, D2O, 0, 15.7039)
##AUDIT TRAIL= $$ (NUMBER, WHEN, WHO, WHERE, WHAT)
$$ ##TITLE= Audit trail, XWIN-NMR		Version 3.5
$$ ##JCAMPDX= 5.01
$$ ##ORIGIN= Bruker BioSpin GmbH
$$ ##OWNER= she
$$ F:/spectra/data/she/nmr/H-F/1/audita.txt
$$ ##AUDIT TRAIL=  $$ (NUMBER, WHEN, WHO, WHERE, WHAT)
(   1,<2019-09-18 14:22:57.93 +0400>,<she>,<DPX200>,
      <created by zg, POWCHK disabled, PULCHK disabled
       configuration hash MD5:
       00 E9 B6 7A A2 85 ED C7 34 08 36 98 17 FE 4E 26
       data hash MD5: 16K
       7D 89 62 01 AA 4D 72 60 F7 3B 97 05 2E 70 D8 3E>)
$$ ##END=
$$ 
$$ hash MD5
$$ 65 13 C2 43 F3 31 21 94 A9 1E FD 93 10 FE B9 DB
##$RELAX= 
##$RELAX= 
##$RELAX= 
##$RELAX= 
##$RELAX= 
##$RELAX= 
$$ Bruker specific parameters
$$ --------------------------
##$DU= <F:/spectra>
##$EXPNO= 1
##$NAME= <H-F>
##$PROCNO= 1
##$TYPE= <nmr>
##$USER= <she>
##$AMP= (0..31)
100 100 100 100 100 100 100 100 100 100 100 100 100 100 100 100 100 100 
100 100 100 100 100 100 100 100 100 100 100 100 100 100 
##$AQSEQ= 0
##$AQ_mod= 1
##$AUNM= <au_zg>
##$AUTOPOS= <>
##$BF1= 200.13
##$BF2= 200.13
##$BF3= 200.13
##$BF4= 200.13
##$BF5= 200.13
##$BF6= 200.13
##$BF7= 200.13
##$BF8= 200.13
##$BYTORDA= 1
##$CFDGTYP= 0
##$CFRGTYP= 5
##$CHEMSTR= <none>
##$CNST= (0..31)
1 1 145 1 1 1 1 1 1 1 1 1 1 1 1 1 1 1 1 1 1 1 1 1 1 1 1 1 1 1 1 1 
##$CPDPRG= <>
##$CPDPRG1= <>
##$CPDPRG2= <>
##$CPDPRG3= <>
##$CPDPRG4= <mlev>
##$CPDPRG5= <mlev>
##$CPDPRG6= <mlev>
##$CPDPRG7= <mlev>
##$CPDPRG8= <mlev>
##$CPDPRGB= <>
##$CPDPRGT= <>
##$D= (0..31)
0 1.2 0 0 0 0 0 0 0 0 0 0.03 0 0 0 0 0 0 0 0 0 0 0 0 0 0 0 0 0 0 0 0 
##$DATE= 1568802177
##$DBL= (0..7)
120 120 120 120 120 120 120 120 
##$DBP= (0..7)
150 150 150 150 150 150 150 150 
##$DBP07= 0
##$DBPNAM0= <>
##$DBPNAM1= <>
##$DBPNAM2= <>
##$DBPNAM3= <>
##$DBPNAM4= <>
##$DBPNAM5= <>
##$DBPNAM6= <>
##$DBPNAM7= <>
##$DBPOAL= (0..7)
0.5 0.5 0.5 0.5 0.5 0.5 0.5 0.5 
##$DBPOFFS= (0..7)
0 0 0 0 0 0 0 0 
##$DE= 6
##$DECBNUC= <off>
##$DECIM= 24
##$DECNUC= <off>
##$DECSTAT= 4
##$DIGMOD= 1
##$DIGTYP= 9
##$DL= (0..7)
0 120 120 120 120 120 120 120 
##$DP= (0..7)
150 150 150 150 150 150 150 150 
##$DP07= 0
##$DPNAME0= <>
##$DPNAME1= <>
##$DPNAME2= <>
##$DPNAME3= <>
##$DPNAME4= <>
##$DPNAME5= <>
##$DPNAME6= <>
##$DPNAME7= <>
##$DPOAL= (0..7)
0.5 0.5 0.5 0.5 0.5 0.5 0.5 0.5 
##$DPOFFS= (0..7)
0 0 0 0 0 0 0 0 
##$DQDMODE= 0
##$DR= 18
##$DS= 0
##$DSLIST= <SSSSSSSSSSSSSSS>
##$DSPFIRM= 0
$$ [...]
##$SUBNAM2= <"">
##$SUBNAM3= <"">
##$SUBNAM4= <"">
##$SUBNAM5= <"">
##$SUBNAM6= <"">
##$SUBNAM7= <"">
##$SUBNAM8= <"">
##$SUBNAM9= <"">
##$SW= 24.0689530833862
##$SWIBOX= (0..15)
0 0 2 0 0 0 0 0 0 0 0 0 0 0 0 0 
##$SW_h= 4816.95568400771
##$TD= 16384
##$TD0= 1
##$TE= 0
##$TE2= 300
##$TE3= 300
##$TEG= 300
##$TL= (0..7)
0 120 120 120 120 120 120 120 
##$TP= (0..7)
150 150 150 150 150 150 150 150 
##$TP07= 0
##$TPNAME0= <>
##$TPNAME1= <>
##$TPNAME2= <>
##$TPNAME3= <>
##$TPNAME4= <>
##$TPNAME5= <>
##$TPNAME6= <>
##$TPNAME7= <>
##$TPOAL= (0..7)
0.5 0.5 0.5 0.5 0.5 0.5 0.5 0.5 
##$TPOFFS= (0..7)
0 0 0 0 0 0 0 0 
##$TUNHIN= 0
##$TUNHOUT= 0
##$TUNXOUT= 0
##$USERA1= <user>
##$USERA2= <user>
##$USERA3= <user>
##$USERA4= <user>
##$USERA5= <user>
##$V9= 5
##$VALIST= <valist>
##$VCLIST= <CCCCCCCCCCCCCCC>
##$VD= 0
##$VDLIST= <DDDDDDDDDDDDDDD>
##$VPLIST= <PPPPPPPPPPPPPPP>
##$VTLIST= <TTTTTTTTTTTTTTT>
##$WBST= 1024
##$WBSW= 4
##$XGAIN= (0..3)
0 0 0 0 
##$XL= 0
##$YL= 0
##$YMAX_a= 313699
##$YMIN_a= -433833
##$ZGOPTNS= <>
##$ZL1= 120
##$ZL2= 120
##$ZL3= 120
##$ZL4= 120
##$ABSF1= 10
##$ABSF2= 0
##$ABSG= 5
##$ABSL= 3
##$ALPHA= 0
##$AQORDER= 0
##$ASSFAC= 0
##$ASSFACI= 0
##$ASSFACX= 0
##$ASSWID= 0
##$AUNMP= <proc_1d>
##$AZFE= 0.1
##$AZFW= 0.1
##$BCFW= 1
##$BC_mod= 2
##$BYTORDP= 1
##$COROFFS= 0
##$CY= 11.3945322036743
##$DATMOD= 1
##$DC= 2
##$DFILT= <>
##$DTYPP= 0
##$F1P= 20.1720416913024
##$F2P= 0.152960286110954
##$FCOR= 0.5
##$FTSIZE= 0
##$FT_mod= 4
##$GAMMA= 1
##$GB= 0.15
##$INTBC= 1
##$INTSCL= 1
##$ISEN= 128
##$LB= 0.24
##$LEV0= 0
##$LPBIN= 0
##$MAXI= 10000
##$MC2= 0
##$MEAN= 0
##$ME_mod= 0
##$MI= 1.114404
##$NCOEF= 0
##$NC_proc= 0
##$NLEV= 6
##$NOISF1= 3.799351
##$NOISF2= 2.8
##$NSP= 1
##$NTH_PI= 0
##$NZP= 0
##$OFFSET= 15.70392
##$PC= 1
##$PHC0= -9576.35
##$PHC1= 11.60096
##$PH_mod= 1
##$PKNL= yes
##$PPARMOD= 0
##$PSCAL= 0
##$PSIGN= 0
##$REVERSE= no
##$SF= 200.130013532006
##$SI= 16384
##$SIGF1= 3
##$SIGF2= 2
##$SINO= 400
##$SIOLD= 16384
##$SREGLST= <1H.CDCl3>
##$SSB= 0
##$STSI= 0
##$STSR= 0
##$SW_p= 3612.71676300578
##$SYMM= 0
##$S_DEV= 0
##$TDeff= 0
##$TDoff= 0
##$TI= <>
##$TILT= no
##$TM1= 0
##$TM2= 0
##$TOPLEV= 0
##$USERP1= <user>
##$USERP2= <user>
##$USERP3= <user>
##$USERP4= <user>
##$USERP5= <user>
##$WDW= 1
##$XDIM= 8192
##$YMAX_p= 0
##$YMIN_p= 0
$$ End of Bruker specific parameters
$$ ---------------------------------
##NTUPLES= NMR FID
##VAR_NAME=  TIME,          FID/REAL,        FID/IMAG
##SYMBOL=    X,             R,               I
##VAR_TYPE=  INDEPENDENT,   DEPENDENT,       DEPENDENT
##VAR_FORM=  AFFN,          ASDF,            ASDF
##VAR_DIM=   8192,          8192,            8192
##UNITS=     SECONDS,       ARBITRARY UNITS, ARBITRARY UNITS
##FACTOR=    0.0002076,     1,               1
##FIRST=     0,             0,               0
##LAST=      1.7004516,     0,               0
##MIN=       0,             -433833,         0
##MAX=       1.7004516,     313699,          0
$$ Real data points
##PAGE= N=1
##DATA TABLE= (X++(R..R)), XYDATA
$$ plain form
0 0 0 0 0 0 8 -8 8 -8 8 -16 16 -24 32 -39 48 -56 64 -80 95 -112 128 -150 176 -201 231 -267 302 -346
28 -346 391 -442 500 -560 630 -703 785 -876 975 -1082 1203 -1330 1476 -1634 1807 -2002
44 -2002 2217 -2462 2735 -3042 3400 -3812 4297 -4880 5589 -6485 7644 -9221 11502 -15105
58 -15105 21693 -37689 158453 65163 -280981 -134034 -113017 -191095 -78159 229473 272062
69 272062 147393 49307 -68370 -258422 -248409 -69715 66551 152484 266749 198903 -50122
80 -50122 -190071 -167057 -190684 -135863 134882 309788 157426 10738 31490 -77851 -310781
91 -310781 -251867 55752 199031 171238 188445 112861 -133997 -249141 -135906 -73769 -61102
102 -61102 126707 313699 191168 -55622 -135743 -153023 -203986 -116563 97205 203201 185786
$$ packed form
0@%%%%Qj6J6j6J6k4L2m0N6p1Q7j04J20j44J75k07K40k78L26l77M32m98N69o48
28c46P37q33R42j060J190j333J488j661J851k057K285k533K806l110L441l809
44b002M219m679N197n777O442p212Q109r177J0469j2074J4129j6865K0723k6607
58a5105L6798n9382J96142r3290l46144J46947K1017p8078J12936L07632M2589
69B72062j24669r8086j17677j90052J0013J78694J36266Q5933J14265o7846k49025
80e0122j39949K3014k3627N4821K70745J74906j52362j46688K0752j09341k32930
91c10781N8914L07619J43279k7793J7207p5584k46858j15144J13235O2137J2667
102f1102J87809J86992j22531k46790q0121j7280n0963Q7423K13768J05996j7415
$$ plain form
113 185786 144884 2104 -208722 -235052 -87968 -15590 25693 193444 273028 75044 -128724
124 -128724 -137325 -154297 -205390 -34665 242558 247104 58487 4753 -3127 -160356 -261520
135 -261520 -111352 90941 166069 185435 148715 -4728 -148020 -168503 -152515 -103586 78059
146 78059 247030 187930 29026 -28783 -88654 -212739 -188138 18601 146205 139843 157055
157 157055 128293 -73684 -243633 -178811 -41327 15309 98293 207528 163957 -3033 -105982
168 -105982 -146351 -181753 -106754 86834 195453 152184 89413 18308 -123171 -215788 -140761
179 -140761 -5533 83259 159761 186282 74757 -79243 -133913 -140512 -144389 -35660 157245
190 157245 216105 109529 13054 -49140 -153895 -199132 -78291 76033 129202 142210 138559
$$ packed form
113A85786m0902j42780k10826k6330J47084P2378M1283J67751P9584j97984k03768
124a28724q601j6972n1093J70725K77223M546j88617n3734p880j57229j01164
135b61520J50168K02293P5128J9366l6720j53443j43292k0483J5988M8929J81645
146G8059J68971n9100j58904n7809n9871j24085K4601K06739J27604o362J7212
157A57055k8762k01977j69949O4822J37484N6636Q2984J09235m3571j66990j02949
168a05982m0369l5402P4999J93588J08619m3269o2771p1105j41479r2617P5027
179a40761J35228Q8792P6502K6521j11525j54000n4670o599l877J08729J92905
190A57245N8860j06576r6475o2194j04755m5237J20841J54324N3169J3008l651
$$ plain form
201 138559 30603 -132315 -188273 -127427 -42577 58869 163765 173961 74539 -35021 -118374
212 -118374 -175797 -138453 3495 120824 142196 128848 81072 -50744 -177568 -168501 -67269
223 -67269 22142 106224 175861 139724 2231 -107216 -139645 -135848 -79022 50656 158608
234 158608 157973 84168 -8819 -109954 -170420 -128560 -17600 83754 145556 150493 70025 -55518
246 -55518 -136518 -144675 -101264 -6006 112326 167218 119866 25972 -65445 -141352 -156689 -74479
258 -74479 49594 128503 142181 103648 10526 -101895 -157373 -124899 -37077 62426 138408 147584
270 147584 76978 -31605 -120182 -150294 -106809 -7832 92848 144214 128227 50120 -57150
281 -57150 -136831 -142906 -78317 20012 109900 148691 110957 15249 -84622 -140506 -128716 -54507
$$ packed form
201A38559j07956j62918n5958O0846Q4850J01446J04896J0196r9422j09560q3353
212a18374n7423L7344J41948J17329K1372j3348m7776j31816j26824R067J01232
223f7269Q9411Q4082O9637l6137j37493j09447l2429L797N6826J29678J07952
234A58608o35p3805r2987j01135o0466M1860J10960J01354O1802M937q0468j25543
246e5518q1000q157M3411R5258J18332N4892m7352r3894r1417p5907j5337Q2210
258g4479J24073P8909J3678l8533r3122j12421n5478L2474Q7822R9503P5982R176
270A47584p0606j08583q8577l0112M3485R8977J00680N1366j5987p8107j07270
281e7150p9681o075O4589R8329Q9888L8791l7734r5708r9871n5884J1790P4209
$$ plain form
293 -54507 48391 127718 143146 85270 -15752 -104829 -139642 -110619 -28981 74496 142087
304 142087 130652 53177 -40907 -114622 -140723 -94256 7328 100788 137021 111652 34551 -65805
316 -65805 -134269 -128763 -61743 29716 111846 141472 93082 -889 -86050 -131444 -120261 -41553
328 -41553 64630 127114 121972 69703 -16204 -108396 -142637 -92405 -3108 75011 126557 124026
340 124026 46337 -58996 -119959 -121187 -75978 10548 104418 136954 92949 14191 -66634 -127519
352 -127519 -123914 -46429 48610 108294 124335 85188 -9991 -100748 -126432 -93287 -29221 58651
364 58651 130723 123037 44754 -38115 -96838 -125946 -92024 5264 94094 120484 97125 36761
376 36761 -56033 -125980 -117192 -51154 24202 93134 129934 90909 -3672 -82069 -113890 -104699
$$ packed form
293e4507J02898P9327J5428n7876j01022q9077l4813K9023Q1638J03477O7591
304A42087j1435p7475r4084p3715k6101M6467J01584R3460L6233k5369p7101j00356
316f5805o8464N506O7020R1459Q2130K9626m8390r3971q5161m5394J1183P8708
328d1553J06183O2484n142n2269q5907r2192l4241N0232Q9297P8119N1546k531
340A24026p7689j05333o0963j228M5209Q6526R3870L2536m4005p8758q0825o0885
352a27519L605P7485R5039N9684J6041l9147r5179r0757k5684L3145O4066Q7872
364E8651P2072p686p8283q2869n8723k9108L3922R7288Q8830K6390k3359o0364
376C6761r2794o9947Q788O6038P5356O8932L6800l9025r4581p8397l1821R191
$$ plain form
388 -104699 -43428 54658 119298 111166 58428 -13014 -91535 -130168 -88531 -2908 68849 110910
400 110910 110654 46379 -50711 -109835 -108478 -68450 5474 91253 125791 84941 10912 -57633
412 -57633 -110101 -113736 -47420 44021 100408 109289 75610 -3137 -88904 -118885 -84880 -22191
424 -22191 50544 111161 112952 46486 -35928 -90581 -110042 -81150 -1002 81899 112893 89082
436 89082 30092 -48644 -109907 -107809 -48492 24293 83525 113143 83622 1858 -75151 -106468
448 -106468 -91606 -36756 43305 104981 105590 54586 -16610 -82181 -112224 -81593 -7300 64778
460 64778 103025 95766 39806 -40568 -97724 -102731 -61690 8175 80512 112389 80404 9623
472 9623 -57425 -97313 -95940 -45969 32537 94163 105441 63975 -8088 -75639 -103794 -81238
$$ packed form
388a04699O1271R8086O4640q132n2738p1442p8521l8633M1637Q5623P1757M2061
400A10910k56o4275r7090n9124J357M0028P3924Q5779L4538m0850p4029o8545
412e7633n2468l635O6316R1441N6387Q881l3679p8747q5767k9981L4005O2689
424b2191P2735O0617J791o6466q2414n4653j9461K8892Q0148Q2901L0994k3811
436H9082n8990p8736o1263K098N9317P2785N9232K9618k9521q1764p7009l1317
448a06468J4862N4850Q0061O1676O09n1004p1196o5571l0043L0631P4293P2078
460F4778L8247p259n5960q0374n7156n007M1041O9865P2337L1877l1985p0781
472I623o7048l9888J373M9971P8506O1626J1278m1466p2063o7551k8155K2556
$$ plain form
484 -81238 -20912 49003 98533 99745 46647 -30871 -89207 -100126 -64248 -102 66172 102004
496 102004 86574 25065 -48000 -95678 -95695 -49861 22360 84067 100648 66794 3544 -60037
508 -60037 -98140 -88624 -31516 42449 94051 95981 48710 -19799 -73505 -92708 -74308 -17736
520 -17736 58832 106105 87337 24174 -37938 -79477 -92482 -60727 9364 74153 96827 73598
532 73598 15415 -54572 -95313 -83898 -34652 26637 80503 97119 58539 -9565 -65856 -92669
544 -92669 -79646 -19665 55132 90515 76963 39273 -14266 -76344 -102413 -63875 7557 64590
556 64590 90199 75979 20374 -44998 -80669 -81775 -51757 13087 81732 97330 55316 -1251
568 -1251 -50512 -87271 -83229 -26776 41308 80218 84952 52037 -16719 -77111 -86711 -55964 -11610
$$ packed form
484h1238O0326O9915M9530J212n3098p7518n8336j0919L5878O4146O6274L5832
496A02004j5430o1509p3065m7678j7M5834P2221O1707J6581l3854o3250o3581
508f0037l8103R516N7108P3965N1602J930m7271o8509n3706j9203J8400N6572
520a7736P6568M7273j8768o3163o2112m1539j3005L1755P0091O4789K2674k3229
532G3598n8183o9987m0741J1415M9246O1289N3866J6616l8580o8104n6291k6813
544i2669J3023N9981P4797L5383j3552l7690n3539o2078k6069L8538P1432N7033
556F4590K5609j4220n5605o5372l5671j106L0018O4844O8645J5598m2014n6567
568a251m9261l6759M042N6453O8084L8910M734l2915o8756o0392r600L0747M4354
$$ plain form
581 -11610 44708 91022 83058 25498 -33561 -73223 -89608 -57406 18169 75502 78827 55939
593 55939 19750 -39885 -91192 -83555 -27346 30634 71309 85782 53294 -10292 -61000 -80630
605 -80630 -71258 -21657 51169 88442 69405 28874 -15725 -67167 -91178 -54485 8498 52538
617 52538 76843 77269 26404 -49559 -84923 -67710 -33822 10105 64821 88584 54765 -2078
629 -2078 -47461 -77873 -75639 -24619 40098 73448 73225 46457 -11239 -69892 -82722 -50388 -5926
642 -5926 41703 81456 74985 19756 -33284 -61712 -74985 -56538 8401 71756 80313 49817 10447
655 10447 -37898 -79793 -73831 -22788 28409 60805 75173 52320 -7325 -59954 -74917 -59068
667 -59068 -18317 40966 80272 68765 25624 -19945 -61146 -78123 -49175 7024 50684 69732
$$ packed form
581a1610N6318M6314p964n7560n9059l9662j6385L2202P5575N7333L325k2888
593E5939l6189n9635n1307P637N6209N7980M0675J4473l2488o3586n0708j9630
605h0630R372M9601P2826L7273j9037m0531m4599n1442k4011L6693O2983M4040
617E2538K4305M26n0865p5963l5364J7213L3888M3927N4716K3763l3819n6843
629b078m5383l0412K234N1020O4717L3350k23k6768n7696n8653j2830L2334M4462
642e926M7629L9753o471n5229n3040k8428j3273J8447O4939O3355Q557l0496l9370
655A0447m8345m1895N962N1043N1197L2396J4368k2853n9645n2629j4963J5849
667e9068M0751N9283L9306j1507m3141m5569m1201j6977K8948N6199M3660J9048
$$ plain form
679 69732 65127 22477 -40871 -74975 -64265 -32602 10476 62346 83448 48176 -8870 -46427
691 -46427 -64295 -63981 -26517 34648 71917 66671 35121 -10116 -57146 -76935 -53191 -2267 46707
704 46707 72526 60262 17915 -26663 -58058 -70088 -47398 11170 63546 71124 44175 9344
716 9344 -32305 -71097 -71205 -24305 31602 62054 63860 40677 -4943 -51272 -70036 -53556 -12408
729 -12408 35961 67553 65096 28774 -21336 -60919 -69921 -40891 6469 46192 64148 55734 17775
742 17775 -33302 -66507 -64020 -29820 17607 56778 66929 43472 894 -41225 -67113 -60147
754 -60147 -17607 34646 64632 58733 28774 -9961 -47172 -66944 -52995 -4811 47404 67839
766 67839 51163 17459 -21448 -57557 -67171 -35797 15003 50057 59828 48355 12092 -38728
$$ packed form
679F9732m605m2650o3348l4104J0710L1663M3078N1870K1102l5272n7046l7557
691d6427j7868L14L7464O1165L7269n246l1550m5237m7030j9789K3744N0924M8974
704D6707K5819j2264m2347m4578l1395j2030K2690N8568N2376P578k6949l4831
716I344m1649l8792j08M6900N5907L0452J806k3183m5620m6329j8764J6480M1148
729a2408M8369L1592k457l6322n0110l9583r002K9030M7360L9723J7956q414l7959
742A7775n1077l3205K487L4200M7427L9171J0151k3457m2578m2119k5888O966
754f0147M2540N2253K9986n899k9959l8735l7211j9772J3949M8184N2215K0435
766F7839j6676l3704l8907l6109r614L1374N0800L5054R771j1473l6263n0820
$$ plain form
778 -38728 -68050 -56200 -18258 22987 52816 61198 39771 -3285 -48305 -68532 -48920 -2881
790 -2881 36588 53390 53636 32929 -15044 -60892 -65632 -32930 5319 39549 62830 53359 9855
803 9855 -33419 -54237 -55524 -32839 15629 57236 60700 35959 1612 -37342 -63687 -51579 -11574
816 -11574 26669 52595 60065 33593 -17243 -52420 -55617 -39458 -6846 37612 63034 48493
828 48493 14858 -19030 -53263 -64604 -30695 19159 44125 49519 46191 14228 -39157 -65142
840 -65142 -46061 -15320 15412 49821 62471 32091 -11597 -39464 -54254 -49491 -9873 37777
852 37777 55235 46253 25406 -13115 -55485 -59761 -27113 4969 31361 58059 54325 7599 -36899
865 -36899 -48335 -45358 -31615 10847 55339 57261 28086 601 -30084 -59843 -51293 -6761 29435
$$ packed form
778c8728k9322J1850L7942M1245K9829Q382k1427m3056m5020k0227J9612M6039
790b881L9469J6802K46k0707m7973m5848m740L2702L8249L4230K3281r471m3504
803I855m3274k0818j287K2685M8468M1607L464k4741l4347l8954k6345J2108M0005
816a1574L8243K5926P470k6472n0836l5177l197J6159L2612M4458K5422j4541
828D8493l3635l3888l4233j1341L3909M9854K4966N394l328l1963n3385k5985
840f5142J9081L0741L0732L4409J2650l0380m3688k7867j4790M763L9618M7650
852C7777J7458q982k0847l8521m2370m276L2648L2082K6392K6698l734m6726m4498
865c6899j1436K977J3743M2462M4492J922k9175k7485l0685k9759Q550M4532L6196
$$ plain form
878 29435 44219 51138 34178 -14184 -51275 -49888 -32710 -8988 32142 62642 46344 6677
890 6677 -19466 -41758 -57763 -33768 18012 45716 43728 38145 14809 -34084 -61970 -42014 -10026
903 -10026 12998 42913 59896 31530 -15150 -38191 -44729 -44510 -12593 36860 54620 37664 19109
916 19109 -7369 -47128 -59581 -26688 10344 29801 48342 49701 9815 -36633 -46601 -37434 -26705
929 -26705 7048 50694 55519 24155 -3304 -25635 -51960 -49637 -6666 30992 40214 42295 32568
942 32568 -9814 -51153 -49120 -24075 -4237 25563 54708 45682 5988 -22000 -36936 -49675
954 -49675 -33513 14749 46855 41716 29097 11518 -27266 -57031 -40944 -6331 15004 36448
966 36448 53236 31748 -14865 -39481 -39515 -36093 -13793 31010 53858 36857 12255 -9680 -40027
$$ packed form
878B9435J4784O919j6960m8362l7091J387J7178K3722M1130L0500j6298l9667
890F677k6143k2292j6005K3995N1780K7704j988n583k3336m8893k7886J9956L1988
903a0026K3024K9915J6983k8366m6680k3041o538K19L1917M9453J7760j6956j8555
916A9109k6478l9759j2453L2893L7032J9457J8541J359l9886m6448r968R167J0729
929b6705L3753M3646M825l1364k7459k2331k6325K323M2971L7658R222K081r727
942C2568m2382m1339K033K5045J9838K9800K9145r026l9694k7988j4936j2739
954d9675J6162M8262L2106n139j2619j7579l8784k9765J6087L4613K1335K1444
966C6448J6788k1488m6613k4616l4L422K2300M4803K2848j7001k4602k1935l0347
$$ plain form
979 -40027 -53732 -25959 12202 29563 40015 43241 13330 -32666 -48361 -34419 -19033 6658
991 6658 42896 52218 23016 -6726 -24794 -43734 -44829 -9314 30444 40342 36036 25729 -6388
1004 -6388 -44450 -48387 -23368 337 23912 47478 42645 5714 -24876 -34692 -39566 -29206 8774
1017 8774 42728 42840 25241 6119 -24497 -50073 -39781 -5790 18544 33264 43756 28651
1029 28651 -11070 -38390 -38184 -29420 -10395 25407 48998 36968 9384 -12588 -34893 -46967
1041 -46967 -26334 11388 32456 36579 33767 10899 -25734 -44475 -34266 -15109 8467 37218
1053 37218 47653 23897 -8022 -27002 -38427 -37259 -9673 26552 40017 32683 19299 -6207
1065 -6207 -37550 -45164 -23475 3209 24193 40808 37879 8162 -23653 -36289 -35177 -21828 8278
$$ packed form
979d0027j3705K7773L8161J7361J0452L226k9911m5996j5695J3942J5386K5691
991F658L6238R322k9202k9742j8068j8940j095L5515L9758R898m306j0307l2117
1004f388l8062l937K5019K3705K3575K3566m833l6931l0590r816m874J0360L7980
1017H774L3954J12j7599j9122l0616k5576J0292L3991K4334J4720J0492j5105
1029B8651l9721k7320K06Q764J9025L5802K3591j2030k7584k1972k2305j2074
1041d6967K0633L7722K1068M123k812k2868l6633j8741J0209J9157K3576K8751
1053C7218J0435k3756l1919j8980j1425J168K7586L6225J3465p334j3384k5506
1065f207l1343p614K1689K6684K0984J6615k929k9717l1815j2636J112J3349L0106
$$ plain form
1078 8278 36524 40379 23871 2101 -22354 -42448 -37226 -8218 19085 34130 38105 23781 -8360
1091 -8360 -34937 -37506 -25473 -6013 21832 42247 34934 9664 -14522 -32433 -39958 -24606 7791
1104 7791 32152 37194 27776 6855 -21877 -39733 -33679 -12695 11522 32590 39275 23467 -4926
1117 -4926 -27266 -37034 -31807 -7657 22989 37474 31534 14758 -8280 -32105 -39954 -23604 3467
1130 3467 25233 36258 31439 8911 -19612 -35742 -33835 -17486 8676 32334 37425 22713 -211
1143 -211 -22595 -36604 -32297 -9171 17479 33525 34416 18901 -7634 -30764 -36701 -23830 -1706
1156 -1706 22237 36222 31064 10415 -14472 -32056 -35648 -20285 7119 29031 34429 24619 5010
1169 5010 -19575 -36116 -33001 -11386 14348 31349 32842 19572 -2656 -24968 -36212 -28376 -4482
$$ packed form
1078H278K8246L855j6508k1770k4455k0094N222K9008K7303J5045L975j4324l2141
1091h360k6577k569J2033J9460K7845K0415p313k5270k4186j7911p525J5352L2397
1104G791K4361N042r418k0921k8732j7856O054K0984K4217K1068O685j5808k8393
1117d926k2340r768N227K4150L0646J4485n940j6776k3038k3825p849J6350K7071
1130C467K1766J1025m819k2528k8523j6130J907J6349K6162K3658N091j4712k2924
1143b11k2384j4009M307K3126K6650J6046Q91j5515k6535k3130n937J2871K2124
1156a706K3943J3985n158k0649k4887j7584l592J5363K7404K1912N398r810j9609
1169E010k4585j6541L115K1615K5734J7001J493j3270k2228k2312j1244P836K3894
$$ plain form
1182 -4482 21425 33646 29735 13116 -10120 -30305 -34963 -20846 3271 24171 33461 28035 7733
1195 7733 -18807 -34283 -31127 -13214 9772 26730 32956 23557 191 -24458 -35378 -26812 -6245
1208 -6245 15651 29710 31063 17348 -6529 -28450 -35384 -22645 889 22297 31481 26483 9720
1221 9720 -12451 -30670 -33356 -17511 7448 26910 32237 22261 2274 -19360 -31986 -28628 -10157
1234 -10157 12548 28774 31326 18686 -4538 -26085 -32789 -22300 -2275 16475 29406 30305 14192
1247 14192 -12071 -31503 -31288 -15387 4584 20200 29487 26473 7441 -17848 -32879 -28789 -10281
1260 -10281 10406 25647 30180 20038 -988 -22022 -31578 -24764 -6748 15249 29753 29023 13213
1273 13213 -8735 -25241 -29125 -20144 -1685 19762 32107 26873 6381 -15844 -27936 -26624 -14448
$$ packed form
1182d482K5907J2221l911j6619k3236k0185m658J4117K4117K0900R290n426k0302
1195G733k6540j5476L156J7913K2986J6958O226r399k3366k4649j0920Q566K0567
1208f245K1896J4059J353j3715k3877k1921o934J2739K3534K1408R184m998j6763
1221I720k2171j8219k686J5845K4959J9462N327r976j9987k1634j2626L358J8471
1234a0157K2705J6226K552j2640k3224k1547o704J0489K0025J8750J2931Q99j6113
1247A4192k6263j9432K15J5901J9971J5616R287l014j9032k5289j5031M090J8508
1260a0281K0687J5241M533j0142k1026k1034r556O814J8016K1997J4504p30j5810
1273A3213k1948j6506l884Q981J8459K1447J2345n234k0492k2225j2092J312J2176
$$ plain form
1286 -14448 4468 22987 31229 22710 1637 -20749 -30867 -24241 -7087 11415 24822 28631 17968
1299 17968 -3986 -24657 -30823 -20267 -1820 16864 28129 25668 10319 -10156 -26056 -29006
1311 -29006 -16981 3418 22478 29656 21865 3299 -16611 -27336 -24305 -11957 6936 25589
1323 25589 31637 17705 -5319 -20947 -25753 -21657 -7429 13552 28716 27158 11688 -8536 -24217
1336 -24217 -27917 -17312 1197 17869 27284 24194 7280 -13848 -26694 -25901 -13606 6571 23977
1349 23977 27543 16988 897 -15645 -27747 -25907 -6974 13866 24675 25225 14373 -4732 -23118
1362 -23118 -26967 -18294 -2625 15163 28523 24757 6371 -11992 -22751 -25352 -16348 3064 21314
1375 21314 26661 19755 4028 -16209 -28030 -22718 -7346 8419 21424 27386 16796 -4268 -19897
$$ packed form
1286a4448J8916J8519Q242q519k1073k2386j0118O626J7154J8502J3407L809j0663
1299A7968k1954k0671o166J0556J8447J8684J1265k461j5349k0475j5900k950
1311b9006J2025K0399J9060P178p791j8566j9910j0725L031J2348J8893J8653
1323B5589O048j3932k3024j5628m806M096J4228K0981J5164j558j5470k0224j5681
1336b4217l700J0605J8509J6672R415l090j6914k1128j2846P93J2295K0177J7406
1349B3977L566j0555j6091j6542j2102J840J8933K0840J0809N50j0852j9105j8386
1362b3118l849Q673J5669J7788J3360l766j8386j8363j0759k601R004J9412J8250
1375B1314N347o906j5727k0237j1821N312J5372J5765J3005N962j0590k1064j5629
$$ plain form
1388 -19897 -24530 -20317 -6433 15186 27413 22007 8690 -5720 -21164 -28477 -17231 3819 18597
1401 18597 23916 20808 6677 -13826 -25215 -22408 -11731 4989 22731 27707 15549 -1511 -15553
1414 -15553 -25015 -23030 -6101 13789 22581 21708 14419 -3544 -22831 -26536 -14934 -537 13126
1427 13126 25543 24383 6196 -12738 -21020 -22556 -14999 3731 21642 24446 15841 3395 -12840
1440 -12840 -26162 -22767 -5982 9477 19773 24717 16187 -4727 -20519 -21910 -17064 -5812 13165
1453 13165 26436 21224 6456 -6248 -18864 -26218 -16340 4634 18049 21199 18800 6672 -13288
1466 -13288 -25095 -19721 -8564 4269 19359 25875 14999 -2753 -15159 -21690 -21201 -6264 13990
1479 13990 22141 19328 11504 -2872 -20546 -25252 -13651 1233 11940 22180 22802 6403 -13039
$$ packed form
1388a9897m633M213J3884K1619J2227n406j3317j4410j5444p313J1246K1050J4778
1401A8597N319l108j4131k0503j1389K807J0677J6720J7742M976j2158j7060j4042
1414a5553r462J985J6929J9890Q792q73p289j7963j9287l705J1602J4397J3663
1427A3126J2417j160j8187j8934q282j536P557J8730J7911K804q605j2446j6235
1440a2840j3322L395J6785J5459J0296M944q530k0914j5792j391M846J1252J8977
1453A3165J3271n212j4768j2704j2616p354R878K0974J3415L150k399j2128j9960
1466a3288j1807N374J1157J2833J5090O516j0876j7752j2406o531M89J4937K0254
1479A3990Q151k813p824j4376j7674m706J1601J4884J0707J0240O22j6399j9442
$$ plain form
1492 -13039 -20519 -19547 -13393 2829 20995 23945 13087 1333 -11169 -23073 -22056 -5724 10323
1505 10323 18181 21463 15053 -3054 -19597 -21781 -14792 -4217 11362 23995 20443 5624 -7139
1518 -7139 -17304 -22417 -15463 4095 17664 19483 16653 6780 -11464 -24114 -19379 -6185 5224
1531 5224 16703 23511 14813 -3188 -15260 -19388 -18343 -6356 12049 22010 18181 9111 -3358
1544 -3358 -17984 -23823 -13495 1804 12726 19968 20272 6267 -11824 -19718 -17946 -11081 2046
1557 2046 18109 22902 13758 428 -11632 -21326 -19500 -4826 10203 17329 18665 13389 -2094
1570 -2094 -18429 -21552 -13031 -2122 10425 21310 19873 6073 -8173 -17122 -20203 -12974 3166
1583 3166 17171 19601 14436 4180 -10735 -20990 -18125 -6131 5913 16131 21373 13916 -3627
$$ packed form
1492a3039p480R72O154J6222J8166K950j0858j1754j2502j1904J017J6332J6047
1505A0323P858L282o410j8107j6543k184O989J0575J5579J2633l552j4819j2763
1518g139j0165n113O954J9558J3569J819k830r873j8244j2650M735J3194J1409
1531E224J1479O808q698j8001j2072m128J045J1987J8405R961l829r070j2469
1544c358j4626n839J0328J5299J0922P242L04j4005j8091p894J772O865J3127
1557B046J6063M793r144j3330j2060r694J826J4674J5029P126J336n276j5483
1570b094j6335l123Q521J0909J2547J0885j437j3800j4246q949l081P229J6140
1583C166J4005K430n165j0256j4915j0255K865J1994J2044J0218N242p457j7543
$$ plain form
1596 -3627 -15601 -18422 -15220 -5277 10046 20274 18318 7903 -5019 -16760 -20978 -12231 1636
1609 1636 12807 18739 17254 5474 -10359 -19460 -17379 -8651 3468 15998 20415 13185 -69
1622 -69 -11492 -19064 -17885 -5688 9326 17938 18073 10404 -3004 -15930 -19521 -12800 -1593 10880
1636 10880 19511 17686 5569 -8693 -16317 -17599 -11006 2007 14663 19636 14107 2256 -11147
1649 -11147 -18612 -16690 -6733 5641 16078 19150 11987 -1751 -14097 -18637 -14536 -3151 10051
1662 10051 18189 16688 7674 -5113 -15214 -18589 -12039 897 12819 18374 14805 4415 -8741
1675 -8741 -16678 -17515 -8570 4320 15458 18101 11969 155 -11874 -17914 -14616 -5088 7167 16669
1689 16669 18004 9257 -4483 -14528 -17364 -12777 -1371 10968 18211 15434 5483 -6940 -16313
$$ packed form
1596c627j1974k821L202R943J5323J0228j956j0415j2922j1741m218Q747J3867
1609A636J1171N932j485j1780j5833r101K081Q728J2119J2530M417p230j3254
1622f9j1423p572J179J2197J5014Q612J35p669j3408j2926l591O721J1207J2473
1636A0880Q631j825j2117j4262p624j282O593J3013J2656M973n529j1851j3403
1649a1147p465J922R957J2374J0437L072p163j3738j2346m540M101J1385J3202
1662A0051Q138j501r014j2787j0101l375O550J2936J1922N555l569j0390j3156
1675h741p937q37Q945J2890J1138K643o132j1814j2029o040L298R528J2255R502
1689A6669J335q747j3740j0045k836M587J1406J2339P243k777r951j2423r373
$$ plain form
1702 -16313 -17099 -9169 2953 12979 17683 13530 1847 -10935 -16986 -15093 -6159 5821 16082
1715 16082 17034 9431 -1748 -12083 -17625 -14270 -2022 10666 16388 14990 7382 -5159 -15494
1728 -15494 -17011 -9899 762 11718 18168 13892 2394 -8936 -14995 -15541 -8378 4745 15165
1741 15165 16445 10595 427 -11330 -17622 -13118 -2939 7019 14786 16839 8694 -4762 -14044 -15384
1755 -15384 -11486 -1698 11005 17035 13139 4103 -6152 -15076 -17087 -8370 3968 12406 15252 12294
1769 12294 1993 -10783 -16681 -13228 -5616 5261 15442 16580 8016 -2717 -10622 -15833 -13314
1782 -13314 -2382 10621 15494 13611 6698 -5004 -15349 -15543 -7910 1114 9924 16542 13542 1777
1796 1777 -9520 -14083 -13534 -7134 4741 14614 15129 9150 273 -10117 -17105 -13066 -1713 7632
$$ packed form
1702a6313p86P930J2122J0026M704m153j1683j2782o051J893Q934J1980J0261
1715A6082R52p603j1179j0335n542L355J2248J2688N722j398p608j2541j0335
1728a5494j517P112J0661J0956O450m276j1498j1330o059n46P163J3123J0420
1741A5165J280n850j0168j1757o292M504J0179R958P767K053q145j3456r282j340
1755a5384L898R788J2703O030l896r036j0255q924k011Q717J2338Q438K846k958
1769A2294j0301j2776n898L453P612J0877J0181J138q564j0733p905n211K519
1782a3314J0932J3003M873j883o913j1702j0345j94P633R024Q810O618l000j1765
1796A777j1297m563N49O400J1875R873N15n979q877j0390o988M039J1353R345
$$ plain form
1810 7632 13375 14374 8141 -4451 -13570 -14602 -10097 -1280 10537 16822 12191 2905 -5743 -13513 -15682
1825 -15682 -7961 4582 12231 13880 11275 1729 -10519 -16003 -11576 -4017 4582 13304 15888 8096
1839 8096 -4022 -11022 -13998 -11447 -2137 9349 14311 12143 5497 -4309 -13953 -15215 -7310 1834
1853 1834 9587 14765 12527 1925 -9121 -13503 -12305 -6564 4135 13753 14749 7614 -873 -9275
1867 -9275 -15131 -12152 -2011 7902 12724 13401 7172 -4289 -13116 -13408 -8563 -658 9098 15361 12061
1882 12061 2191 -6927 -12735 -13375 -7098 3855 11787 13372 9808 1324 -9381 -14612 -11066 -3180
1896 -3180 4953 12301 14958 7446 -3982 -10995 -12983 -10129 -1959 8758 14676 11716 3976 -4789
1910 -4789 -12211 -13665 -7294 1863 9912 13983 10590 1539 -8754 -12693 -11270 -5483 4318 12632 13771
$$ packed form
1810G632N743R99o233j2592r119j032M505Q817J1817O285m631r286q648p770k169
1825a5682P721J2543P649J649k605r546j2248n484M427P559Q599Q722K584p792
1839H096j2118p000k976K551R310J1486M962k168o646r806r644j262P905R144
1853A834P753N178k238j0602j1046m382J198N741J0699R618R96p135q487q402
1867i275n856K979J0141R913M822O77o229j1461q827k92M845P905R756O263l300
1882A2061r870r118n808o40O277J0953P932J585l564q484j0705n231L546P886
1896c180Q133P348K657p512j1428p013j988K854Q170J0717N918k960p740q765
1910d789p422j454O371R157Q049M071l393r051j0293l939J423N787R801Q314J139
$$ plain form
1925 13771 7053 -1650 -8592 -13404 -11298 -1946 7980 12503 11710 5628 -4192 -11925 -12807 -7868 396
1940 396 9362 13807 10555 1814 -6628 -11411 -12343 -6420 3419 11561 13172 8290 -93 -8689 -13109
1955 -13109 -10724 -2712 5522 12146 12729 6618 -3062 -10338 -12455 -9317 -1124 8363 13291 10532 3369
1970 3369 -4765 -11227 -12965 -7130 2421 10181 12261 9095 1474 -7026 -12443 -11422 -4688 4461 11660
1985 11660 12383 6825 -1509 -8786 -12354 -10037 -1958 6961 12026 10698 5275 -3367 -10839 -12430 -7403
2000 -7403 1000 8505 12087 9838 2584 -6422 -11651 -11422 -5317 3231 9908 11794 7805 493 -7855
2015 -7855 -11992 -10572 -3025 5497 11555 11186 5483 -2456 -9487 -11991 -8218 -708 7593 11802 10193
2030 10193 3513 -4783 -11079 -11533 -6244 1885 9294 11703 8454 1031 -6895 -11549 -10508 -3756 4122
$$ packed form
1925A3771o718q703o942m812K106R352R926M523p93o082r820p733q82M939Q264
1940C96Q966M445l252q741q442m783r32N923R839Q142J611m882q383q596m420
1955a3109K385Q012Q234O624N83o111r680p276k117L138Q193R487M928k759p163
1970C369q134o462j738N835R551P760K080l166p621q500n417J021O734R149P199
1985A1660P23n558q334p277l568K317Q079Q919N065j328n423q642p472j591N027
2000g403Q403P505L582k249p254r006n229K29O105Q548O677J886l989p312q348
2015g855m137J420P547Q522O058l69n703p939p031k504L773P510Q301M209j609
2030A0193o680q296o296m54N289Q129P409K409l249p423p926m654J041O752P878
$$ plain form
2045 4122 9766 11320 6888 -994 -8753 -11915 -8645 -1246 6273 11061 10258 4398 -3668 -9958 -11281
2060 -11281 -7300 373 7957 11535 9440 2013 -5900 -10893 -10181 -4846 2985 9161 11305 7589 -414
2075 -414 -7752 -11286 -9076 -3154 4854 10621 10624 5378 -2429 -8678 -11003 -7690 91 7077 10659 9223
2091 9223 3220 -4322 -10179 -11046 -6392 1539 8294 10991 7779 912 -6303 -10327 -9628 -3851 3815
2106 3815 9815 10450 6400 -1136 -8143 -10641 -8165 -1777 5384 10429 9791 4238 -3598 -9168 -10367
2121 -10367 -6006 533 7249 10289 8518 2085 -5140 -10099 -10021 -4703 3026 8828 10421 6816 22
2136 22 -6884 -10350 -8703 -2894 4960 10044 9526 4781 -1955 -8270 -10193 -7621 -633 6718 10427 8778
2152 8778 2505 -4578 -9468 -9530 -5367 1796 7684 9877 7364 1191 -6146 -10078 -8679 -2992 3735
$$ packed form
2045D122N644J554m432p882p759l162L270P399P519M788q03n860q066o290j323
2060a1281L981P673P584L578k095p427p913m993P12N335P831O176K144l716q003
2075d14p338l534K210N922Q008N767Ln246p807o249k325L313P781O986L582j436
2091I223o003p542n857q67M654P931O755K697l212o867p215m024O99N777P666
2106C815O000O35m050p536p007k498K476O388P161N045o38n553p836n570j199
2121a0367M361O539O716L040j771o433p225m959P8N318P729N802J593l605o794
2136B2o906l466J647N809P854N084n18m745o736o315j923K572O988P351L709j649
2152H778o273p083m890o2M163P163N888K193k513o173p337l932J399N687O727
$$ plain form
2167 3735 8598 9474 6048 -1246 -7780 -10136 -7401 -1490 5869 9639 8456 3811 -3522 -8736 -10056
2182 -10056 -6245 1049 7256 9894 7791 2062 -5290 -9249 -8530 -4464 2213 8350 10182 6184 -664
2197 -664 -6700 -9094 -7940 -2692 4491 8943 9088 4619 -1936 -8318 -9824 -6129 -307 5693 9461
2212 9461 8246 2401 -4239 -8677 -8975 -5272 1894 7862 9170 6415 577 -5304 -9383 -8559 -2629
2227 -2629 3431 8220 9257 5344 -1722 -7504 -8830 -6951 -1930 4981 9533 8052 2778 -2881 -7536
2242 -7536 -9043 -5918 1054 6602 9040 7443 2037 -4678 -8989 -8015 -3927 1987 7585 9800 5591
2257 5591 -997 -5619 -8434 -7709 -2486 4797 8667 7707 3961 -1692 -7295 -9156 -5720 83 5290
2272 5290 8752 8155 2201 -4260 -7764 -7938 -5237 1220 7628 9229 5419 386 -4571 -8684 -8148 -3077
$$ packed form
2167C735M863Q76l426p294o534k356K735N911P359L770j183m645p333n214j320
2182a0056L811P294O207K638k103n729p352l959P19M066O677O137J832l998o848
2197f64o036k394J154N248P183M452J45m469o555o382j506L695N822O000L768
2212I461j215n845o640m438k98L703P166N968J308k755n838n881m079Q24N930
2227b629O060M789J037l913p066n782j326J879N021O911M552j481n274n659m655
2242g536j507L125O972N548K438j597n406o715m311R74M088N914N598K215m209
2257E591o588m622k815P25N223P283L870r60l746n653n603j861L436N803N207
2272E290L462n97n954o461l504j74K701O457O408J601l810n033m957m113N36N071
$$ plain form
2288 -3077 3694 7511 8313 5686 -1112 -6627 -8451 -5983 -1692 4630 9009 8081 2519 -2752 -6316
2303 -6316 -8797 -5954 863 6529 7776 6392 1968 -4721 -8734 -7617 -2904 1947 6898 8991 5274
2318 5274 -1048 -5561 -7535 -7203 -2724 4388 8650 7477 3803 -1099 -6489 -9088 -5607 308 5299
2333 5299 7835 7464 2657 -3915 -7409 -7434 -4685 1072 7118 8891 5195 324 -3708 -7784 -8119 -2587
2349 -2587 3969 6894 7341 4876 -658 -6461 -8164 -5271 -1484 3784 8209 7674 2380 -2598 -5957
2364 -5957 -7818 -5668 780 6309 7603 5821 2201 -3706 -8394 -7481 -2361 2250 5829 7982 5259
2379 5259 -398 -5526 -7300 -6288 -2701 4018 7870 6567 3254 -949 -5967 -8529 -5581 770 4871
2394 4871 6589 6654 2425 -3452 -7047 -6570 -3537 627 6253 8220 5006 91 -4110 -7236 -7037 -2426
$$ packed form
2288c077O771L817Q02k627o798n515j824K468M291O322M379r28n562n271l564
2303f316k481K843O817N666J247j384m424o689m013J117M713M851M951K093l717
2318E274o322m513j974L32M479P112M262j173l674m902n390k599L481N915M991
2333E299K536l71m807o572l494k5K749N757O046J773l696m871m032m076l35N532
2349b587O556K925M47k465n534n803j703K893L787N268M425n35n294m978l359
2364e957j861K150O448N529J294j782l620n907m688R13N120M611L579K153k723
2379E259n657n128j774J012L587O719L852j303l313m203n018k562K948O351M101
2394D871J718O5m229n877l595M77L033M164N626J967l214m915m201l126J99M611
$$ plain form
2410 -2426 3188 6510 6680 4476 -291 -6109 -7702 -4798 -596 3357 6875 7337 2563 -2851 -6092
2425 -6092 -6918 -4525 955 5946 6988 4858 1522 -3127 -7379 -7208 -2344 2473 5672 6962 5083
2440 5083 -236 -5319 -6698 -5627 -1998 3132 7325 6821 2616 -1475 -5361 -7203 -5216 130 4737
2455 4737 6363 6117 2374 -3271 -7114 -6090 -2925 1135 5160 7457 5197 309 -4242 -6882 -6133
2470 -6133 -1985 3436 6497 6027 3884 -274 -5453 -7447 -4785 -508 3741 6435 6077 2407 -2330
2485 -2330 -5807 -6336 -4144 215 5465 7020 4798 928 -3295 -6242 -5923 -2568 2482 5318 6762
2500 6762 5027 -342 -4954 -6567 -4912 -1517 2710 6525 6169 2935 -1775 -5216 -6665 -4268 218
2515 218 4674 6239 5098 1938 -2677 -6375 -6133 -2619 1411 5184 6392 4476 -76 -4147 -6276
$$ packed form
2410b426N614L322J70k204m767n818j593K904M202L953L518M62m774n414l241
2425f092q26K393N480M991J042k130l336m649m252J71M864M817L199J290j879
2440E083n319n083j379J071L629N130M193n04m205m091l886j842J987N346M607
2455D737J626k46l743n645l843J024L165M060M025K297k260m888m551k640P49
2470f133M148N421L061m70k143m158n179j994K662M277M249K694l58l670m737
2485b330l477n29K192M359N250J555k222l870m223k947L19L355N050K836J444
2500F762j735n369m612j613J655L395M227L815l56l234m710l441j449K397M486
2515B18M456J565j141l160m615l698K42L514M030L773J208j916m552m071k129
$$ plain form
2530 -6276 -5920 -2399 2651 6009 5988 3218 -922 -4685 -6017 -4585 -370 3697 6212 5915 2067 -2519
2546 -2519 -5936 -5472 -3449 673 4775 6313 4433 824 -3585 -6073 -5667 -2221 2263 5129 5520 3719
2562 3719 -279 -4476 -6441 -4761 -899 3222 5772 5073 2423 -1438 -4980 -6103 -4189 208 4145
2577 4145 6020 4946 1360 -2490 -5445 -5776 -2918 1360 4795 6065 4085 -231 -4006 -5614 -4937
2592 -4937 -1833 2449 5476 5916 3220 -1205 -4764 -5702 -4100 -561 3445 5342 4958 1900 -2121 -5570
2608 -5570 -5774 -3242 947 4223 5763 4158 639 -3230 -5643 -5023 -2018 1858 5038 5409 3264 -603
2624 -603 -4148 -5521 -4256 -672 2870 5300 4907 2582 -1604 -4763 -5586 -3351 211 3502 5654 4568
2640 4568 1240 -2811 -5219 -4912 -2342 1232 4591 5642 3561 -145 -3282 -5291 -4424 -1385 2304
$$ packed form
2530f276L56L521N050L358k1k770m140l763j332J432M215M067K515k97l848m586
2546b519l417M64K023M122M102J538j880l609m409k488M06L446M484K866L91j801
2562C719l998m197j965J680L862M121K550o99k650l861l542j123J914M397L937
2577D145J875j074l586l850k955l31K858M278L435J270j980m316l775j608O77
2592d937L104M282L027M40k696m425l559r38J602L539M006J897l84l058m021l449
2608e570k04K532M189L276J540j605l519l869k413O20L005L876L180L71k145l867
2624f03l545j373J265L584L542K430l93k325m186l159q23K235L562L291K152j086
2640D568l328m051k408L07K570L574L359J051k081l706l137k009Q67L039L689
$$ plain form
2655 2304 5149 5237 2810 -1064 -4314 -5355 -3586 110 3194 5351 4693 1366 -2204 -4706 -5015 -2852
2671 -2852 784 3940 5340 3752 869 -3127 -4871 -4363 -1706 1666 4425 5417 3177 -418 -3762
2686 -3762 -5302 -4281 -1141 2718 5288 4565 1760 -1452 -4623 -5097 -3120 435 3248 4889 3884
2701 3884 909 -2672 -4624 -4476 -2389 1306 4216 5221 3375 -45 -3107 -4821 -4441 -1365 2225
2716 2225 4742 4480 2290 -1060 -4012 -5050 -3280 -166 3211 4909 4089 1141 -2064 -4268 -4318 -2836
2732 -2836 700 4126 4688 3131 511 -2955 -4685 -4002 -1650 1760 4433 4855 2847 -592 -3591 -4734
2748 -4734 -3878 -519 2750 4612 4042 1696 -1482 -4059 -4584 -2836 418 3540 4899 3402 948 -2364
2764 -2364 -4502 -4478 -1678 1516 4205 4337 2851 -266 -3160 -4466 -3761 -988 2254 4297 4348 2063
$$ packed form
2655B304K845Q8k427l874l250j041J769L696L084K157o58l327l570k502l09K163
2671b852L636L156J400j588k883l996j744N08K657L372K759R92k240l595l344
2686c762j540J021L140L859K570p23k805l212l171m74J977L555K813J641j005
2701C884k975l581j952J48K087L695K910J005j846l420l062j714L80L076L590
2716B225K517k62k190l350k952j038J770L114L377J698q20k948l205k204n0J482
2732b836L536L426N62j557k620l466j730O83K352L410K673M22k008l439k999j143
2748d734Q56L359L269J862n70k346l178k577n25J748L254L122J359j497k454l312
2764b364k138K4K800L194K689J32j486l117k894j306P05K773L242K043N1k285
$$ plain form
2780 2063 -915 -4006 -4478 -2862 -36 3025 4173 3821 1378 -1868 -4149 -4397 -2145 1073 3171 4185
2796 4185 3253 418 -2447 -4468 -4433 -1580 1841 4128 4028 2733 -700 -3199 -4296 -3340 -451 2498
2812 2498 4391 3879 1825 -1586 -3783 -4210 -2530 398 2931 4538 3266 671 -2247 -3829 -3814 -1649
2828 -1649 1473 3598 4049 2843 38 -3036 -4324 -3329 -926 1861 4052 3773 2455 -1002 -3812 -4247
2844 -4247 -2793 -58 3086 3936 3271 1256 -1696 -3757 -3879 -2028 767 3262 4246 3005 69 -2544
2860 -2544 -3934 -3702 -1315 1496 3697 3599 2652 -685 -3248 -3887 -3055 -352 2385 3921 3354 1738 -1476
2877 -1476 -3975 -3890 -1984 63 2978 3684 3174 525 -2235 -3622 -3921 -1639 1247 3573 3603 2312 68
2894 68 -2710 -3768 -3069 -809 1920 3814 3810 1859 -1239 -3223 -3659 -3030 -169 2348 4009 2815 882
$$ packed form
2780B063k978l091m72J616K826L061J148l52k443l246k281k48K252L218K098J014
2796D185r32k835k865k021L5K853L421K287j00j295l433k499j097R56K889K949
2812B498J893n12k054l411k197m27J680K928K533J607j272k595k918j582J5K165
2828a649L122K125M51j206k805l074j288R95K403K787K191k79j318l457k810m35
2844d247J454K735L144Q50o65k015k952k061j22J851K795K495R84j241k936k613
2860b544j390K32K387K811K201r8r47l337k563o39Q32K703K737J536n67j616l214
2877a476k499Q5J906K047K915P06n10k649k760j387k99K282K886K326L0j291k244
2894F8k778j058O99K260K729J894mj951l098j984m36O29K861K517J661j194j933
$$ plain form
2911 882 -1858 -3495 -3814 -1803 459 2724 3791 2823 128 -2498 -3607 -2765 -1204 1188 3489 3921
2927 3921 1834 -838 -3105 -3829 -2625 -460 2603 3561 2999 1174 -1230 -3220 -3637 -2273 523 2739
2943 2739 3626 2807 497 -2277 -3395 -3579 -1408 1496 3558 3413 2229 -428 -2536 -3799 -2843 -605
2959 -605 1809 3255 3467 1383 -1118 -3239 -3347 -2108 -56 2399 3646 2766 723 -1801 -3216 -3670
2975 -3670 -1795 1054 2793 3475 2438 -116 -2453 -3371 -2748 -1021 1362 2962 3144 1634 -659 -2406
2991 -2406 -3544 -2748 -209 2120 3255 3026 1036 -1195 -3337 -3281 -1824 665 2449 3436 2603 102
3007 102 -2018 -3313 -2753 -1221 1442 3127 3342 1890 -471 -2213 -3581 -2660 -99 1837 3155 3108
3023 3108 1393 -1143 -3303 -3222 -2080 334 2238 3105 2517 877 -1783 -3094 -2886 -1509 959 2709
$$ packed form
2911H82k740j637l19K011K262K265J067r68k695k626j109Q42J561K392K301M32
2927C921k087k672k267p24J204K165L063R58n62j825k404j990m17J364K796K216
2943B739Q87q19k310k774j118j84K171K904K062j45j184k657k108j263R56K238
2959f05K414J446K12k084k501k121j08J239K052K455J247q80k043k524j415m54
2975c670J875K849J739O82j037k554k337r18O23J727K383J600J82j510k293j747
2991b406j138P96K539K329J135k29j990k231k142N6J457K489J784R87q33k501
3007A02k120j295N60J532K663J685K15j452k361j742j368R21K561J936J318m7
3023C108j715k536k160Q1J142K414J904Q67n88j640k660j311K08J377K468J750
$$ plain form
3039 2709 3134 1989 -118 -2353 -3119 -2321 -640 1666 3005 2958 1792 -914 -2539 -3343 -2201 -257
3055 -257 1894 3165 2922 1231 -1496 -2757 -2886 -1300 692 2180 3125 2534 56 -2208 -2934 -2431 -944
3072 -944 1381 2672 3042 2057 -457 -2316 -3251 -2091 -3 1771 3044 2855 870 -973 -2423 -3387
3088 -3387 -1618 183 2143 2949 2382 606 -1818 -2856 -2800 -1288 578 2434 3002 2120 -12 -2194
3104 -2194 -3083 -2241 -647 1731 2915 2922 1595 -616 -2631 -2973 -1722 -85 1651 2717 2332 734 -1464
3121 -1464 -2610 -2582 -1320 397 2352 3011 1833 224 -1850 -2992 -2383 -892 1343 2316 2648 1772 -427
3138 -427 -2238 -2884 -1841 -302 1385 2989 2616 1010 -1044 -2334 -2883 -1583 616 2091 2822 1774
3154 1774 473 -1259 -2842 -2562 -1106 881 2158 2848 1690 -121 -2004 -2624 -2154 -759 1775 2842
$$ packed form
3039B709M25j145k107k235p66P98J681K306J339m7j166k706j625q04J142J944
3055b57K151J271k43j691k727j261j29J586J992J488R45n91k478k264p26N03J487
3072i44K325J291L70r85k514j859r35J160K088J774J273j89j985j843j450r64
3088c387J769J801J960Q06n67j776k424j038N6J512J866J856N68q82k132k182
3104b194q89Q42J594K378J184Pj327k211k015l42J251J637J736J066l85j598k198
3121a464j146K8J262J717J955O59j178j609k074j142O09J491K235R73L32q76k199
3138d27j811o46J043J539J687J604l73j606k054j290n49J300K199J475P31j048
3154A774j301j732j583K80J456J987J277O90j158j811j883o20M70J395K534J067
$$ plain form
3170 2842 2659 1136 -848 -2322 -2789 -2096 -49 2089 2741 2631 620 -1197 -2523 -2120 -1332 533 2254
3187 2254 2932 1909 -97 -1409 -2690 -2174 -709 991 2303 2749 1376 -278 -1914 -2814 -1889 -349
3203 -349 1460 2593 2358 752 -1040 -2009 -2477 -1672 504 2001 2422 2034 655 -1454 -2684 -2357 -813
3220 -813 948 1791 2776 1746 -162 -1799 -2666 -1770 -548 1114 2814 2627 1031 -576 -1874 -2645 -1718
3237 -1718 157 1665 2554 1877 423 -1111 -2244 -2069 -1199 476 1991 2624 1668 34 -1495 -2715
3253 -2715 -2257 -706 779 2284 2225 1177 -304 -2176 -2044 -1776 -507 1625 2018 2203 584 -774 -2239
3270 -2239 -2065 -986 407 1986 2649 1861 475 -1030 -2118 -2091 -939 883 1982 2228 1348 -371 -1717
3287 -1717 -2481 -1854 -385 970 2423 2110 1044 -475 -1704 -2366 -1342 -16 1512 2300 1918 389
$$ packed form
3170B842j83j523j984j474m67O93K047K138O52j10k011j817j326M03P88J865J721
3187B254O78j023k006j312j281N16J465J700J312M46j373j654j636r00R25J540
3203c49J809J133k35j606j792r69m68Q05K176J497M21l88j379k109j230L27J544
3220h13J761Q43R85j030j908j637q67Q96J222J662J700j87j596j607j298p71R27
3237a718J875J508Q89o77j454j534j133J75Q70J675J515O33r56j634j529j220
3253b715M58J551J485J505n9j048j481j872J32K68J269K132L93J85j619j358j465
3270b239J74J079J393J579O63p88j386j505j088K7J152J822J099K46q80j719j346
3287a717p64O27J469J355J453l13j066j519j229o62J024J326J528P88l82j529
$$ plain form
3303 389 -1008 -2254 -2117 -737 441 1844 2408 1337 -234 -1380 -2229 -1904 -660 1040 2153 1849
3319 1849 1187 -396 -1811 -2471 -1520 -337 1240 2154 1862 923 -716 -2106 -2105 -1131 268 1700 2254 1414
3337 1414 381 -1423 -1987 -1945 -863 887 1693 2073 1268 -5 -1655 -2160 -1545 -360 1063 2258 1909
3354 1909 942 -435 -1775 -2081 -1160 396 1438 2006 1786 439 -1137 -1845 -2155 -729 713 1563 2358
3371 2358 1387 -206 -1051 -2192 -1585 -662 979 1917 1828 974 -343 -1383 -2243 -1386 49 1287 1937 1642
3389 1642 684 -1022 -1953 -1886 -1164 328 1699 2005 1510 80 -1110 -1819 -2170 -706 856 1539 1737 1307
3407 1307 -158 -1555 -2189 -1512 -390 1280 1851 1888 811 -446 -1690 -2035 -1225 -84 1663 1813 1362
3424 1362 17 -1129 -1770 -1953 -920 497 1324 1981 1193 -220 -1128 -1995 -1753 -522 809 1782 1928
$$ packed form
3303C89j397j246J37J380J178J403N64j071j571j146q49L25J244J700J113l04
3319A849o62j583j415o60R51J183J577R14k92r39j639j390JR74J399J432N54q40
3337A414j033j804n64M2J082J750Q06L80q05j273j650n05O15J185J423J195l49
3354A909r67j377j340l06R21J556J042N68k20j347j576p08l10J426J442Q50P95
3371B358r71j593q45j141O07R23J641R38q9q54j317j040q60Q57J435J238O50k95
3389A642r58j706r31O7P22J492J371L06m95j430j190p09l51J464J562O83J98m30
3407A307j465j397o34O77J122J670N71L7j077j257j244l45Q10J141J747J50m51
3424A362j345j146o41j83J033J417Q27O57p88j413r08q67K42J231J331R73J46
$$ plain form
3441 1928 962 -350 -1379 -2061 -1285 169 1741 1968 1481 447 -733 -1875 -1909 -937 436 1351 1944
3458 1944 1688 208 -1104 -1963 -1683 -607 708 1333 1846 1053 -240 -1745 -1630 -1345 -282 929 1522
3475 1522 1724 918 -748 -1549 -1782 -1214 73 1290 1954 1233 504 -981 -1737 -1751 -715 591 1469 1901
3493 1901 1130 -68 -994 -1791 -1473 -196 1083 1640 1587 739 -132 -1605 -1668 -1130 -29 1055 1746 1302
3511 1302 539 -959 -1283 -1518 -743 104 1215 1650 1083 42 -945 -1652 -1632 -477 387 1580 1698 753
3529 753 -53 -1221 -1663 -1122 -5 928 1640 1621 550 -533 -1031 -1576 -1149 303 1113 1656 1504 254
3547 254 -936 -2134 -1401 -575 435 1260 1724 1088 -101 -1202 -1834 -1508 -450 945 1269 1799 853 -402
3565 -402 -1090 -1391 -1288 -72 958 1453 1338 270 -731 -1329 -1301 -832 356 1333 1487 1137 352 -933
$$ packed form
3441A928r66j312j029o82P76J454J572K27m87j034j180j142l4R72J373R15N93
3458A944k56j480j312q59K80J076J315O25N13p93j293j505J15K85J063J211N93
3475A522K02q06j666q01k33N68J287J217O64p21p29j485p56j4J036J306Q78M32
3493A901p71j198r26p97L18J277J279N57n3q48q71j473o3N38J101J084O91m44
3511A302p63j498l24k35P75Q47J111M35n67j041r87p07K0J155Q64J193J18r45
3529G53q06j168m42N41J117R33P12j9j071j083m98n45M27J452Q10N43j52j250
3547B54j190j198P33Q26J010Q25M64o36j189j101o32L26J058J395L24N30r46j255
3565d02o88l01J03J216J030M95j15j068j001n98K8M69J188R77J54l50p85j285
$$ plain form
3583 -933 -1590 -1238 -639 646 1354 1387 1022 -77 -1407 -1683 -1097 -186 809 1594 1384 784 -323 -1282 -1419
3602 -1419 -1052 133 865 1742 1195 500 -723 -1386 -1558 -557 453 1407 1393 1175 116 -1063 -1426 -1313
3620 -1313 -233 630 1352 1394 726 -268 -831 -1722 -1038 86 1085 1591 1361 295 -579 -1124 -1086 -748 255
3639 255 1066 1479 1299 168 -730 -1119 -1237 -425 252 1300 1115 940 -170 -1220 -1270 -845 -92 631 1447
3658 1447 1352 682 -493 -1347 -1414 -712 268 1184 1450 969 267 -574 -1260 -1232 -577 611 1090 1437 1076 56
3678 56 -997 -1589 -1010 -593 302 965 1571 735 -287 -1210 -1099 -966 -311 823 1032 1254 306 -356 -1454
3697 -1454 -1568 -726 347 1005 1353 909 412 -628 -1268 -1000 -620 231 1307 1386 702 190 -918 -1208 -1347
3716 -1347 -447 466 1369 1291 538 -355 -1092 -1159 -564 175 870 1342 909 74 -619 -1233 -1439 -380 278 1203
$$ packed form
3583i33o57L52N99J285P08L3l65j099j330k76N86R11R95P85k10o00j107r59j37
3602a419L67J185P32Q77n47o95j223o63j72J001J010R54j4k18j059j179l63J13
3620a313J080Q63P22M2o68r94n63q91O84J124R99N06k30j066q74n45L8L38J003
3639B55Q11M13j80j131q98l89j18Q12O77J048j85j75j110j050n0M25P53P23Q16
3658A447r5o70j175q54o7P02R80R16K66m81p02q41o86K8O55J188M79L47l61j020
3678E6j053n92N79M17Q95O63O06q36j022r23J11J33O55J134K09K22r48o62j098
3697a454j14Q42J073O58L48m44m97j040o40K68L80Q51J076P9o84n12j108k90j39
3716a347R00R13R03p8p53q93p37o7N95P39O95M72m33q35o93o14k06J059O58R25
$$ plain form
3736 1203 1290 870 -16 -793 -1438 -1101 -53 607 982 1266 399 -408 -1005 -1319 -895 -197 647 1305 841 315
3756 315 -410 -1102 -1050 -536 261 1095 1286 777 150 -644 -988 -1060 -492 401 1006 1021 781 -104 -1022 -1105 -919
3777 -919 -64 649 1243 666 407 -82 -1285 -1324 -690 -80 784 1199 953 343 -519 -1065 -1145 -627 213 1135
3797 1135 1064 687 -116 -914 -1065 -755 -251 816 976 1078 663 -285 -1068 -1072 -642 -167 861 960 1164 341
3817 341 -387 -912 -1093 -698 322 1183 1178 796 77 -658 -1082 -966 -336 196 832 1038 542 137 -802 -1177
3837 -1177 -749 -417 613 1010 558 226 -293 -1116 -1017 -651 51 678 1150 629 80 -781 -871 -841 -523 219
3857 219 1184 1049 572 334 -785 -986 -944 -111 483 802 818 563 -568 -792 -1030 -735 -152 577 901 885
3877 885 40 -610 -899 -819 -616 20 658 641 807 108 -469 -983 -862 -187 225 738 872 886 -401 -582 -1199
$$ packed form
3736A203Q7m20q86p77o45L37J048O60L75K84q67q07n97l14M24O98Q44O58m64n26
3756C15p25o92N2N14P97Q34J91n09o27p94l44p2N68Q93O05J5k40q85r18q3J86
3777i19Q55P13N94n77k59m89j203l9O34O10Q64M15k46o10q62n46q0N18Q40R22
3797A135p1l77q03p98j51L10N04J067J60J02m15r48p83mM30M75J028R9K04q23
3817C41p28n25j81L95J020Q61nl82p19p35m24J16O30N32O36K06m96m05r39l75
3837a177M28L32J030L97m52l32n19q23R9L66P02O27M72n21n49q61r0L0L18P42
3857B19R65j35m77k38j119k01M2Q33N94L19J6k55j131k24k38K95N83P29L24j6
3877H85q45o50k89Q0K03O36O38j7J66o99n77n14J21O75M12N13J34J4j287j81o17
$$ plain form
3898 -1199 -876 -207 694 1012 806 359 -269 -851 -622 -670 -135 730 981 813 180 -334 -827 -806 -137 137
3918 137 964 1070 431 -121 -683 -916 -731 -128 437 793 1261 586 -354 -714 -993 -823 -123 462 1096 732
3938 732 108 -300 -782 -710 -301 267 492 1061 463 -19 -433 -848 -933 -302 90 749 839 697 -142 -380 -668
3959 -668 -676 -206 491 874 818 337 -300 -687 -664 -238 127 498 514 447 260 -245 -1103 -803 -495 488 821 650
3981 650 811 196 -280 -707 -599 -130 343 879 690 731 -151 -750 -849 -834 -188 417 1076 597 220 -393 -641
4002 -641 -737 -521 16 532 1001 562 247 -459 -830 -741 -294 236 948 630 492 -228 -779 -696 -553 -162 385
4023 385 469 589 323 -260 -802 -920 -444 -32 482 500 668 519 -105 -619 -587 -333 -127 796 724 693 149 -34
4045 -34 -561 -730 -370 618 775 641 388 -66 -469 -672 -422 14 617 635 664 266 -283 -1007 -531 -410 72
$$ packed form
3898a199L23O69R01L18k06m47o28n82K29m8N35Q65K51j68o33n14m93K1O69K74
3918A37Q27J06o39n52n62k33J85O03N65L56M68o75r40l60k79J70P00N85O34l64
3938G32o24m08m82P2M09N68K25N69n98m82m14m15q5O31L92O59R0j42q39k38k88
3959f68qM70O97L83n6m81o37l87K3M26L65L71J6o7j87n05q58L00L08R83L33j71
3981F50J61o15m76m27J08M69M73N36j89M1q82n99r9J5O46O05O59m79l77o13k48
4002f41r6K16N37N16M69m39l15p06l71Q9M47N30P12l18j38p20n51Q3J43L91N47
4023C85Q4J20k66n83n42j18M76M12N14J8J68j49o24n14L2K54K06R23p2l1n44j83
4045c4n27j69L60R88J57j34k53m54m03k03K50M36O03J8K9l98n49p24M76J21M82
$$ plain form
4066 72 472 412 284 73 -218 -794 -567 -429 340 793 658 727 -147 -319 -596 -606 -293 490 641 610 179 -114
4088 -114 -851 -853 -415 268 574 729 602 -15 -360 -504 -627 -453 -114 573 728 380 -340 -185 -689 -341 -124
4109 -124 129 785 771 385 -152 -485 -619 -424 -176 373 381 459 385 -414 -739 -489 -507 145 216 706 542 50
4131 50 -308 -476 -387 -205 318 635 526 648 209 -221 -580 -542 -318 435 322 542 594 7 -697 -816 -568
4152 -568 160 523 505 657 196 -302 -184 -765 -64 198 525 730 548 -62 -116 -512 -474 -321 249 549 615
4173 615 415 167 -432 -707 -315 -72 280 716 500 273 -388 -515 -569 -597 182 92 301 485 204 -242 -543
4194 -543 -488 -236 441 476 526 352 -15 -494 -434 -359 108 94 581 509 466 -38 -275 -489 -241 -59 222 687 501
4217 501 254 -142 -503 -486 -163 78 238 604 151 329 -45 -464 -331 -309 327 344 571 409 111 -279 -503
$$ packed form
4066G2M00o0j28k11k91n76K27J38P69M53j35O9q74j72k77j0L13P83J51l1m31k93
4088a14p37kM38O83L06J55j27o17l45j44j23J74L39O87J55l48p20J55n04L48K17
4109a24K53O56j4l86n37l33j34J95K48N49QP8p4p99l25K50j8O52P1M90j64m92
4131E0l58j68Q9J82N23L17j09J22m39m30l59L8K24P53j13K20N2n87p04j19K48
4152e68P28L63j8J52m61m98J18n81P01K62L27K05j82o10n4l96L8J53N70L00O6
4173F15k00k48n99k75L92K43L52M36k16k27o61j27n4k8P79r0K09J84k81m46l01
4194e43N5K52O77L5N0j74l67m79O0P5M67j4M87p2m3n04k37k14K48J82K81M65j86
4217E01k47l96l61J7L23K41J60L66m53J78l74m19J33K2O36J7K27j62k98l90k24
$$ plain form
4238 -503 -553 -119 149 579 318 76 -310 -438 -580 -5 22 330 518 586 287 13 -496 -465 -256 211 377
4259 377 796 -53 140 -148 -441 -590 -239 118 472 595 178 121 -381 -461 -544 -77 521 545 556 261 -99 -478
4281 -478 -279 -288 164 298 545 567 156 -322 -433 -302 -111 321 346 501 195 240 -364 -605 -570 -102 376 634
4303 634 302 207 -117 -306 -458 -498 75 179 235 183 12 -197 -585 -509 -236 151 356 246 557 176 -19 -472
4325 -472 -490 -226 100 553 326 232 -19 -434 -173 -438 138 293 468 410 14 30 -349 -439 33 -16 168 284
4347 284 290 115 -310 -268 -540 -377 -1 465 346 394 84 -325 -158 -253 -194 111 326 364 70 -124 -409 -540
4369 -540 -452 -117 343 308 509 236 -7 -367 -423 -343 -7 256 634 303 -139 -328 -447 -210 -109 282 185 596
4391 596 224 -31 -379 -542 -157 86 262 328 249 330 208 -366 -304 -519 25 412 194 42 135 -369 42 -574
$$ packed form
4238e03n0M34K68M30k61k42l86j28j42N75K7L08J88O8k99k74n09L1K09M67J66
4259C77M19q49J93k88k93j49L51L57L54J23m17n7n02q0q3M67N98K4J1k95l60l79
4281d78J99rM52J34K47K2m11m78j11J31J91M32K5J55l06M5o04k41L5M68M78K58
4303F34l32r5l24j89j52m0N73J04N6n2j71k09l88P6K73L87K05j10L11l81j95m53
4325d72j8K64L26M53k27r4k51m15K61k65N76J55J75n8l96J6l79r0M72m9J84J16
4347B84Oj75m25M2k72J63L76M66j19M8l10m09J67r5N9L05K15L8k94j94k85j31
4369e40Q8L35M60l5K01k73k43l60n6Q0L36K63L78l31m42j89j19K37J01L91r7M11
4391E96l72k55l48j63L85K43J76O6p9Q1j22n74O2k15N44L87k18j52R3n04M11o16
$$ plain form
4413 -574 -143 -34 337 490 330 -63 -254 -156 -225 163 -47 318 484 173 -58 -320 -431 -388 31 239 215
4434 215 354 44 8 -216 -258 -155 78 18 517 394 76 -62 -379 -484 -149 122 161 324 197 -176 -65
4455 -65 -662 -151 -50 3 443 284 291 -208 -122 -309 -182 -23 155 369 299 112 -197 -262 -205 -698 198 431 295
4478 295 152 313 -173 -264 -185 159 -152 559 170 451 203 -251 -94 -177 -101 238 595 34 177 -138 -172 -211
4500 -211 -209 78 325 254 346 -32 -167 -275 -239 -224 45 370 174 226 25 -318 -98 -56 -59 1 185 368 -114 -132
4524 -132 -187 -150 -282 -37 130 174 455 -35 -241 -128 -430 -227 122 319 108 249 85 -98 -190 -492 -54
4545 -54 268 88 456 152 -278 146 -330 -320 -364 36 342 11 225 -26 104 -361 -286 20 336 194 420
4566 420 166 -175 -198 -351 25 179 153 409 286 126 22 33 -191 -538 -210 260 147 249 308 -285 -271 -56
$$ packed form
4413e74M31J09L71J53j60l93j91R8o9L88k10L65J66l11k31k62j11M3M19K08k4
4434B15J39l10l6k24m2J03K33o0M99j23l18j38l17j05L35K71L9J63j27l73J11
4455f5n97N11J01N3M40j59Pm99Q6j87J27J59J78K14p0j87l09o5N7m93Q96K33j36
4478B95j43J61m86r1P9L44l11P11l89K81k48m54J57q3P6L39L57n61J43l15l4l9
4500b11KK87K47p1R2l78j35j08L6J5K69L25j96N2k01l43K20M2lO0J84J83m82j8
4524a32n5L7j32K45J67M4K81m90k06J13l02K03L49J97k11J41j64j83r2l02M38
4545e4L22j80L68l04m30M24m76J0m4M00L06l31K14k51J30m65P5L06L16j42K26
4566D20k54l41k3j53L76J54k6K56j23j60j04J1k24l47L28M70j13J02N9n93J4K15
$$ plain form
4588 -56 -293 44 163 164 308 24 -198 -123 -541 10 521 94 21 84 -282 95 -407 -196 150 280 530 212
4610 212 97 -513 -319 -435 -65 287 131 275 304 5 -195 -273 262 -408 266 281 -87 -39 -59 -217 -303 -284
4632 -284 5 451 268 93 -12 40 -29 -241 -84 -1 62 485 221 216 -154 7 -304 -260 199 295 207 1 297
4655 297 -284 -164 -311 27 281 220 198 27 -94 -162 -440 65 90 224 193 160 70 -341 77 -119 -254 84
4677 84 136 347 228 -97 -306 90 -206 73 -3 443 400 157 21 -260 -139 -296 -71 53 390 336 175 -126
4699 -126 -455 -576 -64 -138 319 494 11 50 31 -44 -45 -114 -91 158 -221 240 -87 7 -146 -91 -228 36 325
4722 325 218 86 -45 -260 -111 -214 136 494 -27 384 57 -61 -62 -246 63 216 224 234 -190 1 -123 -151
4744 -151 -165 41 -129 112 220 -205 49 -411 -135 -304 -44 -7 273 98 44 170 57 0 -261 86 118 -132
$$ packed form
4588e6k37L37J19JJ44k84k22P5m18N51N11m27p3O3l66L77n02K11L46J30K50l18
4610B12j15o10J94j16L70L52j56J44K9k99k00p8N35o70O74J5l68M8k0j58q6J9
4632b84K89M46j83j75j05N2o9k12J57Q3O3M23k64nl70J61l11M4M59R6q8k06K96
4655B97n81J20j47L38K54o1k2j71j21o8k78N05K5J34l1l3r0m11M18j96j35L38
4677H4N2K11j19l25k09L96k96K79p6M46m3k43j36k81J21j57K25J24L37n4j61l01
4699a26l29j21N12p4M57J75m83L9j9p5jo9K3K49l79M61l27R4j53N5j37K64K89
4722C25j07j32j31k15J49j03L50L58n21M11l27j18jj84L09J53QJ0m24J91j24k8
4744a51j4K06j70K41J08m25K54m60K76j69K60L7K80j75n4J26j13n7k61L47L2k50
$$ plain form
4766 -132 128 212 -169 7 -377 -316 -19 267 93 -129 -328 -145 16 -104 16 42 158 138 187 -46 -120 -248
4788 -248 -6 -18 413 176 270 266 -218 98 -252 -28 73 245 202 133 30 -325 -313 154 204 -129 37 120 60
4811 60 -435 -241 -116 -334 -67 -22 1 62 169 110 -46 -24 -174 -155 -45 64 207 172 101 -281 -435 -274 290
4834 290 112 63 358 271 -205 29 -414 -238 -94 150 327 -33 76 -155 -447 -197 -4 264 122 289 116
4855 116 1 -190 -357 237 39 178 272 177 44 81 -211 -45 -105 86 145 -2 157 138 -94 -157 -224 -41 52
4878 52 350 260 10 -242 -186 -273 -113 284 -64 -69 -76 15 -275 -352 -312 -66 -143 79 686 162 269 40 117 22 -213
4903 -213 -84 383 65 31 132 -76 -23 -477 164 128 451 -22 -27 -205 -140 -95 -99 -320 185 6 -138 185 4
4926 4 -118 -236 -331 -45 265 345 407 -107 77 -15 -283 -101 -50 -84 181 -268 192 13 -68 -430 47 1 47 439
$$ packed form
4766a32K60Q4l81J76l84O1K97K86j74k22j99J83J61j20J20K6J16k0M9k33p4j28
4788b48K42j2M31k37R4mm84L16l50K24J01J72m3o9j03l55J2M67N0l33J66Q3o0
4811F0m95J94J25k18K67M5K3O1J07n9j56K2j50J9J10J09J43l5p1l82j54J61N64
4834B90j78m9K95q7m76K34m43J76J44K44J77l60J09k31k92K50J93K68j42J67j73
4855A16j15j91j67N94j98J39R4r5j33L7k92J66o0J91N9j47J59j9k32o3o7J83R3
4878E2K98r0k50k52N6q7J60L97l48npR1k90p7M0K46p7K22O07n24J07k29P7r5k35
4903b13J29M67l18l4J01k08N3m54O41l6L23m73nj78O5M5mk21N05j79j44L23j81
4926Dj22j18r5K86L10Q0O2n14J84r2k68J82N1l4K65m49M60j79q1l62M77m6M6L92
$$ plain form
4950 439 325 -51 90 -155 -342 124 196 -26 -32 -7 -131 -91 28 76 132 191 -43 -9 -124 41 -48 152 -80
4973 -80 152 -10 200 -109 125 94 -316 -171 244 496 253 -46 96 -158 -155 -158 -105 -182 24 133 50 94 114 -84
4997 -84 -246 -147 -92 -37 120 272 82 -107 -199 -211 -184 385 51 305 65 -38 -126 -70 -407 -35 360 94 35
5020 35 -38 50 -147 -206 -46 -89 127 521 97 -378 -273 -193 -7 -119 78 53 166 73 -30 -21 8 -13 -69 -125 244
5045 244 187 331 -215 -299 -114 -64 148 -241 155 71 -177 112 -193 -325 12 -16 44 -85 231 152 -56 -221
5067 -221 -174 -72 -37 319 211 85 -134 -121 -177 -77 269 137 4 94 -361 -90 -90 102 -319 -117 1 336
5089 336 189 344 66 -86 191 -168 305 74 -76 230 -53 -15 -170 -225 -148 41 -57 237 137 85 -246 -155
5111 -155 198 20 -200 334 478 67 -232 -266 -191 -92 16 -27 151 357 112 -11 -171 17 -200 59 56 88
$$ packed form
4950D39j14l76J41k45j87M66P2k22oK5j24M0J19M8N6N9k34L4j15J65q9K00k32
4973h0K32j62K10l09K34l1m10J45M15K52k43k99J42k54LlN3p7K06J09q3M4K0j98
4997h4j62R9N5N5J57J52j90j89r2j2K7N69l34K54k40j03q8N6l37L72L95k66n9
5020C5p3Q8j97n9J60m3K16L94m24m75J05Q0J86j12J97k5J13r3j03RK9k1n6n6L69
5045B44n7J44n46q4J85N0K12l89L96q4k48K89l05j32L37k8O0j29L16p9k08j65
5067b21M7J02L5L56j08j26k19J3n6J00L46j32j33R0m55K71%J92m21K02J18L35
5089C36j47J55k78j52K77l59M73k31j50L06k83L8j55n5P7J89r8K94j00n2l31R1
5111a55L53j78k20N34J44m11k99l4P5R9J08m3J78K06k45j23j60J88k17K59lL2
$$ plain form
5133 88 413 -151 -107 -415 -279 -184 289 125 187 239 -160 -223 -49 -54 -63 13 570 169 129 -117 -420 -65 -84 -32 135
5158 135 252 166 83 346 -10 -247 13 206 127 -15 229 112 -8 -294 -31 291 89 161 370 25 -93
5179 -93 -173 -175 -61 183 86 140 543 10 -2 -259 -187 122 244 282 -75 -107 -54 129 39 -93 52 -316 357 187
5203 187 321 47 -30 179 223 28 406 126 258 322 -219 -86 -92 359 -93 -98 128 257 -72 -254 -471 -111
5225 -111 -104 315 -50 -4 114 -266 -147 -9 212 78 69 287 164 99 67 -179 -210 -20 -17 -137 199 340 130
5248 130 -38 -130 -268 -162 162 -53 211 -47 30 -74 -60 -203 140 -31 -64 189 -4 83 -195 -185 -5 -95
5270 -95 224 86 232 4 94 175 -275 -87 189 -255 -28 264 269 -88 -137 -175 14 173 -42 181 154 139 180
5293 180 -480 -173 93 208 303 -110 96 77 -31 -291 12 -69 19 -28 395 -145 122 144 -359 -198 31 -39
$$ packed form
5133H8L25n64M4l08J36R5M73j64O2N2l99o3J74nrP6N57m01m0k46l03L55j9N2J67
5158A35J17q6q3K63l56k37K60J93p9j42K44j17j20k86K63L22k02P2K09l45j18
5179i3q0kJ14K44r7N4M03n33j2k57P2L09J22L8l57l2N3J83r0j32J45l68O73j70
5203A87J34k74p7K09M4j95L78k80J32O4n41J33oM51m52nK26J29l29j82k17L60
5225a11PM19l65M6J18l80J19J38K21j34rK18j23o5l2k46l1J90Lj20L36J41k10
5248A30j68r2j38J06L24k15K64k58P7j04J4j43L43j71l3K53j93Q7k78J0J80r0
5270i5L19j38J46k28R0Q1m50J88K76m44K27K92Nl57m9l8J89J59k15K23k7j5M1
5293A80o60L07K66J15R5m13K06j9j08k60L03q1Q8m7M23n40K67K2n03J61K29p0
$$ plain form
5315 -39 180 365 19 116 33 -67 23 104 73 243 -37 67 -219 -208 -1 1 419 232 20 356 -198 -87 43
5338 43 -143 122 8 135 194 219 75 33 -387 -255 240 82 120 -91 201 -53 -274 -76 134 -80 317 284
5360 284 151 30 -38 -204 -220 76 -109 291 136 414 -23 -128 -101 -48 -14 -182 117 53 52 8 -106 -321 -220
5383 -220 -30 77 133 352 -142 -127 -257 -6 251 195 124 47 102 140 -24 -69 -135 265 63 -111 97 -115 1
5406 1 -101 -196 21 56 135 127 28 71 -165 -144 -93 -226 -11 -37 121 -4 -58 -112 -280 -411 -359 218 70 136 122 100
5432 100 203 -82 -289 -63 -141 413 131 -183 -375 39 -165 67 -11 159 -207 105 -80 161 20 -111 -131
5453 -131 265 182 54 306 -422 44 -379 -69 -166 -87 176 90 -131 75 23 -297 -64 69 -4 94 280 109
5475 109 197 -112 91 -222 -110 120 69 265 -50 -43 160 -422 33 39 -112 -386 4 232 -122 -184 8 -156
$$ packed form
5315c9K19J85l46R7q3j00R0Q1l1J70k80J04k86J1K07KM18j87k12L36n54J11J30
5338D3j86K65j14J27N9K5j44m2m20J32M95j58L8k11K92k54k21J98K10k14L97l3
5360B84j33j21o8j66j6K96j85M00j55K78m37j05K7N3L4j68K99o4jm4j14k15J01
5383b20J90J07N6K19m94J5j30K51K57n6p1p7N5L8j64m5o6M00k02j74K08k12J16
5406Aj02r5K17L5P9qr9M3k36K1N1j33K15k6J58j25n4n4j68j31N2N77j48O6j4k2
5432A00J03k85k07K26p8N54k82l14j92M14k04K32p8J70l66L12j85K41j41j31k0
5453a31L96q3j28K52p28M66m23L10r7P9K63q6k21K06n2l20K33J33p3R8J86j71
5475A09Q8l09K03l13J12K30n1J96l15PK03n82M55Oj51k74L90K28l54o2J92j64
$$ plain form
5497 -156 260 174 54 513 -183 -148 -175 66 -100 188 318 40 -121 -25 -277 -179 -246 -52 -42 209 183 -27 -183
5520 -183 -13 -266 219 133 396 40 52 32 -112 93 67 -26 255 309 287 353 -252 85 109 232 100 -77 201
5543 201 65 53 -132 -14 -162 -228 118 264 481 118 -113 -3 -363 -123 102 -112 136 164 54 -177 -316
5564 -316 -167 -206 338 204 -162 431 -97 140 -284 -279 -77 -105 333 53 93 -172 -150 -42 -39 45 83 47 142 163
5588 163 244 -32 -368 -69 -28 248 208 341 227 -166 -251 -133 -225 -106 -35 157 18 171 -5 -182 -75 -36
5610 -36 40 172 252 81 -124 -70 -230 78 -258 91 -3 -91 -92 -14 -78 21 78 155 261 30 -25 -32 31 -288 -191 -94
5636 -94 113 37 156 144 297 -125 -157 -76 -69 161 -222 132 254 -267 -24 -81 -132 223 -76 466 2 -125 -61
5659 -61 -48 202 3 -53 53 81 82 -78 -59 -81 -101 -50 272 97 182 119 113 -129 -219 -92 -83 -127 -24 487 -35 28
$$ packed form
5497a56M16q6j20M59o96L5k7K41j66K88J30k78j61R6k52R8o7J94J0K51k6k10j56
5520a83J70k53M85q6K63l56J2k0j44K05k6r3K81N4k2O6o05L37K4J23j32j77K78
5543B01j36j2j85J18j48o6L46J46K17l63k31J10l60K40K25k14K48K8j10k31j39
5564c16J49l9N44j34l66N93n28K37m24NK02k8M38k80M0k65K2J08LQ4L8l6R5K1
5588A63Q1k76l36K99M1K76m0J33j14l93q5J18r2J19P1J92j39J53j76j77J07L9
5610c6P6J32Q0j71k05N4j60L08l36L49r4q8jP8o4R9N7P7J06k31n5pO3l19R7R7
5636i4K07p6J19j2J53m22l2Q1PK30l83L54J22n21K43n7n1L55k99N42m64j27O4
5659f1J3K50j99n6J06K8Jj60J9k2k0N1L22j75Q5o3ok42r0J27Rm4J03N11n22O3
$$ plain form
5685 28 -331 50 -280 -63 254 241 -34 181 31 -131 -217 -124 50 -94 91 220 1 -205 23 -106 14
5706 14 114 111 394 -156 -262 -12 -218 -135 -89 24 140 62 228 -147 -137 50 -139 -3 61 332 455 178 -230
5729 -230 -266 -225 -146 -86 -196 200 49 -110 -213 30 0 -21 -52 233 131 -239 263 100 -533 -65 -76 -58 308
5752 308 160 -145 12 -86 -134 -218 83 280 147 163 50 -190 -316 124 -35 -52 224 -14 221 -271 -345 -185
5774 -185 -195 -112 185 405 89 -75 54 -48 68 -186 227 178 208 327 -68 -294 -136 129 47 -153 103 354
5796 354 111 98 48 -325 -7 -51 -99 431 99 273 -168 -48 -111 -211 -222 -49 140 -36 -136 23 -95 -55
5818 -55 -159 -135 -25 308 -227 -74 -112 -63 128 -48 -64 -260 23 16 -53 149 5 15 -138 363 258 188 79
5841 79 -211 146 -126 -6 -202 -90 77 12 -70 199 -140 -106 -41 250 98 14 -80 44 -244 96 12 -82 -133
$$ packed form
5685B8l59L81l30K17L17j3k75K15j50j62q6R3J74j44J85J29k19k06K28j29J20
5706A4J00lK83n50j06K50k06Q3M6J13J16p8J66l75J0J87j89J36O4K71J23k77m08
5729b30l6M1P9O0j10L96j51j59j03K43l0k1l1K85j02l70N02j63o33M68j1J8L66
5752C08j48l05J57r8m8q4L01J97j33J6j13k40j26M40j59j7K76k38K35m92p4J60
5774a85j0Q3K97K20l16j64J29j02J16k54M13m9L0J19l95k26J58K65q2k00K56K51
5796C54k43j3n0l73L18m4m8N30l32J74m41J20o3j00j1J73J89j76j00J59j18M0
5818e5j04K4J10L33n35J53l8M9J91j76j6j96K83po9K02j44J0j53N01j05p0j09
5841G9k90L57k72J20j96J12J67o5q2K69l39L4O5K91j52q4r4J24k88L40q4r4n1
$$ plain form
5864 -133 60 86 -165 111 -247 47 -249 -33 72 -328 -61 -335 -74 45 -205 -8 1 209 369 99 -120
5885 -120 -142 -141 -199 22 -246 196 68 334 216 71 -131 -301 57 163 293 -162 -127 50 -169 -384 81 -128
5907 -128 87 128 -187 74 24 -27 -117 -27 73 -272 -12 -97 -199 -86 -54 -22 -270 -128 327 -24 110 32 21
5930 21 -73 -232 -42 78 111 220 48 -16 -412 -73 -7 211 73 -11 112 -178 -139 -68 112 265 120 84 147
5953 147 274 9 -79 19 -426 -119 386 210 316 83 -348 -192 -68 -57 96 -14 160 358 14 235 -112
5974 -112 19 185 -322 199 275 90 -201 -482 115 -211 202 65 96 -1 68 -64 -16 -245 -240 -230 222 135 -5
5997 -5 -105 -261 86 -104 -77 196 176 54 -274 -14 254 -342 -25 -77 -73 9 166 -66 176 -332 -292 -16 -101
6020 -101 -176 -19 260 -134 -88 -124 -120 -305 315 -265 72 268 -205 -110 -37 -236 -237 76 -33 12 246 -15 -275
$$ packed form
5864a33J93K6k51K76l58K94k96K16J05m00K67k74K61J19k50J97RK08J60k70k19
5885a20k2Jn8K21k68M42j28K66j18j45k02j70L58J06J30m55L5J77k19k15M65k09
5907a28K15M1l15K61n0n1r0R0J00l45K60q5j02J13L2L2k48J42M55l51J34p8j1
5930B1r4j59J90J20L3J09j72o4l96L39O6K18j38q4J23k90L9P1J80J53j45l6O3
5953A47J27k65q8R8m45L07N05j76J06k33m31J56J24J1J53j10J74J98l44K21l47
5974a12J31J66n07N21P6j85k91k81N97l26M13j37L1r7O9j32M8k29NJ0M52q7j40
5997ej00j56L47j90K7K73k0j22l28K60K68n96L17n2MQ2J57k32K42n08M0K76q5
6020a01p5J57K79l94M6l6Mj85O20n80L37J96m73R5P3j99jL13j09M5K34k61k60
$$ plain form
6043 -275 -99 -130 31 -55 -61 37 -54 -150 -222 -19 195 -2 76 393 147 347 -57 -139 -150 -273 67 445 104 27
6067 27 19 -172 -316 -205 57 115 158 -74 23 231 50 -83 18 35 137 175 -35 10 12 -159 34 74 109 202 237
6092 237 67 21 -133 130 -5 -95 -158 81 134 332 158 -309 -138 -6 89 -84 137 406 139 234 30 -314
6114 -314 112 131 42 9 -377 79 -162 -11 2 -255 57 -54 447 236 -165 38 57 -45 -325 -87 371 158
6136 158 110 -380 -316 97 -302 -62 220 346 17 111 -172 -255 -126 18 157 139 209 15 257 179 -237 106
6158 106 31 -14 194 317 -19 -45 43 -109 -90 -254 -447 277 124 109 -7 -182 -144 -268 179 -37 290 148
6180 148 -10 60 -138 -199 59 124 69 101 36 207 -5 7 39 -95 76 120 71 299 221 126 -149 -269 84 -43
6204 -43 29 24 -159 206 -15 93 -30 120 61 699 -124 -93 77 302 28 137 -123 157 19 35 148 -149
$$ packed form
6043b75J76l1J61q6oR8r1r6p2K03K14j97P8L17k46K00m04q2j1j23L40L78l41p7
6067B7qj91j44J11K62N8M3k32R7K08j81j33J01J7J02L8k10M5Kj71J93M0L5R3L5
6092B37j70m6j54K63j35r0o3K39N3J98j74m67J71J32R5j73K21K69k67R5k04l44
6114c14M26J9q9l3l86M56k41J51J3k57L12j11N01k11m01K03J9j02k80K38M58k13
6136A58m8m90O4M13l99K40K82J26l29R4k83q3J29J44J39j8P0j94K42p8m16L43
6158A06p5m5K08J23l36k6Q8j52J9j64j93P24j53j5j16j75L8j24M47k16L27j42
6180A48j58P0j98o1K58O5n5L2o5J71k12J2L2j34J71M4m9K28p8r5k75j20L53j27
6204d3P2nj83L65k21J08j23J50n9O38q23L1J70K25k74J09k60K80j38J6J13k97
$$ plain form
6226 -149 -360 60 15 139 235 218 -175 122 -292 -380 -166 47 144 168 43 -62 -28 -61 -224 117 -143 18 166
6249 166 128 124 -185 -71 -54 254 105 90 -85 -172 33 35 -81 -341 -33 262 66 295 223 -152 -176 -27 179
6272 179 40 152 -2 303 -20 -35 -124 76 37 -15 -78 272 291 -327 113 -326 25 -88 272 18 230 -236
6294 -236 -87 -185 -221 37 99 243 -37 96 57 157 -133 -220 64 -51 110 290 9 198 169 -448 -109 126
6316 126 -114 81 308 392 45 -319 -225 -178 339 304 -251 39 14 -58 -22 -65 47 1 247 227 -94 222 -64
6339 -64 -93 158 -100 112 -33 239 312 98 140 -305 -225 -191 114 294 -43 216 -21 -343 -193 85 142 58 43
6362 43 -132 51 80 201 -139 -39 46 78 240 76 73 -256 108 -81 -221 163 26 153 -108 -24 -9 -273 -97
6385 -97 39 -71 37 -23 109 -96 -100 -42 -127 -9 148 104 -121 114 -200 -101 -109 -223 -122 323 148 28 -181
$$ packed form
6226a49k11M20m5J24R6j7l93K97m14q8K14K13R7K4j25j05L4l3j63L41k60J61J48
6249A66l8ml09J14J7L08j49j5j75q7K05Kj16k60L08K95j96K29p2l75k4J49K06
6272A79j39J12j54L05l23j5q9K00l9n2o3L50J9o18M40m39L51j13L60k54K12m66
6294b36J49r8l6K58O2J44k80J33l9J00k90q7K84j15J61J80k81J89k9o17L39K35
6316A26k40J95K27Q4l47l64R4M7N17l5n55K90k5p2L6m3J12m6K46k0l21L16k86
6339f4k9K51k58K12j45K72P3k14M2m45Q0L4L05J80l37K59k37l22J50K78N7q4j5
6362D3j75J83K9J21l40J00Q5L2J62j64ll29L64j89j40L84j37J27k61Q4J5k64J76
6385i7J36j10J08o0J32k05mN8q5J18J57m4k25K35l14R9qj14J01M45j75j20k09
$$ plain form
6408 -181 97 93 -69 94 -34 -164 88 1 -61 -36 -6 -100 -129 -135 -62 60 -73 -43 -67 120 -187 135 144 391 92
6433 92 203 48 115 -358 -22 354 58 192 173 61 44 47 -6 -141 -67 158 294 260 173 -341 -135 -101 -42 -73
6457 -73 51 68 -10 66 -131 -100 -261 -50 222 106 172 149 -96 45 -38 54 -69 -210 -14 -244 -53 -228 145
6480 145 -75 -93 227 138 240 74 171 -43 -18 249 53 -147 122 152 26 -311 -118 171 -357 -71 242 35
6502 35 2 -10 -79 -125 -5 49 -198 -77 268 -9 -146 -343 -320 -73 -201 222 -141 130 -87 -144 -253 -152 -403
6525 -403 -105 132 -175 99 -67 -369 40 -148 -139 -35 250 -198 -19 165 231 -275 -74 167 79 148 346 102
6547 102 -134 -147 -320 83 -5 96 21 208 -19 -230 -173 -279 -47 75 -189 327 48 -203 -69 -123 -41 -32 8
6570 8 -132 44 -66 105 -102 -196 -63 52 23 -21 -14 93 -64 -222 269 253 -186 55 -99 153 233 -83 -116
$$ packed form
6408a81K78mj62J63j28j30K52q7o2K5L0r4k9oP3J22j33L0k4J87l07L22RK47k99
6433I2J11j55O7m73L36L76k96J34j9j12j7Ln3j35P4K25J36l4q7n14K06L4N9l1
6457g3J24J7p8P6j97L1j61K11K72j16O6k3k45J41q3R2j23j41J96k30J91j75L73
6480A45k20j8L20q9J02j66R7k14K5K67j96k00K69L0j26l37J93K89n28K86L13k07
6502C5l3j2o9m6J20N4k47J21L45k77j37j97K3K47j28M23l63K71k17n7j09J01k51
6525d03K98K37l07K74j66l02M09j88RJ04K85m48J79J84O6n06K01K41q8O9J98k44
6547A02k36j3j73M03q8J01p5J87k27k11N7j06K32J22k64N16k79k51J34n4Q2RM0
6570Hj40J76j10J71k07r4J33J15k9m4PJ07j57j58M91j6m39K41j54K52Q0l16l3
$$ plain form
6593 -116 -237 -39 49 204 113 50 25 75 -54 49 133 271 -79 211 -75 -37 -273 196 117 99 30 153 177 -25
6617 -25 98 -255 -460 78 -14 -102 176 -37 -48 -96 -255 -14 77 -59 259 244 143 -247 4 -213 104 -128
6639 -128 319 -13 380 -163 115 -113 -125 -21 -113 51 58 423 -166 -226 52 41 51 258 94 39 21 -115 109
6662 109 -152 -124 59 -166 61 -58 -100 -156 -59 -249 2 342 32 119 292 191 150 25 -269 -161 -20 57
6684 57 -27 41 -94 27 -30 -329 130 64 50 -61 -128 -219 -84 11 -80 8 31 -115 164 183 -87 -235 -160 -81 231
6709 231 137 300 -6 -141 -136 130 -217 -82 -41 231 169 -135 184 53 -102 -9 -35 298 -29 -273 -194 -13 18
6732 18 -243 -274 -43 246 226 25 -55 -98 -89 -107 128 150 255 96 -48 7 9 -208 24 -101 58 115 84 16 181
6757 181 39 -389 41 70 78 136 36 -3 66 -96 -80 198 415 144 -124 57 238 -293 -177 -115 45 224 147
$$ packed form
6593a16j21J98Q8J55r1o3k5N0j29J03Q4J38l50K90k86L8k36M69p9j8o9J23K4k02
6617b5J23l53k05N38r2q8K78k13j1m8j59K41R1j36L18j5j01l90K51k17L17k32
6639a28M47l32L93n43K78k28j2J04r2J64PL65n89o0K78j1J0K07j64n5j8j36K24
6662A09k61K8J83k25K27j19m2n6R7j90K51L40l10Q7J73j01m1j25k94J08J41P7
6684E7q4O8j35J21n7k99M59o6j4j11o7r1J35R5r1Q8K3j46K79J9k70j48P5P9L12
6709B31r4J63l06j35NK66l47J35M1K72o2l04L19j31j55R3k6L33l27k44P9J81L1
6732A8k61l1K31K89k0k01q0m3Rj8K35K2J05j59j44N5Kk17K32j25J59N7l1o8J65
6757A81j42m28M30K9QN8j00l9O9j62J6K78K17k71k68J81J81n31J16O2J60J79p7
$$ plain form
6780 147 16 -158 -139 13 -24 -338 179 185 -29 -52 -2 -350 -280 -180 -102 -127 154 -64 168 156 157 6 -248 -121
6804 -121 -89 150 310 -114 133 -207 264 -197 -81 11 -210 -135 -105 -251 -417 -81 -170 59 80 353 205 141
6826 141 -126 -17 -288 20 -145 237 111 -141 210 -155 -76 -44 -118 -69 59 -47 -209 -110 32 -18 -27 67 5
6849 5 346 357 80 -185 33 44 124 92 -45 -168 40 128 34 0 -254 -26 47 176 239 154 31 -22 -196 90
6873 90 -5 -68 284 118 -114 -290 23 220 -116 -87 -209 40 88 -66 165 -176 2 58 -46 -114 86 81 324
6896 324 -77 -59 -254 96 7 188 -62 165 -321 -94 -172 -264 -12 157 123 -98 18 -178 -185 -176 48 -179 -41
6919 -41 279 -53 151 -155 -130 63 -146 389 59 59 250 -66 -173 -52 -46 71 -61 71 65 -174 260 91 93
6942 93 182 39 43 -59 -184 204 -46 -285 -111 -101 -228 -212 124 12 215 -242 -48 41 -114 137 2 -91 -12
$$ packed form
6780A47j31j74J9J52l7l14N17Ok14k3N0l48P0J00P8k5K81k18K32j2Jj51k54J27
6804a21L2K39J60m24K47l40M71m61J16R2k21P5L0j46j66L36q9K29K1K73j48o4
6826A41k67J09k71L08j65L82j26k52L51l65P9L2p4M9J28j06j62R9J42n0rR4o2
6849EL41J1k77k65K18J1Q0l2j37j23K08Q8r4l4k54K28P3J29O3q5j23n3j74K86
6873I0r5o3L52j66k32j76L13J97l36K9j22K49M8j54K31l41J78N6j04o8K00nK43
6896C24m01J8j95L50q9J81k50K27m86K27p8r2K52J69l4k21J16j96pRK24k27J38
6919d1L20l32K04l06K5J93k09N35l30%J91l16j07J21OJ17j32J32ok39M34j69K
6942I3Q9j43Mj02j25L88k50k39J74J0j27J6L36j12K03m57J94Q9j55K51j35r3P9
$$ plain form
6965 -12 -106 10 -256 66 -86 185 308 -117 -101 -171 -145 -106 51 -121 166 -211 246 -112 25 -24 69 -100 -148
6988 -148 -7 -84 -58 13 -61 -31 242 108 80 113 65 215 -245 -366 -63 -135 113 131 45 -145 -143 59 -121 31
7012 31 51 149 13 72 33 109 -39 28 -324 -154 -288 -140 70 103 117 -256 -206 -321 -277 1 115 -218 -156 -2
7036 -2 134 -141 -37 189 222 441 -17 -178 11 -306 -36 -115 -105 145 -97 18 -12 -260 -115 -101 209 15
7058 15 41 137 194 -220 -183 -73 -152 21 -91 -42 65 230 -146 -102 -160 -195 -131 36 197 96 -150 -34 -70 -118
7082 -118 162 -47 62 86 -42 -60 -4 -87 -184 -164 184 154 441 -119 -58 174 -46 173 227 177 258 -10 -12 309
7106 309 55 56 161 117 -77 139 10 -140 -36 -135 24 159 -76 147 64 102 -203 -267 -7 -121 10 -91
7128 -91 135 89 26 -7 -120 -317 164 -150 132 39 84 -197 101 -326 -171 103 127 -170 259 -17 -481 -135
$$ packed form
6965a2r4J16k66L22j52K71J23m25J6p0K6L9J57j72K87l77M57l58J37m9R3j69m8
6988a48J41p7K6P1p4L0K73j34k8L3m8J50m60j21L03p2K48J8q6j90KK02j80J52
7012C1K0R8j36N9l9P6j48O7l52J70j34J48K10L3J4l73N0j15M4K78J14l33O2J54
7036bJ36k75J04K26L3K19m58j61J89l17K70p9J0K50k42J15l0k48J45J4L10j94
7058A5K6R6N7m14L7J10p9J73j12M9J07J65l76M4n8l5O4J67J61j01k46J16l6m8
7082a18K80k09J09K4j28j8N6q3r7K0L48l0K87n60O1K32k20K19N4n0Q1k68kL21
7106C09k54JJ05m4j94K16j29j50J04r9J59J35k35K23q3L8l05o4K60j14J31j01
7128i1K26m6o3l3j13j97M81l14K82r3M5k81K98m27J55K74K4k97M29k76m64L46
$$ plain form
7150 -135 -226 43 -47 -278 64 -148 -112 -129 -257 58 8 50 262 127 -60 106 146 -196 -37 -98 21 158 -176
7173 -176 109 35 -42 56 -44 -199 -114 43 135 -79 -124 -27 -182 -231 79 35 -252 19 142 -217 41 -304 -56
7196 -56 -51 193 -98 -27 -137 -175 -109 -40 -146 237 -38 131 38 -134 288 -49 201 112 33 -131 -11 197 108 -248
7220 -248 17 -23 -70 -165 -30 -7 100 43 -54 -71 -93 136 362 213 130 31 -31 -54 -151 124 60 7 226 -42 -135
7245 -135 2 -562 -67 106 211 11 303 -3 -257 -221 -336 329 -14 81 -43 -88 98 -85 -203 7 253
7266 253 -255 -42 -95 25 14 243 -205 62 94 35 140 -58 8 6 21 -142 -175 -56 -147 97 -125 -155 93 -36
7290 -36 -182 -120 153 154 165 -16 34 67 -296 -321 183 106 174 107 -10 59 0 66 82 58 -13 37 79 -125 -312 -345 -62
7317 -62 30 39 19 -229 12 9 1 144 133 -113 19 106 -194 -384 -122 -199 -95 146 -81 -102 29 56 -252 37 64
$$ packed form
7150a35r1K69r0k31L42k12L6j7j28L15n0M2K12j35j87J66M0l42J59o1J19J37l34
7173a76K85p4p7R8j00j55Q5J57R2k14m5R7j55m9L10m4k87K71J23l59K58l45K48
7196e6NK44k91P1j10l8O6O9j06L83k75J69r3j72M22l37K50q9p9j64J20K08q9l56
7220b48K65m0m7r5J35K3J07n7r7j7k2K29K26j49q3r9o2k3r7K75o4n3K19k68r3
7245a35J37n64M95J73J05k00K92l06k54L6j15O65l43R5j24m5J86j83j18K10K46
7266B53n08K13n3J20j1K29m48K67L2n9J05j98O6kJ5j63l3J19r1K44k22l0K48j29
7290c6j46O2K73JJ1j81N0L3l63k5N04p7O8o7j17O9n9O6J6k4p1N0M2k04j87l3K83
7317f2R2Rk0k48K41lqJ43j1k46J32Q7l00j90K62p7J04K41k27k1J31K7l08K89K7
$$ plain form
7342 64 -216 -320 156 -10 -13 38 -41 175 -319 -191 59 247 -139 138 -61 127 -203 -288 203 -12 -1 -54 230
7365 230 130 -189 -233 -64 -233 48 187 -35 64 0 145 113 -52 302 -32 90 80 266 -285 -57 2 -350
7387 -350 -199 217 218 -307 -296 25 -305 146 -113 14 -6 4 -176 -255 -170 42 235 96 290 108 5 175
7409 175 -103 53 -118 -182 -159 79 24 -175 -33 -108 -343 61 -30 48 -162 -75 85 -164 -280 -7 -146 -100 215
7432 215 33 198 59 143 33 -49 -309 29 57 -163 -62 -146 197 -31 -11 -40 -46 322 262 122 -241 -139 -130 -271
7456 -271 -166 142 81 20 215 68 36 -29 -105 201 171 -13 176 175 -130 -242 -153 11 122 -122 302 32 86
7479 86 -100 36 -173 -147 349 191 -86 96 160 -254 -31 -39 -104 -77 28 218 98 -39 -24 10 -126 105 -92
7502 -92 169 -51 -77 -159 -174 -94 87 -104 307 187 -169 37 -67 -105 -10 -21 117 102 -144 -22 -118 147 -88
$$ packed form
7342F4k80j04M76j66lN1p9K16m94J28K50J88l86K77j99J88l30q5M91k15J1n3K84
7365B30j00l19m4J69j69K81J39k22R9o4J45l2j65L54l34J22j0J86n51K28N9l52
7387c50J51M16Jn25J1L21l30M51k59J27k0J0j80p9Q5K12J93j39J94j82j03J70
7409A75k78J56j71o4K3K38n5j99J42p5k35M04r1P8k10Q7J60k49j16K73j39M6L15
7432B15j82J65j39Q4j10q2k60L38K8k20J01q4L43k28K0k9oL68o0j40l63J02Rj41
7456b71J05L08o1o1J95j47l2o5p6L06l0j84J89jl05j12Q9J64J11k44M24k70N4
7479H6j86J36k09K6M96j58k77J82O4m14K23qo5K7J05J90j20j37J5L4j36K31j97
7502i2K61k20k6q2j5Q0J81j91M11j20l56K06j04l8R5j1J38j5k46J22r6K65k35
$$ plain form
7525 -88 250 20 -159 8 146 -112 -2 -54 -95 71 33 -12 314 66 86 -271 -167 -151 177 122 154 59 -63
7548 -63 186 124 -167 -282 -266 -363 181 46 146 157 35 -90 -162 120 -68 198 364 -39 -217 43 -247 89
7570 89 108 73 332 10 -175 -95 -167 -6 -219 -8 161 66 -73 53 -66 -80 277 173 -161 27 57 83 134
7593 134 -128 344 -10 -47 -401 85 -28 21 -112 -211 17 35 -27 29 161 173 -94 120 -130 -144 117 91 -162
7616 -162 201 2 -274 100 -220 82 -7 -153 185 190 32 -164 -89 -60 -49 95 358 69 44 187 85 18 -73
7639 -73 -425 -13 -52 210 -72 -184 104 -190 16 243 332 136 16 -303 -288 -320 0 102 -15 92 301 79
7661 79 -51 -325 12 170 9 176 72 -45 -214 -219 -71 -318 -169 338 62 218 143 18 7 -22 -76 68
7683 68 -11 181 461 308 -162 86 -121 -270 49 -45 35 123 -60 -135 20 40 -162 28 -61 316 233 -326 171
$$ packed form
7525h8L38k30j79J67J38k58J10n2m1J66l8m5L26k48K0l57J04J6L28n5L2r5j22
7548f3K49o2k91j15J6r7N44j35J00J1j22j25p2K82j88K66J66m03j78K60k90L36
7570H9J9l5K59l22j85Q0p2J61k13K11J69r5j39J26j19j4L57j04l34J88L0K6N1
7593A34k62M72l54l7l54M86j13M9j33r9K28J8o2N6J32J2k67K14k50j4K61k6k53
7616a62L63j99k76L74l20L02q9j46L38Nj58j96P5K9J1J44K63k89k5J43j02o7r1
7639g3l52M12l9K62k82j12K88k94K06K27Q9j96j20l19J5l2L20J02j17J07K09k22
7661G9j30k74L37J58j61J67j04j17j69nJ48k47J49N07k76J56p5j25j1k9n4J44
7683F8p9J92K80j53m70K48k07j49L19r4Q0Q8j83p5J55K0k02J90q9L77q3n59M97
$$ plain form
7706 171 2 192 73 130 158 240 252 199 -118 195 -138 205 -81 72 54 207 240 -145 -108 -103 255 -296 -105
7729 -105 212 -81 -74 -28 103 143 87 388 -21 233 152 1 -11 -12 147 222 217 30 -119 -94 -309 -43 73 -152
7753 -152 190 134 -141 84 -71 -141 120 -64 215 88 102 -2 -74 1 -165 15 -37 287 -64 235 164 -303
7775 -303 -185 123 -5 -96 -163 -10 155 -336 -64 -56 -106 77 49 148 152 366 -55 -118 -13 -116 219 29 -21 158
7799 158 73 45 185 -148 14 203 -180 121 43 48 -123 -160 93 -319 101 148 318 70 50 -53 -6 -131 121
7822 121 -173 61 222 -194 26 -215 18 -173 61 -14 38 76 -162 -20 -133 161 -111 4 -57 310 -75
7843 -75 -10 49 -179 -52 247 108 5 -64 -75 -291 75 75 -27 -171 95 37 -24 -61 -53 -34 -109 -58 -17 -9 -282 -245
7869 -245 -108 70 1 -12 -174 -233 0 -25 72 223 -167 -81 -38 -111 76 -149 -203 8 128 -253 -209 108 -100
$$ packed form
7706A71j69J90j19N7K8Q2J2n3l17L13l33L43k86J53j8J53L3l85L7NL58n51J91
7729a05L17k93PM6J31M0n6L01m09K54q1j51j2jJ59P5nj87j49K5k15K66J16k25
7753a52L42n6k75K25j55p0K61j84K79j27J4j04p2P5j66J80n2L24l51K99p1m67
7775c03J18L08j28r1o7J53J65m91K72Qn0J83k8R9MK14m21o3J05j03L35j90n0J79
7799A58q5k8J40l33J62J89l83L01p8Nj71l7K53m12M20M7J70k48k0j03M7j25K52
7822A21k94K34J61m16K20k41K33j91K34p5N2L8k38J42j13K94k72J15o1L67l85
7843g5O5N9k28J27K99j39j03o9j1k16L66%j02j44K66n8o1l7QJ9p5N1M1Qk73L7
7869b45J37J78o9j3j62n9K33k5R7J51l90Q6M3p3J87k25n4K11J20l81M4L17k08
$$ plain form
7892 -100 95 25 5 -107 -106 -121 -379 37 304 114 44 87 249 -102 11 -83 50 267 186 157 78 -63 4 65
7916 65 -353 169 -100 -147 -274 231 274 -435 21 113 90 121 105 143 -131 -50 -76 -397 -291 -75 -19 161 103 161
7940 161 -188 123 48 -85 -127 77 272 35 115 -199 35 -108 -49 -227 -143 21 -93 -81 -147 -39 -13 266 224
7963 224 9 191 -44 66 -95 -384 -87 -111 69 60 317 73 124 -46 140 84 48 115 245 178 -161 -184 14
7986 14 -26 310 -86 -62 330 -1 97 -102 130 -216 -86 -361 7 97 -77 -70 30 -128 -11 350 58 -109
8008 -109 -165 113 -71 -124 -104 -293 -182 185 100 -129 -153 -276 281 -175 41 91 156 217 -137 111 282 -157 -35
8031 -35 7 -39 -60 34 -26 -22 -116 -263 -40 -148 193 124 -229 56 -17 139 -6 -56 207 71 221 -93 -7 77 2
8056 2 -116 49 -193 260 84 134 -331 -106 140 -58 -151 -83 152 289 72 109 -80 -69 80 25 -124 232 85
$$ packed form
7892a00J95p0k0j12Jj5k58M16K67j90p0M3J62l51J13r4J33K17q1k9p9j41O7O1
7916F5m18N22k69m7j27N05M3p09M56R2k3L1j6L8k74Q1k6l21J06K16N6J80n8N8
7940A61l49L11p5j33m2K04J95k37Q0l14K34j43N9j78Q4J64j14J2o6J08K6K79m2
7963B24k15J82k35J10j61k89K97k4J80rK57k44N1j70J86n6l6O7J30o7l39k3J98
7986A4m0L36l96K4L92l31R8j99K32l46J30k75L68R0j74PJ00j58J17L61k92j67
8008a09n6K78j84n3K0j89J11L67q5k29k4j23N57m56K16N0O5O1l54K48J71m39J22
8031c5M2m6k1R4o0Mr4j47K23j08L41o9l53K85p3J56j45n0K63j36J50l14Q6Q4p5
8056Bj18J65k42M53j76N0m65K25K46j98r3O8K35J37k17L7j89J1J49n5j49L56j47
$$ plain form
8079 85 41 -170 106 -49 -50 264 -163 -1 3 -125 10 46 -173 114 22 -13 -164 -143 -15 -109 -160 -193 -125 -107 -9
8104 -9 221 -120 97 -100 -198 248 24 463 214 157 218 44 -107 -98 30 287 209 106 191 10 -318 -270 -294 39
8128 39 -24 189 -10 -237 78 -72 -178 106 -72 407 365 53 -31 -38 314 -34 -60 -3 -9 9 -204 -50 -20 -254
8152 -254 -106 47 296 -67 55 -78 -251 17 -180 209 -60 2 328 97 49 -75 -226 -310 167 267 -95
8173 -95 -137 36 -318 3 128 -162 -107 -136 9 32 -38 -123 44 39 -652 146 194 123
$$ packed form
8079H5m4k11K76j55jL14m27J62Mj28J35L6k19K87r2l5j51K1J28r4n1l3O8J8R8
8104iK30l41K17j97r8M46k24M39k49n7O1j74j51RJ28K57p8j03Q5j81l28M8k4L33
8128C9o3K13j99k27L15j50j06K84j78M79m2l12q4pL52l48k6N7oJ8k13J54L0k34
8152b54J48J53K49l63J22j33j73K68j97L89k69O2L26k31m8j24j51q4M77J00l62
8173i5m2J73l54L21J25k90N5k9J45K3p0q5J67no91P98M8p1
8191A23
$$ Imaginary data points
##PAGE= N=2
##DATA TABLE= (X++(I..I)), XYDATA
$$ plain form
0 0 0 0 0 0 0 0 -8 8 -8 8 -8 16 -16 23 -24 31 -39 41 -48 60 -68 80 -93 106 -123 139 -160 180 -202 231
30 231 -259 291 -325 360 -405 450 -499 555 -615 682 -757 835 -925 1025 -1137 1262 -1401
47 -1401 1566 -1752 1971 -2234 2548 -2944 3446 -4115 5058 -6473 8839 -13532 26362 -133852
61 -133852 -433833 -158195 30768 -4478 75658 297277 229160 -31711 -161999 -185185 -229698
72 -229698 -116815 124602 232364 187592 146889 12538 -219625 -278264 -117573 -10097 59998
83 59998 238564 293942 39403 -175835 -130324 -119465 -221141 -84078 239396 305824 118928
94 118928 7927 -70064 -235403 -251189 -31368 108735 98196 173793 238125 31655 -235977
105 -235977 -238556 -109691 -52789 51780 220233 229920 78776 -45870 -150983 -250090 -168814
$$ packed form
0@%%%%%%qJ6j6J6j6K4l2L9m7N5p0Q0q9J08j28J48j73J99k29K62k99L40l82M33
30B31m90N50o16O85p65Q55r49J054j170J297j439J592j760J950k162K399k663
47a401K967l318L723m205M782n492O390p561R173j1531J5312k2371L9894j60214
61a33852k99981K75638J88963l5246Q0136K21619o8117k60871j30288k3186m4513
72b29698J12883K41417J07762m4772m0703j34351k32163n8639J60691J07476P0095
83E9998J78566N5378k54539k15238M5511J0859j01676J37063L23474O6428j86896
94A18928j11001p7991j65339j5786K19821J40103j0539P5597O4332k06470k67632
105b35977k579J28865N6902J04569J68453R687j51144j24646j05113r9107Q1276
$$ plain form
116 -168814 59137 155417 126169 165134 146261 -87152 -266147 -175228 -50859 -22454 115835
127 115835 296576 191767 -87739 -162362 -96905 -142761 -154080 49104 238005 205888 87574
138 87574 -15132 -146007 -217784 -133540 -11483 69010 180315 237565 82270 -130522 -165622
149 -165622 -122274 -132070 -46554 161989 233499 114000 20044 -37188 -178034 -247829 -81216
160 -81216 119529 151253 133446 138468 32800 -147591 -197799 -124217 -55231 47191 193992
171 193992 212152 63778 -65994 -116771 -168738 -161696 -12089 144838 173297 135433 70658
182 70658 -66897 -188770 -162964 -63752 3221 98828 212573 171340 -18365 -137667 -138092
193 -138092 -136486 -96163 59285 190351 161608 67485 -1016 -98891 -195160 -155048 -6420
$$ packed form
116a68814K27951R6280k9248L8965j8873k33413j78995R0919J24369K8405J38289
127A15835J80741j04809k79506p4623O5457m5856j1319K03184J88901l2117j18314
138H7574j02706j30875p1777Q4244J22057Q0493J11305N7250j55295k12792l5100
149a65622M3348r796Q5516K08543P1510j19499r3956n7232j40846o9795J66613
160h1216K00745L1724j7807N022j05668j80391n0208P3582O8986J02422J46801
171A93992J8160j48374j29772n0777n1967P042J49607J56927K8459l7864o4775
182G0658j37555j21873K5806R9212O6973R5607J13745m1233j89705j19302m25
193a38092J606M0323J55448J31066k8743r4123o8501r7875r6269M0112J48628
$$ plain form
204 -6420 104503 149569 156543 81094 -62555 -154786 -153406 -106132 -7254 129961 187072 114621
216 114621 15465 -58853 -143726 -182584 -84636 69675 142294 142703 113699 16280 -124623 -179143
228 -179143 -116731 -27877 54921 144953 171418 80400 -49165 -127820 -151549 -119097 -11786
239 -11786 111140 159799 127928 49635 -59827 -152309 -154908 -72783 26330 110942 160626 125833
251 125833 8660 -101710 -144115 -130383 -63901 52844 150745 152781 76732 -17737 -104505
262 -104505 -154846 -123615 -18368 88883 143678 134754 63041 -47011 -133952 -148710 -90474
273 -90474 9823 107536 151111 116558 27619 -72379 -140244 -139961 -64540 42681 123499 144208
285 144208 97467 636 -99701 -146918 -118711 -34166 65845 134460 137610 71228 -31407
$$ packed form
204f420J10923M5066O974p5449j43649r2231J380M7274R8878J37215N7111p2451
216A14621r9156p4318q4873l8858R7948J54311P2619M09k9004r7419j40903n4520
228a79143O2412Q8854Q2798R0032K6465r1018j29565p8655k3729L2452J07311
239a1786J22926M8659l1871p8293j09462r2482k599Q2125R9113Q4612M9684l4793
251A25833j17173j10370m2405J3732O6482J16745R7901K036p6049r4469q6768
262a04505n0341L1231J05247J07251N4795q924p1713j10052q6941j4758N8236
273i0474J00297R7713M3575l4553q8939r9998o7865K83P5421J07221Q0818K0709
285A44208m6741r6831j00337m7217K8207Q4545J00011O8615L150o6382j02635
$$ plain form
296 -31407 -118643 -143668 -95692 -4816 86212 140958 127433 42391 -64422 -129702 -129886 -75373
308 -75373 18216 111045 145826 99778 9890 -78986 -134874 -126123 -47777 53150 121145 132682
320 132682 83255 -13924 -105638 -136557 -101137 -24144 70012 137036 126592 47339 -43005 -108650
332 -108650 -134502 -91926 10296 102007 129488 101192 33985 -62237 -134566 -125284 -50920 33318
344 33318 103397 135327 93054 -5988 -91093 -123763 -107983 -40257 60559 127588 119194 59520
356 59520 -20476 -102294 -137042 -88793 1493 75562 119210 117850 46077 -60271 -120112 -112666
368 -112666 -67609 8876 98970 136465 89449 6535 -66134 -118029 -119346 -45927 52510 108017
380 108017 113411 77907 -5143 -97520 -128547 -87777 -18258 57185 120020 119614 45114 -42668
$$ packed form
296c1407q7236k5025M7976R0876R1028N4746j3525q5042j06813o5280j84N4513
308g5373R3589R2829L4781m6048q9888q8876n5888Q751P8346J00927O7995J1537
320A32682m9427r7179r1714l0919L5420P6993R4156O7024j0444p9253r0344o5645
332a08650k5852M2576J02222R1711K7481k8296o7207r6222p2329R282P4364Q4238
344C3318P0079L1930m2273r9042q5105l2670J5780O7726J00816O7029q394n9674
356E9520p9996q1818l4748M8249R0286P4069M3648j360p1773j06348n9841P446
368a12666M5057P6485R0094L7495m7016q2914p2669n1895j317P3419R8437N5507
380A08017N394l5504q3050r2377l1027M0770O9519P5443O2835m06p4500q7782
$$ plain form
392 -42668 -97232 -115780 -84859 3170 92016 120064 90020 30553 -51983 -119581 -116034 -47984
404 -47984 30224 90193 120370 88029 -2708 -83962 -110914 -94026 -38837 48773 116176 111690
416 111690 52668 -19463 -87717 -121999 -85884 -646 72623 105988 101214 44043 -47686 -109772
428 -109772 -105947 -58333 9838 83810 120761 85780 8162 -63247 -106403 -104681 -44180 43746
440 43746 99361 103296 67423 -2694 -82707 -117735 -84000 -14503 54629 103982 105578 47253
452 47253 -35759 -93118 -105375 -71626 1510 78364 110272 85124 23779 -49201 -102276 -103446
464 -103446 -48178 26577 85478 107619 76981 378 -74822 -104941 -84079 -29141 41345 97634
476 97634 104613 54832 -21924 -85006 -105630 -73279 -5388 63023 99787 90648 36721 -39334
$$ packed form
392d2668n4564j8548L0921Q8029Q8846K8048l0044n9467q2536o7598L547O8050
404d7984P8208N9969L0177l2341r0737q1254k6952J6888N5189Q7610O7403m486
416A11690n9022p2131o8254l4282L6115Q5238P3269L3365m774n7171r1729o2086
428a09772L825M7614O8171P3972L6951l4981p7618p1409m3156J722O0501Q7926
440D3746N5615L935l5873p0117q0013l5028L3735O9497O9132M9353J596n8325
452D7253q3012n7359j2257L3749P3136P6854L1908k5148o1345p2980n3075j170
464a03446N5268P4755N8901K2141l0638p6603p5200l0119K0862N4938P0486N6289
476I7634O979m9781p6756o3082k0624L2351O7891O8411L6764r139n3927p6055
$$ plain form
488 -39334 -96984 -101961 -53896 17182 76626 99982 77116 14311 -58523 -101105 -91056 -36723
500 -36723 34329 89433 100610 59322 -11885 -73110 -97775 -77627 -20258 51387 98245 93821
512 93821 40414 -32254 -86612 -94738 -57684 604 60208 100254 89282 21541 -57441 -94017
524 -94017 -82804 -42993 17136 78135 100228 66014 625 -62241 -96941 -82987 -23363 44309
536 44309 85022 88640 51960 -17173 -78927 -94823 -64612 -8960 56295 98911 82752 20773
548 20773 -38309 -74227 -88644 -62118 10467 79290 96030 64611 9445 -52705 -91123 -78276
560 -78276 -29955 25033 74728 97098 60490 -16069 -71814 -83902 -67054 -21921 46387 91687
572 91687 81599 34712 -23030 -76887 -95060 -54027 11852 58267 80084 75621 25971 -47220
$$ packed form
488c9334n7650m977M8065P1078N9444K3356k2866o2805p2834m2582J0049N4333
500c6723P1052N5104J1177m1288p1207o1225k4665K0148N7369P1645M6858m424
512I3821n3407p2668n4358q126L7054N8288N9604M0046j0972o7741p8982l6576
524i4017J1213L9811O0129O0999K2093l4214o5389o2866l4700J3954N9624O7672
536D4309M0713L618l6680o9133o1754j5896L0211N5652O5255M2616j6159o1979
548B0773n9082l5918j4417K6526P2585O8823J6740l1419n5166o2150l8418J2847
560g8276M8321N4988M9695K2370l6608p6559n5745j2088J6848M5133O8308M5300
572I1687j0088m6887n7742n3857j8173M1033O5879M6415K1817m463m9650p3191
$$ plain form
584 -47220 -86982 -77753 -41630 15456 79035 95989 49797 -9596 -48954 -77187 -80475 -29542
596 -29542 44863 83962 77147 42234 -14835 -71760 -86877 -55527 -7029 47550 89677 79868
608 79868 18036 -41300 -68513 -75561 -52981 10488 71582 82407 55372 15504 -41964 -91582
620 -91582 -81200 -18978 35230 63595 77122 55393 -7654 -65626 -79121 -59601 -18802 41188
632 41188 84077 74542 27663 -21663 -65855 -85608 -53277 11349 57359 73388 65442 22181
644 22181 -44053 -79836 -66266 -33198 9193 64032 91320 53525 -11263 -52919 -70641 -67579
656 -67579 -25156 40462 75853 66431 36262 -9730 -62582 -82985 -52452 -987 44504 75877
668 75877 71906 22039 -38047 -68439 -68108 -42857 9818 62858 75106 49726 9867 -38668 -78172
$$ packed form
584d7220l9762R229L6123N7086O3579J6954m6192n9393l9358k8233l288N0933
596b9542P4405L9099o815l4913n7069n6925j5117L1350M8498N4579M2127r809
608G9868o1832n9336k7213p048K2580O3469O1094J0825k7035l9868n7468m9618
620i1582J0382O2222N4208K8365J3527k1729o3047n7972j3495J9520M0799N9990
632D1188M2889r535m6879m9326m4192j9753L2331O4626M6010J6029p946m3261
644B2181o6234l5783J3570L3068M2391N4839K7288l7795o4788m1656j7722L062
656f7579M2423O5618L5391r422l0169m5992n2852k0403L0533N1465M5491L1373
668G5877l971m9867o0086l0392L31K5251N2675N3040J2248k5380l9859m8535l9504
$$ plain form
681 -78172 -71542 -20549 30288 59915 72070 50797 -9999 -65657 -72460 -46571 -12389 32613
693 32613 73377 71766 25627 -26230 -60173 -71296 -48997 3587 54721 74377 56991 11133
705 11133 -39689 -67034 -60704 -32502 11527 60882 79693 45505 -10358 -47016 -62503 -60164
717 -60164 -25411 34790 74129 65793 27659 -16049 -54075 -69797 -48969 -1634 43595 67881
729 67881 60278 21662 -29450 -64722 -67950 -36694 14247 56491 66918 45806 6498 -37019
741 -37019 -67232 -62784 -23221 26944 61208 65933 37931 -9394 -50206 -65489 -51392 -12398
753 -12398 37362 69359 61435 20423 -25341 -54340 -59985 -42189 -1506 47274 72552 54010
765 54010 5863 -36930 -57809 -57700 -32380 16498 59756 64498 36583 -1322 -38834 -65453 -58362
$$ packed form
681g8172O630N0993N0837K9627J2155k1273o0796n5658o803K5889L4182M5002
693C2613M0764j611m6139n1857l3943j1123K2299N2584N1134J9656j7386m5858
705A1133n0822k7345O330K8202M4029M9355J8811l4188n5863l6658j5487K339
717f0164L4753O0201L9339q336l8134m3708l8026j5722K0828M7335M5229K4286
729F7881p603l8616n1112l5272l228L1256N0941M2244J0427k1112l9308m3517
741c7019l0213M448L9563N0165L4264M725k8002m7325m0812j5283J4097L8994
753a2398M9760L1997p924m1012m5764k8999n645J7796M0683M8780K5278j8542
765E4010m8147m2793k0879J09K5320M8878M3258M742k7915l7905l7512k6619P091
$$ plain form
778 -58362 -13547 35469 60061 56018 29590 -11433 -50108 -65911 -46954 -1003 46755 64007
790 64007 46025 14591 -19088 -53912 -67584 -36531 17411 52103 57653 44073 8530 -39485
802 -39485 -63853 -50510 -18163 18446 54292 64986 34475 -13661 -45360 -57453 -48247 -9871
814 -9871 37485 59547 50641 24203 -16337 -57049 -63107 -31439 8089 38830 58747 50979 8559
827 8559 -34740 -53565 -53022 -31087 16839 59237 57180 28030 422 -31186 -62905 -55717 -8182
840 -8182 34292 49448 51177 32700 -13666 -53400 -55631 -34598 -5415 34855 63368 49481 9325
853 9325 -23154 -47188 -59145 -33056 18147 47951 48866 39989 12633 -36916 -64568 -44442 -10070
866 -10070 15313 45280 62033 33926 -16504 -42608 -47999 -44246 -12813 37196 58727 42230
$$ packed form
778e8362M4815M9016K4592m043k6428m1023l8675j5803J8957M5951M7758J7252
790F4007j7982l1434l3679l4824j3672L1053N3942L4692N550j3580l5543m8015
802c9485k4368J3343L2347L6609L5846J0694l0511m8136l1699j2093R206L8376
814i871M7356K2062q906k6438m0540m0712o058L1668L9528L0741J9917p768m2420
827H559m3299j8825N43K1935M7926M2398k057k9150k7608l1608l1719P188M7535
840h182M2474J5156J729j8477m6366l9734k231K1033K9183M0270K8513j3887m0156
853I325l2479k4034j1957K6089N1203K9804R15q877k7356m9549k7652K0126L4372
866a0070K5383K9967J6753k8107n0430k6104n391L753L1433N0009K1531j6497
$$ plain form
878 42230 17645 -11202 -49278 -61011 -28763 11041 34106 51105 50166 10120 -37545 -50454
890 -50454 -41188 -26503 9530 54014 58428 24149 -4555 -27107 -54312 -53346 -7856 34931 44490
903 44490 43204 31629 -10015 -52705 -52942 -26769 -3274 27970 58804 48745 5047 -26004 -38990
916 -38990 -49720 -34866 14034 48974 45935 31428 10940 -30305 -60558 -43242 -5831 17205
928 17205 38016 55228 33614 -16138 -42654 -42081 -37152 -13587 32834 57185 38376 11345 -9967
941 -9967 -41053 -58652 -29411 15367 35256 41836 41993 12799 -33609 -50147 -36655 -20420 7190
954 7190 47034 56732 23438 -10169 -26748 -44828 -47716 -9861 33507 43584 36522 26227 -6519
967 -6519 -47771 -51583 -22824 1592 23746 49911 47357 6771 -28410 -38313 -41551 -29894 10795
$$ packed form
878D2230k4585k8847l8076j1733L2248L9804K3065J6999r39m0046m7665j2909
890e0454R266J4685L6033M4484M414l4279k8704k2552k7205R66M5490M2787R559
903D4490j286j1575m1644m2690k37K6173K3495L1244L0834j0059m3698l1051j2986
916c8990j0730J4854M8900L4940l039j4507k0488m1245l0253J7316L7411K3036
928A7205K0811J7212k1614m9752k6516N73M929K3565M6421K4351j8809k7031k1312
941i967l1086j7599K9241M4778J9889O580J57k9194m6408j6538J3492J6235K7610
954G190L9844R698l3294l3607j6579j8080k888L7855M3368J0077p062j0295l2746
967f519m1252l812K8759K4416K2154K6165k554m0586l5181r903l238J1657M0689
$$ plain form
980 10795 45909 43605 24885 7633 -23240 -53965 -44689 -5182 21298 34737 46129 31241
992 31241 -12497 -41988 -39412 -29240 -11405 26197 53013 38776 7887 -13204 -35062 -50224
1004 -50224 -29204 12753 35760 38906 35350 11531 -29634 -48422 -33721 -13212 7794 37601
1016 37601 51187 26183 -10059 -29085 -39743 -40273 -10383 30422 43869 33048 19037 -6661
1028 -6661 -40386 -48036 -22970 5090 24040 42486 41723 9022 -26780 -38483 -35943 -23877 7802
1041 7802 41487 44254 22574 794 -22362 -44095 -39984 -7730 20999 34486 39999 26782 -9266
1054 -9266 -38899 -39756 -25132 -6152 23491 46135 36649 7405 -15840 -31908 -41650 -27314 8875
1067 8875 35016 38232 29240 8542 -24195 -44287 -34718 -10735 12131 33800 42976 24422 -7948
$$ packed form
980A0795L5114k304j8720j7252l0873l0725R276L9507K6480J3439J1392j4888
992C1241m3738k9491K576J0172J7835L7602K6816j4237l0889k1091k1858j5162
1004e0224K1020M1957K3007L146l556k3819m1165j8788J4701K0509K1006K9807
1016C7601J3586k5004l6242j9026j0658n30K9890M0805J3447j0821j4011k5698
1028f661l3725p650K5066K8060J8950J8446p63l2701l5802j1703K540J2066L1679
1041G802L3685K767k1680k1780k3156k1733M111L2254K8729J3487N513j3217l6048
1054i266k9633q57J4624J8980K9643K2644r486k9244k3245j6068r742J4336L6189
1067H875K6141L216q992k0698l2737k0092R569K3983K2866K1669R176j8554l2370
$$ plain form
1080 -7948 -29010 -36923 -32885 -9531 24613 41478 33317 14993 -9283 -35276 -42890 -22661 5608
1093 5608 25045 36974 34644 9656 -23115 -37955 -33498 -18506 7567 34909 41817 23427 -2373
1106 -2373 -23656 -38003 -34194 -9290 19456 34646 35258 20343 -7548 -32732 -38526 -24936 -2670
1119 -2670 23032 40399 33842 8400 -16654 -31770 -35691 -22366 6507 31976 37212 25356 4250
1132 4250 -21143 -37925 -33376 -11305 13788 32477 37253 21407 -5892 -28075 -35276 -27561 -6118
1145 -6118 20723 37129 32428 13011 -11313 -31606 -36981 -21821 4491 26437 35691 28541 6685
1158 6685 -19041 -34246 -32580 -15451 9483 31689 37086 21727 -2499 -23214 -33917 -30138 -9490
1171 -9490 18263 34949 32679 14636 -8870 -27517 -34044 -25161 -2091 23359 36801 29114 7597
$$ packed form
1080g948k1062p913M038K3354L4144J6865q161j8324k4276k5993p614K0229K8269
1093E608J9437J1929k330k4988l2771j4840M457J4992K6073K7342O908j8390k5800
1106b373k1283j4347L809K4904K8746J5190O12j4915k7891k5184n794J3590K2266
1119b670K5702J7367o557k5442k5054j5116l921J3325K8873K5469N236j1856k1106
1132D250k5393j6782M549K2071K5093J8689M776j5846k7299k2183p201P715K1443
1145f118K6841J6406m701j9417k4324k0293n375J5160K6312K1946R254p150k1856
1158F685k5726j5205J666J7129K4934K2206N397j5359k4226k0715j0703L779K0648
1171i490K7753J6686k270j8043k3506j8647o527Q883K3070K5450J3442p687k1517
$$ plain form
1184 7597 -15390 -30747 -32620 -18249 6843 28329 34161 23420 2439 -20108 -34560 -31149 -10005
1197 -10005 15104 30988 30977 18250 -3278 -25189 -35686 -26460 -2505 21330 32486 27914 11939
1210 11939 -10048 -28649 -34141 -21295 4014 26437 33905 23805 3762 -16774 -30037 -30468 -14952
1223 -14952 9815 29934 33544 19291 -2725 -22639 -32119 -26059 -6342 16518 30916 29882 14261
1236 14261 -7785 -27390 -33327 -21425 2022 22743 30143 24623 9688 -12606 -31335 -33116 -14523
1249 -14523 10527 26486 28546 19697 3438 -17771 -32832 -29450 -8676 15327 29276 28455 15459
1262 15459 -4684 -23666 -31716 -22705 -2310 18617 30411 27229 10395 -12632 -28614 -29619 -15979
1275 -15979 3617 21581 30301 24800 4912 -18769 -31411 -26407 -9389 9943 24201 28653 19721
$$ packed form
1184G597k2987j5357j873J4371K5092K1486N832j0741k0981k2547j4452L411K1144
1197a0005K5109J5884j1j2727k1528k1911j0497R226K3955K3835J1156m572j5975
1210A1939k1987j8601n492J2846K5309K2423P468j0100k0043k0536j3263m31J5516
1223a4952K4767K0119L610j4253k2016j9914r480O060J9717K2860J4398j034j5621
1236A4261k2046j9605n937J1902K3447K0721P400n520j4935k2294j8729j781J8593
1249a4523K5050J5959K060q849j6259k1209j5061L382K0774K4003J3949q21j2996
1262A5459k0143j8982q050R011K0395K0927J1794l182j6834k3027j5982j005J3640
1275a5979J9596J7964Q720n501j9888k3681j2642N004J7018J9332J4258M452q932
$$ plain form
1288 19721 -839 -22113 -32175 -24528 -3755 17247 27764 25358 12647 -6290 -24984 -31451
1300 -31451 -19816 2772 21429 28771 23150 6823 -13547 -27460 -27596 -14036 7192 24559 29489
1313 29489 19365 23 -19616 -29200 -23462 -6434 12040 24460 28214 17148 -6114 -26276
1325 -26276 -28799 -17226 -618 15266 27150 26575 9535 -12126 -26633 -27335 -15123 5151 21979
1338 21979 27325 20406 4198 -15680 -28572 -25565 -9332 9670 24677 28101 15917 -4557 -20275
1351 -20275 -25387 -21541 -6619 15542 28817 24458 9084 -7830 -22717 -27838 -17276 2447 18710
1364 18710 25709 23237 6577 -15759 -27175 -22896 -10749 5543 21943 27987 17730 -836 -17446
1377 -17446 -26881 -23634 -5759 14207 24027 22819 13762 -4447 -23190 -27664 -16182 -454 14584
$$ packed form
1288A9721k0560k1274j0062P647K0773K1002J0517k406j2711j8937j8694o467
1300c1451J1635K2588J8657P342n621j6327k0370j3913j36J3560K1228J7367M930
1313B9489j0124j9342j9639r584N738J7028J8474J2420L754j1066k3262k0162
1325b6276k523J1573J6608J5884J1884n75j7040k1661j4507p02J2212K0274J6828
1338B1979N346o919j6208j9878j2892L007J6233J9002J5007L424j2184k0474j5718
1351b0275n112L846J4922K2161J3275m359j5374j6914j4887n121J0562J9723J6263
1364A8710O999k472j6660k2336j1416M279J2147J6292J6400O044j0257j8566j6610
1377a7446r435L247J7875J9966R820j208r057j8209j8743m474J1482J5728J5038
$$ [...]
8191b3
##END NTUPLES=NMR FID
##END=
