##TITLE=1H_LR-683A-AK
 D2O, 8 sc, 
 24.9.2019
##JCAMPDX= 6.0         $$ Bruker NMR JCAMP-DX V2.0
##DATA TYPE= NMR FID
##DATA CLASS= NTUPLES
##ORIGIN= UXNMR, Bruker Analytische Messtechnik GmbH
##OWNER= root
$$ XWIN-NMR		Version 3.5
$$ Tue Sep 24 14:04:58 2019 Russian Standard Time (UT+4h)  she@DPX200
##.OBSERVE FREQUENCY= 200.1315
##.OBSERVE NUCLEUS= ^1H
##.DELAY= (6, 6)
##.ACQUISITION MODE= SIMULTANEOUS
##.ACQUISITION SCHEME= undefined
##.AVERAGES= 8
##.DIGITISER RES= 18
##SPECTROMETER/DATA SYSTEM= spect
##.PULSE SEQUENCE= zg30
##.SOLVENT NAME= CDCl3
##.SHIFT REFERENCE= (INTERNAL, CDCl3, 0, 15.7039)
##AUDIT TRAIL= $$ (NUMBER, WHEN, WHO, WHERE, WHAT)
$$ ##TITLE= Audit trail, XWIN-NMR		Version 3.5
$$ ##JCAMPDX= 5.01
$$ ##ORIGIN= Bruker BioSpin GmbH
$$ ##OWNER= she
$$ F:/spectra/data/she/nmr/H-F/1/audita.txt
$$ ##AUDIT TRAIL=  $$ (NUMBER, WHEN, WHO, WHERE, WHAT)
(   1,<2019-09-24 14:03:56.62 +0400>,<she>,<DPX200>,
      <created by zg, POWCHK disabled, PULCHK disabled
       configuration hash MD5:
       00 E9 B6 7A A2 85 ED C7 34 08 36 98 17 FE 4E 26
       data hash MD5: 16K
       F8 F5 4D 67 0D 94 BE 50 6C 08 61 81 DD AB F7 35>)
$$ ##END=
$$ 
$$ hash MD5
$$ F6 83 0F 12 56 0A C1 28 14 EA EF 80 55 17 C9 20
##$RELAX= 
##$RELAX= 
##$RELAX= 
##$RELAX= 
##$RELAX= 
##$RELAX= 
$$ Bruker specific parameters
$$ --------------------------
##$DU= <F:/spectra>
##$EXPNO= 1
##$NAME= <H-F>
##$PROCNO= 1
##$TYPE= <nmr>
##$USER= <she>
##$AMP= (0..31)
100 100 100 100 100 100 100 100 100 100 100 100 100 100 100 100 100 100 
100 100 100 100 100 100 100 100 100 100 100 100 100 100 
##$AQSEQ= 0
##$AQ_mod= 1
##$AUNM= <au_zg>
##$AUTOPOS= <>
##$BF1= 200.13
##$BF2= 200.13
##$BF3= 200.13
##$BF4= 200.13
##$BF5= 200.13
##$BF6= 200.13
##$BF7= 200.13
##$BF8= 200.13
##$BYTORDA= 1
##$CFDGTYP= 0
##$CFRGTYP= 5
##$CHEMSTR= <none>
##$CNST= (0..31)
1 1 145 1 1 1 1 1 1 1 1 1 1 1 1 1 1 1 1 1 1 1 1 1 1 1 1 1 1 1 1 1 
##$CPDPRG= <>
##$CPDPRG1= <>
##$CPDPRG2= <>
##$CPDPRG3= <>
##$CPDPRG4= <mlev>
##$CPDPRG5= <mlev>
##$CPDPRG6= <mlev>
##$CPDPRG7= <mlev>
##$CPDPRG8= <mlev>
##$CPDPRGB= <>
##$CPDPRGT= <>
##$D= (0..31)
0 1.2 0 0 0 0 0 0 0 0.06 0 0.03 0 0 0 0 0.0002 0 0 0 0 0 0 0 0 0 0 0 0 
0 0 0 
##$DATE= 1569319436
##$DBL= (0..7)
120 120 120 120 120 120 120 120 
##$DBP= (0..7)
150 150 150 150 150 150 150 150 
##$DBP07= 0
##$DBPNAM0= <>
##$DBPNAM1= <>
##$DBPNAM2= <>
##$DBPNAM3= <>
##$DBPNAM4= <>
##$DBPNAM5= <>
##$DBPNAM6= <>
##$DBPNAM7= <>
##$DBPOAL= (0..7)
0.5 0.5 0.5 0.5 0.5 0.5 0.5 0.5 
##$DBPOFFS= (0..7)
0 0 0 0 0 0 0 0 
##$DE= 6
##$DECBNUC= <off>
##$DECIM= 24
##$DECNUC= <off>
##$DECSTAT= 4
##$DIGMOD= 1
##$DIGTYP= 9
##$DL= (0..7)
0 120 120 120 120 120 120 120 
##$DP= (0..7)
150 150 150 150 150 150 150 150 
##$DP07= 0
##$DPNAME0= <>
##$DPNAME1= <>
##$DPNAME2= <>
##$DPNAME3= <>
##$DPNAME4= <>
##$DPNAME5= <>
##$DPNAME6= <>
##$DPNAME7= <>
##$DPOAL= (0..7)
0.5 0.5 0.5 0.5 0.5 0.5 0.5 0.5 
##$DPOFFS= (0..7)
0 0 0 0 0 0 0 0 
##$DQDMODE= 0
##$DR= 18
##$DS= 0
##$DSLIST= <SSSSSSSSSSSSSSS>
$$ [...]
##$SUBNAM2= <"">
##$SUBNAM3= <"">
##$SUBNAM4= <"">
##$SUBNAM5= <"">
##$SUBNAM6= <"">
##$SUBNAM7= <"">
##$SUBNAM8= <"">
##$SUBNAM9= <"">
##$SW= 24.0689530833862
##$SWIBOX= (0..15)
0 0 2 0 0 0 0 0 0 0 0 0 0 0 0 0 
##$SW_h= 4816.95568400771
##$TD= 16384
##$TD0= 1
##$TE= 0
##$TE2= 300
##$TE3= 300
##$TEG= 300
##$TL= (0..7)
0 120 120 120 120 120 120 120 
##$TP= (0..7)
150 150 150 150 150 150 150 150 
##$TP07= 0
##$TPNAME0= <>
##$TPNAME1= <>
##$TPNAME2= <>
##$TPNAME3= <>
##$TPNAME4= <>
##$TPNAME5= <>
##$TPNAME6= <>
##$TPNAME7= <>
##$TPOAL= (0..7)
0.5 0.5 0.5 0.5 0.5 0.5 0.5 0.5 
##$TPOFFS= (0..7)
0 0 0 0 0 0 0 0 
##$TUNHIN= 0
##$TUNHOUT= 0
##$TUNXOUT= 0
##$USERA1= <user>
##$USERA2= <user>
##$USERA3= <user>
##$USERA4= <user>
##$USERA5= <user>
##$V9= 5
##$VALIST= <valist>
##$VCLIST= <CCCCCCCCCCCCCCC>
##$VD= 0
##$VDLIST= <DDDDDDDDDDDDDDD>
##$VPLIST= <PPPPPPPPPPPPPPP>
##$VTLIST= <TTTTTTTTTTTTTTT>
##$WBST= 1024
##$WBSW= 4
##$XGAIN= (0..3)
0 0 0 0 
##$XL= 0
##$YL= 0
##$YMAX_a= 248252
##$YMIN_a= -369059
##$ZGOPTNS= <>
##$ZL1= 120
##$ZL2= 120
##$ZL3= 120
##$ZL4= 120
##$ABSF1= 10
##$ABSF2= 0
##$ABSG= 5
##$ABSL= 3
##$ALPHA= 0
##$AQORDER= 0
##$ASSFAC= 0
##$ASSFACI= 0
##$ASSFACX= 0
##$ASSWID= 0
##$AUNMP= <proc_1d>
##$AZFE= 0.1
##$AZFW= 0.1
##$BCFW= 1
##$BC_mod= 2
##$BYTORDP= 1
##$COROFFS= 0
##$CY= 11.3945322036743
##$DATMOD= 1
##$DC= 2
##$DFILT= <>
##$DTYPP= 0
##$F1P= 20.1720416913024
##$F2P= 0.152960286110954
##$FCOR= 0.5
##$FTSIZE= 0
##$FT_mod= 4
##$GAMMA= 1
##$GB= 0.15
##$INTBC= 1
##$INTSCL= 1
##$ISEN= 128
##$LB= 0.24
##$LEV0= 0
##$LPBIN= 0
##$MAXI= 10000
##$MC2= 0
##$MEAN= 0
##$ME_mod= 0
##$MI= 1.114404
##$NCOEF= 0
##$NC_proc= 0
##$NLEV= 6
##$NOISF1= 3.799351
##$NOISF2= 2.8
##$NSP= 1
##$NTH_PI= 0
##$NZP= 0
##$OFFSET= 15.70392
##$PC= 1
##$PHC0= -9570.028
##$PHC1= 9.200951
##$PH_mod= 1
##$PKNL= yes
##$PPARMOD= 0
##$PSCAL= 0
##$PSIGN= 0
##$REVERSE= no
##$SF= 200.130013532006
##$SI= 16384
##$SIGF1= 3
##$SIGF2= 2
##$SINO= 400
##$SIOLD= 16384
##$SREGLST= <1H.CDCl3>
##$SSB= 0
##$STSI= 0
##$STSR= 0
##$SW_p= 3612.71676300578
##$SYMM= 0
##$S_DEV= 0
##$TDeff= 0
##$TDoff= 0
##$TI= <>
##$TILT= no
##$TM1= 0
##$TM2= 0
##$TOPLEV= 0
##$USERP1= <user>
##$USERP2= <user>
##$USERP3= <user>
##$USERP4= <user>
##$USERP5= <user>
##$WDW= 1
##$XDIM= 8192
##$YMAX_p= 0
##$YMIN_p= 0
$$ End of Bruker specific parameters
$$ ---------------------------------
##NTUPLES= NMR FID
##VAR_NAME=  TIME,          FID/REAL,        FID/IMAG
##SYMBOL=    X,             R,               I
##VAR_TYPE=  INDEPENDENT,   DEPENDENT,       DEPENDENT
##VAR_FORM=  AFFN,          ASDF,            ASDF
##VAR_DIM=   8192,          8192,            8192
##UNITS=     SECONDS,       ARBITRARY UNITS, ARBITRARY UNITS
##FACTOR=    0.0002076,     1,               1
##FIRST=     0,             0,               0
##LAST=      1.7004516,     0,               0
##MIN=       0,             -369059,         0
##MAX=       1.7004516,     248252,          0
$$ Real data points
##PAGE= N=1
##DATA TABLE= (X++(R..R)), XYDATA
0@%%%%Qj6J6j6J6k4L2m0N6o5P4r0J12j36J62j94K26k62L07l56M08m67N34o11O94
29C68p82Q83r96J118j251J397j560J737j930K145k379K635k919L231l576L960
45B081m391M875n418O043o767P609q610R824j1332J3264j5838J9464k4995L4569
59B0378n5746J80982q7760l18630J95926M5578j36028M5568K79869L1045j21509
70G9673m2018m4558j69164j7061J46781R7085L6474R2688l7117j85201q0181M3097
82g9502n5584K274K31105J43524j64760j04110R6119p7848k52909M8625L02895
93H9829Q5708j04338J7481J0035j68683j01382Q5267L3529q470J57151J45114
104B41241j26914j86835j1185J04o3977P3228J72225L3843m7204J1173o9248j76642
$$ plain form
0 0 0 0 0 0 8 -8 8 -8 8 -16 16 -24 32 -33 41 -49 63 -73 89 -105 121 -141 166 -190 218 -249 285 -326 368
29 368 -414 469 -527 591 -660 737 -823 914 -1016 1129 -1250 1385 -1534 1697 -1879 2081
45 2081 -2310 2565 -2853 3190 -3577 4032 -4578 5246 -6086 7178 -8660 10804 -14191 20378
59 20378 -35368 145614 57854 -260776 -64850 -19272 -155300 -109732 170137 201182 79673
70 79673 37655 -6903 -176067 -193128 -46347 50738 87212 179900 142783 -42418 -122599 -79502
82 -79502 -135086 -132812 98293 241817 77057 -27053 69066 -8782 -261691 -213066 89829
93 89829 175537 71199 88680 98715 -69968 -171350 -86083 -52554 -61024 96127 241241
104 241241 114327 -72508 -83693 -83589 -147566 -74338 97887 131730 84526 95699 26451 -150191
116a50191k5704J35068M5916K747J27624O2227j68561j46067K7604l759l8583
127a31679J42235J74545o5974j22182M8400j0641k01503n8087K11291J46766m1994
138I1177j3174K0252j00720j20066O193M0722K9091J07460J01601n2412j00765
149I359k9063o0039q7807P0238J67258L3523m0361M1712k1422j81800q8255J21452
161f5205Q1795l2343O5013J27444n5568j77314o2958K6737M998N2715J16823M0020
173A22157m5983k7681m7781j11602l9973R3461Q8298L1321M9253J1282j09606
184A3146j09236K412K0071j983Q5100J26183n585r9713m2628k7557p8590r852
196a28232J17635R6398N216M6j8399j05774r4311K6411O4400K6768N6496Q0887
$$ plain form
116 -150191 -175895 -40827 5089 7836 135460 197687 29126 -116941 -89337 -93096 -131679
127 -131679 10556 185101 119127 -3055 45345 34704 -166799 -224886 -13595 133171 91177
138 91177 78003 98255 -2465 -122531 -116338 -75616 -46525 60935 162536 110124 9359
149 9359 -19704 -79743 -167550 -97312 69946 103469 63108 104820 83398 -98402 -186657 -65205
161 -65205 16590 -15753 49260 176704 121136 -56178 -119136 -92399 -87401 -34686 82137 122157
173 122157 76174 48493 712 -110890 -150863 -57402 30896 62217 111470 122752 13146
184 13146 -96090 -93678 -73607 -75590 9510 135693 130108 30395 -12233 -39790 -118380 -128232
196 -128232 -10597 85801 91017 91063 72664 -33110 -127421 -101010 -36610 -9842 46654 127541
208A27541j5453j04355p3526k6200j1988M4946J00969N7624j0828k2037m7120
219A9573r5459n2542N0149P1260M1117N3352L4071o3814j07459m0805P381Q458
231g4718N4410J01255M1541n0257o1547m3921n3764k4838N6343Q9282N2087J1638
243I7511k4190p0636p6901k6170K3180M7182O9414O1032j138n7508o3795n1275
255g3294l0750K6241Q1042O9398J9517j4231m2900p4595o0951M877N4932O1295
267B0581N1245K7429k5418p1045p0052k9071J6613N2678O7729M8483L901m3933
279D9140o9758n8504j5595L1190N7597O3131L9304j2632n8974o8045m2269k915
291h8330L9327O5994N8941J8929k8938o2343o3697l0949J3534M8636O5233N2236
$$ plain form
208 127541 112088 7733 -65793 -91993 -103981 -59035 41934 99558 88730 66693 19573
219 19573 -75886 -128428 -78279 -7019 34098 87450 121521 57707 -49752 -90557 -83176 -74718
231 -74718 -20308 80947 122488 72231 10684 -33237 -87001 -111839 -55496 33786 85873 97511
243 97511 73321 2685 -74216 -100386 -77206 -30024 39390 100422 99284 41776 -22019 -73294
255 -73294 -104044 -77803 3239 72637 92154 77923 35023 -39572 -100523 -95646 -40714 20581
267 20581 71826 99255 73837 2792 -67260 -96331 -79718 -27040 40689 89172 93073 49140
279 49140 -20618 -79122 -94717 -63527 -5930 57201 96505 83873 24899 -43146 -85415 -88330
291 -88330 -49003 16991 75932 94861 65923 3580 -60117 -91066 -77532 -28896 36337 88573
303H8573K997m8908o2685m7539k2504J8955O5354O9547K5653j7760m2342o1717
315c2376n4756l390M8799N9682M7714K4982k1453o5626o2835k4794R231M2163
327c2659O8656N0566l548m1235n1503n5640k9678K9917O5784N0879K6174K702
339H0415m4384p6587m4633J0053L2110M6002O1471L2000l3620o3002m6541l0356
351g7072m540M8449P2324L8261k639k5121n3893o5226k0691L4081M8722M7545
363D0200M3339m60n7986o3489k8572q211J7980O3726O7205J0396l2883l9317m9246
376c7318m7875M270N7727N6127L2073J5127k5145o7907n5652o812J9771L6786
388a8828O0728M5855j4613n1663m6488l8287k0996L1502O8509M6359R655j0745
$$ plain form
303 88573 91570 42662 -20023 -67562 -90066 -71111 -5757 63790 89443 71683 29341 -32376
315 -32376 -87132 -90522 -41723 17959 65673 90655 69202 3576 -59259 -84053 -74822 -32659
327 -32659 35997 86563 83015 41780 -9723 -65363 -95041 -65124 660 51539 77713 80415
339 80415 36031 -40556 -85189 -75136 -43026 2976 64447 96447 62827 -175 -46716 -77072
351 -77072 -81612 -33163 39161 77422 74783 49662 -4231 -69457 -90148 -56067 -7345 40200
363 40200 83539 83079 25093 -38396 -66968 -75179 -57199 6527 73732 84128 51245 11928 -37318
376 -37318 -85193 -80923 -23196 32931 65004 80131 54986 -12921 -68573 -75385 -55614 -18828
388 -18828 41900 87755 73142 21479 -25009 -63296 -84292 -52790 15719 62078 71733 60988
400F0988m0796o6598l7901J7876M1614M3753M7082J9449l8063o1695m0015j8052
412g2358O072M8498O7144K8752j5592l2283m6451n2113j5085L9216N4570M0511
424E0881K4453r180n3531n9071k4619O865K8974N4473N2296N616l6948m5588m1953
437d7332k9752J1504N4565N4778K5567k877l2124n7132m5050l465K8652M3313
449F47M9614K9107j8436n1998m7418k7723k567L4160N7884M2314M025k5377m3831
462D01m9815k7346J7103M7715M8569K9766l7l2746n1950m2823j1878K5245N0935
475C139M9012J8060j6058l7927m5643l7368m368L7013N5778L9949O190k3938m2920
488I19m5645k5841J1248M2885N0242L1959m15l2329n0732m1360q349K3529M2247
$$ plain form
400 60988 20192 -46406 -84307 -66431 -24817 18936 66018 85467 47404 -14291 -54306 -72358
412 -72358 -66286 -17788 49356 78108 62516 30233 -16218 -68331 -83416 -44200 10370 50881
424 50881 75334 66154 12623 -46448 -71067 -64202 -35228 19245 71541 77157 40209 -5379 -47332
437 -47332 -77084 -65580 -11015 43763 69330 66453 34329 -22803 -67853 -71318 -42666 647
449 647 50261 79368 60932 8934 -38484 -66207 -68774 -34614 23270 65584 69609 44232 401
462 401 -49414 -76760 -59657 -11942 36627 66393 66356 33610 -18340 -61163 -73041 -47796 3139
475 3139 52151 70211 54153 16226 -29417 -66785 -71153 -34140 21638 61587 67777 43839 919
488 919 -44726 -70567 -59319 -16434 33808 65767 65352 33023 -17709 -59069 -67418 -43889 -1642
501a642M4629K6615r403m3010n0436l2393O26L5086M8587L3954R635j3285m0230
514H733n4894k9447K0230M5865L8933K6339Q013k6117n1047m1974j1762J9153
526d7975M6021M9477J8615j6457l2111l8773l9008q720L5702M9839L3178J4858
538F4646j3334m9372n1656j2388J7425K2979L7013M5943J1499m0333n1315l1726
550e0619j0617J5685M2048M2011K0331j570k9358n6431m0623J0857L6971K8657
562G342L0848K9171j2963n3510m4530j3374K618K7958N5188L7159j1597l0746
574B3564k7682l4873k7328J4532M7389M2980K2829l685l9249m9713k1172L442
586d8966J0526L5320N5401K0368l4259m1688k5058k4845p300L7023N1623K3903
$$ plain form
501 -1642 42987 69602 60199 17189 -33247 -65640 -65014 -29928 18659 52613 62248 48963 8733
514 8733 -46161 -75608 -55378 -9513 29420 55759 63772 37655 -13392 -55366 -67128 -47975
526 -47975 -1954 47523 66138 49681 17570 -21203 -60211 -68931 -33229 16610 49788 64646
538 64646 51312 1940 -49716 -62104 -44679 -21700 15313 61256 72755 32422 -18893 -50619
550 -50619 -61236 -45551 -3503 38508 58839 57269 27911 -28520 -69143 -58286 -21315 7342
562 7342 38190 67361 54398 888 -43642 -57016 -54398 -26440 28748 65907 54310 23564
574 23564 -4118 -38991 -66319 -51787 -4398 38582 61411 57726 18477 -31236 -52408 -48966
586 -48966 -38440 -3120 52281 72649 38390 -3298 -28356 -53201 -60501 -23478 28145 52048
598E2048K082j3379m4634n2957p762L2573K9606K5432L2070N345l8728m5900k5757
611d9961r380J8613N1953M2629k94j8970k1073l8636l7951O020M1435L6051K5556
624D5992J5079k2345n2076l3272k168N766K3301N3211L5900k0252m0974k4913
636a6751k3034j9119J9097M8503L4280J0470o341l4006n0884k3346J7376K8103
648a5652K7921L3488J3134k5332l9784k9969j9691N249M1999M7027J3520r046
660D2864j6679l6850m3418n854L3372L4062K4507K2017l936m1680m2220j4146
672d7961J479J6409M2719M2828J352l1308l1591k6060j9286N588L3986L8062K4359
685E0576K285k7916m3816k7506k278J3783L1774M3254J9115k2004l2838k3630
$$ plain form
598 52048 54130 40751 -3883 -56840 -64602 -32029 -2423 23009 55079 60424 21696 -24204 -49961
611 -49961 -59341 -40728 11225 53854 53560 34590 13517 -25119 -63070 -57050 -15615 20436 45992
624 45992 61071 38726 -13350 -46622 -48790 -43024 -19723 33488 69388 49136 8162 -16751
636 -16751 -39785 -58904 -39807 8696 42976 53446 47105 13099 -37785 -61131 -43755 -15652
648 -15652 12269 45757 58891 33559 -6225 -36194 -55885 -50636 -8637 38390 51910 42864
660 42864 26185 -10665 -54083 -59937 -26565 7497 32004 54021 50085 8405 -33815 -47961
672 -47961 -46482 -30073 12646 55474 56826 25518 -6073 -32133 -51419 -45831 -11845 26217 50576
685 50576 52861 24945 -18871 -46377 -48655 -34872 -3098 40156 59271 37267 4429 -19201
697a9201k4440j3255K7797N1372K7467n272j4165k4689l9871k5505J5755L9636
709d371L2369J6633M78j9529l5520l3693j1572K0242L9373L2417J0908p497k4607
722A5631l8825l0346M536L1659L1577K2100J2705r659l7592l9969j4664J3716
734c9131K8845L2742K4230J818k5025l7798k7799n491J5708L0238L3537J9607
746E1481r238l2087l4318k0678j662K1844L7453K9819M855j6196k8942l3745k0503
759e1917J1120L2162L0257K0411N545k0130m0085l1424m586J9056K9947K9992
771C0348J6097o570k5319l4462k8128N29K8464L1815K1120J2076p207l7163l8949
784c7349q935J3656J7697K8607L3687M222l2228l4582j8298r165N711L2310L7667
$$ plain form
697 -19201 -43641 -56896 -29099 22273 49740 44468 30303 5614 -34257 -59762 -44007 -4371
709 -4371 27998 44631 45109 25580 -9940 -43633 -55205 -34963 4410 36827 47735 40238 15631
722 15631 -23194 -53540 -49004 -17345 14232 36332 49037 39378 1786 -38183 -52847 -39131
734 -39131 -10286 22456 46686 48504 23479 -14319 -42118 -47609 -31901 -1663 31874 51481
746 51481 42243 10156 -24162 -44840 -46502 -24658 12795 42614 47469 31273 2331 -31414 -51917
759 -51917 -40797 -8635 21622 42033 47578 27448 -12637 -44061 -48647 -29591 356 30348
771 30348 46445 39875 14556 -19906 -48034 -47505 -19041 12774 33894 45970 38763 1600 -37349
784 -37349 -46284 -32628 -14931 13676 47363 51585 19357 -15225 -33523 -42688 -36977 -4667 33000
797C3000J4906r205k5027l4886k3970L934K0733K4406L0303J8882j8697m0182
809e803k3877p951l276K0028M4355K5782j1711j9803j8626l1882k1791K1448L9168
822F061K0708J0651N301k3241m3042k0517O936J2580K5444L7428J3194k4080k8742
835a319j8991k1786m272L2983L8265J1850k82o051l3286l9922l356K3066J7906
848e195K2140L0686p89l9548l0506p356q237M816L9502L6989j176j7495j3671
861A0160k9314l0542Q072L4766K2271J5258J5150j4876m2869k5008K531L951J5176
874a5274M0880K5625j7292k6091j5416k5100j8554K5129M1431J4428J617N756
886C7139k2043m5861j6535J8804J5613J6443L3908J3475l0906l2390j0611j3108
$$ plain form
797 33000 47906 38701 13674 -21212 -45182 -41248 -20515 3891 34194 53076 34379 -5803
809 -5803 -29680 -37631 -40907 -20879 23476 49258 37547 17744 -882 -32764 -54555 -33107 6061
822 6061 26769 37420 42721 19480 -23562 -44079 -37143 -24563 881 38309 51503 27423 -1319
835 -1319 -20310 -42096 -46368 -13385 24880 36730 36448 30397 -2889 -42811 -46167 -23101 -5195
848 -5195 16945 47631 46842 7294 -23212 -30568 -38805 -33989 5513 42502 41326 23831 10160
861 10160 -19154 -49696 -41624 -6858 15413 30671 45821 30945 -11924 -36932 -34401 -30450 -15274
874 -15274 25606 51231 33939 7848 -7568 -32668 -51222 -26093 15338 29766 31383 37139
886 37139 15096 -30765 -47300 -28496 -12883 3560 37468 50943 20037 -12353 -22964 -36072
898c6072n955L3062M3283N603j3357p427k4491l7126l204K9234K1269J5923K3642
911D4384l281m1423l0335J131j083L457L7197L6561p259k5420j2265k1935k8307
924d8578J0679M1109K0706L524J0066j0470m2629k7991R936J4999J3572L1003
936B5926K1953j8595k9714j3627j7454j4714K4647M4761J3205r499j600j6670
948H619l9469j6400K2407K1876J3708K4746J0599l1014l5665p220k303k417K7615
961d918L9995O066j8861j2937j9669l0240q83L1602K3091Q389J5653p72l8397
974a881l3983J696J1124R006K7201K9153o353k6942j4934j6704k1075J1672M0407
987H387K2400k660J14j0324l6351k5009J2150K0883J3539K4184J6865j9103l3625
$$ plain form
898 -36072 -42027 -8965 34318 39921 26564 19137 -5354 -42480 -45684 -16450 4819 20742 44384
911 44384 41103 -320 -30655 -29524 -30607 -27150 10047 46608 39349 13929 1664 -20271 -48578
924 -48578 -37899 3210 23916 27440 37506 27036 -15593 -43584 -33648 -18649 -5077 25926
936 25926 47879 29284 -430 -14057 -31511 -46225 -21578 23183 36388 26889 25289 8619
948 8619 -30850 -47250 -24843 -2967 10741 35487 46086 15072 -20593 -27813 -30116 -32533 -4918
961 -4918 35077 41143 22282 9345 -10324 -40564 -41447 -9845 13246 21635 37288 36516 -1881
974 -1881 -35864 -34168 -23044 -14038 13163 42316 35963 9021 -5913 -22617 -43692 -32020 8387
987 8387 30787 28127 28241 17917 -18434 -43443 -31293 -10410 3129 27313 44178 25075 -8550
1000h550j3812o585o352J9754L8947J5711j1197j2733j7714k8937j0237K2368
1012a9337K3446J2120J6975N829k8705l5502p674O154O775K3002L1496M282k1492
1025A7369j7807j5787k0610J005L0051K6722O987K209o458l0332k8531O27J5766
1038a8789J5251K2960J9686q270k7114j8207j1363r891J2469L4572K1681k789
1050C0196r020j4691k8125j8686J2754K3275J5333J6423R779j6627l1926j7296
1062b8611j104M753J9062K9659J3512j1383j7701j8938k0400m847K0334K5002
1074I338J3725Q346k542k4505k9617q895R231J3632K0835K2850K597k0330k1427
1087f762j4927j1113M941K5389K5411Q130m210j3358k4547k2133P19J7582J9422
$$ plain form
1000 -8550 -22362 -28947 -35299 -15545 23402 39113 27916 15183 -2531 -31468 -41705 -19337
1012 -19337 4109 16229 33204 39033 10328 -25174 -32848 -26694 -19919 3083 34579 38861 17369
1025 17369 -438 -16225 -36835 -35830 -5779 20943 27930 30139 23681 -6651 -35182 -34555 -18789
1038 -18789 -3538 19422 39108 30838 3724 -14483 -25846 -35737 -23268 11304 32985 30196
1050 30196 21176 6485 -21640 -40326 -27572 -4297 11036 27459 37238 20611 -11315 -28611
1062 -28611 -29715 -24962 -5900 23759 37271 25888 8187 -10751 -31151 -35998 -15664 9338
1074 9338 23063 31409 28867 4362 -25255 -34150 -24919 -11287 9548 32398 34995 14665 -6762
1087 -6762 -21689 -32802 -27861 -2472 22939 31069 26859 13501 -11046 -33179 -32460 -14878 4544
1100D544J8337J1013q480k3635k1628r886O42J5672K6564J8559j456j3698j9042
1113b494k1846j0250J1353K2173J7965J2272J379j7324k7401j6049J542J1673
1125a7007J8638K1822J0593j0312k1531k0282j1969J923J6672K2587J5977L776
1137C0887j1577k3280k1399n767R182J7083K0820J5652k338j9407k1673j3566
1149b5383l701R048K1792K2548P666r501j8577k0306j3117J708J5801K2306J6593
1162B6877L708j2619k1245j8907p927O144J8350K2237J4163l348j6703k0475j5637
1175b5382m258J0195K1117K0973Q391p666j9327j9681j2383L67J4264K2168J8525
1188B7303K821j2742k0148j7236q802M049J7800K2621J3883k544j6000j9004j5933
$$ plain form
1100 4544 22881 33894 25414 1779 -19849 -29735 -29093 -13421 13143 31702 30246 16548 -2494
1113 -2494 -24340 -34590 -23237 -1064 16901 29173 30552 13228 -14173 -30222 -28680 -17007
1125 -17007 1631 23453 34046 23734 2203 -18079 -30048 -28125 -11453 11134 27111 30887
1137 30887 19310 -3970 -25369 -31136 -21954 -4871 15949 31601 29263 9856 -11817 -25383
1149 -25383 -29084 -20036 1756 24304 31970 22469 3892 -16414 -29531 -27823 -12022 10284 26877
1162 26877 30585 17966 -3279 -22186 -30113 -23969 -5619 16618 30781 27433 10730 -9745 -25382
1175 -25382 -29640 -19445 1672 22645 31036 23370 4043 -15638 -28021 -27654 -13390 8778 27303
1188 27303 30124 17382 -2766 -20002 -28804 -24755 -6955 15666 29549 27005 11005 -7999 -23932
1201b3932n852R555K1986K0415P090p891j5122j8342j5753k164J7035K3535J4733
1214B5293J101q883j6169j9638j2461N199K0114K1558J0966k555j1129j8744j8470
1227b3818o968J1206K1633J7744P279l698j5399k1085j5238J678J4715J8470J5488
1240B2007O327p522k0137k1030r051P283J6986J6983J2539K225j0938k1337j9377
1253b5042m517J1782J8620J6162R275k630j4951k0872j4744p03J4320K0023J5338
1266B2061M925q062j7259j8884j0661M013J6204J9589J3575J292j3027j9980j6342
1279b2556l816Q515J5633J7456J2116j646j7336k2596j1920K828J1157J4883J6559
1292A9277R646p127k1300j9489p401M795J3662J7790J4161K180j1725j9377j6673
$$ plain form
1201 -23932 -29784 -20229 1757 22172 29262 21371 6249 -12093 -27846 -30010 -12975 10560 25293
1214 25293 26394 17511 1342 -18296 -30757 -25558 -5444 16114 27080 24525 13396 -5348 -23818
1227 -23818 -30786 -19580 2053 19797 27076 23378 7979 -13106 -28344 -26666 -11951 6519 22007
1240 22007 28334 20812 675 -20355 -29406 -22123 -5137 11846 24385 26610 15672 -5665 -25042
1253 -25042 -29559 -17777 843 17005 26280 23650 8699 -12173 -26917 -27620 -13300 6723 22061
1266 22061 26986 18924 1665 -17219 -27880 -23867 -7663 11926 25501 26793 13766 -6214 -22556
1279 -22556 -26372 -17857 -2224 15232 27348 25702 8366 -14230 -26150 -23322 -12165 2718 19277
1292 19277 28923 21796 496 -18993 -26394 -21599 -7937 9853 24014 26194 14469 -4908 -21581
1305b1581n502Q018J7300J7934J0560l678j5773j7773j1253k991P284J9831K0563
1318B2939N076j1699j5563j3473j0842j497J3890K1677J3648Q10j0472j8075j6478
1331b0059n463O909J4592J7398J2513j529j5500j8910j2442k672J0112J8956J5128
1344A9033M958m823j3560j9732j3297M432J5855J5797J2087M763r971j9121j4976
1357a8555n397L689J4242K1417J1159n674j3264j3679j4147o297J0643J9320J4576
1370A8033O257m336j6701j8277q320K993R136J7126J7357K949j2857j6074j3075
1383a5789r167L787J8421J8227N939j707p043j7907j9094j273J3858J3775J2349
1396A4376J0043k732j8342j7781p428L85R740J9613J5193m96r811j2246j5919
$$ plain form
1305 -21581 -27083 -19065 -1765 16169 26729 23051 7278 -10495 -21748 -24739 -17455 2376 22939
1318 22939 28015 16316 753 -12720 -23562 -25059 -11169 10508 24156 24966 14494 -3581 -20059
1331 -20059 -25522 -18613 -4021 13377 25890 24361 8861 -10049 -22491 -25163 -15051 3905 19033
1344 19033 23991 19168 5608 -14124 -27421 -22989 -7134 8663 20750 25513 15542 -3579 -18555
1357 -18555 -23952 -20263 -6021 15396 26555 20881 7617 -6062 -20209 -26506 -15863 3457 18033
1370 18033 24290 19954 3253 -15024 -23344 -20351 -11215 5911 23268 26217 13360 -2714 -15789
1383 -15789 -24956 -21169 -2748 15479 21418 19711 12668 -5239 -24333 -25606 -11748 2027 14376
1396 14376 24419 21687 3345 -14436 -21864 -21479 -11739 7874 23067 22571 12760 514 -15405
1409a5405j1045O651J7613J3734R472K575j2046k1235j1976J620N541J1703J9410
1422A6612J0274q861j5627j1935j1286l797J3505K0576J0374Q98m720j4865j8757
1435a7609p303P919J2254J3611J3930J387j5164j6734r663n202M767J8710J8151
1448A9054K997o240q672j5803j5719J606J5498J3083R490Q259m851k0703j6523
1461a8524j943L604Q737J7833J4524l228j3184j1547j2468q773Q312J9008J3554
1474A5905M347r82j1305j9805j0983L896R324J2012J5984P224j1790j6664r479
1487a2316p121j890J3336K1343Q741m399p019j3003j6948m941J1168J3971J0897
1500A1819R395l04j5584j7779o980N73O797J6394J5918J284r339j0314j3677j2152
$$ plain form
1409 -15405 -26450 -19799 -2186 11548 21020 23595 11549 -9686 -21662 -20042 -14501 -2798 16612
1422 16612 26886 18025 2398 -9537 -20823 -24620 -11115 9461 19835 20733 16013 1148 -17609
1435 -17609 -24912 -16993 -4739 8872 22802 24189 9025 -7709 -17372 -22574 -17807 903 19054
1448 19054 22051 15811 7139 -8664 -24383 -22777 -7279 5804 15294 23553 18702 -2001 -18524
1461 -18524 -20467 -16863 -8126 9707 24231 21003 7819 -3728 -16196 -24969 -16657 2351 15905
1474 15905 20252 19270 7965 -11840 -22823 -18927 -9603 2409 18393 25617 13827 -2837 -12316
1487 -12316 -19437 -21327 -7991 13352 22093 17694 10675 -2328 -19276 -24217 -13049 922 11819
1500 11819 21214 20910 5326 -12453 -19433 -18860 -12063 4331 20249 21533 12194 1880 -11797 -23949
1514b3949L677J6987J4362N979L229p068j8216j4802n16P195J0496J5850J0438
1527B3662o087j4633j0770r476n067R733J9346J1725N53m867j1077j7452q859
1540b3269O911J2359J1224J0937L903j1231j7116j0398l423M177J4377J6619N518
1553B0588m755q720j3651j3934j515J3957J3813Q165N305j972j5015j7606n230
1566b0570M922R256J3181J2870J129j0868j4026j0902n900N511J4909J3366O094
1579A8972j181j0058j6883j0675J479R158J0948J2553P935o844j5704j2225n892
1592a8417Q42R582J6251J0795m6q412j2552j3575n165O369J3090J2273Q092j007
1606A8120j1221j5714q595n60O593J3103J3885N263o690j2381j3067p676J287
$$ plain form
1514 -23949 -20272 -3285 11077 17056 20285 13217 -4999 -19801 -20317 -13122 -2626 13224 23662
1527 23662 17575 2942 -7828 -17304 -22371 -12638 6708 18433 18986 14119 3042 -14410 -23269
1540 -23269 -16358 -3999 7225 18162 22065 10834 -6282 -16680 -20103 -15926 -1549 15070 20588
1553 20588 15833 7113 -6538 -20472 -21987 -8030 5783 13948 19253 17281 2266 -15340 -20570
1566 -20570 -15648 -6392 6789 19659 20788 9920 -4106 -15008 -20908 -15397 -488 12878 18972
1579 18972 17791 7733 -9150 -19825 -18346 -9188 1760 14313 22248 15404 -300 -12525 -18417
1592 -18417 -17575 -7993 8258 19053 19007 10595 -1957 -15532 -20697 -14328 -1238 11035 19127 18120
1606 18120 6899 -8815 -17410 -17970 -11377 1726 15611 20874 14184 1803 -11264 -18940 -17653
1619a7653J1380J3640R789J858p371j4490j2508l726M961J1360J3490Q973j813
1632A7890j1958j3137r267k344O911J4288J2499M526n590j1640j2860p871J040
1645a7513R733J4913J0652R68q590j2507j1086n169L529J2324J3570P988k119
1658A6693r847j3007j0794j777P713J2892J2420M848n178j1321j2404q024mJ0683
1672g107J3983R178J489o062j2411j3130n379N443J1567J2076Q223o17j0200j2995
1686e942r256k960O150J3278J3052L871m838r700j2200r803J115J0460J2548R517
1700A5292K886o056j4227j1672l636L370R759J3798R382k569r761j1423r946m057
1714a8860P073J4172J0096M169j762j0209j4748q180K718Q606J0906J1017L693
$$ plain form
1619 -17653 -6273 7367 17156 19014 11643 -2847 -15355 -19081 -14120 -2760 10730 19703 17890
1632 17890 5932 -7205 -16472 -18816 -11905 2383 14882 19408 13818 2178 -10682 -18553 -17513
1645 -17513 -7780 7133 17785 18753 10163 -2344 -13430 -18599 -15070 -2746 10824 18812 16693
1658 16693 6846 -6161 -16955 -18732 -11019 1873 14293 19141 13963 2642 -9762 -17786 -17790 -7107
1672 -7107 6876 16054 17543 11481 -930 -14060 -19439 -13996 -2429 9647 17870 17253 7053 -5942
1686 -5942 -15198 -18158 -12008 1270 14322 18193 13355 3655 -8545 -18348 -17233 -6773 5775 15292
1700 15292 18178 12122 -2105 -13777 -17413 -14043 -4284 9514 18896 16327 6566 -4857 -14803 -18860
1714 -18860 -11787 2385 12481 16650 14888 4679 -10069 -18249 -15531 -6925 3981 14998 18691
1727A8691p850j2717j0067n094J536J1698J4293O150j817o298j1683j2989k649
1740a8796Q747J1198R382P160k183j2135j3120n920J57O421J3166J2498O56p534
1754I697r485j0917p586L337J2434J1018O569J666p312j4831j0311L1N925Q150
1768a615J2218Q086m123j1901j0380p257k171Q516J4046Q744J031l518r672j3807
1782a1803o971N464J0260R239R136J994r211j2655p924l504K978J1832J3927M501
1796A7263n397p529r133j1279j565J0190J1840P542M372k938j2952j2703l284
1809a5573L215O687J1132J1172j44r268j0587q416n240M700J2353J0325M127l59
1823A4124p070j4182r854J933Q557Q635R419N634m719j2222r647n348n6Q765J4182
$$ plain form
1727 18691 10841 -1876 -11943 -17037 -15501 -3803 10490 16640 14823 8525 -3158 -16147 -18796
1740 -18796 -10049 1149 10531 17691 15508 3373 -9747 -15667 -15510 -9089 4077 16575 17231 9697
1754 9697 212 -10705 -18291 -14954 -2520 8498 15067 16733 9421 -5410 -15721 -15690 -9765 -1615
1768 -1615 10603 18689 14566 2665 -7715 -14972 -17143 -8627 5419 14163 15194 11676 2004 -11803
1782 -11803 -18774 -13310 -3050 6189 15325 17319 8108 -4547 -12471 -15975 -12997 -1165 12762 17263
1796 17263 11866 4337 -4796 -16075 -17640 -7450 4390 11932 16304 13366 414 -12289 -15573
1809 -15573 -12358 -5671 5461 16633 16489 7221 -3366 -11782 -17022 -12322 31 10356 14483 14124
1823 14124 7054 -7128 -16982 -15049 -6492 2143 11562 17196 12477 255 -9392 -14740 -14796 -6031 8151
1838H151P547j841n956r032j1258n207O077J1579R058O249l10j0038j2997n901
1852a3879L74M156J0521J2252L692o374j0011r622o997J723J0118J0744O196K297
1866A5190m725j3041j1510j648O339P310J0055P871j081j0496j0482o596k378
1879a5192N406J2569J0003J612l545q519j1140p008J915Q885J0474Q213K061p316
1893H418j1520p698k844J774Q292J3103O929l562q475q864q681k576O899J1151
1907B346Q412L626k139r562j1898n860K415O881J0041Q975K230p064j0076q473
1921a0146n183L012J0371J1058M686j235o084j0503r472j394O275R744R727M382
1935A5238l252j0239r955n366L42O584J1707Q232R25n876q784r719n181L891R758
$$ plain form
1838 8151 15698 13857 7901 -1131 -12389 -17596 -11519 60 9118 15367 15057 5019 -7978 -13879
1852 -13879 -13505 -9349 1172 13424 17116 10742 731 -8891 -15888 -14165 -4047 6697 12893 15190
1866 15190 10465 -2576 -14086 -15734 -9395 -2085 7970 15841 14760 4264 -6218 -12814 -15192
1879 -15192 -9786 2783 12786 14398 10853 2334 -8806 -15814 -13899 -5014 5460 13673 15734 8418
1893 8418 -3102 -10800 -13644 -11870 -3578 9525 16454 12892 4417 -4447 -13128 -15704 -8805 2346
1907 2346 10758 14384 12245 2683 -9215 -15075 -12660 -5779 4262 13237 15467 8403 -1673 -10146
1921 -10146 -15329 -12317 -1946 9112 13798 12563 6479 -4024 -13496 -14890 -8615 1129 10856 15238
1935 15238 11986 1747 -8208 -13574 -13232 -6648 5059 13291 14216 8340 -444 -10163 -15344 -11453 -1695
1950a695R611N784k88o917j1141q028j360N383R321R270M484k974q343j0575o621
1965a4089M34Q279R994P123K102m238j0013r670m543L593Q190R347P242k44p391
1980F116j0607p495j675M533R381R407M576k584q622r803o350N7O560R689Q842
1995A2025K327m901j0137r176m144K521Q308R762O539k60o608r614p763l089M750
2010i460R650R576M019k834p698r287o707l71O758R490P863K639m360r313r130
2025i165m325K081Q334R343O317o0o240r578p540k606M197Q734R585M538k281
2040A1334p887r304o847L5O395R392P743K366m177q493r104m603J781P518R919
2055F068O566l15o042q812q260k527L939R149Q714M407j790p043r505p109n03
$$ plain form
1950 -1695 7916 13700 13412 6495 -4646 -12674 -14034 -8651 670 9940 14424 11450 3107 -7468 -14089
1965 -14089 -13655 -5376 4618 11741 13843 9605 -408 -10078 -14621 -11028 -2838 6509 13751 13507 6116
1980 6116 -4491 -11986 -13661 -9128 253 9660 14236 11652 3030 -6773 -13123 -13066 -6506 3183 12025
1995 12025 14352 9451 -686 -9862 -14006 -11485 -3177 6585 13124 12864 6256 -3358 -11121 -14210 -9460
2010 -9460 190 9766 13785 10951 3253 -6034 -12741 -13112 -6354 3136 10999 13638 9278 -35 -9165
2025 -9165 -13490 -11409 -3075 6268 12585 12525 6285 -3293 -10833 -13439 -9242 -508 9077 13615 11334
2040 11334 3447 -5857 -12704 -12669 -6274 3118 10861 13227 9050 557 -8547 -13150 -11369 -3851 6068
2055 6068 12634 12319 6277 -2535 -10795 -13322 -9383 -234 8480 12887 11097 4054 -5451 -12560 -13063
2070a3063O604R232P579K363l190q603r356m783K130P636Q946O130R33n549r410
2085b401q251k434M420P821Q681N088j297p947r158o054k87M743R082P860L283
2100A3149l498q943q966m397J749P277Q456O610Q79n352r212p718k925M048Q294
2115e49Q127N071j732o807r182o425q30N669Q572P732K990l844p616q297n121
2130a2242J023O876R428O569M42n848q231p634k712L752O863Q441N541j070o966
2145D232r432o219j34M687Q475P717L068l268p745q198n352J068P362Q419N551
2160A0231J248m320q136q482k830L261P738Q252M719j147o536q116n790k037M518
2175g427Q967Q060K561l733o789q415m707R28O141Q198O605J695n133q871o944
$$ plain form
2070 -13063 -6459 2773 10352 12715 9525 922 -8434 -13217 -11087 -3451 5495 11625 12558 7009 -2401
2085 -2401 -10652 -13086 -8666 -845 7836 12924 11627 3680 -5478 -11532 -11819 -7076 2006 9866 13149
2100 13149 9651 708 -8258 -12655 -10906 -3629 4827 11437 12316 6964 -2248 -9966 -12891 -8843 -549
2115 -549 7578 12649 10917 4110 -5072 -11497 -12327 -6658 1914 9646 12636 8792 1176 -7121 -12242
2130 -12242 -11219 -4343 5085 11654 12096 6248 -1983 -9617 -12329 -8577 -1714 6727 12268 11198 4232
2145 4232 -5200 -11419 -11553 -6866 1609 9326 12394 9126 1381 -6817 -12169 -11101 -3739 4680 10231
2160 10231 11479 7159 -977 -9459 -12289 -9028 -1290 6962 11681 10534 3998 -4118 -9908 -11945 -7427
2175 -7427 1540 9600 12161 8428 1639 -6776 -11483 -10555 -4414 3784 10389 12084 6951 -1920 -8864
2190h864k229K406O399Q211N897j046o541q227o339j377N027Q236O241L493j898
2205I389p325q908m526J135N914P445P384R83n241p211o391m101J282P972R066
2220F867M324j565n116p521o737j575M488P197P367M286k570q308p271l647k59
2235a0040M022R094P517O52m828o892p317m540K950P914O867M284J019m930r202
2250c430o773p66L899P131Q060L551l224o581o485n405j363O231R060N659L62
2265I926k586o539q670l698K669O300P261N791K26o032p913m809k346K054Q244
2280a22Q207K754k943m836p441o690N18O471O862M946L110k381q509p956k333
2295a0343J891N438P475O234o63n404o394o459l531M366Q131O370K120J0n101
$$ plain form
2190 -8864 -11093 -8687 -2288 5923 11820 10774 4233 -3994 -10333 -11710 -6683 1553 7794 11287 9389
2205 9389 2064 -6844 -11370 -10235 -4321 3124 10508 11491 6250 -961 -7352 -11453 -10171 -2199 6867
2220 6867 11191 9626 4510 -3011 -9748 -11323 -6835 362 7729 12015 9445 1137 -6134 -9781 -10040
2235 -10040 -6018 3076 10593 11245 6417 -475 -7792 -12332 -9382 -1468 5399 9683 10702 5772 -3430
2250 -3430 -10203 -10969 -7070 61 8121 11672 8448 1867 -4618 -10023 -11386 -5155 3905 9564 9926
2265 9926 7340 801 -7869 -11567 -8898 -2598 4663 10454 10680 4648 -3265 -8074 -10420 -8366 -122
2280 -122 8085 10839 7896 3060 -4381 -11071 -10553 -4082 2780 7726 10836 8455 -54 -8010 -10343
2295 -10343 -8452 -3014 4461 10695 10032 4628 -1766 -8225 -11756 -7390 741 7111 9231 9241 4140
2310D140r099n963J110N099O271O962L079m342p712n810l693J98O302Q838M634
2325A0014r22l776o441p771k386M778O471N517M934k93p362q479l199J72L111
2340e632P019P442J788l951o022o726m529J365P112O486L823J724l478q450p435
2355i464l70L512N050O709N211j495o818o326m285j856M263Q089O384P62k117
2370G249n723p950m337K604N681N637O107J167n496p572m960j438J385O013Q160
2385F527L626k022n040o460n796j162N300O511N681K608k060o938p597k692J579
2400g935L963O955O538K89n351n861m874l857J961P540O821K684o29m588o943
2415c287o007J15L929O084O436L111l239o834n832k668p00M844P866M963j4l490
$$ plain form
2310 4140 -4959 -10922 -9812 -4713 1558 8520 11599 7257 -455 -6265 -9958 -9760 -3458 5380 10014
2325 10014 9092 5316 -1125 -8896 -11282 -6504 -33 5484 10418 10125 2763 -5716 -8915 -8743 -5632
2340 -5632 1387 8829 10617 6666 644 -6082 -10611 -9246 -2134 4352 8175 9899 6421 -2029 -9464
2355 -9464 -9834 -6322 -1272 5437 10648 9153 2335 -3991 -8276 -10132 -5869 2220 8604 9366 7249
2370 7249 1526 -6424 -10761 -8157 -2476 3161 9268 10435 4939 -2633 -7593 -9031 -7646 -1633 6527
2385 6527 10153 8131 3091 -3369 -9165 -10327 -5027 1484 7165 9773 7713 775 -6822 -9514 -7935
2400 -7935 -3972 2983 9521 9810 4459 -1402 -6276 -10133 -8172 -632 6189 8873 8244 3656 -3287
2415 -3287 -9294 -9179 -5250 834 7270 10381 7142 308 -5524 -8192 -8892 -4048 3818 8781 8767 5277
2431E277n728o839l016K958O901N338L941L21n233p670m662k53K975N942O898
2446G150K482k794n787n368m985K03N634O931M161R99k753o417o648k414K696
2461f910M833O599M741o51n267o434m480j673K802P192O423J624j842m651o889
2476d583m991R84M976O193M990J413k788o796o263k093J631N134O862M401n21
2491H549m819n879n510j911L642O611N590K813j224n747o899l900P88M088O120
2506B312N214J844l306o665n205l338J764N483O509L765k56l704o605n498j451
2521i137L500N914N607L017j581n441n968m158j47L932O700N064J323k904n625
2536I6n810l490J706N292O094M268K78m166o374n134j310K552N732N931L018j559
$$ plain form
2431 5277 -451 -7290 -10306 -7348 -447 4891 8832 9153 3920 -3750 -8412 -8665 -5690 252 7150
2446 7150 9632 6838 1051 -4317 -9302 -9099 -3465 3466 7627 8626 5873 -544 -7192 -9606 -6910
2461 -6910 -2077 4522 9263 8612 3345 -3089 -7569 -9242 -6440 752 7175 8799 6957 2306 -4583
2476 -4583 -9574 -8590 -3614 2579 7569 8982 6194 -602 -6865 -8958 -7327 -2193 4669 9070 8549
2491 8549 3730 -2149 -7659 -9570 -5928 683 6273 9086 7862 2115 -4784 -8684 -7896 -3808 2312
2506 2312 7526 9370 6064 -601 -5806 -9144 -7380 -1897 4612 8377 8121 4417 -2188 -7686 -9137
2521 -9137 -5637 277 5884 8901 7320 1879 -4089 -8247 -8394 -4462 2238 7302 8625 5721 96
2536 96 -5714 -9204 -7498 -2206 3888 8156 8434 4268 -2106 -7240 -8550 -5998 -266 5665 8683 7124
2552G124m953n883m335l48M169N860N356J722k534n837o106k894J481M809N868
2567C499M374K67l917n785n559j156K344N686N334L170j083m722o098m120k47
2582h013L571O029N223J600k623n214n748l260J385M654N924M072J030l834o327
2597a531n163j544K294M887O000L441q45m915n805m392l95L410O029M916J776
2612H163k382n014n929l430J435M716N692M136Q91l536n908n190j479J541N290
2627a004N977L299j414m257n540m204q74L448O030M777J626j650n315n787l201
2642h089Q90M435N865M337N51l156n921m642k579J998N389N648K720n49l690o070
2658b863m710JL220N327M776K170j836n324n174l173L89L975O346M083O82l369
$$ plain form
2552 7124 2171 -3712 -8047 -8395 -4226 1634 6990 8712 6178 341 -5765 -8659 -7178 -2369 3499
2567 3499 7873 8140 4223 -1562 -7121 -8277 -5933 -247 5087 8257 7174 2452 -3646 -7766 -8013
2582 -8013 -4442 1587 6810 8410 5787 573 -5175 -8435 -7050 -2396 3528 7600 8630 4796 -1531
2597 -1531 -6694 -8238 -5944 -1057 4943 8384 7539 2624 -3181 -7573 -7968 -4558 1471 6387 8163
2612 8163 5781 767 -5162 -8592 -7157 -2441 3251 7387 8278 4742 -1166 -6356 -7835 -6294 -1004
2627 -1004 4973 8272 6858 2601 -2939 -7143 -8017 -4569 1461 6238 7864 6214 899 -4888 -8089
2642 -8089 -7199 -2764 3101 7438 7989 4833 -1088 -5730 -8309 -6311 -922 4726 7446 6897 3207 -2863
2658 -2863 -7573 -7572 -4352 975 5751 7921 6085 761 -4413 -7586 -7197 -3222 3124 7207 7889 4520
2674D520n291n137k157J932N125N250L031j70l971n893m248n98L032M971N306
2689E702K338k110m893m851l740K38M134N621M079J210k685n488n124k235J854
2704e950M521N215L779l34l808o143l814j031K371N644N090K607k155m610n327
2719c945l839J106L484N131M441J269k949n117m796k429J339M488N621L505l53
2734F956l764m610m814j275K492N250M720K464j144m290n451l816J09L681N430
2749A938M082J578k918m733m897k630J331M413N431L248Q2l282n276m736j167
2764g536K393N297M289K852o14m597n208l550p7K893N519M038J611k299m788m835
2780d612k655R37M312N293L469nl116m800m613j480J969M724N169K316p64l771
$$ plain form
2674 4520 -771 -5908 -8065 -6133 -1008 4242 7273 7103 3132 -2761 -7009 -7607 -4575 396 5702
2689 5702 8040 5930 1037 -3814 -7554 -7316 -3182 2439 6518 7728 5043 -445 -5569 -7804 -5950
2704 -5950 -1429 3786 7565 7231 3423 -2720 -6534 -7565 -5194 450 5540 8147 5992 1382 -3945
2719 -3945 -7784 -6678 -3194 1937 6378 7647 4698 -419 -5215 -7644 -6305 -1817 3804 7309 6956
2734 6956 3192 -1418 -6232 -7507 -5015 235 4955 7419 6275 1985 -3466 -7282 -7173 -3492 1938
2749 1938 6020 7598 4680 -53 -4950 -7580 -6249 -1836 3595 6843 6925 3643 -1633 -6369 -7536
2764 -7536 -5143 154 4443 7295 6681 2084 -3124 -6674 -6751 -3858 1661 5699 7310 5011 223 -4612
2780 -4612 -7267 -6330 -2018 3275 6744 6739 3623 -1177 -5790 -7270 -5301 -577 4592 6908 6144 2373
2796B373n298l739L6L030N042M293J536j991m915m736k803J098L959M873L714
2811F472L20k895m667m937j483K309M067M860K579m16l648n469l469n51L023N042
2827A137M258J572j655m291m985k861P38L862M666L647J154l442m990m321j810
2842g321K074M262M977K964p58l733m472m208o36K967N024M000J841j723m387
2857H71n066k625R70L532M444M258N22l049m862m286j629J676L942N042L208p54
2873F194l707m848l522j100L315M491L725K176j217m643m950k327K01L436N073
2888B297L754N27k913m522l895j772J093M880M254L047p15l405m823l997m87K734
2904c943M698M188J884j862m078m546k601K46L301M740L907L03k183m634m438
$$ plain form
2796 2373 -2925 -6664 -6628 -3598 1444 5737 7273 5282 367 -4369 -7172 -6074 -2115 2758 6472
2811 6472 6792 3897 -770 -5707 -7190 -4881 -814 4046 6625 6209 2561 -2908 -6377 -6928 -3905 1137
2827 1137 5395 6967 5312 1021 -3964 -6825 -6087 -2225 2441 6088 7242 3800 -1190 -5511 -7321
2842 -7321 -5247 -985 3992 6956 6198 2465 -2007 -6215 -6851 -3884 1140 5140 6981 5258 871
2857 871 -4195 -6820 -5850 -2318 2126 6384 6906 3857 -1005 -5291 -6920 -5244 -1302 3740 6948 6194
2873 6194 2487 -2361 -5883 -6983 -3668 823 4548 6724 5507 864 -4086 -6413 -6212 -2776 2297
2888 2297 6051 6578 3665 -857 -4752 -6524 -5431 -551 3703 6750 6035 2630 -2193 -6190 -6677 -3943
2904 -3943 755 4943 6827 4965 887 -3659 -6260 -6014 -2713 2027 5934 6237 4054 -580 -5018
2919e018j469J223M414M549K848m02l656m746l191q23K414M378M105J865j389
2934E102l972m766k776K03L856M334L664P12k158m520m212j872J257L853M702
2949C407K965m01l259m554l426j194K167M658M677J256j007l808m445l323K70
2964f017L398M041L787J323k153m409m159k252J285L498M850K812L7l051m520
2979a530l586j474K327M389M263J877p97l896m804k661Q8K687M489L869J464k639
2995D066m121m223j889J055L687M110L124j43k706m535l596q86J777M314L818
3010C852K555j369l320m315l102j30K958M047L733J153j937l866m506j739P56
3025e230L316M757L218k45l073l950l519j554J958M143M141K135j114l402m020
$$ plain form
2919 -5018 -6487 -5264 -850 3699 6547 6145 2489 -2257 -5448 -6271 -3857 521 4626 6491 5102
2934 5102 1130 -3636 -6412 -6209 -2353 1981 5645 6357 4199 -321 -4533 -6405 -5148 -1295 3407
2949 3407 6372 5971 2712 -1842 -5268 -6462 -4295 363 5040 6296 5289 1481 -2964 -6287 -6017
2964 -6017 -2619 1422 5209 6532 4379 -30 -4189 -6441 -5156 -1658 3192 6004 6041 2990 -1530
2979 -1530 -5116 -6590 -4263 126 4389 6266 5469 1573 -3231 -5892 -5804 -3117 1372 5241 6705 4066
2995 4066 -55 -4278 -6167 -5112 -1425 2685 5809 5666 2960 -1575 -5171 -6057 -4280 34 3852
3010 3852 6407 5038 1718 -2597 -5699 -5829 -2871 1176 4909 6062 4125 259 -4247 -5986 -5230
3025 -5230 -1914 2843 6061 5816 2743 -1207 -4726 -6280 -4322 -179 3962 6097 4983 1581 -2439
3040b439l119L2K514M232L479J275j738m064l876k278P13L498M256K850J18k167
3056C286m280m046r55K057L758L776K272j220k575m368l076n93K779M481L805
3071E101P84j793l589m010k541Q89L561L975K737M28k428m177l555j062J480L655
3087e45L967K482q48k895m730k625k91K221M196L254J456j209l342m533k695J084
3103e053L285L974K592Q32k283m306l376j369J281M017L716K225q17k825l643
3118a750l509k20K619L624L578J603j625l695m037j604J73K347M347L421M70k656
3134C086m053l308j289J492L349L966J944P9l151m391l192K6K469L241L555J731
3150E554j204m056l633k129N76K466M539K923J96k129l589l635j619J495L551
$$ plain form
3040 -2439 -5558 -5526 -3012 1220 4699 5974 4236 172 -3704 -5982 -5269 -1771 2485 5335 5453 3286
3056 3286 -994 -5040 -5995 -3938 -180 3596 5868 4648 2073 -2295 -5371 -5964 -3185 1296 5101
3071 5101 5885 4092 503 -3507 -6048 -5159 -1598 2377 5114 5542 3114 -1063 -4618 -5680 -4200 -545
3087 -545 3422 5904 5056 2161 -2569 -5194 -5485 -3264 932 4186 5642 4433 1091 -3442 -6137 -5053
3103 -5053 -1768 2206 4798 5630 3347 -959 -4335 -5704 -4423 -406 3310 5535 4718 1893 -1750
3118 -1750 -5259 -5479 -2860 764 4342 5945 4320 625 -3412 -5016 -4843 -2496 1851 5272 5742 3086
3134 3086 -967 -4275 -5564 -4072 -723 3243 5187 5266 2115 -2276 -5468 -5442 -2973 268 3823 5554
3150 5554 4350 294 -3339 -5468 -4892 -2426 2113 5036 5232 3103 -486 -4121 -5740 -4245 -694
3165f94L458K319J50l473l970k403q97J869L885M154J128j533l323l688k242j47
3181e407L211L947K799R41k054m035l409j160J283L008L484K810n36l071l539
3196a728k807r83K107L786L608J043j150k578l874l070P17K778L581K742J152
3211E324k082l569l380j546O28L556L941K361o34k364l313l373j347K543L927
3226F72K855J880r53l214m284j956P3K764L533L264R34k305l448l214j783P17
3242d465L548L981J488M3j726m118l164o14J775L236L292K038r15l489l480k111
3258d681j44K304L720L367M65j647l137l376k289Q30L830L396K295J94k488m108
3274a469k697p19J500L220L820J550j241k785l597k399mK336L967K703N14j214
$$ plain form
3165 -694 2764 5083 5233 1760 -2210 -4613 -5510 -3641 244 4398 5526 3993 670 -3018 -5260 -5407
3181 -5407 -2196 1751 4550 5491 3437 -598 -4007 -5167 -3884 -876 2608 5418 4882 1811 -1728
3196 -1728 -4535 -5518 -3411 375 3983 5026 3876 1298 -2576 -5646 -4929 -2151 1430 4172 5324
3211 5324 3242 -327 -3707 -5253 -4625 -1069 2872 5233 4599 2235 -1078 -4451 -5798 -3255 672
3226 672 3527 5407 4454 1240 -3044 -5000 -4927 -2163 1370 4634 5568 3263 -185 -3399 -5182 -4465
3242 -4465 -917 3064 4552 4595 2869 -1249 -4413 -5027 -3252 -16 3276 5314 4399 910 -2570 -4681
3258 -4681 -4825 -2521 1199 4566 5031 3384 247 -3129 -5418 -4588 -758 2638 4933 5127 2639 -1469
3274 -1469 -4166 -4885 -3385 -165 3655 5205 3964 1179 -2418 -4817 -4821 -2485 1482 4185 4699 3485
3290C485l296l853j551Q96L193L193L066j94k790l434k869r88J575L811L123J534
3306D901q85k189l837k549j44K303L297K951J211j241l635l533j380O16K667L793
3322B346K430j29k070l635k681j173J297L458K938J954n56k740l639k083l39K259
3338b363K942L241J355j682l173l038j808O5K899L544K317M09k121l274k868j487
3354e042J703L032L180J983n24l148l180k542k21K001L710K674J267j651k566
3369F76l226k279L70K631L578K424M97j814l596l216q34J038K967L599J794n97
3385D012k365l225k701o79K309L114K888J265q60l123l338j762L38K240L221K777
3401D111N61k063l188k957r82O98K982L423J865m34k156l637k488l96K071K764
$$ plain form
3290 3485 189 -3664 -5215 -4319 -1126 2067 5133 4939 2149 -1285 -4154 -5142 -3567 244 3367 4901
3306 4901 4016 1827 -2010 -4559 -4703 -2400 897 3848 5059 3818 183 -3350 -4730 -4114 -1447 2346
3322 2346 4776 4647 2577 -1058 -3739 -4912 -3615 -157 2781 4735 4179 1439 -2200 -4283 -4622 -2363
3338 -2363 579 3820 5175 3493 320 -2718 -4526 -4461 -1562 1982 4299 4708 2587 -687 -3555 -5042
3354 -5042 -3339 -307 2873 4856 4332 1184 -1996 -4538 -4759 -2758 952 3626 4893 3242 676
3369 676 -2550 -4829 -4459 -1828 1750 4174 4671 2857 -739 -3955 -4789 -3751 -784 2815 4609 4012
3385 4012 1647 -1578 -4279 -4958 -2649 465 3353 4618 3758 635 -2703 -4465 -4127 -1887 1334 4111
3401 4111 4672 2609 -579 -3536 -4518 -3820 -838 2585 4450 4016 1860 -1777 -4265 -4661 -2590 174
3417A74L208J392j423k651l235j863MK692L524K312L47j585l179k781j666R78
3433c752K879L417J956l52k199l289k846l78J573L291K837J536j047k751l229
3448b354k012L28J815L454K349P18j498l221k959j146J105K236L505K057k43k151
3464A983l009k779p95J847L054K936J175j031k155l480k167J07K398L133K749
3479C966O59j782l132l015j401R98L152K622K357p0k409l077k660n50J599K747
3495DK929J422o60k429l224k135l09K605L043K387O01j124l314k695j256N38K481
3512a136L193J848L33j995l400k476r53J237L155K589K056q39k636k893k394M48
3528c863J686L153K838N32j422k836k802j713R37K505L175J961J96k166l402k183
$$ plain form
3417 174 3382 4774 3351 700 -2535 -4398 -4394 -1702 1822 4134 4481 2896 -283 -3064 -4730 -3752
3433 -3752 -873 2544 4500 4148 1949 -1340 -4186 -4564 -2991 300 3137 4673 3626 875 -2354
3448 -2354 -4366 -4038 -2223 1231 3580 4298 2800 -421 -3380 -4526 -3421 -1185 2320 4377 4134 1983
3464 1983 -1026 -3805 -4600 -2753 301 3237 4412 3381 1226 -2254 -4421 -4314 -1916 1217 3966
3479 3966 4625 2843 -289 -3304 -4705 -3707 -555 2067 4424 4354 1945 -1132 -3792 -4342 -2743 4
3495 4 2933 4355 3695 1266 -1958 -4093 -4402 -1797 1246 3633 4234 3110 -204 -2899 -4155 -3617 -1136
3512 -1136 2057 3905 4238 2243 -1157 -3633 -4586 -3349 -194 2395 4451 3612 976 -1917 -4311 -3863
3528 -3863 -2177 976 3814 4346 2924 88 -2714 -4427 -3490 -985 2190 4151 4347 2181 -1221 -3404
3544c404o75R53L116K714J476j80k790k953k072j32J883L101K132J114j293k773
3560B17l083j423O24K286L102K178K90k129l128k495q26J409K896K791J497o72
3576C534k124l423j605l59K043K664K556P80p87l151k943j469N89K533L080J935
3592C853N6j559l115k479j019J427K353K843J688l70k394k668k375n63K225K621
3608E24K782Q75j182k774k506j457J9K330K905K292n4j345l192k327r55Q67L035
3625a63K276J879k15k021l304k208J3J504K565K832O90p65k241l227j750M14K265
3642a456K830K132O24j751k782k564j469J352K440K905J966p27k113k571k326
3657c510l19J178K975K401J442p63k675l059j301j17K331K505K107R25j842k536
$$ plain form
3544 -3404 -4079 -3126 -10 2704 4180 4000 1210 -1743 -3815 -3947 -2064 1037 3169 4283 2990 217
3560 217 -2866 -4289 -3665 -1379 1723 3901 4191 2062 -1066 -3561 -4387 -2978 -82 2709 4206 3534
3576 3534 1410 -2013 -3618 -3977 -1934 730 3286 4066 3279 128 -2815 -4284 -3695 -1162 1918 3853
3592 3853 3909 2350 -765 -3244 -4263 -2836 -483 2360 4048 3678 1284 -1384 -3759 -4322 -2097 524
3608 524 3306 4181 2999 225 -2281 -3738 -3719 -1389 1516 3808 3754 2409 -783 -3110 -4065 -3198 -163
3625 -163 2113 3992 3777 1756 -1548 -3756 -3743 -2239 326 3158 3848 3083 842 -2385 -4135 -3721 -1456
3642 -1456 1374 3506 4130 2379 -403 -2967 -4436 -3084 -644 2261 4227 3500 1387 -1184 -3510
3657 -3510 -3829 -2651 324 2725 4167 3404 729 -2330 -3631 -3748 -1417 1088 3195 4120 2278 -258
3673b58k729j139J125K350K350K056l5k370k303k549o86J424L059K529J134n99
3689C359k567k476k127K47J909K758J870P56j391k294k671j112N04K173K929J901
3705C768k54k116k385k363m37J120K962J944J583p54k489k362k198N22J647K592
3721G80K450O10j346k512k652r29L40K466K748J585oj589k970k393l24J276K331
3738a35K889J077n83k351k502j954k31K221K436K589mr50k371k502j318M77K296
3755i16K658J694O7j842k519k183m77Q90K524K657J160o59k386k208j927q3J411
3772b139K904K215J029j359k625k636j064M77J915K773K078Q3j962k490k375n57
3788c733J066K817K267J116k71k380k397k094R6J641K272K634N58q71k566k422
$$ plain form
3673 -258 -2987 -4126 -3001 -651 1699 3755 3720 1350 -953 -3502 -4188 -2764 295 2824 3958 3359
3689 3359 792 -1684 -3811 -3564 -1655 1103 2973 3729 2338 44 -2627 -3739 -3235 -1062 1867 3768
3705 3768 3514 1398 -987 -3350 -3787 -2667 295 2239 3822 3068 579 -1783 -3981 -3459 -1812 780
3721 780 3230 3840 2494 -18 -2670 -3599 -3259 -793 1955 3540 3534 1945 -1025 -3418 -3742 -2466 -135
3738 -135 2754 3831 3248 897 -1605 -3559 -3790 -1569 867 3456 3452 2502 131 -2371 -3689 -3212 -916
3755 -916 1742 3436 3503 1661 -858 -3041 -3518 -2628 -104 2553 3713 3054 668 -1540 -3467 -3550 -2139
3772 -2139 765 2980 4009 2650 25 -2611 -3675 -3198 -1283 1490 3568 3651 1689 -801 -3176 -3733
3788 -3733 -2667 150 2417 3533 3262 882 -1515 -3609 -3513 -1872 400 3034 3592 2721 155 -2267
3804b267j092r0K504K641J648K0j358k517k226p74Q60K620K278J523n39k453k242
3821a464j771k93J623K391K252R10j101k249k034j663P48J203K733J914J96j610
3837A785k111k294p48O93K293K471J335j18k063k669j929j24J660K404J964Q78
3853C427r50k012k471j525K32K010K670J716K72j563k261k139r70Q58K312K384
3869A990J255k46j722k313j979k12J176K090K588Q82q02k170k488j373M60J272
3885a592K441K212K40j197k255k333r91J056J856K438J330m1j730k400j970k28
3901c164Q58K092K549J028l27k492k302j324J03J397K479K053K03j108k134k301
3917b390j330Q32K115K399J603j83j842j928k186k80J132J995K252J084n11k127
$$ plain form
3804 -2267 -3359 -3449 -945 1696 3344 3364 2006 -511 -2737 -3511 -2651 -31 2247 3770 3231 778 -1464
3821 -1464 -3235 -3528 -1905 486 2738 3648 2547 298 -1736 -3399 -2651 -1448 1285 3199 3395 1785
3837 1785 -326 -2620 -3368 -2675 -382 2089 3424 3306 1243 -1426 -3355 -3479 -1819 585 2549 3427
3853 3427 2477 465 -2006 -3531 -3299 -1289 1381 3097 3369 1806 -455 -2594 -3564 -2706 -394 1990
3869 1990 3245 2999 1277 -1036 -3015 -3227 -2051 39 2627 3509 2707 537 -1951 -3324 -2864 -1592
3885 -1592 849 3061 3301 2104 -151 -2484 -3475 -2419 -563 1875 3205 3164 1434 -966 -2936 -3164
3901 -3164 -2306 -214 2335 3363 3036 544 -1758 -3082 -2979 -1582 897 2950 3153 2045 -89 -2390
3917 -2390 -3720 -2888 -773 1626 3229 3046 1204 -724 -2910 -3190 -2058 -63 2189 3273 2762 635
3933F35k321j606P7J768K368J708N87q44k171k237j476O81K278K113J719j04j755
3950A420k064k225n78J288K363K080P15l6k303k260j378k09J759K277J569P79
3966C197j035k141k062j131M09K236K176J216K61j027k882k090m36J178K072K196
3982B137J048l64j910k702j255k12J360K547J952M29n78k519j930j223P01J658
3998h61K272J509J95j769k044j660r69Q59K171K138J075j36j949j921j739k58
4014c087J336K462J680O85p02k281j995j220K83J853K293J674L04j499k429j552
4030b195j047Q44K153K023J171l5j752k402j359m11J299K286J744Q25o54j892
4046E98k034j528K69J408K473J510L75j469k085j951p00P92J866K140J322j69
$$ plain form
3933 635 -1686 -3292 -3215 -1447 921 2629 3216 2372 201 -2036 -3512 -2831 -553 1560 3279 3175 1420
3950 1420 -644 -2869 -3447 -2159 204 2284 2999 2963 660 -1600 -2978 -3187 -1428 849 2418 3197
3966 3197 2162 21 -2041 -3172 -2763 -527 1649 2865 3126 2099 -783 -2873 -3309 -2131 -59 2137
3982 2137 3185 2821 911 -1791 -3046 -3258 -1898 649 2601 3030 2452 -67 -1997 -3220 -2519 -861
3998 -861 1411 2920 3115 1346 -698 -2358 -3327 -2468 -297 1841 2916 2780 831 -1090 -2829 -3087
4014 -3087 -1751 711 2391 3076 2374 93 -1902 -3122 -2839 -986 1307 2981 3285 1786 -643 -2195
4030 -2195 -3242 -2398 -245 1778 2949 2914 1162 -1240 -2599 -3010 -1711 575 2319 3144 2490 598
4046 598 -1436 -2964 -2695 -1287 1186 2696 3071 1602 -483 -2434 -3134 -2342 -476 1664 2986 2817
4062B817j649k395j665j60J478J750K013R73p32k070j798j564L06J598J948J815
4078B665L42j170k263k140n19J014J759J863J596l81j774j818j807n93J427K259
4094D60J773P54q79j613k032j486J47J756J984J749L82j212j959k170o78J006
4110b018J425K081J215n1j735k013j590m2N78K493J550J012n97j626k074j545
4126b937K11J562J906J575Q75j379j797k059j000M43K225K049R12J41j551j962
4142g86j791n24J188K103J832R55n60j726k028j632K66J520J893J904M66j224
4158A856j859k129r40O27J764K242R70L25j447k238j771l56Q44K073J987J094
4174C042o43j737j987j313k17J597K177J569J34p48j767k120q33M58J750J811
$$ plain form
4062 2817 1168 -1227 -2892 -3052 -1574 176 2189 3162 2430 360 -1438 -3002 -2696 -1098 850 2665
4078 2665 3007 1837 -426 -2566 -3085 -2071 -312 1551 3147 2766 992 -826 -2633 -3226 -1799 460
4094 460 2233 2987 2108 495 -1537 -3023 -2876 -1120 864 2613 2995 1783 -176 -2346 -3024 -2018
4110 -2018 -593 1488 2703 2652 917 -1096 -2686 -2728 -2150 343 1893 2905 2308 682 -1392 -2937
4126 -2937 -2726 -1164 742 2317 3192 1813 16 -2043 -3043 -2600 -375 1674 2586 2727 1176 -786
4142 -786 -2577 -3101 -1913 190 2022 2977 2417 691 -1337 -2969 -2703 -1183 710 2614 3080 1856
4158 1856 -3 -2132 -3072 -2445 -681 1561 2531 2856 1409 -829 -2600 -2956 -2112 -39 1948 3042
4174 3042 2399 662 -1325 -2638 -2855 -1258 919 2488 2622 1874 107 -2013 -2846 -2388 -638 1173
4190A173J383m4j264j747j688l38N86J885J961J160q12j466j942j480p7J437J978
4207G05J439O71r72j840j658r21M53J068J900J606J36j374j589j765r32J275J676
4224a22J720Q08R6j850k212q79M4R11J984J898L61j076j795j835r30N13J344K317
4242A297R35N36j380j887j714m63P11K054J193J149P4j715j968j594l3J419J566
4259A80K060N83r75j943j547j036N94J358J762J276M02r95k223j629m04P17J768
4276e2J650J081k29j662j717j535r2R84K153J644N90p43j720k143p58J01J490
4293i58K186J291m7r03j867j772n86Q02J788J570R09j14j421j825j314m13J257
4310a417J803J596O10p85j295k208j086N10J383J750J555j1r30j832j421q06M45
$$ plain form
4190 1173 2556 2512 1248 -499 -2187 -2525 -1939 -54 1907 3067 2255 789 -1153 -2633 -2710 -1273 705
4207 705 2144 2815 1843 3 -1655 -2576 -2123 -1055 845 2451 2587 1213 -376 -2141 -3073 -1798 -122
4224 -122 1598 2406 2502 652 -1560 -2439 -2395 -1484 500 2398 2759 1683 -112 -1947 -2877 -2364 -1020 1297
4242 1297 2232 2768 1388 -499 -2213 -2676 -1965 89 1282 2431 2505 790 -1178 -2772 -2805 -1386 180
4259 180 2240 2823 1848 -95 -1642 -2678 -2084 -726 1036 2312 2714 1719 -504 -2133 -2537 -1820 -52
4276 -52 1598 2679 2450 788 -929 -2464 -2556 -1572 581 2225 2815 2072 352 -1791 -2549 -2448 -958
4293 -958 1228 2519 2472 1569 -298 -2070 -2656 -1854 -66 1504 2413 2299 878 -947 -2261 -2674 -1417
4310 -1417 386 1982 2592 1807 512 -1696 -2782 -2272 -889 861 2416 2405 1475 -357 -1778 -2584 -2139
4327b139J967J539J293m01j433j772j238n88J063J787J754Q72n64j709j948j104
4343b621J14J406J914J519J66j112j592j589r40P55J473J902J246k75j245j948
4359h27j266p13J243J636J878N16o35j297k096j270P73J095J595J454K49p19j823
4376b07j538j000O22J852J652J276q4j767j467j501m59J334J704J424P15n79j804
4393A73j675j025K44J094J582J837K78r15j667j523p27L35J578J596J014K48j624
4410H23j720j170m46J125J362J434J347p43j254k270p87J83J090J688J407P00
4426B769r60j894j300j210P24J444J503J582k60j260j492j723l42Q25J652J686
4442A744P24n26j496j507j270J98J148J741J097M16p73j529j807p16M72J352J654
$$ plain form
4327 -2139 -172 1367 2660 2259 826 -946 -2184 -2772 -1709 78 1832 2704 2140 431 -1517 -2621
4343 -2621 -2507 -1101 813 2332 2498 1386 -206 -1795 -2735 -1980 -507 1395 2641 2366 1121 -827
4359 -827 -2093 -2806 -1563 73 1951 2467 1832 535 -1561 -2831 -2058 -963 632 2086 2335 1616 -207
4376 -207 -1745 -2745 -2123 -271 1381 2657 2573 806 -661 -2162 -2621 -1287 417 1841 2556 1977 173
4393 173 -1502 -2527 -2283 -1189 393 2230 2508 1593 -74 -1597 -2324 -1989 -411 1185 2199 2447 823
4410 823 -897 -2067 -2513 -1388 -26 1408 2755 2012 758 -1512 -2299 -2116 -1026 662 2069 2769
4426 2769 1809 -85 -1385 -2595 -1871 -427 1076 2658 2398 1138 -354 -2077 -2419 -1594 58 1744
4442 1744 2468 1942 446 -1061 -2331 -2133 -985 756 1853 2269 1496 -33 -1840 -2556 -2084 -732 922
4459I22J346j55j026k051j111R8J55K090J015J162m79j423j678j348M76Q21J868
4476F82J209P02r93j659j479j102Q40J193J246J755j18j175j663j644k92Q00J720
4493B2J559P46l75j309j661r70l48J270J514J609M91o68j782j362q90M9J754J363
4511A012J182r8r30j708j364l37M16J578J701P71l93j246j444j351j25J098K162
4528I24Q54M02o54j277j618q29M83R15J827J218J41j130j751j290m70O38J369
4545b48J770P55l67j177j571j222n3R23J487J614L35q31j101j712q68L39J200
4562g27J591R18L81q68j585j637m88P01J492J262J215n16j260j203j289m77J207
4579a283J767J272O52q73j393j428j151M13J233J477J361K69p29k146j209l79
$$ plain form
4459 922 2268 2113 1087 -964 -2075 -1977 -1822 268 1283 2445 1966 543 -1135 -2483 -2007 -1186 682
4476 682 1891 2593 1600 -59 -1538 -2640 -1800 -607 639 2394 2276 1101 -562 -2206 -2498 -1698 22
4493 22 1581 2327 1952 643 -1018 -1988 -2336 -1066 448 2057 2548 1880 98 -1264 -2154 -2105 -351 1012
4511 1012 2194 2096 1166 -542 -1906 -2243 -1827 -249 1452 2223 1830 584 -860 -2211 -2336 -1238 924
4528 924 1778 2180 1526 249 -1369 -2198 -1715 -800 1027 2245 2386 1256 -495 -1785 -2255 -1617 -248
4545 -248 1522 2277 1910 733 -838 -2060 -2113 -1190 297 1911 2246 1415 314 -1398 -2266 -1927 -727
4562 -727 864 1782 2163 1295 -290 -1927 -2415 -1714 -222 1040 2255 1739 479 -724 -2013 -2490 -1283
4579 -1283 484 1756 2408 1535 142 -1286 -2437 -2024 -791 686 2047 2316 1587 -559 -1768 -2147
4595b147N12J410J705N93p3j614j103j412k6J189J075J592J56J50j865j341p82
4612a981J72J060J832J014J90j013j664j369j33L20J362J639Q30m59j075j379
4628f54j378p7O65J516J258N86k12j496j083j392L47Q95J618J344O4q45j252j360
4646a456p01L66J441J514R04l30p71j527j296j48R89R82J643O90k88j581j602
4663a171o70k71J069J617J356O7n37j612j453o59N08J409J281R26J71j073j330
4680c72j569k57Q07J140J713P65m14j256j451j080l2J008J809R21J72n66j404
4697f6j688k57K84J085J609R14p8q34j356j520l36P76J090J780N15k78r77j710
4715a047n14n78J137J612J191J32m08j468j177j025M40J123J508Q66J05j192j131
$$ plain form
4595 -2147 -1635 -225 1480 2073 2000 386 -717 -2129 -2155 -966 109 1701 1857 2007 142 -1199 -1981
4612 -1981 -1809 -749 1083 2097 2287 1274 -390 -1759 -1892 -1572 -210 1429 2259 1800 725 -654
4628 -654 -2032 -2109 -1444 72 1330 1916 1704 208 -875 -2267 -1920 -1025 593 1937 2001 1156 -96 -1456
4646 -1456 -2157 -1791 -350 1164 2068 1738 967 -560 -1856 -2004 -1015 -33 1610 2300 2012 431 -1171
4663 -1171 -1841 -2112 -1043 574 1930 1997 1460 -152 -1605 -2264 -1756 -347 934 1860 2031 958 -372
4680 -372 -1941 -2198 -1391 -251 1462 2227 1813 557 -894 -1974 -2006 -998 811 1732 1904 1338 -66
4697 -66 -1754 -2011 -1727 -642 967 1881 1803 969 -387 -1907 -2243 -1467 -377 1403 1918 1640 663 -1047
4715 -1047 -1561 -2139 -1002 610 1801 1933 1525 57 -1120 -2145 -1705 -582 926 1792 1897 705 -426
4732d26r35r87J132J131J385N68j80j062j342j104q1P57J566J066M69n35j477
4749e5j012q44Q3J317J592Q07k15m29j775j237J2L62J333J348O48j19j159j632
4767i75o49l12N42J937J065M10q79q62j500p53N57O83J725P30L17r10j349j330
4785a553l01J49J503J079Q95kq54j500j040n11P44J759J180K76m76r76j769l53
4803a750j67J354J314J022J67q03j480j031n21P74O93J467Q70k38q50j246j055
4820a480m40R78J157J060N40l78j401r67q77L9J398J063P69N48j074j098j186
4837a349l18J6J144J509P79j18r62j087j049k48L75J569J032P95n31j204j478
4854a125n83J00Q38J577O85K27l63j495j244o26O32Q71J626N83j54r29j205p87
$$ plain form
4732 -426 -1361 -2348 -1216 -85 1300 1868 1688 626 -716 -1820 -1901 -1144 422 1488 1957 1422 -55
4749 -55 -1067 -1911 -1828 -511 1081 1888 1673 1244 -531 -1768 -1756 -1394 -61 1287 1935 1816 657 -975
4767 -975 -1624 -1936 -1394 543 1608 2018 1139 277 -1223 -1976 -1419 -736 989 1719 2036 1126 -223 -1553
4785 -1553 -1854 -1705 -202 877 1772 1770 916 -584 -1624 -2135 -1391 368 1548 1824 1348 372 -1397 -1750
4803 -1750 -1917 -563 751 1773 1940 1137 -343 -1374 -1895 -1121 -428 1039 1909 1671 821 -425 -1480
4820 -1480 -1920 -942 215 1275 1815 1437 36 -931 -1808 -1769 -371 692 1461 2009 935 -163 -1349
4837 -1349 -1667 -1651 -507 1002 1781 1663 701 -386 -1435 -1683 -1308 261 1293 2088 1557 353 -1125
4854 -1125 -1708 -1608 -770 807 1492 1719 1356 -139 -1383 -2009 -1377 -506 1120 1703 1549 620 -585 -1372
4872a372m44N68J245J110Q97n54j266j078r00n4R27J323J136M56p32j309q84r68
4890a899M59R53J498P87r5r70j445q98m77R51J005J325N36k44j103j142j305L57
4908a707J105R18J287L01o34j257r68p97N8J458J288Q48q6q80j427j049k77K91
4926a528J490J156Q74m66q52j477j058K59R59Q37J001P26n50j306j042r83L08
4943a652J137J388R76k41r55p30j420P8L06R08J322P32l07r23j599m80k78O16
4961a122J490J080J30n13r15j232o49L45P52J464O22K28m92j677o91o73M87J199
4979a67J411P40r34m87j376m65j70P66J040J157K30n34j043j319n43J54J159J303
4997I22Q57j5q46j178j153O6l0J352R73P24l68j068p63q82j4N82J057J214M34
$$ plain form
4872 -1372 -1816 -1248 -3 1107 2004 1450 184 -894 -1794 -1848 -921 402 1538 1994 1262 -47 -931 -1899
4890 -1899 -1440 -487 1011 1798 1703 733 -712 -1610 -2087 -1136 -131 1194 1730 1486 383 -759 -2064 -1707
4908 -1707 -602 316 1603 1904 1270 13 -955 -1752 -1694 -236 1052 1900 1814 934 -493 -1542 -1819 -1528
4926 -1528 -38 1118 1992 1526 674 -803 -1861 -1602 -643 194 1195 1921 1371 65 -977 -1960 -1652
4943 -1652 -515 873 1849 1608 653 -77 -1497 -1419 -1113 -205 1117 1849 1542 619 -980 -1460 -1738 -1122
4961 -1122 368 1448 1578 1065 150 -1082 -1731 -1386 -634 830 1452 1680 1188 -489 -1180 -1853 -1366 -167
4979 -167 1244 1984 1050 563 -813 -1278 -1448 -682 358 1515 1745 1211 168 -1151 -1694 -1540 -381 922
4997 922 1779 1764 918 -260 -1413 -1347 -1377 -25 948 1672 1304 236 -527 -1409 -1423 -841 216 1430 1864
5016A864o30r88j355m50J94R88J145Q02j85l65j149j015p55O19J291P86Q36k66
5034A367o46j335p57l46R24R40J011M64l72j053j250p31K03Q41J056J056K05o42
5052I35j255j226j78N54Q19J315O79Lj243q01j063r9M80J352Q18O48n20j109j376
5071a267j62n2Q96J281Q02qn56j249o61o18K79J163J003M77R6o46j308p72l06
5090a608L92J138J015O36n92n93j141p52K02O38J240N39K16n26r38j159j09L60
5108a042N54J247O01m0n87j125j141l43Q75R33J291J84j68r25p52j068K04P99
5126e03R36R66L37r04r64j049k07K01Q99R82Q71P0r71j122p76m29N82J006J011
5145I36O25l87n80j164q89Q2M94J456P55J2o04p71j308m60Q13J069K30J163Pp46
$$ plain form
5016 1864 1234 246 -1109 -1559 -1365 -377 768 1570 1385 1020 -129 -1144 -1899 -1280 11 797 1633 1367
5034 1367 721 -614 -1371 -1717 -793 147 1158 1622 1250 197 -1053 -1784 -1581 -740 316 1372 1577 935
5052 935 -320 -1546 -1724 -1170 -351 964 1643 1646 403 -398 -1461 -1560 -1080 272 1090 1738 1218 109 -1267
5071 -1267 -1429 -1481 -585 696 1498 1490 934 -315 -976 -1594 -1315 -152 851 1328 1424 778 -530 -1302 -1608
5090 -1608 -1216 -78 937 1573 981 388 -753 -1505 -1303 -665 575 1114 1330 804 -134 -1293 -1402 -1042
5108 -1042 -488 759 1360 1320 733 -392 -1533 -1876 -1001 -68 1223 1407 1239 314 -438 -1506 -1302 -503
5126 -503 433 1399 1736 832 -132 -1181 -1388 -1187 -288 694 1565 1635 664 -458 -1234 -1663 -1081 -75 936
5145 936 1561 1174 594 -570 -1459 -1377 -883 573 1328 1340 736 -35 -1343 -1803 -990 79 309 1472 1479 733
5165G33j155o79m32N36Q17J021O99m68o77j421m26o9P36J336P24R8n30q55r52
5184i64n29K59R61N95J212k35p31n74j081l63M04P43J591K89m50n56j182r12j8
5203a541O55J181P92M52m70j154q03p23N44N27J020P93L28j043n82q44m38Q2J297
5222G3Q80O17k10o28j670n52OP56J212O96M10o80r84o40o63J59P28Q41Q40J26
5242A317m20q72p96o99K66R24J002Q07k60r40j007o08p9L28J521P46J42l95r13
5261F4r34o26J59Q29J130O99K58r75p21j186j27J62J242R65N23m34o73r72p67
5280a384k25P74J000P87N07p93o08j133k03J89M89R58R16K19p42r48j032k15K53
5299a191R07Q29P95j99o53q74q51l0N57Q69R86O68q95o85j093l48Q8N64R56R34
$$ plain form
5165 733 -422 -1101 -1533 -997 -180 841 1540 1072 395 -1026 -1452 -1521 -785 551 1275 1373 843 -12 -964
5184 -964 -1493 -1234 -273 322 1534 1299 568 -6 -1087 -1450 -1046 -303 1288 1577 1127 571 -611 -1523 -1541
5203 -1541 -886 295 1087 1539 1069 -85 -888 -1611 -1067 -540 480 1273 1601 558 -24 -868 -1306 -1224 73
5222 73 953 1570 1360 732 -938 -1490 -1484 -728 484 1180 1590 910 -74 -714 -1377 -1218 -490 351 1191 1317
5242 1317 897 25 -771 -1470 -1204 -280 722 1529 1269 329 -678 -1286 -1365 -1037 484 1230 1372 977 64
5261 64 -870 -1496 -1337 -508 622 1321 1579 604 -117 -1303 -1430 -1268 -26 939 1462 1028 355 -617 -1384
5280 -1384 -1609 -835 165 952 1459 666 58 -1075 -1278 -1089 -600 358 1274 1493 751 -197 -1229 -1444 -1191
5299 -1191 -284 545 1340 1141 488 -386 -1237 -1267 -710 159 1145 1813 918 233 -860 -1208 -1120 -556 400 1334
5319A334K01r96q76n91m11J85J082O07R15j25q61j062n64j45N53Q25Q69N71m07
5338A104q02j319l46J79P81Q66R22j34o38l49j320k04K09P58P16Q33q8o78j269
5357g79m96K97J7J185N95N76k88q14j039m39O1L36J462M67M7l40o78j162l52P3
5377a271J052P40P90j94j05j529o01k03O03Q11Q60L10k78p68o72p61j23P16J121
5396D98Q72l72k72n93q60p62M26P90R48N75j23m93j084p83q1M12J035Q80K76k29
5416A060q93r61n62K89N60Q32O24L16k36j048r55j15p7Q86R37N86j41m85o46j043
5436a072qK85P18O86P58o7j172o66o38R9O31N02J077J65m67q60p61n55K53O94
5456c98J079N92N3p39r15n31p27P83P91O08Q86k92o66j057p44L44K51P91P92L26
$$ plain form
5319 1334 1535 539 -337 -928 -1339 -1154 -72 535 1450 1325 464 -598 -1162 -1307 -754 71 940 1511 1104
5338 1104 302 -1017 -1363 -1184 -403 463 1385 1251 613 264 -1056 -1260 -1051 -293 423 1256 1168 490 -779
5357 -779 -1275 -978 -961 224 819 1395 1107 293 -746 -1185 -1124 -788 674 1141 1188 848 170 -992 -1344 -1271
5377 -1271 -219 521 1311 1117 1012 -517 -1118 -1321 -718 93 953 1263 985 217 -455 -1216 -1339 -623 498
5396 498 1370 998 726 133 -727 -1489 -1063 -273 675 1250 1127 634 -450 -1233 -1314 -902 133 1013 1289 1060
5416 1060 167 -794 -1356 -1067 -507 325 949 1265 1029 -19 -974 -1089 -1166 -280 657 1243 1102 617 -29 -1072
5436 -1072 -1080 -795 -77 609 1367 1300 128 -538 -1176 -1077 -446 56 1133 1298 831 -29 -790 -1345 -1092 -398
5456 -398 681 1273 1326 587 -328 -859 -1586 -803 -12 596 1482 1190 524 -533 -1277 -933 -682 109 901 1227
5476A227l69j003p25j81k0O79R82M27L15n79r54p97j58J90Q09J168K25k74n68
5495C94r00n98j81P23P19P31N39n27q94q33o38N55O92O98O06P0m78q16q45k82
5515a265L13J028M03O33p4o26r29n14j01O15Q12Q00l8Ko67j260j93r7O41O97P37
5536I17M44o98m56j220NM55M48P22R96k41n72j096n03m24M13N08J320K87m03o73
5556B29j020l18k7O41Q20J044k69j44r75r04k71L14M38R61P07K4o29r88l03m99
5576a169L20R84N23O92l39r78p92l28OO33P78O91M65n74r05p66l45p5P71R47L84
5597I23J8l80j045m22l49L80Q88Q70K49l98n14o35o23j72N91R40O63L78r89n18
5617a45m90m74J29O88J001K98j98m92m8j303l70P03R05Q2R06k2o05r47p76J55
$$ plain form
5476 1227 858 -145 -870 -1051 -1071 -392 590 1017 1332 753 -201 -998 -1156 -966 -157 1011 1236 962 394
5495 394 -506 -1104 -1285 -562 157 888 1427 900 6 -827 -1465 -910 -218 480 1086 1156 678 -138 -983 -1265
5515 -1265 -952 76 479 1112 1038 412 -517 -1031 -1132 -517 295 1095 1057 1059 392 -868 -1061 -1158 -517 180 917
5536 917 1361 663 207 -1013 -1008 -553 -105 617 1613 1372 800 -296 -799 -1223 -810 -302 1018 1305 902 229
5556 229 -791 -1109 -1136 -495 325 1369 1100 956 -19 -923 -1194 -880 -442 519 1226 1250 621 -367 -670 -1169
5576 -1169 -849 135 658 1350 1011 33 -759 -1087 -1081 -448 330 1021 1486 912 7 -759 -1104 -1179 -408 539 923
5597 923 941 561 -484 -906 -1255 -875 13 883 1132 734 220 -415 -1038 -1210 -619 321 984 1362 373 -145
5617 -145 -635 -1109 -980 -292 709 1007 809 317 269 -1034 -1404 -701 204 286 1192 1170 565 -382 -1158 -1003
5637a003M18Q62O23m0o2o81j038J24k82P02J037J91K74p06n12j187L09j54J184
5656E9Q51J21l32n08p93k70j07M90P16P28P2n18l49p18l50R4M00Q99L33j0l59
5677D49q10m37n0j60J055M44P40k28p12n61o87j09N74O75N75M38m61r98o47k18
5697a128L09L23O90O54N20p74o96r65n3M83N03Q45K56j45p36n79m15j73M61R10
5717B90O34Nk80o79q76m03O04L96P10K84m6j57o23p39l80K38P70P45L71J75r39
5738A00j56r44r1N45O56N15Q34n50p45q05k54o4R03L66K64L22n18m80p62j14J22
5759h56O87R90K71l36j41j225k85k18P18N52O24K59R7j221n83J2j24M12Q44M82
5779I59J8k52p83m70m32K06N08P23L86m1k86j151k43k05N98P30L61M67n15m96
$$ plain form
5637 -1003 -585 277 900 860 798 117 -921 -797 -1079 -377 660 851 1125 419 -93 -1280 -971 -1125 59
5656 59 910 1031 699 191 -602 -872 -979 -489 227 955 1027 509 160 -558 -908 -814 -414 485 818 808 449
5677 449 -361 -798 -848 -1008 47 491 1231 1003 291 -270 -957 -1066 -492 183 758 1196 735 -263 -910 -1128
5697 -1128 -819 -496 194 848 1368 594 -102 -1067 -1120 -637 -134 711 967 822 86 -493 -908 -1081 -620 290
5717 290 924 929 649 -30 -906 -1309 -705 -309 401 685 639 482 -141 -880 -1260 -1022 -252 493 864 1039 100
5738 100 -56 -1000 -1091 -546 110 625 1459 909 164 -641 -895 -959 -56 310 574 896 378 -102 -864 -978 -856
5759 -856 -169 821 1092 756 615 -610 -895 -1113 -395 157 781 1040 1137 -84 -667 -655 -779 -367 477 959
5779 959 977 725 -58 -528 -960 -754 -246 477 863 822 536 -615 -858 -1063 -465 265 626 1093 578 82
5799H2o81j54k3L58P44Q06k52j96m34r31m14N76P06M15K74k6l97r38l53o2K00
5820g00O32P22L38j92m58j009m78N8Q66P43L67J26k86q39p80n0J25N77Q92M09
5840A063k48l41n82q69O6J00P18Q20J46p7r30m42m63K19M02P24N49J93n38n61
5860e1q54j55M62K60P34P03m48l41m92o70l15P31O16L13N76q2p97n47o75R6M44
5881d92P08P04j01Mp31p38o51K89O45P16N77j05n13k54q91J43k9O17R22K06l75
5902F51l48o85o58L11K49J064J81L45l04q14r22J38m07J006Q54K43O5q3j341l19
5922g74k56K14R04L95N90k40o43k77q31J08L42N87M78K23k1o98o49n45J17P46
5942b30P47L20K8l50o89n46j74Q8R26M93L28l38k92m63o60j3M14L11O22K33j55
$$ plain form
5799 82 -599 -753 -776 -418 326 1132 880 684 250 -681 -1095 -519 187 602 876 850 453 -485 -838 -900 -700
5820 -700 -68 654 992 800 342 -667 -1145 -1087 -221 522 889 1015 729 -110 -890 -940 -815 -238 654 1063
5840 1063 815 474 -108 -977 -911 -811 -93 727 873 796 -134 -576 -1039 -820 -418 306 855 1048 510 -51
5860 -51 -905 -1060 -598 -338 396 1099 651 310 -182 -852 -1167 -436 180 493 1069 987 190 -357 -1032 -936 -492
5881 -492 216 920 819 823 92 -646 -1297 -1008 -363 353 930 825 312 58 -833 -690 -719 -102 820 1026 651
5902 651 303 -382 -1040 -729 -480 584 765 1110 806 -8 -930 -792 -1199 -193 661 904 969 886 -455 -774
5922 -774 -1030 -816 88 483 1073 833 190 -87 -918 -810 -468 119 597 820 799 101 -548 -1093 -976 -230
5942 -230 517 837 865 515 -174 -720 -894 -806 120 613 941 603 311 -152 -812 -825 -411 -100 522 755 600
5963F00n10p63l56L92M44O54M64j55j28j033m09k12M70N44P67Lm12r7m35p33L41
5984e64L84J66P55J86N8r14m41m75j1M16Q46M94k53q5p46m87l49J7O97O31N91
6005I16J03p51n67m44k93N88L67O85N52m86p10l64o09L70K65Q43M62J36p21j37
6025B05r31j2R8O15M35L99K30q34j33j157J81L54O83L23L48j27n05o69l34K58
6045e73N56K68L42M16l68p50k53l84L81J23Q82J50k4j37q86k99k04J43L49R87
6065G19P1N1l35r49m23K37K92O53L30K06k39m75r56r5o7P05Q12L20j26l15o15
6086a99n03j68M75K87N37N57l46l68p21m23k15O54Q16J49L94m80m09n63p2j02
6106g00N22O76K29K4k70m95o78k52L94P41K47L11J51r64p9n99J35J84Q15K35L63
$$ plain form
5963 600 90 -673 -1029 -637 -193 461 925 770 642 -391 -800 -1012 -542 2 769 772 360 263 -172 -905 -564
5984 -564 -180 -14 741 927 985 71 -370 -845 -856 -440 406 900 647 562 -184 -671 -1020 -1003 -306 325 916
6005 916 1019 268 -299 -743 -1036 -448 -81 604 1156 670 -40 -404 -1013 -643 -378 465 927 1063 342 205
6025 205 -726 -738 -640 -25 410 809 1039 205 72 -1085 -904 -550 133 456 804 677 172 -497 -831 -573
6045 -573 -17 251 593 1009 641 -109 -362 -746 -365 -242 640 790 766 629 -257 -556 -760 -617 -268 719
6065 719 790 841 506 -443 -866 -629 -337 316 646 852 613 138 -818 -913 -980 -275 537 857 731 416 -199
6086 -199 -702 -870 -395 -108 429 986 640 272 -449 -872 -1087 -433 383 532 926 446 37 -526 -598 -700
6106 -700 -178 498 727 751 481 -14 -692 -944 -550 191 438 749 900 -64 -143 -742 -607 -423 392 627 990
6127I90n01n20m39j95j11N31O40N35R5o52l97j009K64L11L05O53L02N9n33n61
6147b33o61o2M12O72P02p5l36o67J7p98K99N42M97L57K53m94n38n55j38K1O67
6168a18O84N3j39m20m51j26k50J78P08Q35pn51j26n24o52J79M34P38L47j55P5
6189G12p05l90n77L93O52P51k48J7j94o41l85j89J72P30K85L99M5p42m28n40K57
6210f26J16P41K74m2q9l44n71l07J92P33K83M80l9m72o24o17K67K86L86P35K90
6231A052n26m11n31k66n7O30L67M89L2k26o83n86l2m7N29Q59K08l74l32k38o42
6252g85L32k27Q09M34j48L63o14p13k39p9O46N26J32L44k31p82k13m85L39M76
6272a15O46J38r2m86l79o35K27L33N13M22K69n8o57l27n58P8L25K39R16Q0m72
$$ plain form
6127 990 489 -31 -470 -665 -776 -245 395 930 1025 373 -24 -1033 -769 -458 -153 500 802 861 328 -233
6147 -233 -894 -956 -544 128 830 755 419 -248 -231 -1029 -730 -188 309 666 919 425 -113 -668 -806 -785 -118
6168 -118 566 619 480 60 -391 -517 -767 -589 119 954 947 396 270 -254 -906 -727 -293 445 792 637 712
6189 712 7 -383 -960 -567 85 836 588 605 411 -230 -615 -804 -632 98 383 782 827 85 -343 -883 -626
6210 -626 -510 231 505 463 374 30 -541 -848 -656 77 360 840 801 329 -295 -912 -645 -359 27 762 1052
6231 1052 526 115 -416 -682 -739 -109 258 747 779 553 -130 -716 -748 -795 -266 593 801 427 95 -143 -785
6252 -785 -453 -680 129 563 415 778 164 -549 -788 -867 -221 305 437 781 550 -232 -445 -930 -591 -115
6272 -115 531 669 577 91 -288 -923 -696 -363 150 572 841 783 126 -201 -759 -681 -356 -117 799 879 407
6293D07m27m91j50K20K85N53K50o6l5o80m50l48N86M39M86M9J60n20q01j01Q3
6314e51K12L41Q13P6k55p37p25K44j01N37M93J47N43n49o93o39n3M95M00O59j52
6335E05J65l24o46m49K3L55M23N49L62m08n09n34n84Q06K51K20O97k15m53m2r47
6356g55J10R7P13M83j05R0m69m04o09K94N20K76M16N1k89k75n48m26N16N6N83
6377C25M01j95l82l92m66J12m3N62Q23l31M2n14O6o26q5N92K40K74J25j75m56
6398a03m57P2n9K56J024m40M64k01p48m57k0M33K63L26L59j08o72j07k87k98L87
6419c73L99M15K20k10k70m40m23K26M02M9N74j41j78m58n22K71L7J38Q15L8o8
6440E01J5q07k66m45O55O09K62L19l95j98l80n70K3P9Q33J84K42l83n54m87J20
$$ plain form
6293 407 -20 -511 -661 -441 -156 397 647 581 546 -134 -584 -932 -346 93 579 628 788 268 -533 -634 -551
6314 -551 -339 2 815 891 636 -101 -826 -582 -683 -146 347 494 1037 488 -205 -844 -897 -402 -2 657 505
6335 505 670 346 -300 -749 -726 -371 52 601 963 555 46 -488 -1072 -266 -15 205 902 687 234 192 -755
6356 -755 -645 -548 165 648 543 633 164 -240 -849 -555 -35 241 657 708 419 144 -404 -830 -314 -258 325
6377 325 726 531 149 -243 -709 -597 -640 -78 745 414 456 -58 8 -618 -703 -111 129 403 528 353 -103
6398 -103 -560 -488 -547 -291 733 293 757 556 -192 -649 -669 -236 27 353 712 604 -68 -175 -462 -760 -373
6419 -373 26 441 661 451 181 -259 -682 -456 -54 -5 569 428 250 -208 -730 -459 -422 -284 531 569 501
6440 501 516 -291 -557 -1002 -347 262 524 843 448 250 -130 -700 -677 -598 235 419 661 278 -276 -763 -643
6461f43j5R33n4N52M6n29n70m76N2N10L41J90L04m6n01l08o37K45Q53l01P27o7
6483F06k36l31l09l14mQ36L5K94l3l07n40l98m02Q57L70L53K19j29o90k35l63
6504g21K82L27M10M00r9l64k50l74j98J06L92K76L43K74p25j77o39K23o3Q36P1
6525C30K80j47k05r16J31p9N74L52J60L11m78j34q72J26k14O73M10K10Q3k09n19
6546a33n02r9J96L82N39N48l55l69m88k80o3L17P05Q9l0k19j08o36L7J68K73M37
6568D09K26o0j40l54p03J70J22N50r7N28k40j15o62K9m32N72L97K81J06k7m21
6589A39n82r3j57L73O37K22l0l94m13j87m11K61N90L96J27k36j62l68l07o3K43
6610d15L50N08J00j5m65m62l01L31K9N69J63M25n04o49J41m50J91K26P60K47k57
$$ plain form
6461 -643 -658 275 221 773 819 290 -280 -756 -704 -194 147 337 641 595 94 -214 -851 -606 247 -54 673 606
6483 606 370 39 -270 -584 -588 248 283 577 544 237 -303 -701 -1103 -246 124 477 696 567 -123 -358 -721
6504 -721 -439 -112 298 698 599 235 -15 -389 -587 -481 -89 187 530 804 79 -98 -737 -514 -577 259 330
6525 330 610 463 258 -658 -527 -606 -32 320 480 791 313 179 -693 -567 -781 -108 302 512 595 386 -133
6546 -133 -635 -734 -538 -156 383 931 576 207 -281 -561 -624 -307 398 487 457 238 130 -506 -469 -301 -28 409
6568 409 635 575 435 81 -622 -452 -330 220 123 651 411 296 -366 -337 -769 -197 200 481 587 560 139
6589 139 -443 -536 -693 -320 317 539 509 115 -298 -485 -896 -635 -45 351 478 242 80 -288 -595 -658 -415
6610 -415 -65 443 543 528 63 -399 -700 -369 -340 229 392 817 313 -336 -195 -645 -454 -228 532 779 522
6631E22k82m17n29J45N55j9O12n8J8o43m92jj37M92M27J0L30p9k63p94M5J76L29
6654e3M44L54k64k51k14o42j90M52K49M55O03n96m17k80m75J79R1O39L42N1m8
6675D29o09l71l3%N24L97L16k56k0m82o86J16N64K76J96J63k15j57l78j67k63
6696f56J47M42N23J01q0p20m69J95R2L54K88K97J43l85l22l15l89P40%P02j42
6717E46k13k40k40l90L27k12Q80J14J65l42o65j19m43K77O34K25P8L61m20l09
6737A4n82P6J2P94J98M6k36l75k39m17J96N81J10L49L10l49m51n92J24Mn1N51
6759G3M23J89o18r3n43j82K94O46N16Q3l09j60m63n52N42k45J52P42k39N2l45
6780c7m73J30k64O58J34N46J49n91m98k23Pk8M61M74RJ87o93l11l82L91M03K91
$$ plain form
6631 522 240 -177 -706 -561 -6 -25 587 529 547 -96 -588 -589 -726 -234 193 203 533 454 191 -603 -558 -382 -53
6654 -53 391 745 481 230 16 -626 -816 -364 -115 340 943 347 -70 -350 -825 -646 -555 84 426 477 429
6675 429 -180 -551 -584 -584 -60 337 653 397 377 -105 -791 -675 -111 165 361 524 309 152 -226 -393 -656
6696 -656 -509 -67 456 557 477 -243 -712 -517 -425 -71 217 514 657 272 -50 -365 -754 -14 -14 688 546
6717 546 333 93 -147 -537 -210 -422 458 572 737 395 -270 -389 -832 -555 79 304 382 743 323 14
6737 14 -568 -492 -480 314 512 558 322 -53 -292 -709 -513 68 178 527 837 488 37 -555 -431 -427 -478 73
6759 73 496 685 67 -26 -569 -751 -457 189 705 788 479 319 -144 -696 -154 -399 -247 495 256 308 -37
6780 -37 -510 -380 -644 14 148 694 843 252 -246 -469 -462 -490 -29 445 454 641 -52 -363 -745 -354 49 340
6802C40J08K15ql75p70j75JL69M56N10j64j95o05o2j11J40P84n2M8Q5k58l39m06
6825d64l47L94O08L41J10j70l17l92m60K80K92K75N31k29o7n16q04L96Q9K87L02
6846A39M61j0j77p39j47N5J43O32J55J16m53qm46l22J32j18Q68K20K53k96n70
6867a12n78k1K09N09N28q6j91Q8m90l42j44K85M80K35M69o80k90l43J09j14N1
6888d28P26K44m8k56j66n11m2L8P23J08J53j48J8o91J98m34J56N50J62M19l88
6909C83l38k18m32K61R7J55M46J48k93k57k13k70O2N65J10N05m37k64R9m05l52
6930f48L84J11M49J85k44p9l51l33o6L61K71O31j55m34j26n28j5M06J72K26K89
6951E06q0k75l05k68k87J02N49N02k4L8l41l64m55J77J81N53K82R8k33k05o57
$$ plain form
6802 340 448 663 655 280 -490 -665 -664 -295 161 671 507 312 -293 -355 -466 -326 458 406 454 539 281 -58 -464
6825 -464 -811 -417 191 532 642 472 155 -237 -697 -417 -125 150 681 452 385 -131 -935 -539 -450 -163 139
6846 139 600 590 413 -326 -473 -418 -275 357 512 628 175 167 -279 -601 -469 -587 281 501 754 458 -112
6867 -112 -690 -711 -502 7 535 449 258 346 -144 -486 -630 -345 135 370 839 159 -131 -474 -365 -479 -428
6888 -428 298 542 494 238 72 -439 -481 -443 280 388 541 393 411 -280 -82 -516 -360 190 352 771 383
6909 383 45 -173 -605 -344 -247 -92 354 502 209 -48 -261 -531 -469 96 206 711 274 10 109 -296 -648
6930 -648 -264 -153 296 481 237 158 -193 -526 -592 -231 40 671 516 82 -44 -572 -587 -181 -9 217 506
6951 506 426 151 -154 -422 -709 -607 -58 444 420 458 117 -247 -702 -525 -344 209 491 589 356 151 -506
6972e06j78L18M56J75K85j5j44n64l79j75L99K07O48J02k27k15l62l25L7N2N02
6993I1M25j02k05k25o66r2K57M88r0N26m3l27K6o14k69O42J19L29J57J1j89l55
7015a06j61j51L9L38L51J16J65p26k30R7o7J48N72j82J58k72n67p2K53n6M75K48
7037C70K96k69k16n74j18J23K25L59J47j18K23n12k95k50Q5L46N03P0K7l82j63
7058a23l90n1L26K12K30L00j27l0o59l46M8L63P13j00K45m82Q6o09Q6k01O05K11
7080C07Q2J83m89j24n26J60r7M53k9M60j46k48k66j01k41J51N33J00L77k09l27
7101Cr5m37J78l3M56J50L44l02o77n4Q6J39K21L38L56l27l81J96m92m07K39N21
7123B2j6O17k67k83n97M9L07j9M45K24J73k83k88m57m3j63N70K79L49k82l23l6
$$ plain form
6972 -506 -684 -366 90 265 550 535 391 -173 -552 -727 -328 -121 527 629 402 187 -175 -500 -463 -411 91
6993 91 516 414 209 -16 -682 -774 -517 -29 -119 407 364 37 63 -551 -820 -178 -59 270 427 438 249 -106
7015 -106 -267 -418 -379 -41 310 426 591 -135 -365 -268 -335 -187 385 203 361 89 -478 -550 -297 -353 122 370
7037 370 666 397 181 -393 -511 -388 -163 196 343 225 448 -64 -359 -609 -524 -178 325 395 422 40 -123
7058 -123 -513 -564 -238 -26 204 504 377 347 -312 -658 -610 -247 466 366 611 129 215 -394 -308 -509 96 307
7080 307 389 572 83 -41 -567 -407 -504 -51 -80 380 234 -14 -280 -381 -622 -471 62 162 539 330 3
7101 3 -92 -529 -351 -384 72 222 566 264 -413 -467 -381 -242 -21 317 673 346 -35 161 -331 -738 -499 22
7123 22 6 623 356 73 -524 -475 -168 -187 258 482 655 372 84 -373 -416 -579 -9 270 619 337 14 -22
7145b2m24q2N15N4M88N3l18l57k11K09n54L73M28L63N1m90l70k6k68k23Q34K81
7167C04K2K9m24k27k21K77r3K75L29K6L26p57m4j43R5j6K93M78j69k6l40k08k21
7190d35J08K34M43n6J67k18n3n57k78J63L08O02K36m52l54q1q3m7J30M82K02J94
7212F55p38K59l18n97L91J96N06M14l48k16m01pl8j65N84n6P64m34j72q76M20
7233a77q2J47L82N6J02k41r0l91m55K89M30K48K16j35J18m35n20K96j21N26q7
7254G6M65m0m84l34pj51M9N64L64q5P3o75k08jj20L39M48L21j67j93l85k93k15
7277f59N21R9K60K5J59k83l94j93rL38L82J07K39m97j11l28l16L14q0P20K75n8
7299E11n78l34j34K00j34Q24k1L8K33m49m42j56J19q3K10L33M16o77k3P3m13K67
$$ plain form
7145 -22 -446 -528 -13 41 529 582 264 -93 -304 -95 -649 -276 152 515 566 76 -294 -320 -588 -811 23 304
7167 304 326 355 -69 -296 -517 -240 -333 -58 271 297 623 -134 -178 -321 -226 -242 51 529 360 334 -6 -214 -435
7190 -435 -327 -93 350 294 461 243 190 -367 -645 -482 -174 428 664 212 -142 -223 -306 -353 -223 259 461 655
7212 655 -83 176 -142 -739 -348 -152 354 768 420 204 -197 -204 -242 -407 177 121 885 451 279 -597 -177
7233 -177 -259 -112 270 326 428 187 97 -294 -749 -460 -30 218 434 299 417 -18 -538 -242 -363 163 76
7254 76 541 501 17 -317 -324 -475 -426 138 502 417 490 -185 -393 -394 -514 -175 273 594 427 234 -151 -444 -659
7277 -659 -138 -39 221 246 405 122 -272 -465 -474 -136 246 353 592 95 -16 -344 -660 -346 -426 294 569 511
7299 511 -67 -401 -535 -335 -469 355 334 372 605 156 -286 -442 -323 -406 -196 137 553 -124 -147 -74 -487 -220
7321b20J95K11K96%n30J17l33j06K92J04J86K44j77%m72k25K83r2K96J18L86k54
7343C19j11m80j34J53k2K11K68J93j65k51l09p2J13O17k4J69j94l26j33m75R4
7364e59K93L60J33J06K73n01n70j14L42L1L52J92j31J8n96n4q1J15L13J58M77
7385E57o0j07m77l66P9J49K31K36J37l30r4l56LM4J62M76J45J1j35l33k66k44
7407e38J41Q1N52J30J19j53n65j72j73K65O86N7k89P6o8l47k43K3J51K79N95j37
7429D70o7o72j25p2K75Q3K57K51P4m07k3j97r9k27M08N36q7J6k68n18j7o6L56
7452a19K39K37J22m77O2m60j42J03O73K0j6L70n52K28n02O2j14K01O36k00o9k34
7474F8l15j8j97L01J93j94N77j52m15l90R7M16j05L10r3K10n5l10l37k74K57K78
$$ plain form
7321 -220 -25 186 482 482 -48 69 -264 -370 -78 26 212 456 279 279 -193 -418 -135 -227 69 187 573 319
7343 319 208 -272 -406 -253 -275 -64 204 397 232 -19 -328 -400 -287 330 306 475 281 -45 -178 -653 -559
7364 -559 -266 94 227 333 606 105 -465 -579 -237 -206 146 338 207 225 -371 -425 -506 -391 -78 80 557
7385 557 497 390 -87 -453 -374 -225 6 242 379 49 -45 -401 -398 -354 -192 284 429 440 305 -28 -294 -538
7407 -538 -397 -316 236 366 485 332 -233 -405 -578 -313 373 430 141 217 149 -198 -441 -418 -267 12 607 470
7429 470 403 -269 -394 -466 -191 -108 149 400 474 67 44 -153 -252 -479 -71 465 378 394 126 -392 -409 -475 -119
7452 -119 120 357 479 2 64 -396 -538 -435 238 258 242 612 60 288 -214 -152 -266 -65 571 371 302 68
7474 68 -247 -265 -462 -161 32 -162 415 263 -152 -542 -445 -29 -134 176 83 293 238 -72 -409 -683 -426 -148
7496a48O71k73K34j81m86k97K14K4K14J07L83J47n31m84k27K73K81L36K15Q9n90
7517b9K21l53m10K47M44L84j7j58j76k92l29K62J30R8J84K56k43j03m31j05J75
7538b45J19N23k3o4k19j24l35J33j27M31R0K49%k67m84q7J37K96k11O66Q1k54
7560B85n08j66O6K60p8k10R47o8l10r6m24m7j20L40K10L12l7q5n46L3l17K95M21
7583A57K34J05q9l03k58j44l95O05O47k10J77m28k3m01K95l12J93L45K26j31k85
7604El11k03Q8K6K15M79J13j67j7q05L22k76L15K09J60M74n01m60M2M1k88K19
7626c20L36K77L5j45m99Q4R1j46M20K44J16l77Q4k50j85l8m4L65L93k41j54j11
7648f5k31l21L89L65l9N39j95k46l23o30K42J65J28L22M93j70q2m47l42K49KM51
$$ plain form
7496 -148 523 250 484 303 -183 -480 -266 -242 -28 79 462 609 78 -406 -633 -360 -79 257 472 561 -29
7517 -29 192 -161 -571 -324 120 504 487 329 153 -139 -468 -206 -76 22 206 462 219 116 -315 -420 -245
7538 -245 -126 397 374 310 91 -33 -368 -235 -362 69 159 408 408 141 -343 -430 -293 3 -208 458 539 285
7560 285 -223 -389 -323 -63 -141 -351 596 528 218 122 -302 -349 -469 -129 81 393 356 271 -275 -242 -559 -264 157
7583 157 391 496 407 104 -154 -298 -693 -88 559 349 526 98 75 -326 -31 -343 -150 195 421 290 5
7604 5 -306 -509 -421 -395 -180 299 412 245 228 -577 -255 -531 -216 -7 153 627 126 -334 -292 -251 -539 -320
7626 -320 16 293 328 183 -316 -232 -141 -287 133 377 493 116 200 -50 -235 -273 -317 48 441 200 46 -65
7648 -65 -296 -617 -228 137 98 637 442 196 -127 -757 -515 -350 -222 100 593 423 341 -106 -448 -199 -197 254
7670B54k81N83l11k72j11k80L40J6K01M76k69l48j30j27K4O8K45J46k6p1j8n97
7692d88O6K52q6K10M63m68K60l64j36k37J68q6O93J34k08O2m28j04j04k7L32q0
7714a76P74l34k49r9n8j60n2O68ro2j0lm82k73L38q6M02O0N6m92L11k07j75L67
7738D9k64J80J75j65N9j60j31k10M21J30J73L46n53K39o69L22j58J81k05L28K79
7759C67l46k16j36L05j72K77N7j36N84m79j66l47N6M00p8K96j22k21m0J6k24M6
7781b79J32J49M09mp2j60j89m15R4N67k9k6O7l1m65k18M7L47J86J21K14l1l16
7804I8l25j79Q5J07N68M94m78k8n61j97J79j63M05L10j24J01k95m08K20l0J07
7825a14J15M34j29k41n8k2l06o3K26M97j15L17l30k6m35j23J70J10M96j63J92
$$ plain form
7670 254 -27 556 245 -27 -138 -418 -78 -62 139 615 346 -2 -132 -259 -235 -167 78 224 198 127 109 -488
7692 -488 -422 -170 -256 -46 417 -51 209 -155 -291 -528 -360 -446 247 381 173 235 -193 -297 -401 -428 -96 -176
7714 -176 598 264 15 -84 -142 -302 -354 314 305 243 233 230 -252 -525 -187 -273 129 189 245 -247 64 -143 -318 49
7738 49 -215 -35 140 -25 34 -126 -257 -467 -46 84 257 603 50 289 -380 -58 -216 -35 -240 88 367
7759 367 21 -195 -331 -26 -198 79 136 0 584 105 -61 -408 -352 48 -30 266 144 -77 -117 -101 -325 -279
7781 -279 -147 2 411 407 335 175 -14 -429 -335 232 203 177 244 213 -252 -470 -423 -76 110 231 445 414 98
7804 98 -227 -406 -321 -214 354 848 370 342 -219 -416 -237 -400 5 315 191 292 -3 -411 -191 -221 -114
7825 -114 1 435 306 65 7 -15 -321 -384 -158 339 224 541 211 185 -250 -373 -203 -93 403 240 432
7846D32l36k91%q6K25J9J48K37k8m81m43L81p9K4M53R0Q4J34l77n38j11L44Q0
7869a19L85J06j57l17R8l30J02J36M2K77K02n0l32n9o33P14m51O75J39R9k01k59
7891F7n31J00q6L09L22J50k11m01J17k17K57J06o3P13l48o2k61J9k50K61l38L43
7913dO9P3n7j11j94l93M93O6N8J82L25j50o31J21k26J85K11m3J88j1J28k22l72
7936c15l5J58N46K01m47j15J9m3k71k24N73r2R1J98l36O5k10O1l7M31JQ7j12k03
7960ip7m1k50M93N4j44J80r5J84k68m19q8N04O60k81j67l49J41k66k71L52J09
7982d8K44p0K66l79k49l00J53L72J21K38K30l73rm5o05J97L04M44p5K63m59k70
8004e0l23L6J43K64o1M56j08k02j41l26J5k4M64J36m3k12O4k22l99M02nL48j8
$$ plain form
7846 432 96 -195 -195 -281 -56 -37 111 348 320 -161 -604 -223 -302 -278 175 265 349 483 106 -432 -543 -199 -119
7869 -119 266 372 215 -102 -4 -334 -232 -96 -54 223 425 375 43 -16 -649 65 -386 289 428 527 326 67
7891 67 -464 -364 -450 -141 181 331 120 -281 -164 -381 -124 -18 -81 632 284 222 -39 -20 -270 -9 -347 -4
7913 -4 65 138 81 -30 -224 -617 -124 -58 0 182 507 357 -274 -153 -379 -194 17 -26 162 151 279 57 -315
7936 -315 -350 -192 354 555 108 -7 12 -31 -302 -526 47 -45 46 244 -92 -27 -237 -176 -213 218 219 306 194 -9
7960 -9 -86 -127 -377 116 170 26 206 111 295 27 -392 -480 24 684 403 236 -113 28 -238 -509 -157 -48
7982 -48 196 126 392 13 -236 -536 -383 -11 110 348 578 205 196 151 -454 -257 47 491 416 679 220 -50
8004 -50 -373 -337 -194 70 9 465 357 155 14 -312 -297 -321 143 279 236 24 88 -134 -533 -131 -136 212 194
8027A94L81m55k00l42O5L99J19L14j33k34n6l33kp0J09J92J48M10m29j84l24J88
8049b43k53M37L03J19j08j48j30l97j64M51j48L27M93l78o7n41M30k46J71M6L84
8070C38p3M7j52j53m26K90Q5N4J33J29l11k03J74k29%L52J12M37k35m50R9l06
8092b88p6K29l0L31J91j04k31j24q6j8J17K50J46J72q3n23k29j83M10OM83l34
8114B6M22j82l63k34k72M14m9M40J61j79Mk35j63n1L26J57J9J35l0n12K2l30J91
8137b83K87R4K7j9j48J46o04N2M0R2N04p5K40k90m2l04QK62K12p2N6L6m48k59
8161d88K60R7RO7M66n0l01J1l80Q4O2L16jR7K12k11l83k39J4P0L61K41r4K57o22
8186a45J51j79k77O19l3
$$ plain form
8027 194 575 120 -80 -422 -357 42 161 475 342 108 52 -281 -283 -353 -244 -52 96 506 77 -107 -431 -243
8049 -243 -496 -59 244 363 255 107 -23 -420 -584 -133 -281 46 539 161 94 -447 -17 -263 -92 -46 338
8070 338 265 312 160 7 -419 -129 -44 10 143 272 -39 -242 -68 -297 -297 55 167 604 369 -81 18 -288
8092 -288 -364 -135 -165 166 357 253 22 -102 -188 -206 -89 161 307 479 396 -127 -356 -539 -129 -123 360 26
8114 26 448 266 -97 -331 -603 -189 -238 202 363 184 188 -47 -210 -261 65 222 241 376 346 -166 -144 -474 -283
8137 -283 4 98 125 106 -42 104 -500 -448 -408 -316 188 113 353 63 21 -283 -275 -13 199 127 183 219 -229 -488
8161 -488 -228 -131 -122 -55 411 361 60 71 -309 -225 -163 153 152 249 461 250 -133 -372 -358 -288 73 314 220 477 -145
8186 -145 6 -173 -450 169 136
8191A36
$$ Imaginary data points
##PAGE= N=2
##DATA TABLE= (X++(I..I)), XYDATA
0@%%%%%%%%qJ6j6J6j8K6l2L6m4N6o5P3q8J04j20J37j59J83k07K35k65K99l39L80
32B00m24M74n30N91o55P26q06Q95r91J096j215J346j490J653j837K047k291K573
50A362k910L319l821M459n297O459q180J0978j6282K9693j17802k71037K69579
63i9480J80224j13716K3180K30960k7121k29094p6266J8500o7139M4983J97294
74H2325Q9036n2982k0081p4326j73646l8281J29820M3724J4914J65225P0372k25517
86A0583j60666J02631O271j59578R9620L15424L3967k18448o5292K3043j14568
97a27013n3261J52256J00665k0167P1259O1141j77395k00615M4360J05312K013
108d1445P0222J40505k2318j33945m3467l7626j01991L7616J88555O7138n2779
$$ plain form
0 0 0 0 0 0 0 0 0 0 -8 8 -8 8 -10 16 -16 20 -24 32 -33 40 -48 56 -64 73 -86 97 -110 125 -140 159 -180 200
32 200 -224 250 -280 311 -344 382 -424 471 -520 576 -639 707 -783 870 -967 1080 -1211 1362
50 1362 -1548 1771 -2050 2409 -2888 3571 -4609 6369 -9913 19780 -98022 -369059 -99480
63 -99480 80744 -32972 -9792 221168 194047 -35047 -111313 -92813 -159952 -114969 82325
74 82325 171361 118379 98298 23972 -149674 -187955 -58135 -14411 503 165728 236100 10583
86 10583 -150083 -47452 -41181 -200759 -101139 214285 248252 29804 -35488 -12445 -127013
97 -127013 -180274 -28018 72647 52480 123739 184880 7485 -193130 -148770 -43458 -41445
108 -41445 28777 169282 146964 13019 -30448 -68074 -170065 -132449 56106 123244 70465
119G0465L2842L513j82723j27358J00919R4819j081R8870J13696j20739j79181
130i5958K9686M1906j19980K009K40783J24716j28306j02629J42o9484p7361O9493
142h4983J08882L8569M8341L0936j05121j33574q469K0483r792R5422J53920j0811
154A43803j18887k3747j8064j27072k6655J76649J14601n8046p052O2920r0314
165B8136j78994j1581J15877O1219M0812P0256j2750j05648o1266j9805m4257
176a18001K0968J31200Q9234k3572l1583l5567j07030p4964O2236Q7383K4688
187B4992N2108O6303o2788j40379m2000K8604p714L3423J25171O8066o1534o9746
199A4506l9150p2592l9769Q3331J05524K2481M192J8023o0111j19069m3760M3997
$$ plain form
119 70465 103307 106820 -75903 -203261 -102342 -7523 -8604 90266 203962 83223 -95958
130 -95958 -66272 -24366 -144346 -142337 98446 223162 94856 -7773 -7631 -77115 -154476 -84983
142 -84983 23899 62468 110809 141745 36624 -96950 -105419 -84936 -94728 694 154614 143803
154 143803 24916 1169 -16895 -143967 -170622 6027 120628 62582 55530 118450 28136
165 28136 -150858 -162439 -46562 14657 55469 125725 112975 7327 -53939 -73744 -118001
176 -118001 -97033 34167 123401 99829 68246 32679 -74351 -149315 -87079 304 24992
187 24992 77100 143403 80615 -59764 -101764 -73160 -80874 -47451 77720 145786 84252 14506
199 14506 -24644 -97236 -137005 -53674 51850 74331 78523 96546 36435 -82634 -126394 -82397
211h2397N1141O1970P6056Q403p1904o4939m0641m5663O591R5918Q7040R826j2259
224G9142k2187q4605r0598Q862P2029M9608M6098N5711j5721r8612p6028j0644
236h6945O733K7668Q0564P5898R37n2418o2502o3404l5340L0859P1845O0193L7390
249I1478M636n3126q3489n0276J57K9567O1822P7489L1206l8911o2952n4502m4222
262i1123o928N7215Q1542M6757J889k9998o1078p0302l1818K8738O3431O4171
274E2496L9247m089m8380o9590n4720j1247L9601O6945N7277K5525j6479n7957
286A8629p1579m1552J0076M8781O3422N2453J4032l6107o5738o0632k6424K2398
298g2241N7977O1864L9682K54m7383p2295n0520l307L2000N3995O4087L4376k6628
$$ plain form
211 -82397 -31256 30714 106770 115173 43269 -21670 -62311 -107974 -101383 -5465 81575 91401 79142
224 79142 56955 -27650 -118248 -109386 -37357 12251 58349 114060 98339 -273 -76301 -86945
236 -86945 -80212 -52544 28020 103918 104855 52437 -10065 -73469 -108809 -77950 -6105 54088 91478
249 91478 96114 42988 -40501 -90777 -90620 -61053 769 78258 109464 70553 7601 -46901 -91123
262 -91123 -98051 -40836 40706 87463 89352 59354 -1724 -72026 -103844 -75106 -11675 52496
274 52496 91743 87654 39274 -30316 -85036 -96283 -56682 10263 67540 93065 76586 18629
286 18629 -52950 -94502 -84426 -35645 27777 80230 94262 58155 -7583 -68215 -94639 -72241
298 -72241 -14264 47600 87282 87536 40153 -32142 -82662 -85969 -53969 26 64113 98489 71861
311G1861o2583n5497l5262n013M4909P3174M8516L868k8945n4817o5234k9706
323i4729K6699N4668N4283M2903L317n1016o7160m0937j1150K1525O2682O7359
335F8444J9324k5390m1883n5751n2962O1N7798N9481L4589J9189j6881o7345o6858
348f8184j5398K1661L7712O0045N2007n281n1769n2193m2151k4752K6490O8842
360G029N3691J5799p648m0380p0946m5075J4721M1399M2917N2518K9620l6406
372E7239o8325m3282j7867N19M3227P2617L8821j2876l3404m8079n7414k0802
384h9626L9886N6324L9542K9779O93n4093o8445k8621O495K5029N4337O1012J2131
397H4443l8020m6439m3082l7368N386N7914N8419K6299L628k4491o1514n6783
$$ plain form
311 71861 9278 -46219 -81481 -86494 -41585 31589 80105 83973 55028 211 -65023 -94729
323 -94729 -68030 -13362 40921 83824 87141 36125 -31035 -71972 -83122 -61597 1085 68444
335 68444 87768 62378 20495 -35256 -88218 -88157 -30359 29122 63711 82900 66019 -1326 -68184
348 -68184 -83582 -61921 -24209 35836 87843 82562 30793 -21400 -63551 -88303 -61813 7029
360 7029 60720 76519 68871 28491 -42455 -87530 -72809 -31410 11507 64025 93645 57239
372 57239 -11086 -54368 -72235 -71716 -28489 44128 82949 70073 36669 -11410 -68824 -89626
384 -89626 -49740 6584 46126 75905 76598 22505 -45940 -74561 -68066 -43037 11300 72312 84443
397 84443 46423 -16 -43098 -80466 -75080 -17166 41253 67552 71180 46689 -14825 -71608
409g1608o018L0101M0631N0931M0028j3743n6011m9478k8346j0927K7377O4200
421A7137N0541N911k2909m1697n6818l4486J8478M7855M4808L6832J2225l5678
433D2199o2742m1236p544J5090M3727N9575L0690j7807m3084m7059l9480p782
445g5453L8171N4511L8705J5830j4276n0406n7633k3762J4942L6283M8675M3213
457F8800N699l8394n1045l9128j7738J5264M9471N4613K4521j1854l7246m9057
469b6094l8439o556L0174N1160M6748J7318k2759m7926m4515k4359K799L3168
481b9281N4282M2742L615l4841m8453l9522j6702J4811M3435N0661K9304p827
493F2224l7934m9169l8052o031L0592M8867L9959J6493j3445m1941n0682l0147
$$ plain form
409 -71608 -77626 -47525 -6894 44037 84065 70322 14311 -35167 -63513 -74440 -47063 17137
421 17137 67678 73589 50680 8983 -47835 -82321 -63843 -15988 28820 65652 77877 42199
433 42199 -20543 -61779 -69323 -54233 -10506 49069 79759 61952 18868 -28191 -67671 -75453
445 -75453 -37282 17229 55934 71764 57488 7082 -50551 -74313 -59371 -23088 25587 68800
457 68800 74499 36105 -14940 -54068 -71806 -56542 -7071 47542 72063 60209 22963 -26094
469 -26094 -64533 -71089 -40915 10245 56993 74311 51552 3626 -40889 -65248 -62449 -29281
481 -29281 25001 67743 71358 36517 -11936 -51458 -68160 -53349 -9914 40747 70051 62224
493 62224 24290 -24879 -62931 -68962 -38370 10497 50456 66949 53504 11563 -39119 -69266
505f9266O804L8323N0210L6021J517k8481l9397l9326k7159J0450N2455N3576
517D5727J9085j1848k7077m2236m2501r962K8443M6144M3529K1314j8828m6861
529D929m0977k1068k182K6499N3230M1627J617k6217l8447m6421k5242K3186M7976
542a490L2998J9698J0477k4054n8244m4163J448K8718L8420M0308K0016j6092
554D8040l4871l9527l7022n295M4552N4514K0604m26p227l5658n5666k2078K3865
567d6195L6232L5992L6126L552m3940m9356j9291m898O976L8545N1712K0846j6750
580D9551l5506m5942l2304R412L6591L0577K7711K5814j4101n8868m5000k096
592e4161J2832K1147M4873L9229p010l4669l2663l5688k3250K5805N6425L1659
$$ plain form
505 -69266 -62462 -24139 26071 62092 63609 35128 -4269 -43595 -70754 -60304 -7849 45727
517 45727 64812 52964 25887 -16349 -58850 -68812 -40369 5775 49304 70618 51790 4929
529 4929 -36048 -57116 -59298 -32799 20431 62058 63675 37458 -989 -47410 -72652 -49466 -1490
542 -1490 31508 51206 61683 37629 -20615 -64778 -63330 -34612 3808 44116 64132 48040
554 48040 13169 -26358 -63380 -68675 -24123 30391 50995 50569 43342 7684 -47982 -70060 -46195
567 -46195 -9963 26029 62155 65707 21767 -27589 -46880 -51778 -44802 -6257 45455 66301 49551
580 49551 14045 -31897 -64201 -54789 -18198 12379 40090 65904 51803 -7065 -52065 -54161
592 -54161 -41329 -20182 24691 63920 56910 22241 -10422 -46110 -69360 -43555 12870 44529
604D4529L030k449k1367m9758l4862N972K7924L6339M2528J5511l2829m3926k3848
617c3206j6267n329L3651N3984K4491q001j9620l7374m5548r392L1750L2265K5813
630B7217L0650L134m8256n2441j1581R193J1601L4620M5155J1602k5252l3463
642B179l4574k9339Q252M5303L9572J4279L300j6251m2628l8082n934J5867L0112
655g944M3556K7863j7052l8724k8659k2869j4230K3562N2156L0922q12j1224k6424
668A0121m4475k6109J6173L2730K7975K9926J4391k9095m9764k7959r21J1175
680c5832K7457L9217K2804o567k7676l9117l2855j281K9146L3670K7643J8812
692E5421j0900m4547l8098p942O551J4927L8641M1858J171l6409l2845k0832j7211
$$ plain form
604 44529 47559 45110 23743 -26015 -60877 -54905 -26981 9358 51886 67397 34568 -9358 -33206
617 -33206 -49473 -54802 -21151 32833 57324 49323 29703 -7671 -53219 -62611 -30861 1404 27217
630 27217 57867 61001 12745 -39696 -51277 -42084 -30483 4137 49292 60894 35642 2179
642 2179 -32395 -61734 -53482 -8179 31393 45672 48972 32721 -9907 -47989 -53923 -38056 -7944
655 -7944 35612 63475 46423 7699 -20960 -43829 -58059 -34497 17659 48581 47769 36545 10121
668 10121 -34354 -60463 -44290 -11560 16415 46341 60732 31637 -18127 -46086 -47007 -35832
680 -35832 -8375 30842 53646 47079 19403 -19714 -52569 -53850 -24704 8966 36609 55421
692 55421 44521 -26 -38124 -46066 -39515 -24588 14053 55911 57082 20673 -12172 -33004 -50215
705e0215M313L9647M4640J5014j3709k5285l0283k7500p985J9413L8563L6321
717D2934J0578j8470l1609k9710k2533j030L1126M3503K2590l868j6529k7601
729f19l5577j9803J5755L7707L3996J6003l822k4530l7383k8545k396K2900L3974
742G660K7966J3395r850l1527l7476j9539O733K5427L3214K8512N412k3126l4351
755g550k7351j3129Q307L3031L7559J6224p256k0937l1732l1974p373K5062L6317
768I198K7768R597j1064k8998l1290k1038k49K6474L9550K4728k329j6166k5245
781I36l5002k0155J7722L6303K4736J4030O689k0003m4511k8074N470J8301K3071
794d87L1053K0616j2274l3397l1315j9818K047K7343L3590J9206O210q977l4865
$$ plain form
705 -50215 -45902 -6255 38385 53399 39690 14405 -15878 -43378 -51363 -31950 6613 42934
717 42934 53512 35042 3433 -26277 -48810 -49840 -18714 24789 47379 43511 26982 -619
729 -619 -36196 -55999 -40244 -2537 31459 47462 43640 19110 -18273 -46818 -49214 -26314 7660
742 7660 35626 49021 39171 7644 -29832 -49371 -42638 -17211 16003 44515 49927 26801 -7550
755 -7550 -34901 -48030 -39723 -6692 30867 47091 39835 18898 -12834 -44808 -52181 -27119 9198
768 9198 36966 46563 35499 6501 -24789 -45827 -46076 -19602 19948 44676 42347 26181 936
781 936 -34066 -54221 -36499 -196 24540 38570 45259 25256 -19255 -47329 -41859 -23558 -487
794 -487 30566 51182 38908 5511 -25804 -45622 -43575 -16232 17358 36564 42774 33797 -1068
807a068l9562p162J9634K0054K4442L0673K200l6064l3359j1882q315L610L7350
820E51M0568M701j8205j7014k7266l1103K041L2069K7907J7798J4188j1242m1178
833f185l0916j649O183J6640L7589K8664j1404k6704j9567k5068j9103K0230M1926
846A0636K0451L563M114k0579m5781k1532J6451J8434J6379L2376J8664k5677
858B7499l7175j5919j0231o619K7707M3303J3753r849j0615k5362l7234p863K7919
871b0686K3967J5628K3751K588l7551l5903n796O1N577L4856L8738k898k4483
884A7849j3955k1123l1221N167M1119K5697N411R691p997m2492l1439P927J4352
897b1014J0688L3232K9362j6038l6675j6139j2048j5218J6385M3249K0604l928
$$ plain form
807 -1068 -40630 -47792 -28158 -8104 16338 47011 49211 13147 -20212 -32094 -40409 -36799 551
820 551 41119 45820 27615 10601 -16665 -47768 -45727 -13658 14249 32047 46235 34993 -6185
833 -6185 -37101 -38750 -32567 -15927 21662 50326 38922 12218 -7349 -32417 -51520 -31290 10636
846 10636 31087 34650 38764 18185 -27596 -49128 -32677 -14243 2136 34512 53176 27499
858 27499 -9676 -25595 -35826 -42445 -14738 28565 42318 32469 21854 -3508 -40742 -48605 -20686
871 -20686 3281 18909 42660 45248 7697 -28206 -34002 -33941 -28364 6492 45230 42332 17849
884 17849 3894 -17229 -48450 -43283 -2164 23533 28944 38635 30638 -11854 -43293 -35366 -21014
897 -21014 -10326 22906 52268 36230 -445 -16584 -28632 -43850 -27465 15784 36388 32460
909C2460k994j8444m2211j8492K3505K2241J0567K6102J7608k8488m1169j0173
921b9488r22m403K5153M4208R816k0676j3116j5968l3817r166L2844L0281J0000
934B4746J0746M47l3160l5119k457P764O601L0886L6620n113l3033j6928j1277
947a9277k1885L198L9850K8408K87M48q679l7563k9868J0830K2512J0850K3482
960B2593K4528j4371l7584j8754n642p502J6587M0327J8876j1135q676j3499l5111
$$ plain form
909 32460 29466 11022 -31189 -49681 -26176 -3935 6632 32734 50342 21854 -19315 -29488
921 -29488 -30410 -34813 -9660 34548 44364 23688 10572 -5396 -39213 -48379 -15535 14746 24746
934 24746 35492 35939 2779 -32340 -34797 -27033 -20432 10454 47074 41961 8928 -8000 -19277
947 -19277 -41162 -37964 1886 30294 30581 31029 22350 -15213 -45081 -34251 -11739 -889 22593
960 22593 47121 32750 -4834 -23588 -29230 -36732 -20145 20182 39058 27923 19247 5748 -29363
$$ [...]
8191D26
##END NTUPLES=NMR FID
##END=
