##TITLE=1H_LR-683A-AK
 D2O, 8 sc, 
 25.9.2019
##JCAMPDX= 6.0         $$ Bruker NMR JCAMP-DX V2.0
##DATA TYPE= NMR FID
##DATA CLASS= NTUPLES
##ORIGIN= UXNMR, Bruker Analytische Messtechnik GmbH
##OWNER= root
$$ XWIN-NMR		Version 3.5
$$ Wed Sep 25 14:52:44 2019 Russian Standard Time (UT+4h)  she@DPX200
##.OBSERVE FREQUENCY= 200.1315
##.OBSERVE NUCLEUS= ^1H
##.DELAY= (6, 6)
##.ACQUISITION MODE= SIMULTANEOUS
##.ACQUISITION SCHEME= undefined
##.AVERAGES= 8
##.DIGITISER RES= 18
##SPECTROMETER/DATA SYSTEM= spect
##.PULSE SEQUENCE= zg30
##.SOLVENT NAME= CDCl3
##.SHIFT REFERENCE= (INTERNAL, CDCl3, 0, 15.7039)
##AUDIT TRAIL= $$ (NUMBER, WHEN, WHO, WHERE, WHAT)
$$ ##TITLE= Audit trail, XWIN-NMR		Version 3.5
$$ ##JCAMPDX= 5.01
$$ ##ORIGIN= Bruker BioSpin GmbH
$$ ##OWNER= she
$$ F:/spectra/data/she/nmr/H-F/1/audita.txt
$$ ##AUDIT TRAIL=  $$ (NUMBER, WHEN, WHO, WHERE, WHAT)
(   1,<2019-09-25 14:51:37.71 +0400>,<she>,<DPX200>,
      <created by zg, POWCHK disabled, PULCHK disabled
       configuration hash MD5:
       00 E9 B6 7A A2 85 ED C7 34 08 36 98 17 FE 4E 26
       data hash MD5: 16K
       B6 18 9E 06 6C 9A AA 24 FC 97 44 3D 1C EE B4 C2>)
$$ ##END=
$$ 
$$ hash MD5
$$ E0 B7 BA 68 9B F2 93 3D 6B CF 9C A1 10 EA B3 B3
##$RELAX= 
##$RELAX= 
##$RELAX= 
##$RELAX= 
##$RELAX= 
##$RELAX= 
$$ Bruker specific parameters
$$ --------------------------
##$DU= <F:/spectra>
##$EXPNO= 1
##$NAME= <H-F>
##$PROCNO= 1
##$TYPE= <nmr>
##$USER= <she>
##$AMP= (0..31)
100 100 100 100 100 100 100 100 100 100 100 100 100 100 100 100 100 100 
100 100 100 100 100 100 100 100 100 100 100 100 100 100 
##$AQSEQ= 0
##$AQ_mod= 1
##$AUNM= <au_zg>
##$AUTOPOS= <>
##$BF1= 200.13
##$BF2= 200.13
##$BF3= 200.13
##$BF4= 200.13
##$BF5= 200.13
##$BF6= 200.13
##$BF7= 200.13
##$BF8= 200.13
##$BYTORDA= 1
##$CFDGTYP= 0
##$CFRGTYP= 5
##$CHEMSTR= <none>
##$CNST= (0..31)
1 1 145 1 1 1 1 1 1 1 1 1 1 1 1 1 1 1 1 1 1 1 1 1 1 1 1 1 1 1 1 1 
##$CPDPRG= <>
##$CPDPRG1= <>
##$CPDPRG2= <>
##$CPDPRG3= <>
##$CPDPRG4= <mlev>
##$CPDPRG5= <mlev>
##$CPDPRG6= <mlev>
##$CPDPRG7= <mlev>
##$CPDPRG8= <mlev>
##$CPDPRGB= <>
##$CPDPRGT= <>
##$D= (0..31)
0 1.2 0 0 0 0 0 0 0 0.06 0 0.03 0 0 0 0 0.0002 0 0 0 0 0 0 0 0 0 0 0 0 
0 0 0 
##$DATE= 1569408697
##$DBL= (0..7)
120 120 120 120 120 120 120 120 
##$DBP= (0..7)
150 150 150 150 150 150 150 150 
##$DBP07= 0
##$DBPNAM0= <>
##$DBPNAM1= <>
##$DBPNAM2= <>
##$DBPNAM3= <>
##$DBPNAM4= <>
##$DBPNAM5= <>
##$DBPNAM6= <>
##$DBPNAM7= <>
##$DBPOAL= (0..7)
0.5 0.5 0.5 0.5 0.5 0.5 0.5 0.5 
##$DBPOFFS= (0..7)
0 0 0 0 0 0 0 0 
##$DE= 6
##$DECBNUC= <off>
##$DECIM= 24
##$DECNUC= <off>
##$DECSTAT= 4
##$DIGMOD= 1
##$DIGTYP= 9
##$DL= (0..7)
0 120 120 120 120 120 120 120 
##$DP= (0..7)
150 150 150 150 150 150 150 150 
##$DP07= 0
##$DPNAME0= <>
##$DPNAME1= <>
##$DPNAME2= <>
##$DPNAME3= <>
##$DPNAME4= <>
##$DPNAME5= <>
##$DPNAME6= <>
##$DPNAME7= <>
##$DPOAL= (0..7)
0.5 0.5 0.5 0.5 0.5 0.5 0.5 0.5 
##$DPOFFS= (0..7)
0 0 0 0 0 0 0 0 
##$DQDMODE= 0
##$DR= 18
##$DS= 0
##$DSLIST= <SSSSSSSSSSSSSSS>
$$ [...]
##$SUBNAM2= <"">
##$SUBNAM3= <"">
##$SUBNAM4= <"">
##$SUBNAM5= <"">
##$SUBNAM6= <"">
##$SUBNAM7= <"">
##$SUBNAM8= <"">
##$SUBNAM9= <"">
##$SW= 24.0689530833862
##$SWIBOX= (0..15)
0 0 2 0 0 0 0 0 0 0 0 0 0 0 0 0 
##$SW_h= 4816.95568400771
##$TD= 16384
##$TD0= 1
##$TE= 0
##$TE2= 300
##$TE3= 300
##$TEG= 300
##$TL= (0..7)
0 120 120 120 120 120 120 120 
##$TP= (0..7)
150 150 150 150 150 150 150 150 
##$TP07= 0
##$TPNAME0= <>
##$TPNAME1= <>
##$TPNAME2= <>
##$TPNAME3= <>
##$TPNAME4= <>
##$TPNAME5= <>
##$TPNAME6= <>
##$TPNAME7= <>
##$TPOAL= (0..7)
0.5 0.5 0.5 0.5 0.5 0.5 0.5 0.5 
##$TPOFFS= (0..7)
0 0 0 0 0 0 0 0 
##$TUNHIN= 0
##$TUNHOUT= 0
##$TUNXOUT= 0
##$USERA1= <user>
##$USERA2= <user>
##$USERA3= <user>
##$USERA4= <user>
##$USERA5= <user>
##$V9= 5
##$VALIST= <valist>
##$VCLIST= <CCCCCCCCCCCCCCC>
##$VD= 0
##$VDLIST= <DDDDDDDDDDDDDDD>
##$VPLIST= <PPPPPPPPPPPPPPP>
##$VTLIST= <TTTTTTTTTTTTTTT>
##$WBST= 1024
##$WBSW= 4
##$XGAIN= (0..3)
0 0 0 0 
##$XL= 0
##$YL= 0
##$YMAX_a= 287221
##$YMIN_a= -452103
##$ZGOPTNS= <>
##$ZL1= 120
##$ZL2= 120
##$ZL3= 120
##$ZL4= 120
##$ABSF1= 10
##$ABSF2= 0
##$ABSG= 5
##$ABSL= 3
##$ALPHA= 0
##$AQORDER= 0
##$ASSFAC= 0
##$ASSFACI= 0
##$ASSFACX= 0
##$ASSWID= 0
##$AUNMP= <proc_1d>
##$AZFE= 0.1
##$AZFW= 0.1
##$BCFW= 1
##$BC_mod= 2
##$BYTORDP= 1
##$COROFFS= 0
##$CY= 11.3945322036743
##$DATMOD= 1
##$DC= 2
##$DFILT= <>
##$DTYPP= 0
##$F1P= 20.1720416913024
##$F2P= 0.152960286110954
##$FCOR= 0.5
##$FTSIZE= 0
##$FT_mod= 4
##$GAMMA= 1
##$GB= 0.15
##$INTBC= 1
##$INTSCL= 1
##$ISEN= 128
##$LB= 0.24
##$LEV0= 0
##$LPBIN= 0
##$MAXI= 10000
##$MC2= 0
##$MEAN= 0
##$ME_mod= 0
##$MI= 1.114404
##$NCOEF= 0
##$NC_proc= 0
##$NLEV= 6
##$NOISF1= 3.799351
##$NOISF2= 2.8
##$NSP= 1
##$NTH_PI= 0
##$NZP= 0
##$OFFSET= 15.70392
##$PC= 1
##$PHC0= -9578.273
##$PHC1= 19.00095
##$PH_mod= 1
##$PKNL= yes
##$PPARMOD= 0
##$PSCAL= 0
##$PSIGN= 0
##$REVERSE= no
##$SF= 200.130013532006
##$SI= 16384
##$SIGF1= 3
##$SIGF2= 2
##$SINO= 400
##$SIOLD= 16384
##$SREGLST= <1H.CDCl3>
##$SSB= 0
##$STSI= 0
##$STSR= 0
##$SW_p= 3612.71676300578
##$SYMM= 0
##$S_DEV= 0
##$TDeff= 0
##$TDoff= 0
##$TI= <>
##$TILT= no
##$TM1= 0
##$TM2= 0
##$TOPLEV= 0
##$USERP1= <user>
##$USERP2= <user>
##$USERP3= <user>
##$USERP4= <user>
##$USERP5= <user>
##$WDW= 1
##$XDIM= 8192
##$YMAX_p= 0
##$YMIN_p= 0
$$ End of Bruker specific parameters
$$ ---------------------------------
##NTUPLES= NMR FID
##VAR_NAME=  TIME,          FID/REAL,        FID/IMAG
##SYMBOL=    X,             R,               I
##VAR_TYPE=  INDEPENDENT,   DEPENDENT,       DEPENDENT
##VAR_FORM=  AFFN,          ASDF,            ASDF
##VAR_DIM=   8192,          8192,            8192
##UNITS=     SECONDS,       ARBITRARY UNITS, ARBITRARY UNITS
##FACTOR=    0.0002076,     1,               1
##FIRST=     0,             0,               0
##LAST=      1.7004516,     0,               0
##MIN=       0,             -452103,         0
##MAX=       1.7004516,     287221,          0
$$ Real data points
##PAGE= N=1
##DATA TABLE= (X++(R..R)), XYDATA
$$ [...]
1418B46k35q8j18K13j20k3J43K43k64r9J95m03J62M0J91m7j25J89k43J15j3o8
$$ 246 11 -77 -195 18 -102 -125 18 261 -3 -102 93 -310 -148 -108 83 36 -89 100 -143 -28 -41 -109
1440a09K04k00J35N4m1q8M5j01n5qK88j00QJ97l85L7K7K03j14P8r2J62J8l10L16
$$ -109 95 -105 30 84 43 -45 0 -101 -156 -164 124 24 32 229 -156 -119 -92 111 -3 75 -17 145 163 -147 169
1465A69k90r3L11j2l15K01j4O7k74J57J12J77n3l12K87k94K80l32O1J19K89po9
$$ 169 -121 -214 97 85 -230 -29 -43 24 -250 -93 19 196 143 -169 118 -176 104 -228 -167 -48 241 234 165
1488A65j83J1k4j40J62o9L47l60J09kj55K41j38K9r6J20O8m9k14R2L2j7J82J04
$$ 165 -18 -7 -31 -171 -9 -78 269 -91 18 16 -139 102 -36 -7 -103 17 85 36 -178 -86 -54 -71 111 215
1512B15k02j66J8J33j44P9K5j40K19M1MJ14j87J5r8O1K00j29p6L3j22J31j73J49
$$ 215 13 -153 -135 -2 -146 -67 -42 -182 37 78 82 196 9 24 -74 -13 187 58 -18 15 -107 24 -149 0
1536@L7j96J51q8L33l35j4K21n4j97N76l39q5j21K07j16j82L12Jk04K86p2R4l57
$$ 0 37 -159 -8 -96 237 -98 -112 109 55 -142 434 95 10 -111 96 -20 -202 110 111 -93 193 121 215 -142
1560a42k5J05R6K03O4j76j20J26R0k43Oj1K37r8m9Nj21P5l0J11r0j91K84R6l53
$$ -142 -167 -62 34 237 301 125 5 131 221 -22 -16 -27 210 112 63 68 -53 22 -8 103 13 -178 106 202 -151
1585a51l3K64l2K0p7J66j95j4m1J48m0j77K10j19L37nm48L27j85j18l6P9K84M7
$$ -151 -184 80 48 68 -9 157 -38 -52 -93 55 15 -162 48 -71 266 261 -187 140 -45 -163 -199 -120 164 211
1609B11j03j96j23L12O9p7j02J62k72K28j00O3k34L7j7OL58j87Om7K4q2k1R6n3
$$ 211 108 -88 -211 101 170 93 -9 153 -119 109 9 72 -162 -125 -142 -136 222 35 41 -6 18 -64 -85 11 -42
1634d2K36j33q5n3K9j9L3K16k86K22l1j5j35K09k49J37R9j17q5J84r3Q6l01K24
$$ -42 194 61 -24 -77 -48 -67 -34 182 -104 118 87 72 -63 146 -103 34 133 16 -69 115 22 108 -193 31
1658C1L8J31j93j59K01n7R6j05L3M0J15Jj12K5j61p6J76q1J34K5j37Lo4l3K4Q6
$$ 31 69 200 7 -152 49 -8 88 -17 16 56 171 172 60 85 -76 -152 24 -57 77 102 -35 -32 -96 -129 -105 -19
1684a9p6R6Rj3k0j19J96n8N2j8j8M1j08K8j61J07Q0r8J00q1J54l1j47J42N5k32
$$ -19 -95 1 10 -3 -23 -142 54 -4 48 30 12 53 -55 -27 -188 -81 -1 -99 1 -80 74 43 -104 38 93 -139
1710a39J78J52j88N6j34J3j7J77q3r3J52k43K8J77j2R3j31kR7l8r3J80n3p4j5
$$ -139 39 191 3 59 -75 -62 -79 98 15 -78 74 -169 -141 36 24 117 -14 -16 81 43 -50 130 77 3 -12
1735a2j36K29J5J9j8J04k86J43J93k05J95j67k14K95qk18n3P9J8M7N6N2k39J63
$$ -12 -148 81 96 115 97 201 -85 58 251 46 241 74 -140 155 147 -71 -124 -45 -27 20 76 128 -111 52
1759E2n4q4J46j02K21j03p1rj08R9j3j25J74o1l3N7K75j14j22j69J94k17M3J58
$$ 52 -2 -86 60 -42 179 76 5 -4 -112 -13 -26 -151 23 -38 -71 -14 261 147 25 -144 50 -167 -124 34
1783C4k10J54J52j05j27J33kn6M6j36J27j77M1J37j54K43r1K0K05l24LJ7K1K36
$$ 34 -176 -22 130 25 -102 31 29 -27 19 -117 10 -167 -126 11 -143 100 9 29 234 -90 -87 -70 -49 187
1807A87j15Ok26L30k09P1j35K55j2k33M5J09j85Q5L5rj93J66J38j39n3m5J89j54
$$ 187 72 78 -148 182 -27 44 -91 164 152 -81 -36 73 -112 -27 8 -1 -194 -28 110 -29 -82 -127 62 -92
1831i2m2J48P4j67L5P3p4j0r5j4J85J66j99J53k20J47k7j21O6J60j52m4o5R1l
$$ -92 -134 14 88 -79 -44 29 -45 -55 -150 -164 21 187 -12 141 -79 68 41 -80 -14 146 -6 -50 -115 -24 -27
1856b7j61J81J12l8r9K14r9j18K77j26j49nK08j91J3K6j10Q9l4Q7j41j53L29K75
$$ -27 -188 -7 105 67 -32 182 83 -35 242 116 -33 -38 170 -21 -8 18 -92 -3 -37 50 -91 -244 85 360
1880C60l74q1PJ83j7j52Q8K3R5l14m7o4K09L14k31K0J33l52J37Q9j50R2o8K19
$$ 360 -14 -95 -88 95 78 -74 14 37 132 -182 -229 -293 -84 230 -1 19 152 -200 -63 26 -124 -32 -100 119
1904A19j23N1n7J22j8q5N6O3j35l1q7R5j2n4K62j63J05j44K1J13j42J37j83om6
$$ 119 -4 47 -10 112 94 9 65 128 -7 -38 -125 -30 -42 -96 166 3 108 -36 -15 98 -44 93 -90 -96 -142
1929a42K84P3k15Q5J2o8J30k34J19m1l8O4K1K3j42n5J22J97j04J35j82%j52O9
$$ -142 142 215 0 85 97 29 159 -75 44 3 -35 29 50 73 -69 -124 -2 195 91 226 44 44 -108 -39
1953c9N4q7K57j90R2p1k28J38j4L5Q8O6Pk47Q7j8Q3q4r9J26N0L1oL0j18J5lO6
$$ -39 15 -72 185 -5 87 16 -212 -74 -88 -53 35 101 108 -139 -52 -70 13 -71 -170 -44 6 37 31 61 -57 -42 -45 21
1981B1O8j06J82j73l6n2q4L37j07J06j10l2J42L8k65lJ47J12j87M1j00J41j55
$$ 21 89 -17 165 -8 -44 -96 -180 157 50 156 46 14 156 194 -71 -74 73 185 -2 39 -61 80 -75
2004g5J90j73J5J12j56Q1L6kR3k05K09j7k11k0M2J45p4Q1J51m35J03K09j41P1
$$ -75 115 -58 -43 69 -87 -6 30 28 121 -84 125 108 -103 -123 -81 64 -10 71 222 -213 -110 99 -42 29
2028B9RK7o1O6J15k05J63r7n3r5Q0K19J3k56n1K05r4O8p7j08K32j58K21j74L07
$$ 29 38 65 4 70 185 -20 143 46 -7 -102 -22 197 210 -46 -97 108 14 82 5 -103 129 -29 192 18 325
2053C25l10r2O2q9NJ16m2j50J59lO7j46O6q7J31j92J81J76R9l12m6q4J05R4m3
$$ 325 15 -77 -15 -104 -99 17 -25 -175 -16 -19 48 -98 -32 -119 12 -180 1 177 276 -36 -82 -166 -61 33 -10
2078a0qM7o4j6J01j98k1L11l9j47q7N1%j86J83m5L1K12j52K4j9q1J24Kj63K84
$$ -10 -18 29 -35 -51 50 -148 -169 142 103 -44 -131 -80 -80 -266 -83 -128 -97 115 -37 -13 -32 -113 11 13 -150 134
2104A34j08N5Q0k22J07j23L3J10q1j46J83o9o5j18K71J94k66q9J30LP8l20L07
$$ 134 26 81 161 -61 46 -77 -44 66 -15 -161 22 -47 -112 -230 41 235 -31 -120 10 13 91 -229 78
2127G8j03q8J36O4J31k71J39k28K2L4L0q4K25j21j14R2Q3Q2q9P8p6j26K2j6K17
$$ 78 -25 -113 23 87 218 -53 86 -142 -120 -86 -56 -140 85 -36 -150 -58 25 107 18 96 20 -106 -84 -100 117
2152A17j08oj76K02N0k28J64r0M3KJ61p4M5k94K70LL5j33j55O9k3P2J13J47k43
$$ 117 9 3 -173 29 79 -149 15 -75 -32 -30 131 57 102 -192 78 81 116 -17 -172 -103 -126 -54 59 206 -37
2177c7k9J06K0r9P2n5L7j10J83N8j46J34qM9n6r1P9q9r1J63pq4Q3k59L30Pk93
$$ -37 -66 40 60 -39 33 -22 15 -95 88 146 0 134 126 175 119 28 107 18 -73 90 83 -1 82 -177 153 160 -133
2204a33O1m1J33JL1O6N2l69J3O5Q8O6j17J74j02N5k30K54j10N9l7L3n3J52r7j95
$$ -133 -72 -113 20 21 52 118 170 -199 -186 -121 -33 33 -84 90 -12 43 -187 67 -43 16 -21 12 -41 111 14 -181
2230a81J84j54M47l65l6L49j69j55J36J5k4K1O3K11k63j31J76j59J2k3J28M3l6
$$ -181 3 -151 296 -69 -105 244 75 -80 56 71 47 68 131 342 79 -52 124 -35 -23 -46 82 125 89
2253H9q9O6l8n0j29J05J76K9k81JM9J75q6R6k87J55j45N9M5k7j0J78jj2r9k8Q7
$$ 89 0 66 28 -22 -151 -46 130 159 -122 -121 -72 103 17 113 -174 -19 -164 -105 -60 -87 -97 81 80 68 -31 -59 28
2280B8O6j57k8R3r1J06M8j25L02k79R2J62j27k46J23Q3m9n3J74P1k66J64K4K6
$$ 28 94 -63 -91 2 -89 17 65 -60 242 -37 55 217 90 -156 -33 50 1 -52 122 193 -73 91 115 141
2304A41j07j21p8J25J05j61l4M2O3J28m0q2NJ8mOK68l20O2J14k29K2J35j74J27
$$ 141 34 -87 -165 -40 65 -96 -130 -88 -25 103 63 -19 -14 4 0 6 274 -46 16 130 -99 -77 58 -116 11
2329A1L7j07J84j6j48J6J69q6r1N1J25k15J47r8J82j25m3M3N9k3j46K8j8Q2O5
$$ 11 48 -59 125 109 -39 -23 146 60 -31 20 145 -70 77 -21 161 36 -7 36 95 72 -74 -46 -64 18 83
2354H3k75J80Q8Qj63L1J28k36L22j65J3N9j44K00k42J03r2J55J22l3j20Lk3j43
$$ 83 -192 -12 76 84 -79 -48 80 -156 166 1 14 73 -71 129 -113 -10 -102 53 175 142 22 25 2 -141
2378a41K64k41M2J2J79j93R5Nn5J47k00K3L4O9o7J34J26k22j62K48q9Mj4nj40
$$ -141 123 -118 -76 -64 115 -78 17 22 -33 114 -86 -63 -29 40 -27 107 233 11 -151 97 8 12 -2 -7 -147
2403a47J68j68O9K45q9j1j64O4j07O1Q4M7Mj85J42L06k31l6j38m3J81K6k9P2j59
$$ -147 21 -147 -78 167 78 67 -97 -33 -140 -79 5 52 56 -129 13 319 88 52 -86 -129 52 78 49 121 -38
2428c8J84k15l4J58R4k86K12l16J18K04n3p2M4R0j56J54M2j31r3J58k8j98M4K03
$$ -38 146 -69 -103 55 149 -137 75 -241 -123 81 28 -44 0 90 -66 88 130 -1 -94 64 36 -162 -118 85
2452H5J51l56J09L0J18L2j43M5j19k2J13J47j00l45L46o8j29L10p5j48pk6lR1
$$ 85 236 -120 -11 19 137 169 26 71 -48 -70 43 190 90 -255 91 23 -106 204 129 -19 -26 -52 -55 36
2476C6J4n2P0k04K00j37J37o9n9j02P5J63J52j92M4j2l0j53J36n9j28K66j76J45
$$ 36 50 -2 68 -136 64 -73 64 -5 -64 -166 -91 72 224 32 76 64 34 -119 17 -42 -170 96 -80 65
2500F5n9N5j5kj05L2n6m0P0j06L3J84j42J44k94K88j36J47j0j2np8K86k76J48
$$ 65 6 61 46 44 -61 -29 -85 -125 -55 -161 -128 56 -86 58 -236 52 -84 63 53 41 36 -42 244 -32 116
2525A16j36J00j09M1j12K31j89Q8k8q8P2k69K20J46J27k00P1k04J00J36j51K45
$$ 116 -20 80 -29 12 -100 131 -58 30 2 -86 -14 -283 -63 83 210 10 81 -123 -23 113 -38 207
2547B07j07k02K55j58j27Qk2J81o0j6k9N3jO6O8k23J04J40m5o9ml3m4o5K68j47
$$ 207 100 -102 153 -5 -132 -124 -146 35 -25 -41 -70 -17 -18 48 116 -107 -3 137 92 23 19 -14 -58 -123 145 -2
2573bom2ln7J02p5M5J16j75KJ36Q8l37K62OJ35p9n6j51J13N5K6j83K66k72K4P9
$$ -2 -8 -50 -53 -110 -8 -83 -38 78 -97 -95 41 129 -208 54 60 195 116 60 -91 22 77 103 -80 186 -86 -62 17
2600A7j7Mj9l4R4p6N7r3K29j67k48L10J27k42J62N0qJ3Q4l00K2J47k18J1P2K10
$$ 17 0 4 -15 -49 45 -31 26 -67 162 -5 -253 57 184 -58 104 154 146 159 243 -57 -35 112 -106 -95 -23 187
2626A87k21MJ08k1j31J7j5N5l5J78m7j68o5J56K69k87q6J13k23R0L05k34j22J94
$$ 187 -34 -30 78 57 -74 -57 -72 -17 -52 126 79 -89 -154 2 271 -16 -102 11 -212 -122 183 -51 -173 21
2650B1j24N4J0J27k44K2K29L1j31J00j57J27o5P4k37M6J11k1J02q9k29L87l10
$$ 21 -103 -49 -39 88 -156 -134 95 126 -5 95 -62 65 0 74 -163 -117 -6 -27 75 -14 -243 144 -166
2673a66J37r9J24J2N7m6k38J72j75K04J47k4k02P2rK56j09j12Q0j86J3J80j61
$$ -166 -29 -128 -4 8 65 19 -219 -47 -222 -18 129 105 -97 -25 -34 222 113 1 81 -105 -92 88 -73
2696g3m5J58j78J68r6m4L40j14q3Lk1l3k3J22Oj15K20l96L04j47Q3P3k3p9Kn0
$$ -73 -118 40 -138 30 -66 -110 230 116 33 36 15 -18 -41 81 87 -28 192 -204 100 -47 36 109 86 7 9 -41
2722d1R7P5k37J13j38n3L08j28j01J22n0Q1m1MRO1K7k37J20N0J47l06J72O1k05
$$ -41 56 131 -106 7 -131 -184 124 -4 -105 17 -33 48 7 11 20 81 108 -129 -9 41 188 -118 54 115 -90
2747i0N5N0J16p4j05K8K02n7j82o1q0K83k29R4j1P0M5k77K59M0j35OJ0J1j51J3
$$ -90 -35 15 131 57 -48 -20 182 125 -57 -118 -198 85 -144 -50 -61 9 54 -223 36 76 -59 -53 -43 -32 -183 -170
2773a70R7q3N2j1J87j23K3k1l8K06l81K91Q4p5m8R9R6k84J18J1k09K65p2Mp2J41
$$ -170 -73 -156 -104 -115 72 -51 -28 -49 -87 119 -262 29 113 38 -10 89 185 -99 19 30 -179 86 14 18 -54 87
2799H7r6J01lq1p3rl6J2J38L7r0N1j20LK08k08k2n8K26r4J71p6r6MP8pq8K45m3
$$ 87 -9 92 89 8 -65 -74 -110 -98 40 77 -13 38 -82 -79 129 -79 -101 -159 67 -27 144 68 -28 -24 54 47 -41 204 161
2828A61k08K4J12M6m35K48J10l2K0L7m0p2N0J37p8j32J05n4N8j03o9J9j21K76
$$ 161 -47 -23 89 135 -300 -52 58 26 46 83 43 -29 21 158 80 -52 53 -1 57 -46 -115 -96 -217 59
2852E9m8J93l68m2O3K65k10J46j52J04r4N1L3J2j17J40q0r0J15M0K8r0j7R8Lj71
$$ 59 11 204 -164 -206 -143 122 -88 58 -94 10 -84 -33 0 12 -105 35 -45 -135 -20 20 48 -42 -59 39 42 -129
2878a29K55k26K65k55J83n2p6O0p4m9J15j20J10O1q8NK16l60J74J15J14l26J70
$$ -129 126 -100 165 -90 93 41 -35 25 -49 -98 17 -103 7 68 -20 -15 201 -159 15 130 244 -82 88
2901H8j26M3K7n1m4k1O8J41k89K76o5j58O6n4J12L0nk02K62m03L93R3l01J88O4
$$ 88 -38 5 32 -19 -63 -84 -16 125 -164 112 47 -111 -45 -99 13 43 38 -164 98 -305 88 181 -120 68 132
2926A32j25PqK1L2j06R5o1M7l1j17L5M6N3%Qo3P7j10P8J36j38n0j55J93K9j1K
$$ 132 7 14 6 27 59 -47 48 -13 34 3 -114 -79 -33 20 20 28 -35 42 -68 10 146 8 -42 -197 -4 25 14 16
2954A6J83j93M9j02J58nj33j8l5J39q9N2j41J69n8n5J2m3P6K54k16J15p2J4N7
$$ 16 199 6 55 -47 111 106 -27 -45 -80 59 -30 22 -119 50 -8 -63 -51 -94 -18 236 20 135 63 77 134
2979A34j00M3j52m0L16l03O9m4P4K5k7Q6j77K01j64K13j88o1N0J13m8L7J40k15
$$ 134 34 77 -75 -115 201 -102 -33 -77 -3 22 -5 81 -96 105 -59 154 -34 -95 -45 68 20 57 197 -18
3003a8J3j26J50J3j62l9K63O9R2j82Kq4j01P9Pm6J77k43J69O7r4J3m2K3J88j24
$$ -18 -5 -131 19 32 -130 -169 94 163 255 73 75 -9 -110 -31 -24 -70 107 -136 33 100 6 19 -23 0 188 64
3029F4j40m3K81k00R5n7J35j94R9J50j57oj82J15J56j27p6J81j26J27J0J27k59
$$ 64 -76 -119 162 -38 57 0 135 -59 40 190 33 27 -155 -40 116 -11 -87 94 -32 95 105 232 -27
3052b7P4n1p6Q9k08K73p4J19k03J48n7k8L7J28k49m4L06j33j12K0J06l08K34j59
$$ -27 47 -4 -80 9 -199 74 0 119 -84 64 7 -21 16 144 -105 -149 157 24 -88 -68 38 -270 -36 -195
3076a95J65L4j01J60j9j8jp7K02j49j58NJ47n0J05j49M2N9j28J85K10k70P7r8
$$ -195 -30 4 -97 63 44 26 25 -52 150 1 -157 -152 -5 -55 50 -99 -57 2 -126 59 269 -1 76 -22
3100b2Q5n4N2QJ8j75J03M0J50j96j4P4N0r3LJ48m8L7m8j07n0J52k95L17o2j85
$$ -22 63 9 61 69 87 -88 15 55 205 9 -5 69 119 26 29 177 129 166 118 11 -39 113 -182 135 73 -112
3126a12N2l9P1J27j48l1J03N5l39M0K45n5Q6j54J91j88K14L2l77K46J20j58K76
$$ -112 -60 -99 -28 99 -49 -80 23 78 -261 -221 24 -31 55 -99 92 -96 118 150 -227 19 139 -19 257
3149B57k40L7l6k1K9L1j9j45J8J00Q7N0k00K15j00j98J92j47J49j37K84j96j07
$$ 257 17 54 18 -3 26 57 38 -107 -89 11 98 148 -52 163 63 -135 57 -90 59 -78 206 10 -97
3172i7L6J16O1p6kj65J13R6j76K25j81n2L6J28L6l19K10nJ54j87Q4j4n6j39J92
$$ -97 -61 55 116 40 38 -127 -14 82 -94 131 -50 -102 -66 62 98 -221 -11 -16 138 -49 35 21 -35 -174 18
3197A8p2m5J11j43K39j55k54K98M1k18K72m2M6Q0j92j67K14K5j33J20j5m0oQR
$$ 18 -54 -99 12 -131 108 -47 -301 -3 38 -180 92 50 96 176 -16 -183 31 56 -77 43 28 -12 -18 -10 -1
3222aJ20n7nPq9L7j9oj86K13K0o9k1K0k30K20L7k34J68K64j72n5j32J31J49O%
$$ -1 119 62 57 64 -25 12 -7 -13 -199 14 34 -35 -56 -36 -266 -46 -9 -243 -75 189 17 -38 -170 -39 110 116 116
3249A16k4j57j8R8o3N1J41q5l1m0J8L6J35k58O0N0L3j72J87j05J83k10q4J75j02
$$ 116 92 -65 -83 15 -48 3 144 59 28 -12 6 42 177 -81 -21 29 62 -110 77 -28 155 -55 -139 36 -66
3274f6K01j17r0N3q1J16O6k07K46p1q4j18O4P2N3j01L05l80K67p9r2p4K93k2j00
$$ -66 135 18 -72 -19 -100 16 82 -125 121 50 -34 -152 -88 -16 37 -64 241 -139 128 49 -43 -117 176 154 54
3299E4k30J95P5j71P7k11L09j46K1nj67O6MR1O8K0L0J24j14r8M7J0j33k6J4J73
$$ 54 -176 19 94 -77 0 -211 98 -48 -27 -32 -199 -133 -129 -38 30 50 80 204 90 -8 39 49 -84 -110 -96 77
3325G7q5J06j48j49J61J39p3j40J24J7Lq9O2l3J6K2j19K36j52J75j85O0O0qj67
$$ 77 -8 98 -50 -199 -38 101 28 -112 12 29 32 -57 5 -28 -12 10 -109 127 -25 150 -35 25 85 77 -90
3350i0K4n4J79J05j94J20n4N7q4jj7K8n6qK4o2p5L15j04j98L92l45Q8J31j86K1
$$ -90 -66 -120 59 164 -30 90 36 93 9 8 -9 19 -37 -45 -21 -83 -158 157 53 -145 247 -98 -10 121 -65 -44
3376d4L3Oo2M4O9K3k91R2N9j03Q4K55j08K2K4j88K13p1j20J38N1j48l8L4K00j67
$$ -44 -11 -5 -67 -23 46 69 -222 -130 -71 -174 -90 165 57 79 103 -85 128 57 -63 75 126 -22 -60 -26 174 7
3402Gp2Q1l0k1J04j70m3n9K17r7N8o5L8J60k6k8r5J10p8J70j15n6L42m85O8j7
$$ 7 -65 16 -14 -35 69 -101 -144 -203 14 -83 -25 -90 -52 108 82 54 -41 69 -9 161 46 -10 332 -153 -85 -102
3428a02l5O7J33j12N9N0j94J58j4%L1q5Pj79L28j19q8J55l7p9M9K49k63kJ36j29
$$ -102 -137 -70 63 -49 10 60 -134 24 10 10 41 -44 -37 -216 112 -7 -95 60 23 -56 -7 242 -21 -23 113 -16
3454a6k93K08P9j24P9J27j09r1O6J6J09R5k52K28Qj38oL5j18J86k8j34OJ72j82
$$ -16 -309 -101 -22 -146 -67 60 -49 -140 -74 -58 51 146 -106 122 130 -8 -14 21 -97 89 61 -73 -67 105 -77
3479g7R9R3n2Nk2p4o4J03n7q5Q7J04j40j01J76J5k7j33J99n2M9K8k00K46j39j7
$$ -77 22 115 63 68 46 -28 -92 11 -46 -131 -44 60 -80 -181 -5 10 -17 -150 49 -3 46 74 -126 120 -19 -36
3505c6m4K19m14K39J07j29M3J82k73l0J21k7O5j82K59q3r0J95o1j56m6J76j3P6
$$ -36 -80 139 -275 -36 71 -58 -15 167 -106 -136 -15 -42 23 -159 100 17 -73 122 61 -95 -141 35 22 98
3529I8k84K49j61qJ29K8J34k9j79M7l7K5N4M7j04P1q9J76k08qK40j50L4k48K88
$$ 98 -186 63 -98 -106 23 51 185 156 -23 24 -13 12 66 113 9 80 -9 167 -41 -49 191 41 75 -173 115
3554A15j86j06J88O4kj54J84k58K01j01J30j6N4j2j16j33K24o4q7m6J11p6K30
$$ 115 -71 -177 11 75 73 -81 103 -155 46 -55 75 59 113 101 -15 -148 76 12 -75 -121 -10 -86 144
3577A44k51K80k14P0Lj2P0k89L03r8K1jJ02j74k0R2K1m1M3o5K2kj2K42j73K5O7
$$ 144 -107 173 -41 29 32 20 90 -199 104 6 27 26 128 -46 -66 26 47 6 49 -16 6 4 -8 234 61 86 153
3604A53k84o3K73J07M3j51k71M57j90n6M7L8j83O3N4r6P8M5L5m5K5j03j67K10
$$ 153 -131 -194 79 186 229 78 -193 264 74 18 65 103 -80 -17 37 -59 19 64 99 54 79 -24 -191 19
3628A9Q3k5l8J34j44J9k7q5J65j79J92j76Jl5N5RP9k15K68k21J10J2P4j68J51
$$ 19 102 77 39 173 29 48 21 -64 101 -78 114 -62 -61 -96 -41 -32 47 -168 100 -121 -11 1 75 -93 58
3653E8N9J4j10l6j04J89k64L60r7k07M10j62j21l5J88k74R1O3m4L9R1j69M6j7
$$ 58 117 131 21 -15 -119 70 -194 166 69 -138 272 110 -11 -46 142 -132 -41 22 -22 17 108 -61 -15 -32
3677c2K0J7Qo9rJ6J68p2l7o2%o1Q3J0Jo7K1P3Q4l7J4j39Q2l5R7j4Lj57N7P3k30
$$ -32 -12 5 13 -56 -65 -49 119 47 10 -52 -52 -113 -30 -20 -19 -86 -65 8 92 55 69 -70 12 -23 74 60 63 -94 -37 36 -194
3708a94M26k77p8J70nK43k64K84l69J34j19J39k05R8L7P1j42R8m5j61P3O9j31
$$ -194 232 -45 -123 47 42 285 21 305 -64 70 -49 90 -115 -17 20 91 -51 47 2 -159 -86 -17 -148
3731a48K8Q1k37K16jk4J16J16j67K26k36j86K63k20Q3J91k08K07J6n6j12J46j16
$$ -148 -120 -39 -276 -60 -61 -85 31 147 -20 206 -30 -216 47 -173 -90 101 -107 100 116 60 -52 94 -22
3754b2O3j02N6N9j33m8J90m9P4j02o3K15O8k69k9q0K10j11L46k32k70K86j93L1
$$ -22 41 -61 -5 54 -79 -127 63 14 88 -14 -77 138 206 -63 -92 -172 38 -73 273 41 -229 57 -136 -105
3778a05R5j9j44m8K51j66J60J49k38o3j0K12R8q8j87J50k6J02j63q5L8oP3N9L7
$$ -105 -10 -29 -173 -221 30 -136 24 173 -65 -128 -138 74 172 84 -103 47 21 123 -40 -125 -87 -93 -20 39 76
3803G6o1k5k18J68K47k95l8K31k0r9j2J43n1j05K0lp5Q3l9JR9j44R5j38J67L2
$$ 76 15 -10 -228 -60 187 -108 -146 85 65 -34 -46 97 46 -59 -39 -42 -117 -34 -73 -72 27 -117 -22 -160 7 39
3829C9P2k20J73J61q7k58J29J33j53J50r4L7k2L2q4J4oJ91n9j18j06j7J94mj56
$$ 39 111 -109 64 225 138 -120 9 142 -11 139 45 82 60 92 8 22 16 207 148 30 -76 -93 101 97 -59
3854e9P1r6J41j71J6J49P7o2k39K82j78M0N3l3j92J62j5o9J41m9J02j36K07j23
$$ -59 12 -84 57 -114 -98 51 128 66 -173 109 -69 -29 24 -9 -201 -39 -54 -123 18 -31 71 -65 142 19
3878A9j8j14K52o2j54J02J08L5m8j00j89L33j72m1O4J71l25J15j28J02Q6J22k42
$$ 19 1 -113 139 77 -77 25 133 168 120 20 -169 164 -8 -49 15 186 -139 -24 -152 -50 36 158 -84
3901h4O0J29j02j9L1k9j63J09N4j3p4Q0J75k05J13j19k3R0j01k5J64k4L2j2l7
$$ -84 -24 105 3 -16 15 -14 -177 -68 -14 -27 -101 -21 154 -51 62 -57 -80 10 -91 -116 48 24 56 44 7
3926Gj09J57J41l38J21p1j28K48N3p7j62L10j34J28K8o2R1l85J15J44j72J19N5
$$ 7 -102 55 196 -142 -21 -92 -220 28 81 4 -158 152 18 146 174 112 203 -182 -67 77 -95 24 79
3949G9l3k39J39Q6Or7J29o7p9L06j36j26m9l2O7J31l75L00J50J6k13M9J8k39L3
$$ 79 46 -193 -54 32 38 -59 70 3 -76 230 94 -32 -81 -113 -46 85 -290 10 160 176 -37 12 30 -209 -176
3974a76J40K33j8k22p0j6J18M6M2k4j35K41q4Q7N3k10j20Jo5K40j69J52L6ok7
$$ -176 -36 197 179 -43 -113 -129 -11 35 77 53 -82 159 75 162 215 5 -115 -114 -179 61 -108 44 80 74 47
3999D7j51K3K25p9j41J32j09m3J71j61M3%J13J6n6m4r2J71o1j63J79k6N5pJ3l8
$$ 47 -104 -81 144 65 -76 56 -53 -96 75 -86 -43 -43 70 86 30 -14 -106 65 4 -159 20 -6 49 42 55 17
4025A7j57J30j2J39k52O2J88k42K65R1k99L3P4L2j15J31k19J26K4j22J05j0%M7
$$ 17 -140 -10 -22 117 -135 -73 115 -127 138 229 -70 -37 37 69 -46 85 -134 -8 16 -106 -1 -11 -11 36
4049C6p7K23p0j48j18R5L18k55K8n5n0l6Q1J03J17j16j67O2r1J80K18k89J57j4
$$ 36 -41 182 112 -36 -154 -59 259 4 32 -23 -73 -109 -28 75 192 76 -91 -29 -120 60 278 -11 146 132
4073A32r8j68K71l03O0N1R6O1J23k97k9J79o4O9j18l5J17J3j31J24j88K87J3j40
$$ 132 34 -134 137 -166 -106 -55 41 102 225 -72 -101 78 14 83 -35 -70 47 60 -71 53 -135 152 165 25
4097B5R6j62K2j37K18j77K40j63j30R4k0k1n6L30N9k16p9k5J78j11P0j08P7Q2
$$ 25 121 -41 -19 -156 62 -115 125 -38 -168 -74 -94 -115 -171 159 218 2 -77 -102 76 -35 35 -73 4 86
4121H6j48R1lr7J07k8J81Ll37K33k7j80K6ON2R5J9q5Rn3L7R5j84N2L0K30r0j37
$$ 86 -62 29 26 -71 36 8 189 192 -145 88 61 -119 -93 -87 -35 60 79 -6 3 -50 -13 82 -102 -50 -20 210 120 -17
4149a7K89k25q8L3K11j70J4k16K95j03J81k5l3j19p5K18k59J3k6J43k14J9K45
$$ -17 272 47 -41 -8 203 33 47 -169 126 23 204 179 146 27 -48 170 -89 -76 -102 41 -173 -154 91
4172I1Q5j47j2J21q5k48J85O2k3j02R3p4k4J93k28K8J87r4n3J5J02p0Q5l8J1o0
$$ 91 176 29 17 138 53 -195 -10 52 29 -73 20 -54 -78 115 -113 -85 102 8 -45 -30 72 2 87 49 60 0
4198@K48k54n1j9J43k21K14j01L7K48k35K19k46J59o4l1K4j33J59l2k35R4J20
$$ 0 248 -6 -57 -76 67 -154 60 -41 -4 244 9 228 -18 141 77 46 70 -63 96 64 -171 -77 43
4221D3Q3KJ0j51K41l29J40j45M1q8J9J07l8K31k72K22j49Q3j13o4J18J66j17j4
$$ 43 126 128 138 -13 228 -101 39 -106 -65 -153 -134 -27 -65 166 -106 116 -33 50 -63 -127 -9 157 40 26
4245B6j28p8K95p5k1j39R8K4j37p9K26k28L98k26Ljl7j24J45J57j89n0L4P3O0
$$ 26 -102 -180 115 40 19 -120 -22 2 -135 -214 12 -216 182 -44 -41 -42 -79 -203 -58 99 -90 -140 -106 -33 27
4270B7Oj13K38j93L8o0J8M7L8J06k66O2n5Q4OO4j00K00k3j90J64o5kl3Q8j52K90
$$ 27 33 -80 158 -35 3 -57 -39 8 46 152 -114 -52 -107 -23 -17 47 -53 147 124 -66 98 33 31 -2 86 -66 224
4297B24k35P0Q4k37J71k21K24O1Mp0J08k01O0M9j77K1J8K4k1j19J86k7R2k06J52
$$ 224 -11 59 143 -94 77 -144 80 141 145 75 183 -18 42 91 -86 -65 -47 -23 -44 -163 23 -4 88 -118 34
4322C4J8Q1j78n0P7J17j05L0j79J21Q8K5k0J09j49n0j9O6Q1j01l6j3j3Q0m8J9
$$ 34 52 133 -45 -95 -18 99 -6 24 -155 -34 54 79 59 168 19 -31 -50 16 97 -4 -40 -53 -66 14 -34 -15
4348a5Q4o0j88J92Rl0L4J52j82n0J35P2j80L4J47q5J08K2l00j8J86p6K06j25M5
$$ -15 69 9 -179 13 22 -8 26 178 -4 -54 81 153 -27 7 154 69 177 199 -101 -119 67 -9 197 72 117
4373A17r6N8Q2k35p6P0J26R6o5J0oj2l4k4m2K6n5M6J34n3r1J33j10j16J41j48
$$ 117 21 79 161 -74 -150 -80 46 142 77 87 81 69 35 11 -31 -5 -60 -14 120 67 -24 109 -1 -117 24 -124
4399a24L65l49N1N1k4J3N7j56R9l7K5J6j15J26j71J86J39k79j2K75j32Q4o1O3
$$ -124 241 -108 -57 -6 -30 -17 40 -116 -17 -54 -29 -13 -128 -2 -173 13 152 -127 -139 136 4 88 27 90
4423I0j29K39k79kK43l67K71j87J43K0m7m1K50j63K2j3j26R8n3O2p7Q6k7j29J62
$$ 90 -39 200 -79 -81 162 -205 66 -121 22 42 -5 -46 204 41 63 50 -76 22 -31 31 -46 40 13 -116 46
4448D6N1n0j35m6K82j85l7K54j18K01k44r0R4j33j21J00J04l6j1n6j33L18r0K3
$$ 46 97 47 -88 -134 148 -37 -74 180 62 263 19 -71 23 -110 -231 -131 -27 -63 -74 -130 -263 55 -35 -12
4472a2k1q7J31j46J18j62L13l8J1J8J8j46K72l18P9p7n2J39j10RQ1J21j15L13
$$ -12 -33 -120 11 -135 -17 -179 134 96 107 125 143 -3 269 -49 30 -47 -99 40 -70 -61 20 141 26 339
4496C39k69j30L4j09J55Q8r3k8K21p6j96J98k08M8r9J89R8k54J36k59J60J11j03
$$ 339 70 -60 -26 -135 20 108 15 -13 208 132 -64 134 -74 -26 -125 64 162 -92 44 -215 -55 56 -47
4519d7lQ7j71m5J77j18K22k8m7k11J70r6N2J5R8j39Q8n2J20j18N3J04j76J71r4
$$ -47 -50 37 -134 -179 -2 -120 102 74 27 -184 -14 -110 -58 -43 55 -84 4 -48 72 -46 7 111 -65 106 12
4544A2r1q3L20l08J02J54o8r4p2P6J44j75J06M8P7k45j2N0lK0J80p1K9mj96J9
$$ 12 -79 -162 158 -150 -48 106 38 -56 -128 -52 92 -83 23 71 148 -97 -109 -59 -62 -42 138 67 96 92 -104 -85
4570h5j65R0k6K91j71J0q7L18k52J6n5K09j54L7J43j71R1k12n6J47K14j45J25
$$ -85 -250 -160 -186 105 -66 -56 -143 175 -77 -61 -116 93 -61 -24 119 -52 39 -173 -229 -82 132 -13 112
4593A12l02R1K23l12K75j01O8m7J29j67K67q3j78M2r7l8p1J99J51j25o0oQ7P6
$$ 112 -190 -99 124 -188 87 -14 54 7 136 -31 236 153 -25 17 -80 -118 -189 10 161 36 -24 -30 57 133
4617A33q9l9k68M62k59KQ0j06K7Pl6MJ84j52k2K21k14J20p6J87o7j00J45k29K26
$$ 133 44 5 -263 199 -60 -58 22 -84 -57 -50 -86 -82 102 -50 -72 149 -65 55 -21 166 99 -1 144 -85 141
4642A41k16K44j22j58J55K67l14j9k9K11l42K50j16r8J57M0L8j19R0j24J86l8
$$ 141 -75 169 47 -111 44 311 -3 -22 -51 160 -182 68 -48 -146 11 51 89 -30 60 -64 122 84
4664H4m6o1n8J24M3l5mQ6m3j33J1l3KM6n0K2N2j49R3K6m2r4K90o7j5J61j73q1
$$ 84 38 -23 -81 43 86 51 47 133 90 -43 -32 -65 -63 -17 -67 -45 7 -142 -49 -23 -65 -159 131 64 49 210 37 -44
4692d4J55k02j23K92r2J6M0J83k63N0LJ0j76J53M7n9L6q9O1m1r9kJ08j11J84m7
$$ -44 111 -91 -214 78 -14 2 42 225 -38 12 15 25 -151 2 49 -10 26 -63 -2 -43 -142 -144 -36 -147 37 -10
4718a0P7j34N6J85k32K37k74lP2m8O1P8M7j29J09k14M4J19P7m7j1K4j11J58k29
$$ -10 67 -67 -11 174 -58 179 -95 -98 -26 -74 -13 65 112 -17 92 -122 -78 41 118 71 60 84 -27 131 -98
4743i8J34j61J98m7K3P5j68j6J76l3j4j02R1j64N4J56j08Q8O1j73Q9M8l21K77
$$ -98 36 -125 73 26 49 124 -44 -60 116 83 69 -33 58 -106 -52 104 -4 84 145 -28 61 109 -212 65
4767F5M0r4k36L03k17J35n7J44n0L6r4J5J43O9j99p1j03or8K93m5M0n6j39K14
$$ 65 105 11 -225 78 -139 -4 -61 83 33 69 -25 -10 133 202 3 -68 -171 -177 -275 18 -27 13 -43 -182 32
4792C2k91K95NN6j42n1K9Q2p2j27J65R3j50J92o0o5J16j59j31K30m5k8l5O8J3
$$ 32 -259 36 41 97 -45 -96 -67 15 -57 -184 -19 74 -76 116 56 -9 107 -52 -183 47 2 -26 -61 7 20
4817B0m3R1L0k10J63m3k76M78j70J1m1m1J00R2k17k9J38r7Q4k9K8J30j38lP8j8
$$ 20 -23 68 98 -112 51 8 -268 210 40 51 10 -31 69 161 -56 -85 53 -44 40 11 39 169 31 28 106 88
4843H8O1l8j74Q8j18P2Jo6l0pJ24j67J94j00J49p1J18k25J78k73K65J09j13M3
$$ 88 149 111 -63 25 -93 -21 -20 -86 -116 -123 1 -166 28 -72 77 6 124 -101 77 -196 69 178 65 108
4867A08k83L13k55J52n0j52L2m5K37j2m8nN1k27J43n3R9N2r2k00K96K6k18L7J58
$$ 108 -175 138 -117 35 -15 -167 -135 -180 57 45 -3 -8 43 -184 -41 -94 5 57 -35 -235 61 87 -131 -94 64
4892F4O8j54N0j69J49k9J40k39J4N0j03Q4m6R6o%J28j80J89k6k15K13J11k40j04
$$ 64 132 -22 28 -141 8 -21 119 -120 -106 -56 -159 -75 -121 -25 -31 -31 97 -83 106 80 -135 78 189 -51 -155
4917a55K36k03K83q5j73J74J18m17L05k43L60k26N7Jj22j18J23R8p5M8o8P8O1
$$ -155 81 -122 161 76 -97 77 195 -222 83 -160 200 -26 31 32 -90 -208 -85 13 -62 -14 -82 -4 57
4940E7j92L77k89K2R1j20O7j26K40mk14N8J9j9n9J58M6j62O1k43J03R0j52K70
$$ 57 -135 242 -47 -25 66 -54 13 -113 127 123 -91 -33 -14 -33 -92 66 112 -50 11 -232 -129 -39 -191 79
4964G9j35K04j61o0N8O1k0k02J92m4Q8j25n4N3J34j17p0n3K01oo4k5j24J72N2
$$ 79 -56 148 -13 -73 -15 46 26 -176 16 -28 60 -65 -119 -66 68 -49 -119 -172 29 23 -41 -66 -190 -18 34
4989C4j20L4J65j5j05k24K89k12M8K15l2P4k02N1J45j89k2k4L00j55l0R0l24K23
$$ 34 -86 -52 113 98 -7 -231 58 -154 -106 109 77 151 -51 0 145 -44 -66 -90 210 55 25 115 -209 14
5013A4J19j60r1Q3L6n7O3N6%j52j1J39J30q4n2o3r1J30n5J62k06J37o6Q8K4k88
$$ 14 133 -27 -118 -35 1 -56 7 63 63 -89 -100 39 169 85 33 -30 -121 9 -46 116 -90 47 -19 69 93 -195
5039a95L9O6l3K59j39Q4j55K67k45j57K15j48J20O5l0L2q0O4j1j14J85q5r2N9
$$ -195 -156 -90 -123 136 -3 81 -74 193 -52 -209 6 -142 -22 43 13 45 -35 29 18 -96 89 4 -88 -29
5063b9j67J43O9M6K4j38K7l1K4M3j96K35l9M9o3K13j95m2J4p7K18j31N5l2K2M0
$$ -29 -196 -53 16 62 86 -52 -25 -56 -32 11 -185 50 11 60 -3 210 15 -27 -13 -90 128 -3 52 20 42 82
5089H2j36R7o2P3r0J16k15j0J94k32J07R1m0O3q3Q0j1Q6j35j79L14m9Qj99K26
$$ 82 -54 43 -19 54 -36 80 -135 -145 49 -183 -76 15 -25 38 -45 35 24 110 -25 -204 110 61 69 -130 96
5114I6o7N6l4q1p6J61j99J93P8j62k%N8P5k8Mk4N1j66J68j4j74L1q4J70j02n7
$$ 96 29 85 51 -30 -106 55 -144 49 127 -35 -37 -37 21 96 68 72 48 99 -67 101 87 -87 -56 -140 30 -72 -129
5141a29J24j01rj10K00J16k9k63K6J38r3O6Q3o2m1P7n1O3jj12J29o3N1J5p3l6
$$ -129 -5 -106 -115 -225 -25 91 62 -201 -175 -37 -130 -64 19 -43 -84 -7 -58 5 4 -108 21 -42 9 24 -49 -85
5167h5R8m7n0K78k27P4l7J7qk22K76j9K5oM0j13j05K70l28J28k4K32r2j30JK1
$$ -85 13 -34 -84 194 -33 41 4 21 13 -209 67 48 73 67 107 -6 -111 159 -169 -41 -65 167 75 -55 -54 -33
5193c3k2Q4rJ65j32q4J5oM6J7j38J2K2J35L3K8Pk30J76j61K13j39P4q4PP3j57
$$ -33 -55 29 20 185 53 -31 -16 -22 24 41 -97 -85 -63 72 105 133 140 -90 86 -75 138 -1 73 -11 -4 69 -88
5220h8jL72k54J06l6r7K81j37p4r8n9kR2k09K57p1j5q8J28j94J91k19K32K8k43
$$ -88 -89 283 29 135 99 2 283 146 72 -26 -85 -87 5 -204 53 -18 -33 -121 7 -187 4 -215 17 45 -198
5245a98K72J33o9k53Q6N7p9lq0J30J73l34J32R1j60N8K5j8Q9r1J64l78K56l9Q8
$$ -198 74 207 138 -115 -29 28 -51 -54 -134 -4 169 -165 -33 58 -102 -44 -19 -37 52 -39 125 -253 3 -36 52
5270E2j05j53J05J03o9J78q5nO7J4K7k89J92m0n7K5K5N9qn2qJ2n2J14j21Q2m1
$$ 52 -53 -206 -101 2 -67 111 26 21 88 102 129 -160 32 -8 -65 -40 -15 44 36 -16 -24 -12 -64 50 -71 11 -30
5297c0r0K56j82O9P8p6Kj53J09Mj36J29Q3N6l38L26r9n4P0o3P6j52O6J19j46L8
$$ -30 -120 136 -46 23 101 25 27 -126 -17 -13 -149 -20 63 119 -219 107 8 -46 24 -39 37 -115 -49 70 -76 -38
5323c8J51j71O6K08j11j45o6N3J3m7J48Qr7j42R9q5J17j10K6P3m0pJ11J73k21
$$ -38 113 -58 8 216 105 -40 -106 -53 -40 -87 61 69 -28 -170 -71 -156 -39 -149 -123 -50 -90 -97 14 187 -34
5348c4j45K6l0J04J43k7j69j09J59P5J79j71J76m86M44J8l24M4J48k68M23j19
$$ -34 -179 -153 -183 -79 64 37 -132 -241 -82 -7 172 1 177 -309 135 153 -171 -127 21 -247 176 57
5370E7r6L2l9J30k76J71n5K7J33q0j9J17j75J05j6L2L0j47R5M8q9k4O4j34J08
$$ 57 -39 -7 -46 84 -192 -21 -76 -49 84 4 -15 102 -73 32 16 48 78 -69 26 74 -15 -39 25 -109 -1
5395aoj65K53k09n8K26n0R3j67J0q8J70J55k51K20M2j39J53l06p1J67j25P5PL58
$$ -1 -7 -172 81 -128 -186 40 -10 83 -84 -74 -162 8 163 -88 132 174 35 188 -118 -189 -22 -147 -72 -65 293
5420B93l29M4p5n6O4L6M1J45j50k3m6n0M7M6p6J55j40J72j49l6l9J32J1M4P7k72
$$ 293 -36 8 -67 -123 -59 -23 18 163 13 -10 -56 -106 -59 -13 -89 66 -74 98 -51 -87 -126 6 17 61 138 -134
5446a34J86q1%J00R2m4o9j02K6mq6K93k19rJ31k90K40r6O6j36L06k03Q4j45R1
$$ -134 52 -29 -29 71 163 119 50 -52 -26 -30 -116 177 -42 -51 80 -210 30 -66 0 -136 170 -33 51 -94 -3
5471cN4o9J47j09J74j95j49Q5J95o4j59K10k51K69j76P0J01j61P6j2n9N0Q5o6
$$ -3 51 -18 129 20 194 -1 -150 -65 130 66 -93 117 -134 135 -41 29 130 -31 45 33 -26 24 109 43
5495D3M0j24o5n7L42J4j40j26K97l31J98j36J39j7j97J93j21j17K33M3qj45L6
$$ 43 83 -41 -106 -163 179 193 53 -73 224 -107 91 -45 94 77 -120 73 -48 -165 68 111 103 -42 -6
5518fo8j8K17r7J39j45k2m6P3j04Q1j16J00k7J75j82j18J63K6O2j16j05J15k0
$$ -6 -74 -92 125 28 167 22 0 -46 27 -77 4 -112 -12 -39 136 -46 -164 -1 25 87 -29 -134 -19 -39
5542c9K48k84j0K24j56K1k6J06J5k31P8Q4K9k41K10J22j36j27j39J86O3J13N5
$$ -39 209 -75 -85 139 -17 4 -22 84 99 -132 -54 30 59 -182 28 150 14 -113 -252 -66 -3 110 165
5565A65l07J82j07J24j37J42l7j30K0j20K60r1R2j11J98K1j04J69j82K3k39J34
$$ 165 -142 40 -67 57 -80 62 25 -105 -85 -205 55 -36 56 -55 143 164 60 229 47 70 -169 -35
5587c5J0K3j74K72l1j5k68K15M0p6K86l74J23q4N6K07j87J19p3K8J11q8j21J45
$$ -35 -25 -2 -176 96 65 50 -218 -3 37 -39 247 -127 -4 -88 -32 175 -12 107 34 62 173 85 -36 109
5611A09j49n7P3k8J79mq9kO3PN8j29k48Q4K15J43m49J85J82j41q0O9R4j36J46
$$ 109 -40 -97 -24 -52 127 123 34 32 95 102 160 31 -217 -133 82 225 -224 -39 143 2 -78 -9 85 -51 95
5636I5r7R0l83L12j56MJ63l0m6n1J78k24Q0O4J4p4O7j53J29r2J76N4k20M5P4J9
$$ 95 -2 88 -295 17 -139 -135 28 -2 -48 -99 79 -145 -65 -1 13 -61 6 -147 -18 -110 66 120 -100 -55 19 38
5662C8R5Kj97J2K30l19J58J2j57pJ29J14p9J10j58L5p3Q9k02Q9K04j53j47K28
$$ 38 133 135 -62 -50 180 -139 19 31 -126 -133 -4 110 31 141 -17 18 -55 34 -168 -79 125 -28 -175 53
5686E3q1Q8J13K2r5n1r1J58k06qK24O6j93k4RQ8r6J89j05K2q6j55N9K39j60J52
$$ 53 -28 60 173 195 100 49 -42 116 -90 -98 126 192 -1 -25 -16 72 -24 165 60 82 -4 -159 -100 139 -21 131
5712A31j35q2J05k7P7j04j3nJ36n9k2O8r7j14J14j55L76l66M0J65m1M8n5J49j30
$$ 131 -4 -86 19 -8 69 -35 -48 -53 83 24 2 70 -27 -141 -27 -182 194 -172 -132 33 -8 40 -15 134 4
5737DPj9J12nk90K60m9L8l0j77R4Q1j86N4M6n6K51N6j35j88L16q2K3M6k53J30
$$ 4 11 -8 104 99 -191 69 20 58 28 -149 -55 26 -160 -106 -60 -116 135 191 56 -132 184 102 125 171 -82 48
5763D8n6J1K1J15p2J9j38p5L15j29k7K1P6j79K73k55r2J92m1R8n8q4J6K1q6J0
$$ 48 -8 3 24 139 67 86 -52 -127 188 59 32 53 129 -50 223 -32 -124 68 27 125 67 -17 -1 20 -66 -56
5789e6J24q6J33r7j11K1mj6J24j1q8K6J80j84o3K27j22n4L6L6O9j8k01Q2L5K5
$$ -56 68 -18 115 18 -93 -72 -76 -92 32 21 -67 -41 139 -45 -108 119 -3 -57 -21 15 84 66 -135 -53 -18 7
5815GON4q2J8J88k95k4L50j20j89K45k46J27P3j72l9J1J9k9M7n0O9p1J25r7O0
$$ 7 13 67 -15 3 191 -104 -128 222 102 -87 158 -88 39 112 -60 -99 -88 -69 -98 -51 -101 -32 -103 22 -75 -15
5841a5lJ6M6M1j30j95J15J83j66J5J78j30LO8r3L2o8J07K0j94K98Q7r2j16J45
$$ -15 -18 -2 44 85 -45 -240 -125 58 -108 -93 85 -45 -42 26 -67 -35 -103 4 24 -170 128 215 123 7 152
5866A52k71J40j45J84o3L5j29k55L03K2N1k1R1j80R4O4k05N5L2Qj7O8J12k30J71
$$ 152 -119 21 -124 60 -3 32 -97 -352 -49 -27 24 3 94 -86 8 72 -133 -78 -46 -38 -55 13 125 -105 66
5891F6J12j94K08rJ0j19m3l2Q7L6lj09j61L24k12l9J26N9q6K09k08j59N5K03J25
$$ 66 178 -16 192 183 193 74 31 -1 86 122 119 10 -151 173 -39 -78 48 107 21 230 22 -137 -82 121 246
5916B46k76J10rp8j58J67L30k64k22K6J57J43j78r9J6Q3o5O5J10j07P2nj61NM1
$$ 246 -30 80 71 -7 -165 2 332 68 -154 -128 29 172 -6 -105 -89 -6 -71 -6 104 -3 69 64 -97 -92 -51
5941e1%j20o2K54q5OL10k48M2o3p3O8J48j0j30J63j87J0j60J94J4j84L52l07J13
$$ -51 -51 -171 -233 21 -64 -58 252 4 46 -17 -90 -22 126 116 -14 149 -38 -28 -188 6 20 -164 188 -119 -6
5966fo6K2J04m9J4lj40J58j1M8j79K2j30J81J50j51M4O2q9J12N0j93n1J34N5j68
$$ -6 -72 -50 54 5 19 16 -124 34 23 71 -108 -86 -216 -35 115 -36 8 70 -19 93 143 -50 -101 33 88 -80
5992h0J46k14j8K09j54K80k19J23m12K15ML6J27q8j02L18Mj39k07P3J5Q1o8J50
$$ -80 66 -148 -166 43 -111 169 -50 73 -339 -124 -120 -84 43 -45 -147 171 175 36 -171 -98 -83 -2 -70 80
6016H0P6k20m3L08k48L5J35p4P9k12K51n3j86J35j19J29k79J93j31r1J59j27L19
$$ 80 156 -64 -107 201 -47 -12 123 49 128 -84 167 114 -72 63 -56 73 -206 -13 -144 -235 -76 -203 116
6039A16j79N7O5k39L64k6j76K6P2O5q7O2N4j90M5M7j98R0n1j2J08K10j40q9P8
$$ 116 -63 -6 59 -180 184 158 -18 8 80 145 58 120 174 -16 29 76 -122 -32 -83 -95 13 223 83 -6 72
6064G2oJ0n6Q6j17J21l4o7J31o6M5r6L5N0J20l85J30q1J89k7j34J43J7k99J99
$$ 72 66 76 20 106 -11 110 76 9 140 74 119 23 58 108 228 -157 -27 -108 81 54 -80 63 80 -219 -20
6089b0k7O1q1LJ96J6n1n1k12J42R7J17l65J43r2K61M4k16Q6k2j30l6J18K1K1L9
$$ -20 -47 14 -67 -64 132 148 97 46 -166 -24 73 190 -175 -32 -124 137 181 -35 51 29 -101 -137 -19 2 23 62
6115F2O9j21J08m4nm5l13K87l7JJj2M0o8J94j04P8j73O0J12k02J6Q9R9r2K58k72
$$ 62 131 10 118 74 69 24 -289 -2 -39 -38 -37 -49 -9 -77 117 13 91 -82 -22 90 -112 -96 -7 92 0 258 -14
6142a4J4p5Q3k8R8N2k06Q8j9J01q2m4J24j20N6LL5k05R3j5o3J05K32k28K9oj35
$$ -14 0 -75 8 -20 78 130 -76 12 -7 94 12 -32 92 -28 28 31 66 -139 -46 -61 -124 -19 213 -15 14 8 -127
6169a27J16MK0q8J61n2M7l7k61J24K41j35Kj43O6Jk6J93j58K33p9j75K27j37o1
$$ -127 -11 -7 13 -75 86 34 81 44 -217 -93 148 13 15 -128 -62 -61 -87 106 -52 181 102 -73 154 17 -44
6194d4L5PM4q6Q5n9o8l4K16j27M1j34M9M9r6K9J06r8K79k82J66N7j68jK0q7J98
$$ -44 -9 -2 42 -44 41 -18 -86 -120 96 -31 10 -124 -75 -26 -122 -93 13 -85 194 -88 78 135 -33 -34 -14 -101 97
6221I7K8M2l79J53J07q1J12j58J45p6J56m0k64N7K14j33k77L50j07j4M6R7j24
$$ 97 125 167 -212 -59 48 -33 79 -79 66 -10 146 106 -158 -101 113 -20 -297 53 -54 -68 -22 75 -49
6244d9J9jo5J00L3J53k75J1J54q1o9J12n1j27J37j53j23J51M7KJ87q0%q9O2n0
$$ -49 -30 -31 -96 4 37 190 -85 -74 80 -1 -70 42 -9 -136 1 -152 -275 -124 -77 -75 112 32 32 -57 5 -45
6270d5M8N2k1k07J14m7J01n4J28j56K07j9n7k80L12N0j94J80k64j14K25r2J52
$$ -45 3 55 34 -173 -59 -106 -5 -59 69 -87 120 101 44 -236 76 126 -68 112 -152 -266 -41 -133 19
6293A9K9n1J39o8K9j77O9M5or3L01l61J67k90L18j60J77j05J8N0k53PL54J42l17
$$ 19 48 -3 136 68 97 -80 -11 34 28 -65 236 -125 42 -248 70 -90 87 -18 0 50 -203 -196 158 300 -17
6318a7K2K60j3k59L7N5q7L1J1r3J58n2j81O0j10J28k0Q8n3K43k34J3J39j48Q9
$$ -17 5 265 252 -7 30 85 -2 29 40 -53 105 53 -128 -68 -178 -50 -70 18 -35 208 -26 -13 126 -22 67
6343F7p2N0k61J39J21r8J61j23J5J9o0qO7Rj72R3r3j17M02j76k7J00j7n6K37j67
$$ 67 -5 45 -216 -77 44 -54 107 -16 -1 18 -42 -50 17 26 -146 -53 -146 -263 139 -37 -64 36 19 -37 200 33
6369C3p0L21j23k96J12j34J68l6m7PJ40L8k65J06j15K08k28N6J84k28J57K33k18
$$ 33 -37 284 161 -135 -23 -157 11 -25 -72 -65 75 113 -152 -46 -161 47 -181 -125 59 -169 -12 221 3
6392Cj38J59j8l9o5K29j22J6k22J49J00j97K68j69l2L3k6K80k83J6K3p7J63j34
$$ 3 -135 24 6 -33 -98 131 9 25 -197 -48 52 -145 123 -46 -78 -45 -71 209 -74 -58 -35 -112 51 -83
6416h3J84p7%n8q1J15j01J3K37j77M1n6j06M8Q8j96K67J30k23K1q2O2l4L37j24
$$ -83 101 24 24 -34 -115 0 -101 -88 149 -28 13 -43 -149 -101 -13 -209 58 188 -35 -14 -96 -34 -68 269 145
6441A45r8m6k5j30L23m3j14Oj11j82J80J5K06k80J62J19k18NK6k30L32O6r3p7
$$ 145 47 1 -24 -154 169 126 12 18 -93 -275 -95 -80 126 -154 8 127 -91 -86 -60 -290 42 108 15 -62
6465f2r2J22JN0Q3j70m7J15j9K8mo5l7J87k30l1P0J9o0O2nJ67j21K44k40R0m9
$$ -62 -154 -32 -31 19 102 -68 -115 0 -19 9 5 -60 -97 90 -140 -171 -101 -82 -142 -80 -85 82 -39 205 -35 55 6
6492FO9j59J59k0k2r5L9pJ24j4j28J01N6k21K94p0j85q0J05Q5k5j59J85j48O8
$$ 6 75 -84 75 55 33 -62 -23 -30 94 80 -48 53 109 -112 182 112 -73 -153 -48 37 12 -147 38 -110 -42
6517d2P5K3j46P6J30j92P6r0j28K23P0m9k02n9K91k36K17J05j97K17o4j46J24
$$ -42 33 56 -90 -14 116 -76 0 -90 -218 5 75 26 -176 -235 56 -180 37 142 -55 162 98 -48 76
6540G6n8j1kJ68j82K8o8O7m6K0J89j59L3k64J74L1Q1k49K15J48l68J98J6K38m63
$$ 76 18 7 5 173 -9 19 -49 18 -28 -8 181 22 55 -209 -35 -4 77 -172 43 191 -177 21 37 275 -188
6565a88K92k32P7JJ88lk88K21K4k46J05R9O1k56J33Q1jq5o7Q5j33Q0K6M6J16j85
$$ -188 104 -128 -51 -50 138 135 -153 68 92 -154 -49 50 111 -145 -12 69 68 -17 -84 1 -132 -52 -26 20 136 -49
6591d9O9p3k54N04j13K4p8j59J39K82k19k22J33N1j74K82j43Q3p1j94J99j44P4
$$ -49 20 -53 -307 197 84 108 30 -129 10 292 73 -149 -16 35 -139 143 0 83 12 -182 17 -127 -53
6614e3n3J47k16J58L0j49J39J31j64J7J70q0k34K27lj61P4K9r6RK67m2j64N4J14
$$ -53 -106 41 -175 -17 13 -136 3 134 -30 -13 157 77 -157 70 67 -94 -20 9 -87 -78 189 147 -17 37 151
6639A51j67R7J5L2j55J0J84j14k00O1J81q2J8k62M9J88N4j57J84j01J19j37Q0
$$ 151 -16 81 96 128 -27 -17 167 53 -147 -86 95 13 31 -231 -182 6 60 -97 87 -14 105 -32 48
6662D8r7N5J7j18m9J35q1J13J30j31m3J84p3k56K89Lk16J91q3R2j17m4Q3j11J5
$$ 48 -49 6 23 -95 -144 -9 -90 23 153 22 -21 163 90 -166 123 126 -90 101 18 110 -7 -51 32 -79 -64
6687f4L7J29J08k72J94N0k02j67J82K6m7m7j08J11k53M06o6O3j77QJ25L5k4J3
$$ -64 -27 102 210 -62 132 182 -20 -187 -5 21 -26 -73 -181 -70 -323 83 17 80 -97 -89 36 71 47 60
6711F0q5P1j46l3J08K27m04K82m3o9J26oq2Q4j29J52J00l10j0K62m28K19J34o2
$$ 60 -25 46 -100 -133 -25 202 -202 80 37 -32 94 88 6 90 -39 113 213 -97 -107 155 -273 -54 80 18
6735A8k2K6k96L44l3j2J71j92n5K1J75j02l58L01J6J04n2j96M83m93J63j06L7
$$ 18 -4 22 -274 70 37 25 196 4 -51 -30 145 43 -315 -14 2 106 54 -142 341 -152 11 -95 -58
6758e8J50j85K39p2J3j30l4R7k0k58L31m2l9L8J8j37O1J3K0k0R3o2J76n3j83K25
$$ -58 92 -93 146 74 87 -43 -77 20 0 -258 73 31 -8 30 48 -89 -28 -15 5 -15 78 16 192 139 -44 181
6784A81j60Q3r7K4P0j43R5m0r9rQ9j10M9J35p1J16j74r5J61j15J80p7j4p5Jj2
$$ 181 21 104 7 31 101 -42 53 13 -86 -95 -6 -116 -67 68 -3 113 -61 -156 5 -110 70 -7 -21 -96 -95 -107
6810a07L10l38J38P5j32m0L5m1J77q4K71j13j52j54L51k66r0R0J15J49q5n4m4
$$ -107 203 -135 3 78 -54 -94 -59 -100 77 -7 264 151 -1 -155 196 -70 -160 -70 45 194 109 55 11
6833A1L6J41j12n9Q6j81J46k87J60J00jm6q8J61o8j95J05K68k00R3Q4j71P5k59
$$ 11 47 188 76 17 103 -78 68 -219 -59 41 40 -6 -94 67 -1 -196 -91 177 -23 70 154 -17 58 -201
6857b01L60j51k4o6N0q5J31pK0p0Q7J27k30R5j29J67l6o9r4K40l4on1Q1j03j80
$$ -201 159 8 -16 -82 -32 -117 14 7 27 -43 44 171 -59 36 -93 74 38 -31 -125 115 81 75 24 105 2 -178
6883a78J82J95k60J74j27J27Q7j46j76J92l21L31K2m3p9L7K8P3mk87J98j8j39
$$ -178 4 199 -61 113 -14 113 200 54 -122 70 -251 80 102 59 -20 17 45 118 114 -173 25 7 -132
6906a32K07L6%k47j93M03r3Q7j7J19p1k02k8J90m8L5L6PK2l0J1r4%K2p9J88o8
$$ -132 75 111 111 -136 -329 74 -19 68 51 170 99 -103 -131 59 11 46 82 89 111 81 92 -2 -2 20 -59 129 61
6933F1Jn7o2L3L7J62j11j28J41j84K01K30m51J22k9L0j21p1M50k61J7k4p6J74
$$ 61 62 5 -57 -24 13 175 64 -64 77 -107 94 324 -127 -5 -34 -4 -125 -196 254 -7 10 -14 -90 84
6957H4k25J37q7R3p0q2K35j6j71K45j61O9k1N9J65k07l4n0j7n0p9K53M0j39p9
$$ 84 -141 -4 -91 2 -68 -150 85 69 -102 143 -18 51 30 89 254 47 13 -37 -54 -104 -183 70 110 -29 -108
6982a08j9j26L40J6l6n6o3j53K18j24K18K9k73K0R7K6J40j6q7j33J96o1kK16j71
$$ -108 -127 -253 87 103 67 11 -52 -205 13 -111 107 136 -137 -117 -20 6 146 130 43 -90 106 45 43 259 88
7007H8k78l6K76J57j48M7k36K80r2m8L7q2J18l8j42L5J79r0P4r5N1k18L43k42
$$ 88 -190 -226 50 207 59 106 -130 150 58 10 47 -35 83 45 -97 -62 117 27 101 6 57 -161 182 -60
7031f0K90k20J85j89n5J15j15N8n6J48j54l1J2J48P6j75J0O2Q4j13r0J34r4O6
$$ -60 230 10 195 6 -49 66 -49 9 -47 101 -53 -84 -72 76 152 -23 -13 49 133 20 -70 64 -30 36
7055C6j10j09J12K2J34j15PO8M5jj00o1k2J65pl5L1M1j65J65j38R4j09j3M5n0
$$ 36 -74 -183 -71 -49 85 -30 -23 45 90 89 -11 -72 -94 71 64 29 60 101 -64 101 -37 57 -52 -65 -20 -70
7081g0N7J27o1O2j33O5kn0k24K86K0j16j70L25j40j65M58l08J96k64N1K4kK3M5
$$ -70 -13 114 53 115 -18 47 45 -5 -229 57 77 -39 -209 116 -24 -189 269 -39 157 -107 -56 -32 -34 -11 34
7106C4J01l5j71O0k01J62J6N4Q1j66k9K32j86m7K7J30J19k08Q0k22J11O2J06m4
$$ 34 135 100 -71 -11 -212 -50 -34 20 101 -65 -94 138 -48 -95 -68 62 181 -27 53 -169 -58 4 110 66
7130F6r0o8O3j00R3J7l6J99l15K44mj5r5J08Q2l0J9j93M5J62r5l1j18K4R8j82
$$ 66 -24 -92 -29 -129 -36 -19 -55 144 -171 73 69 54 -41 67 149 119 138 -55 -10 152 57 26 -92 -68 30 -152
7156a52P4N1K1n3j6l9J08R3j98M4J79k26N2K03j11k24J72M9j12M4j84Q5j1L26
$$ -152 -78 -27 -6 -59 -75 -114 -6 87 -111 -67 112 -114 -62 141 30 -194 -22 27 -85 -41 -225 -140 -151 175
7180A75k15Q8m7J58j64j09p8MM7Q5J16N6p7o2K31k2j22k57J30J24j07J46j60P1
$$ 175 -40 48 1 159 -5 -114 -192 -188 -141 -56 60 116 39 -23 208 186 64 -193 -63 61 -46 100 -60 11
7204A1nj57K8M90m67j14K73l6j11L3k36K78k9NP2n4M8j32nM1J37m8Q3j48L9K32
$$ 11 6 -151 -123 367 -100 -214 59 23 -88 -55 -291 -13 -42 -37 35 -19 29 -103 -108 -67 70 22 105 -43 -4 228
7230B28k57J24j03J09j83N8j3Rk5N3N8l7n9L0J99k68J03j83K13j2j95J33n4N3
$$ 228 -29 95 -8 101 -82 -24 -37 -28 -53 0 58 21 -38 -8 191 -77 26 -157 56 44 -151 -18 -72 -19
7254a9l3l6P9o1l1O5J45m4k9J02j33r3K34m3o2j21O1o4R1K45k80O6n3q5J12n1
$$ -19 -52 -88 -9 -70 -101 -36 109 65 36 138 5 -88 146 103 41 -80 -19 -83 8 253 -27 39 -14 -99 13 -38
7280c8j46O8n4K79l52J67n3JK53l3n5j6PJ5j88J95j38J26j38K37q8j7o5j44J61
$$ -38 -184 -116 -170 109 -243 -76 -129 -128 125 92 37 21 28 43 -145 50 -88 38 -100 137 49 32 -33 -177 -16
7305a6L2O9j47J4j96J19R9M3J54j81j7O7j14J66j04k02K05M8Rk45J15L23k55o1
$$ -16 16 85 -62 -48 -244 -125 -26 17 171 -10 -27 40 -74 92 -12 -214 -9 39 48 -197 -82 241 -14 -75
7329g5J1J25r4K37k03J48Oj22m4J22j23K03k07o5J13j20K13k22K22j84J13O9k92
$$ -75 -64 61 -33 204 1 149 155 33 -11 111 -12 191 -16 -81 32 -88 125 -97 125 -59 54 123 -169
7352a69J58k7J66j01n2k40K19k05J64L1j32L06j00j6k3p7K40j77J93p2M4l19K11
$$ -169 -11 -38 128 27 -25 -265 -46 -251 -87 -56 -188 118 18 2 -21 -98 142 -35 158 86 130 -189 22
7375B2j6k4n6K23j76K0J16j72K0l1J40j54J47j05KK74k44qlJ6k6nJ36k02p4J69
$$ 22 6 -18 -74 149 -27 -7 109 -63 -43 -74 66 -88 59 -46 -44 230 -14 -22 -25 -9 -35 -40 96 -106 -180 -11
7401a1J1k4k15J70J3rQ5n9j64J97J04j15NJ07j29J33k5l47K80j92J12MR7j00J75
$$ -11 0 -24 -239 -69 -56 -65 20 -39 -203 -6 98 -17 -12 95 -34 99 74 -273 7 -185 -73 -69 28 -72 103
7426A03P3j52M7l7o3J01K5pk17M4p6P1K23n9%j81K33j02l1j09J41j35n2nK79l5
$$ 103 176 24 71 34 -29 72 97 90 -127 -83 -159 -88 135 76 76 -105 128 26 -5 -114 27 -108 -160 -165 114 79
7452G9l14J60R7m7k6q0J52Ok07L61j81k7m0L5K06k87J5L88k78M9j08n0K09j07
$$ 79 -235 -75 22 -25 -51 -131 21 27 -180 181 0 -27 -67 -32 174 -113 -98 290 12 61 -47 -97 112 5
7476Ej36J90j29K38j81j44K12N7m21L43p2J54o9N1j57L3J2j39J19Kno3J36KKj02
$$ 5 -131 59 -70 168 -13 -157 55 112 -309 34 -38 116 47 98 -59 -26 -14 -153 -34 -32 -37 -100 36 38 40 -62
7502f2K87l04J54m0Q1r2O6q4J9Q2p3Q9j67K18j15k15J13M6n3k3K1j43M26p9j39
$$ -62 225 -79 75 35 116 24 90 6 25 107 34 123 -44 174 59 -156 -43 3 -50 -73 -52 -195 231 152 13
7527A3j08J50r9K10k58K01j63r3pq4J48Q9J3o9J87q5m7J08n2n9l8j16K37j7J2
$$ 13 -95 55 -44 166 -92 109 -54 -147 -154 -238 -90 -1 12 -57 130 45 -2 106 54 -5 -43 -159 78 61 73
7552G3J3o0j3O8l7J65k93q7J24K26k79K84j76J3j7o9M7J11m8k3J3j3n3p3J59J
$$ 73 86 26 13 81 44 209 -84 -171 -47 179 -100 184 8 21 4 -65 -18 93 45 22 35 22 -31 -104 55 56
7578E6j17N3p3J68O3r4j81J57M5J7k32J25P2j49J58j50K67k20p7J17n0j4PQ5r5
$$ 56 -61 -8 -81 87 150 56 -125 32 77 94 -138 -13 59 -90 68 -82 185 -35 -112 5 -45 -59 -52 33 -62
7603f2J11L5P8k18J62j26J39m4j31n7N6j8k3J56p5M5m2J4N8NN7j77R0r5N2j51
$$ -62 49 84 162 -56 106 -20 119 75 -56 -113 -57 -75 -98 58 -17 28 -14 0 58 63 120 -57 33 -62 -10 -161
7629a61K31k6j00R6J80l48M7Q3j95K22J88k96O7M7q1r3N5J56n0j5j85K2J08l4
$$ -161 70 44 -56 40 220 -128 -81 2 -193 29 217 -79 -12 35 -46 -139 -84 72 22 7 -178 -156 -48 -82
7653h2P8L2k90l0K73K09j90j53J60J06j02R6k66J66n0J24m9R8j5j28L0n8j08J46
$$ -82 -4 28 -262 -292 -19 190 0 -153 7 113 11 107 -159 7 -43 81 32 130 115 -13 17 -41 -149 -3
7677cj83K95m5M5J7j93P9j54P4O6p9J07J86j36j10O3K3o6k3M3r3J22O8k05K44
$$ -3 -186 109 64 109 126 -67 12 -142 -68 -2 -81 26 212 76 -34 29 52 -14 -37 6 -87 35 103 -102 142
7702A42j77N1j09N4J9RL6N1r6q1P8Q1O2k33p2K68j23n4J10n1j65J81M9q4j05J05
$$ 142 -35 16 -93 -39 -20 -11 25 76 -20 -101 -23 58 120 -113 -185 83 -40 -94 16 -35 -200 -19 30 -54 -159 -54
7728e4J20J43j74J4p7J05J07l56k7R9m3Q9J7J63j97j59K14j34P6N6n3K17l51J79
$$ -54 66 209 35 49 -28 77 184 -172 -199 -100 -143 -54 -37 126 -71 -230 -16 -150 -74 -18 -71 146 -205 -26
7752b6M6j88R3J89k26J17n0%m9J17N1q8O2j32QQ8L7k8L1l5k08J95q5J63n9nj20
$$ -26 20 -168 -75 114 -112 5 -45 -45 -94 23 74 -14 48 -84 -76 12 49 21 52 17 -191 4 -81 82 23 18 -102
7779a02j03M04k29Q1L6m4o9Oj9J13j64J21p7k8ppp1P6N1n1R5l9J75k58L3q2L32
$$ -102 -205 199 -30 51 87 43 -26 -20 -39 74 -90 31 -46 -74 -81 -88 -159 -83 -32 -83 12 -27 148 -110 -77 -159 173
7806A73l31J67J09j7n9p4q3Q2J92j50o9J01J85k29J2n0p0lQ8oP0l8O6l5J5j69
$$ 173 -158 9 118 101 42 -32 -115 -33 159 9 -60 41 226 -3 9 -41 -111 -114 -26 -32 38 0 66 31 46 -123
7832a23K08j04K2N1j56LR4k7K02j26j48N5K9J43j14n5o0K02j73J23j90J01r6J55
$$ -123 85 -19 3 54 -102 -99 -5 -32 170 44 -104 -49 -20 123 9 -46 -106 96 -77 46 -144 -43 -139 16
7856A6L2J4N7j19m3RL9j58K01J17q4qo0rK1L1j11O6J6N3j35Q7J4k30K43j24j61
$$ 16 48 62 119 0 -43 -34 5 -153 48 165 81 73 13 4 25 56 -55 11 27 80 -55 32 46 -184 59 -65 -226
7883b26M28k79J09Q5j28Q4j03ok0K03k19K56k94K16j99P6n9L2J25k08J35k19K88
$$ -226 202 -77 32 117 -11 73 -30 -36 -56 147 -72 184 -110 106 -93 -17 -76 -44 81 -127 8 -211 77
7906G7j22R0J1Q4k57J51j29QJ31J00n9k06J58k25K05p6k21J38M0LJ44j16N5K66
$$ 77 -45 45 56 140 -117 34 -95 -87 44 144 85 -121 37 -188 17 -59 -280 -142 -102 -99 45 -71 -16 250
7930B50j83k9J41l8p5Mk2n1j09j4J01l5Q7J05j7p9o3p9J19J15j86R4J51r6r9%
$$ 250 67 38 179 141 66 70 48 -3 -112 -126 -25 -60 27 132 115 36 -27 -106 13 128 -58 36 187 91 -8 -8
7956hJ40j1k28R4O7m8Rk21Q7R2n5jN4Q8n4K7J00j02mK8m7o8Q1j38J09J63k38j7
$$ -8 132 121 -107 -13 54 6 15 -206 -119 -27 -82 -83 -29 59 5 32 132 30 26 54 7 -61 20 -118 -9 154 -84 -101
7984a01K93l80L34n8j35O8R0lj23o0J67r4J0J21o5j40J47j00Mjm0J18k2k3j3N9
$$ -101 192 -188 146 88 -47 21 111 108 -15 -75 92 -2 8 129 64 -76 71 -29 -25 -26 -66 52 30 7 -6 53
8010E3P5q4Q9j41j52J36p1P2j3Q3K0J1j3j47R9j81J07J52o7J00l3j15J32k19O7
$$ 53 128 44 133 -8 -160 -24 -95 -23 -36 47 67 78 65 -82 17 -164 -57 95 28 128 95 -20 112 -107 -40
8035d0J86o9k73K27j18L1P8j39J14o3Q4j93J48K41n9m3k07j89K00O8Nj55M6K53
$$ -40 146 77 -196 31 -87 -56 22 -117 -3 -66 18 -175 -27 214 155 112 -95 -284 -84 -16 -11 -166 -120 133
8059A33k75J74J35o9q8k8j06K57P5k36K49l78L25k81J1J39o5j8k8J33o9kQ0l8
$$ 133 -142 32 167 98 10 -18 -124 133 208 -28 221 -157 168 -113 -102 37 -28 -46 -74 59 -10 -12 68 30
8083C0R8j01j65K34j06J20j33Q6k30J94m0J16J76l82K85p5j65P1j95K04o6Q1p9
$$ 30 128 27 -138 96 -10 110 -23 63 -167 27 -13 103 279 -103 182 107 -58 13 -182 22 -44 37 -42
8106d2J2J01q0n7P0J14q5J17l8j52RJ28j73J1n3P9Q6pM8q0j97L06r0L3L9m4N4
$$ -42 -30 71 -9 -66 4 118 33 150 112 -40 -31 97 -76 -65 -118 -39 47 40 88 8 -189 117 27 60 99 55 109
8133A09J15j87k17K23J5K5%j91J50O9J2k2j85oJ21o0O1m1j09J28O2l09J26J47
$$ 109 224 37 -180 43 58 83 83 -108 42 111 123 101 -84 -90 31 -29 32 -9 -118 10 72 -237 -111 36
8157C6j06K80k15M3m8j48K10q0l7Q2J0j43K61k38J03P9j30N9L5j20K25j08j11
$$ 36 -70 210 -5 38 -10 -158 52 -28 -65 17 27 -116 145 -93 10 89 -41 18 53 -67 158 50 -61
8180f1M7R4p3p7J70l18J60K18k23j1K26
$$ -61 -14 80 7 -70 100 -218 -58 160 -63 -74 152
8191A52
$$ Imaginary data points
##PAGE= N=2
##DATA TABLE= (X++(I..I)), XYDATA
0@%%%%%%%Qj6J6j6K4l2L6m4N2o0P2q8J04j20J40j63J87k14K43k78L17l57M02m54
$$ 0 0 0 0 0 0 0 0 8 -8 8 -8 16 -16 20 -24 28 -32 40 -48 56 -64 76 -87 100 -114 129 -149 168 -189 213 -241
31b41N11n70O33p08P92q80R76j081J197j326J467j622J797j996K215k458K741
$$ -241 270 -300 333 -375 417 -463 513 -568 629 -697 770 -852 945 -1051 1164 -1294 1447
48A447l069L451l905M453n133N999p141Q729j1086J4933k2237M0685j62957l16272
$$ 1447 -1622 1829 -2076 2377 -2756 3243 -3898 4831 -6255 8678 -13559 27126 -135831 -452103
62d52103N12613K26711l83508q9555L57428o571k68579L8531J20509j42215k6045
$$ -452103 60510 287221 -96287 -185842 171586 165015 -103564 -65033 55476 -86739 -112784
73a12784J94006J8539j14431O1217J0052j67503J3264J70279q0098j05153K16478
$$ -112784 81222 99761 -14670 46547 56599 -110904 -97640 72639 -7459 -112612 103866
84A03866R9141k96055p6977K99348k8122l47843J00300L94482p0052l10911O8208
$$ 103866 203007 -93048 -170025 129323 101201 -246642 -146342 248140 178088 -132823 -64615
95f4615J58043j38315o7974J61616j0863j24681J37976J37487k07920j62290J64981
$$ -64615 93428 -44887 -112861 48755 37892 -86789 51187 188674 -19246 -181536 -16555
106a6555Q7608j29354K4821J43360o2236j01005Q0347K350j44806M3859J65600
$$ -16555 71053 -58301 -33480 109880 47644 -53361 26986 29336 -115470 -71611 93989
117I3989n8899j00797J32275N7468j99356o0103J66969J852j11021J13152J10157
$$ 93989 35090 -65707 66568 124036 -75320 -135423 31546 33398 -77623 35529 145686
128A45686j73030r0983J90029J8253k43146J2386K72942J5010k01520K625J08726
$$ 145686 -27344 -118327 71702 89955 -153191 -140805 132137 147147 -54373 -51748 56978
139E6978o4121p1502P0412K6014l9796N8618M8900r4779m8799O9802k1577p6796
$$ 56978 -7143 -78645 -8233 17781 -22015 36603 85503 -9276 -58075 11727 -9850 -86646
151h6646Q8263J05495r0269o9309J01435j040j53936K1528J66367l1437j27294
$$ -86646 1617 107112 16843 -52466 48969 47929 -106007 -84479 81888 50451 -76843
162g6843Q5628J18671j16796j28794P7513P8111m5764O76N9032k7877m4521L5478
$$ -76843 8785 127456 10660 -118134 -40621 37490 -8274 -7598 51434 23557 -20964 14514
174A4514n577p6527J8103R1971m029m4386L4918P769p9418j2416O8405r027m3201
$$ 14514 8937 -67590 -49487 42484 38455 -5931 28987 36756 -42662 -55078 13327 4300 -38901
187c8901O2240N5693p3947n4139N5001M988o9859K3431Q9790r845n4172K1047
$$ -38901 23339 79032 5085 -49054 5947 10935 -58924 -35493 54297 44452 -9720 11327
199A1327Q203o2090o296O5801J428m0741L7092M6630n0102n6995K1678J9271j5081
$$ 11327 19530 -42560 -48856 16945 18373 -22368 14724 61354 11252 -45743 -24065 -4794 -19875
212a9875K0784L6194j7275k2383J5441j2865m4048J2702M8674k941j5968L0815
$$ -19875 909 37103 19828 -2555 12886 21 -44027 -31325 17349 14408 -1560 29255
224B9255O269n4746k2070L5736N371k0934K9422L8131k7166l7094J2326N956k9529
$$ 29255 35524 -19222 -41292 -5556 -185 -21119 8303 46434 19268 -17826 -5500 456 -29073
237b9073Q64M1556J6147j4763m127m325k2669q976J4140P643M094J9083Q361k0171
$$ -29073 -28209 13347 29494 14731 10604 6279 -16390 -25366 -11226 -3583 511 19594 27955 7784
251G784j7597n68p114n762K1789K4113m588j0566K318r880k3657j255K2005J0688
$$ 7784 -9813 -10381 -17495 -23257 -1468 22645 18057 7491 9809 -71 -23728 -24983 -2978 7710
265G710P8Q902L903j7881k0004j926P550O440J0227J1416K441q575j3820j1447
$$ 7710 7788 16690 20593 2712 -17292 -19218 -11668 -5228 4999 16415 18856 10281 -3539 -14986
279a4986k502O762Q406R748J0425N70j3582j4449m731L93L360J0842J3120M429
$$ -14986 -17488 -10726 -2320 7428 17853 18423 4841 -9608 -14339 -13946 -10586 256 13376 17805
293A7805n938j0644j0601n817J776O812J0180J1927K749j1515j1170l671m672
$$ 17805 11867 1223 -9378 -15195 -13419 -6607 3573 15500 18249 6734 -4436 -8107 -12779
306a2779l418J1393J7994K651p621k208n402j5145m374J2819J0018K395O688L009
$$ -12779 -16197 -4804 13190 15841 8220 6012 610 -14535 -18909 -6090 3928 6323 13011 16020
320A6020j3175j4327k27J962N41J1329J3608j939r411l044o652j1524L111J5683
$$ 16020 2845 -11482 -11709 -9747 -9206 2123 15731 13792 4381 1337 -5315 -16839 -13728 1955
334A955N535r71P030j369j8862r705Q927L449k845J2412J4595q923j5317j13j067
$$ 1955 7490 6519 13549 12180 -6682 -16387 -7460 -4011 -6856 5556 20151 11228 -4089 -4202 -5269
349e269r564M459J7964M366n225J475k369j5740o212J0333N010L51J0260P047
$$ -5269 -14833 -10374 7590 11956 6731 8206 5837 -9903 -16115 -5782 -772 -421 9839 16886
363A6886j2811j1614K537j702o893J0079J7331k191r433K267k014j4855l344J4343
$$ 16886 4075 -7539 -5002 -6704 -13597 -3518 13813 11622 2189 4456 2442 -12413 -15757 -1414
377a414O495j866O168L403j3254j0344M436J168l304R782J3727m655j0486K75
$$ -1414 5081 3215 9383 12786 -468 -10812 -6376 -5208 -8512 1270 14997 10342 -144 131
391A31k799j0173J823J4308L913l071M357J28j3452p751O644L384j042Q560R034
$$ 131 -2668 -12841 -11018 3290 7203 4132 8489 8617 -4835 -12586 -5942 -2558 -3600 4960 13994
406A3994p011j0093J29j997o162N182J2641J837m651J838j459j1858m946Q116
$$ 13994 6983 -3110 -2981 -4978 -11140 -5958 6683 8520 3869 5707 4248 -7610 -12556 -4440
420d440N509J00N715L999p917q259K89m34k728O500J0447l99n374l82l023q718
$$ -4440 1069 1169 6884 10883 2966 -5293 -5004 -5438 -8166 -1666 8781 8382 3008 2626 -397 -9115
436i115j090R030N161k42K980N82p302o457L82R39J020O933O487k478n812j684
$$ -9115 -10205 -1175 3986 3744 6724 7306 4 -6453 -6071 -5132 -4112 2821 9308 6830 1018 -666
452f66k904m674J457Q045L971k12N36j516o870n133K252L701K531L604L365j844
$$ -666 -3570 -8244 -6787 1258 5229 5017 5553 4037 -2833 -7966 -5714 -2013 518 4122 7487 5643
468E643n564m744j745R34L812M202K019Q62n37m682o518j305L962M928J957R26
$$ 5643 79 -4665 -6410 -5476 -1664 2538 4557 5419 4882 200 -6318 -7623 -3661 1267 3224 4150
484D150J398j951n627m392J53L721L968K737J049p71l570l925j945k85K384M905
$$ 4150 5548 3597 -2030 -6422 -6269 -2548 1420 4157 5206 4435 865 -3060 -5005 -5290 -2906 1999
500A999L920l26l289k987k904j451J167K775K772L317J903m174o916j445L396
$$ 1999 5919 5593 2304 -683 -3587 -5038 -3871 -1096 1676 4993 6896 2722 -4194 -5639 -2243
515b243N89p39M358N292j872n991k873o73M04K228L256R43J255J185l879o925
$$ -2243 -1654 -2393 1965 7257 5385 -606 -3479 -4152 -3748 -1520 1736 2679 3934 5119 1240 -5685
531e685m71M659J654K45L686J521m742l218J101k402k628N538P160r12n054l05
$$ -5685 -6156 -1497 157 402 4088 5609 867 -2351 -1250 -3652 -6280 -742 6418 5506 452 147
547A47N36m116k056L233L504K099J929k350n436l87K489k509k207O264O583l585
$$ 147 683 -3433 -5489 -2256 1248 3347 5276 2926 -2510 -2897 -408 -2917 -5124 1140 7723 4138
563D138n677Q16J36l939Q28N256O92r90K902K94p019l896L697L290l02J784J908
$$ 4138 -1539 -723 -587 -4526 -3698 1558 2250 1260 4162 4456 -2563 -6459 -2762 528 226 2010 3918
580C918k008j715k49l341k593N047N712k241k922L397R6p001k014M921K140q41
$$ 3918 1910 195 -54 -3395 -5988 -941 4771 2530 -392 3005 3101 -3900 -5914 -993 1147 306
596C06K762J196m285k285K118j645l524M154O819j249m460Q1n64k887N43L260
$$ 306 3068 4264 -21 -2306 -188 -1833 -5357 -1203 5616 4367 -93 -12 -576 -3463 -2920 340
612C40K39l37L866K65o041k779K928Q73j438L112L314k372k250Q72k039l517K951
$$ 340 579 242 4108 4373 -1668 -4447 -1519 -646 -2084 1028 4342 1970 -280 592 -1447 -4964 -2013
629b013M888j280k094L556P62o120l365L983K393q17J516K022k370k256J065j371
$$ -2013 2875 1595 -499 3057 3819 -2301 -5666 -1683 710 -107 1409 3431 1061 -1195 -130 -1501
645a501k424K370M487L32k260r0j099k604L48K186O1Q0L043Q85m105j921J630
$$ -1501 -3925 -1555 2932 3264 1004 914 -185 -2789 -2441 -255 -194 -114 2929 3814 -291 -2212 -582
662e82n98j785K941L938j347k283K76r92k994Q73L460N36j497J919J441l433l068
$$ -582 -1180 -2965 -24 3914 2567 284 560 -432 -3426 -2553 907 1443 -54 1865 3306 -127 -3195
679c195P28J834P71J285P52p28j054n08j778j034K266K085o08L26J822j842m064
$$ -3195 -2467 -633 138 1423 2175 1447 393 -115 -1893 -2927 -661 1424 816 1142 2964 1122 -2942
696b942Q1K880Lj203K545K221k418k891O82M53j150L19K639J659j113j651j189
$$ -2942 -2861 19 22 -1181 1364 3585 1167 -1724 -1042 -589 -1739 -1420 1219 2878 1765 114 -1075
713a075l25K85J19O80J329J367r39j860l26j93p92L70J989J891r90j420k16m13
$$ -1075 -1400 -1115 -996 -316 1013 2380 1441 -419 -745 -938 -1730 -1360 629 2520 1530 110 -106 -519
731e19j168l0J240J515M85J95q05j350j082l97J001J088R61R9jp29j481n05L87
$$ -519 -1687 -1717 -477 1038 1523 1718 913 -437 -1519 -1916 -915 173 1134 1233 1232 503 -978 -1483 -1096
750a096M16N44J315R31j113j621l55M7m15N15J830Q01j110o80L32r08j324M45
$$ -1096 -680 -136 1179 2110 997 -624 -979 -932 -1347 -832 998 1799 689 9 341 -567 -1891 -1446
768a446J702J079K75p32q26o08k14q46K78J884J090o38q14M64p61k159M58K208
$$ -1446 256 1335 1610 878 52 -556 -770 -1616 -1338 546 1636 998 184 648 -113 -2272 -1814 394
786C94N96r05O40J019j887j950Q63Q92J36N28J206k70q74p74o47o40R69J623l36
$$ 394 990 85 725 1744 -143 -2093 -1230 -338 -202 326 1532 1262 388 -386 -1033 -1673 -704 919 583
805E83k69J136m80k398l42J621J75p61J957J112k077j556R19J29j324R18K291
$$ 583 314 1450 970 -1428 -1770 -149 26 -735 1222 2334 257 -1299 -380 -251 -1575 -657 1634
822A634l56j228M70J8j859n33J975K41n39J162J026k218j121R40J60r90J327J897
$$ 1634 1278 50 520 538 -1321 -1854 121 362 -177 985 2011 -207 -1328 -388 -228 -1218 109 2006
840B006j031j447J013l42j978O15J971o3j155J565L81k335r32J738L7j186J364
$$ 2006 975 -472 541 199 -1779 -1164 807 744 -411 1154 1535 -800 -1732 6 43 -1143 221
857B21J907j332j632Q07N3j566P23K024j85j019R89Q0k364l42J973k35q36J590
$$ 221 2128 796 -836 -29 24 -1542 -819 1205 1020 1 990 1070 -1294 -1636 337 102 -734 856
875H56J124k004r08R80j94j344J153K114r54j307J152l3k136J30J897O8j053J156
$$ 856 1980 -24 -932 48 -146 -1490 -337 1777 823 -484 668 635 -1501 -1371 526 594 -459 697
893F97J076k184j072J593p6j214J115J962j036j494R76j29j619M20J821n14p40
$$ 697 1773 -411 -1483 110 34 -1180 -65 1897 861 -633 343 214 -1405 -985 836 322 -418
910d18J464K94k435l18J536M0j459J574J682j584j240R13k5j524R69J860p11j069
$$ -418 1046 1340 -1095 -1413 123 163 -1296 278 1960 376 -864 49 24 -1500 -531 1329 618 -451
928d51R87N28k129m25J705J82o80R12R14j608r41J445n60j498J376J856q52j433
$$ -451 536 1064 -1065 -1490 215 397 -283 629 1543 -65 -1006 439 -121 -1619 -243 1613 761 -672
946f72J063J30j747J44J647j06p30J048L64j599p00J252p2r94J118J210r66r61
$$ -672 391 521 -1226 -1082 565 459 -271 777 1141 -458 -1158 94 22 -972 146 1356 390 -571
964e71P49m1j255O53J192k78p78J158J99j641l75R94O5n52Q62R13j105o94O84
$$ -571 178 137 -1118 -465 727 449 -329 829 1028 -613 -988 6 71 -481 381 1294 189 -505 179
983A79k08r16N66J295k75q05N59K34j172l69J121K5n02O88P35j053q62J005k68
$$ 179 -29 -945 -379 916 641 -164 395 629 -543 -912 209 234 -268 420 1155 102 -760 245 -23
1002b3p36M72J220m17p45O75m12q96L04R54l10m84P54N93j243n88O28J94n84O81
$$ -23 -759 -287 933 516 -229 446 34 -862 -558 396 86 -398 356 949 -294 -882 -254 -60 -644 37
1022C7R18o44o90P04m14q06M34Q68k05l49N18K52j046l83P54O8k62P74O0m49l45
$$ 37 955 311 -379 325 -89 -895 -461 407 202 -147 371 623 -423 -806 -52 16 -246 528 588 139 -206
1043b06J45j2o87N65J009l54n59L73k31n03j12O59J38l67N40J85n88m78K35m3
$$ -206 -61 -73 -760 -195 814 460 -99 274 43 -460 -572 87 225 -142 398 583 -5 -483 -248 -291
1063b91m23P72N98k67n57L08j29m23k17P00Np8K89K07n58m67L42K11j41L41L46
$$ -291 -714 58 656 389 -168 140 11 -412 -629 71 76 -2 287 494 -64 -531 -189 22 -119 222 568
1084E68k70l73R5j14n87M23K86L05j76K10n7o11k61K99L48j78K34M37k80n16J52
$$ 568 298 -75 20 -94 -681 -258 28 333 157 367 310 -301 -562 -263 85 -93 141 578 298 -218 -66
1105f6k66lL11L18p1m8J86k57k78j07J83M2Q2J42K56l57k81j47K28k7o2M99K1
$$ -66 -332 -335 -24 294 223 175 361 104 -174 -281 -98 -56 26 168 424 67 -214 -361 -133 -160 -222 277 298
1128B98j68j12j41n4J37K2k7J77K01j04l84j95J05K2J08N01j11m5j66k40Rq3J15
$$ 298 130 18 -123 -177 -40 -18 -45 132 333 229 -155 -350 -245 -223 -115 386 275 230 64 -176 -167 -250 -135
1151a35K15J74j42J68k86j72j08L8K97K1J43J07l68n2l4l4Q2J14K39K12k22j12
$$ -135 80 254 112 280 -6 -178 -286 -248 49 70 213 320 -48 -100 -134 -168 -86 28 267 479 257 145
1173A45J6l29J6M0J45L1J1J10j29l5j75Kj02M54J2r8j9j17j02j07n2K49L00j4
$$ 145 161 -168 -152 -112 33 64 75 185 56 21 -154 -152 -254 200 212 114 95 -22 -124 -231 -283 -34 266 252
1197B52m1j26j47r3k70J90M05o4M4N2k7j48k90j1L72N6q9l1J03k00j52J15j50
$$ 252 211 85 -62 -155 -425 -235 170 106 150 202 175 27 -263 -274 98 154 65 34 137 -63 -215 -100 -250
1220b50J65O8R5l6L04l26j94O8J54M5p8L96j98M4j32m06P0J62J31n1J14j72M0
$$ -250 -85 -17 78 42 346 20 -174 -106 48 93 15 411 213 257 125 -281 -211 -49 82 31 145 -27 13
1243A3j16J67k20JM4L07Q0m5l04j79P4K1R1J9O9K66j09m17P6j18K52r0J89K64
$$ 13 -103 64 -156 -155 -111 196 276 231 -73 -252 -178 -157 -66 -47 22 288 179 -238 -162 -280 -28 -118 71 335
1267C35k29l6l43O8j7K3M9L82j74K14l24J30l52r6K97K10K02j29m57K38K30l58
$$ 335 106 70 -273 -205 -222 -199 -150 232 58 272 -52 78 -274 -370 -73 137 339 210 -247 -9 221 -137
1289a37j3lL18K3j19j37J82j30k55K63P0J31j06N9Q1l92J09Q8j27J98k6M2k59
$$ -137 -150 -153 165 188 69 -68 114 -16 -271 -8 62 193 87 146 227 -165 -56 32 -95 103 77 119 -140
1312a40K93k04p7J04m8K31q3m9J8k0m15M88k42J66J9L3j2J2j49o5l2J29J86j50
$$ -140 153 -51 -128 -24 -72 159 76 27 45 25 -390 98 -144 22 41 74 62 74 -75 -140 -172 -43 143 -7
1336gJ33q1j4j61K09j36K0K7K86R8l06p3n2o2P5J51J07j72k2n0k6k30K02j03L16
$$ -7 126 45 31 -130 79 -57 -37 -10 276 374 68 -5 -57 -119 -44 107 214 42 20 -30 -56 -286 -84 -187 129
1361A29k3K00j89r8k98K24J02m6k19K40Q5J1j61J04k69K00RO6r1J39O4j34K2j20
$$ 129 106 306 117 19 -279 -55 47 1 -218 22 107 118 -43 61 -208 -8 1 67 -24 115 179 45 67 -53
1385e3J95k29J95J28o3j92N7j00jr9K51J35j74j61J74l41O2K68r3n1J72o1j41
$$ -53 142 -87 108 236 173 -19 38 -62 -63 -162 89 224 50 -111 63 -278 -216 52 -41 -92 80 19 -122
1408a22M3J9j62J04L4mJ15Q0n4l0k16J55J01j24J14k21J61L4k37J49O8k12K39
$$ -122 -79 -60 -222 -118 -84 -88 27 107 53 23 -193 -38 63 -61 53 -168 -7 27 -210 -61 7 -205 34
1431C4J59o3j37l0JK8j11K25N9q2J49j92k91L5J71J7j3qM2O8n6p0j1j31J38J09
$$ 34 193 130 -7 -37 -36 -8 -119 106 165 83 232 40 -251 -216 -45 -28 -41 -49 -7 61 5 -65 -76 -207 -69 40
1457D0J91m13K61j12J43k98K40P1l75L63P0l01k22K22J30j93J62K71l88J36q3
$$ 40 231 -182 79 -33 110 -188 52 123 -252 111 181 -120 -342 -120 10 -183 -21 250 -138 -2 -85
1478h5K43l57J27j6m8K22k76K93j98q1J3M4J09m8K70l22K30k40K28m14O8M72k18
$$ -85 158 -199 -72 -88 -136 86 -190 103 -95 -176 -163 -119 -10 -58 212 -110 120 -120 108 -306 -238 234 16
1501A6j64J67k4j52M6P0K37k11k8P1O0k51K87l23J17J19K65l61r4L06j15M3j87
$$ 16 -148 19 -5 -157 -111 -41 196 -15 -43 28 88 -163 124 -199 -82 37 302 -59 -153 153 38 81 -106
1524a06J44p0p5p5K12r8n7J23j2k3J65Q5r4q8o8rq2J24m7J29j64MJ07O7k38J79
$$ -106 38 -32 -107 -182 30 -68 -125 -2 -14 -37 128 213 119 31 -37 -46 -128 -4 -51 78 -86 -82 25 92 -146 33
1550C3j52j3J63J04j04j46J15j03J11j8K36k04J99l38L7M6o0o7m3K75j63J85P7
$$ 33 -119 -132 31 135 31 -115 0 -103 8 -10 226 22 221 -117 -80 -34 -94 -161 -204 71 -92 93 170
1573A70j73j32L62l94J78J23j02o4R1j29L9l3J22K01l94L33l6n3k27K61k25M7
$$ 170 -3 -135 227 -167 11 134 32 -32 59 -70 -31 -64 58 259 -135 198 162 109 -118 143 -82 -35
1595c5M6K4j65O1J63r0q5LJ07m0J77j97J65j73j00Q5qJ37j6k29K49j63k9L9j3
$$ -35 11 35 -130 -69 94 4 -81 -78 29 -11 166 -31 134 -39 -139 -54 -62 75 59 -170 79 -84 -113 -74 -87
1620h7K8Q2r9L7oO0L7k30K70j44j43L85m9N3r6j53o3j0q8K42J37k13N1j24Ol8
$$ -87 -59 23 -76 -39 -45 15 52 -178 92 -52 -195 190 141 194 98 -55 -118 -128 -216 26 163 -50 1 -123 -117 -155
1646a55K85k05J24RN5j21j08p3J17J71k22J72qJ37o0j04k2L0j1O1J38l4j02k40
$$ -155 130 -75 49 58 113 -8 -116 -189 -72 99 -123 49 41 178 118 14 -8 22 11 72 210 176 74 -166
1670a66O7J18K2J20k49L25p4j47R2p6M2J04n5k74K96J24j63j76Q8J6N9lj09L4
$$ -166 -99 19 41 161 -88 237 163 16 108 32 74 178 123 -151 145 269 106 -70 18 34 93 90 -19 15
1694A5Oj6J98l32J13j44P3J51j00k5k59K48j8J42O8m5p3m1j32K96j38K5L1j08
$$ 15 21 5 203 -129 -16 -160 -87 64 -36 -61 -320 -72 -90 52 120 75 2 -39 -171 125 -13 12 43 -65
1718f5J70j65J88N0q5j35L6J35k09J56m6J34o8j09j20L12O4j26k40J12q9K8l0
$$ -65 105 -60 128 178 93 -42 -6 129 -80 76 30 164 96 -13 -133 179 243 117 -123 -11 -100 -72 -102
1741a02q6K49j0j39O7m8L8j59L01k45K19l4j32l5J83J6k03O4m2N0J03N1o8p5j39
$$ -102 -188 61 51 -88 -21 -69 -31 -190 111 -134 85 51 -81 -116 67 83 -120 -56 -98 -48 55 106 38 -37 -176
1766a76J18kJ94k79J72l3q7K85l55L00k64J98p2K46j96j61p2l3J12o9L09j59j51
$$ -176 -58 -60 134 -145 27 -6 -93 192 -163 137 -127 71 -1 245 49 -112 -184 -217 -105 -174 135 -24 -175
1789a75K66j12J43m9j36j91K24K5k4K52k72J54k6k32J39j7J33j73j08J15Q4j0
$$ -175 91 -21 122 73 -63 -254 -30 -5 -29 223 -49 105 79 -153 -14 -31 102 -71 -179 -64 20 10
1811A0j56K3K55q0J8j66P1M5j24R0J18p1j02J76j28j18R4J65l73K81o0nJ86k00
$$ 10 -146 -123 132 52 70 -96 -25 20 -104 -14 104 33 -69 107 -21 -139 -45 120 -253 28 -32 -37 149 -51
1835e1J58j37M1o6J06j7q4q4M5O8J53r7j38J19J9qj30L01k29m1O2p3K41k73J38
$$ -51 107 -30 11 -55 51 34 -50 -134 -89 -21 132 35 -103 16 35 27 -103 198 -31 -72 -10 -83 158 -115 23
1860B3l5n8l0J93j41O6Q0pm1k06Q3j6K9M3J31q0Qj27rJ6J26mJ76l66K99M5k06
$$ 23 -12 -70 -100 93 -48 18 98 91 50 -156 -73 -89 -60 -17 114 34 42 -85 -94 -78 48 44 220 -146 153 198 -8
1887hj0m5p8J5J53J10k01pJ14k10J93j61J72K5j09J43k2m6j01J19j20j9J28R0
$$ -8 -18 -63 -141 -126 27 137 -64 -71 43 -167 26 -135 37 62 -47 96 74 28 -73 46 -74 -93 35 125
1911A25j31LQ9j52N4n5K09j80M9M8J14l56K0JK32m5J27M5n6k41N4J45j25K6q0
$$ 125 -6 -3 86 -66 -12 -67 142 -38 11 59 173 -183 -163 -162 70 25 152 197 141 -100 -46 99 -26 0 -80
1936h0R9j12J93j15O7o6J61j30J4K6p3LJ7m8r6K02j31J8L7J36N3j98J29j22j2
$$ -80 19 -93 100 -15 52 -14 147 17 31 57 -16 -13 4 -44 -140 62 -69 -51 -14 122 175 -23 106 -16 -28
1961b8Q7J54j35n7j6p3J10j60J07J10j04M6j9rJ66p4n6r5J96k88L88j70j63k4
$$ -28 59 213 78 21 5 -68 42 -118 -11 99 -5 41 22 13 179 105 49 -46 150 -138 250 80 -83 -107
1985a07J41L7K9j00J80l18K56q8P9o7j67K26j1m08K86K1n6J8R9j88O0K8P2K6K0
$$ -107 34 71 100 0 180 -138 118 30 109 42 -125 101 90 -318 -32 -11 -67 -49 50 -138 -78 -50 22 48 68
2010F8j9j82J16r5Q7M0n5K66r7j49J20j90J04J03p5j00J13j5j81K66J6k8j4K9
$$ 68 49 -133 -17 -112 -25 15 -40 226 129 -20 100 -90 14 117 42 -58 55 40 -141 125 141 113 99 128
2034A28j43j76J82L4J8Q9q9m8K03q3j00j56J94P8j87j01K23j96L8J95k53K36R9
$$ 128 -15 -191 -9 25 43 132 43 -5 198 115 15 -141 53 131 -56 -157 66 -130 -92 103 -150 86 185
2057A85j09j69K02j98j86L04J14qj37QJ30k97K79j68j45M7J09j46J55q1K75k31
$$ 185 76 -93 109 -89 -275 29 143 135 -2 6 136 -161 118 -50 -195 -148 -39 -185 -30 -111 164 -67
2079f7OJ09o7J14j28J50j79J2J62j57M8N5N5m0O7m3j73k0J49k07R4K21k58K20
$$ -67 -61 48 -19 95 -33 117 -62 -50 112 -45 3 58 113 73 140 97 -76 -96 53 -154 -60 161 -97 123
2103A23j58j34J05R3n5P2j8l3J98k69J48j70K22n6j55nJ60J9k00J68j92k3j4J62
$$ 123 -35 -169 -64 29 -26 46 28 -5 193 -76 72 -98 124 68 -87 -92 68 87 -113 55 -137 -160 -174 -12
2127a2k5N6N1k54J15r1L0J18j3l4J05J01j82J14j36j04K14j34J22J4o4P7r3k0
$$ -12 -37 19 70 -184 -69 -160 -130 -12 -25 -59 46 147 -35 79 -57 -161 53 -81 41 55 -9 68 -25 -45
2151d5O5l1L0J03j03N7Mo6r3Q8N8p9J5j53K10k27j17L52j29J17n7N5N0j63N8M1
$$ -45 20 -11 19 122 19 76 80 14 -79 9 67 -12 3 -150 60 -167 -284 68 -61 56 -1 54 104 -59 -1 40
2177D0j46J03l8k3N4o0M6j6M6j59K50j79K47m9l8j3j69J30P9m3j8j35L61k80J28
$$ 40 -106 -3 -41 -64 -10 -70 -24 -40 6 -153 97 -82 165 116 78 65 -104 26 105 62 44 -91 270 -10 118
2202A18o8j28j3o6J38R5P9o0k14J60k51J06JK00ml13P8OJ55j04L48l32j0J79k01
$$ 118 50 -78 -91 -157 -19 76 155 95 -119 41 -210 -104 -103 97 93 -220 -142 -136 19 -85 263 -69 -79 100 -101
2227a01J0Q3n5M3L6Mj51K30j2j29K2J33j88Q8J34j06j19J51j13Mj08J94j69J66
$$ -101 -91 -8 -63 -20 16 20 -131 99 87 -42 -20 113 -75 13 147 41 -78 73 -40 -36 -144 50 -119 47
2251D7j20Km4nL66k97m8L46j31k48K42l9j05k8m7MP5M1L9l7J29r3l9K6l9J8j93
$$ 47 -73 -71 -115 -120 246 -51 -99 247 116 -132 110 71 -34 -62 -109 -105 -30 11 50 13 142 49 10 36 -3 15 -178
2278a78J67p4m0L35q1m6Q6l06P2J24j13NL9K12k17m1J13L3j94J9N0l9O8l7R6L0
$$ -178 -11 -85 -125 210 129 83 169 -137 -65 59 -54 -49 -10 202 -15 -56 57 90 -104 -85 -35 -74 -6 -43 53 83
2304H3l4N4k60jJ88J0N6k51q4L14r6p3j4K35j94PL10j55l2j31K07k03J04R7l17
$$ 83 49 103 -157 -158 30 40 96 -155 -239 75 -21 -94 -108 127 -67 -60 250 95 63 -68 139 -64 40 137 -180
2329a80K86k47J50l5l7K6N9N7J87l36J30j73K03M6j22r0P7k9k8m0K1K00j41J69
$$ -180 106 -141 9 -26 -63 -37 22 79 266 -70 60 -113 90 136 14 -76 1 -28 -56 -96 -75 125 -16 153
2353A53l85L21J7L0j50J48k41J00J7O4j44L9J01k2K3m29M08Q6q1r2J35l35J0K26
$$ 153 -232 89 106 136 -14 134 -107 -7 10 74 -70 -31 70 48 71 -358 50 136 55 -37 98 -237 -227 -1
2377aO5K8p2L2j14J53j9m1n3N2O8q5M9j62j7m5K98k40N6J48j93J87j8m1j63M2
$$ -1 64 92 20 52 -62 91 72 31 -22 30 98 13 62 -100 -117 -162 136 -104 -48 100 -93 94 76 35 -128 -86
2403h6Q1M2o0J77j81K2p0j1Q3J18pJ2L0k38R6j16j69L62p3p5K00j47J81j13nM6
$$ -86 -5 37 -23 154 -27 -5 -75 -86 -3 115 108 120 150 -88 8 -108 -277 85 12 -63 137 -10 171 58 53 99
2429I9j45j6j33K14q3R3j1k5qk01M20k19J29k53L36m0j59P4j56O4N2L8j82M5K18
$$ 99 -46 -62 -195 19 -64 29 18 -7 -15 -216 204 -15 114 -139 197 157 -2 72 -84 -20 32 70 -112 -67 151
2454A51j63P5r9j3K1P4k6j74P7J96j36p5lK05kk05J36j19J35k72L11m5J0%o2N2
$$ 151 -12 63 -36 -49 -28 46 20 -154 -77 119 -17 -92 -95 110 108 -97 39 -80 55 -217 94 49 59 59 -3 49
2480D9k24J62j16o3K86k28K73r9mq5N2Q6OJl0k86Q4K24j26J63k32J75qn6j14L39
$$ 49 -175 -13 -129 -192 94 -134 139 40 36 -49 3 89 95 96 66 -220 -136 88 -38 125 -107 68 60 4 -110 229
2506B29j28p2n4l9P9R3l9j58J75j75K2J3J49j6j60J26j45K6L7K0J00j18J45k23
$$ 229 101 29 -25 -64 15 108 69 -89 86 -89 -67 -54 95 79 -81 45 -100 -74 -37 -17 83 -35 110 -113
2530a13P2p4J72m9l8p2L35l56J39N8k87L85j02n8j20J38K4q6O3r6J86J12J6l16
$$ -113 -41 -115 57 8 -30 -102 233 -123 16 74 -213 172 70 12 -108 30 54 -32 31 -65 121 233 249 -67
2554f7J31P2l74K79M9l0j11p1K81r4k8j57J74J21j42k05K03k2K2m2o2K3j1n5N4
$$ -67 64 136 -238 41 90 60 -51 -122 159 65 37 -120 54 175 33 -172 31 9 31 -11 -73 -50 -61 -116 -62
2579f2J9k9Q5l0l4J47j63k3K15J15l86K52j36r8O0J41m8j2K12j23or0m6q8o3O7
$$ -62 -43 -72 13 -17 -51 96 -67 -90 125 240 -146 106 -30 -128 -68 73 25 13 225 102 96 6 -40 -128 -191 -124
2605a24J20j19O3k24J41K12j2l08J67J73M8j86p9J55k47K45n6O3j47J48n6L1k6
$$ -124 -4 -123 -60 -284 -143 69 57 -251 -84 89 137 -49 -128 27 -220 25 -31 32 -115 33 -23 8 -18
2628a8J2j08J77Ql0l8j66m0K26L4j58L51k01j20K15j75M6j68M7L0K7j21P0K70
$$ -18 -6 -114 63 71 41 3 -163 -203 23 57 -101 250 49 -71 144 -31 15 -153 -106 -76 -49 -170 -100 170
2652A70k56J0J15ml8j68P1J38j82lK74M0P9k51m2p8L9q3J72j46Q5Qkj6R1p0Q6
$$ 170 -86 -76 39 35 -3 -171 -100 38 -144 -147 127 167 246 -5 -47 -125 -86 -169 3 -143 -58 -50 -52 -68 23 -47 39
2679C9J21l37J18N8lj32J17p0m3L3K00J24k70J16j9K9r2k1jp3J87oK1j26r1J65
$$ 39 160 -177 -59 -1 -4 -136 -19 -89 -132 -99 101 225 -45 71 52 81 -11 -32 -33 -106 81 75 96 -30 -121 44
2705D4m6J22j58JJ86j03O1n6j60P9J90p7L1m2j9k2n3QN5R9j50l6O0m2N2n5K70
$$ 44 -2 120 -38 -37 149 46 107 51 -109 -30 160 83 114 72 53 31 -22 -14 41 140 -10 -46 14 -28 24 -31 239
2732B39l63J79m8L8J47k36n5q5J40j45K96j75LR1r5K82j54r0j5N7O3j0j88J25
$$ 239 -124 55 7 45 192 -44 -99 -184 -44 -189 107 -68 -65 26 -69 213 59 -31 -46 11 74 64 -124 1
2756AJ69l18K51j57N4J6l3N4j91K70j62M3J04j53k2k6P3M5j00O8R8Q4M2k88k5
$$ 1 170 -148 103 -54 0 16 -17 37 -154 116 -46 -3 101 -52 -74 -100 -27 18 -82 -14 84 168 210 -78 -103
2781a03R9j58J96L2j15R8k55J22J03P5k95L14j08l0k1o3K20n6L4j05Q3j32J49
$$ -103 -4 -162 34 66 -49 49 -206 -84 19 94 -201 113 5 -25 -46 -109 111 55 89 -16 67 -65 84
2804H4p2k40K58J03lk13O2m4P9q0j41K67j56o6K51k04L2J12l27K44OJ72J9r6M8
$$ 84 12 -228 30 133 130 -83 -21 -65 14 -66 -207 60 -96 -162 89 -115 -83 29 -298 -54 -48 124 143 47 95
2829I5K3k3j88R8o0N4j11L23m44L64m6k05J28r8J06j2J12j73J01j37J73j05J02
$$ 95 118 95 -93 5 -55 -1 -112 211 -233 131 85 -120 8 -90 16 4 116 -57 44 -93 80 -25 77
2852G7k3j04P9J18j94J6j73K59R0l29P5j13J75N5lr8j03L51Q0j45j22J47o8k21
$$ 77 54 -50 29 147 -47 -31 -204 55 145 -184 -109 -222 -47 8 5 -93 -196 155 235 90 -32 115 47 -174
2876a74K40m8kN1n3O6l65L58j5k3J72j20N9j92K0J49j33J18k9O7p8K9j52o5m0
$$ -174 66 18 16 67 14 80 -285 73 58 35 207 87 146 -46 -26 123 -10 108 79 146 68 97 -55 -120 -160
2901a60J34R5N8k0k64J42J1J10j20R2j76o9K90k41L01j97o6K05o5N5j02o6Q9J22
$$ -160 -26 69 127 107 -157 -15 -4 106 -14 78 -98 -167 123 -118 183 -14 -80 125 60 115 13 -53 36 158
2925A58k89J77l3J52j09k30K60j53Q4M4Qj74J45k37L41j44n2J92n8j83J3J28N8
$$ 158 -131 46 13 165 56 -174 86 -67 17 61 69 -105 40 -197 144 0 -52 140 82 -101 -88 40 98
2948I8N3j99l0J04q9q1K92q3l0k62K87m7J5J72k66J21j63K46j89P5r1J14N2q9
$$ 98 151 -48 -78 26 -63 -144 148 65 35 -227 60 13 28 200 -66 55 -108 138 -51 24 -67 47 99 10
2972A0j71J66k1O4Jj73K34j11pN3L0j93L8M0O1j20Q8J30j27p8J15l9J10j9R3r4
$$ 10 -161 5 -16 48 49 -124 110 -1 -8 45 75 -118 -80 -40 21 -99 -11 119 -8 -86 29 -10 100 81 174 80
2998H0m8P6k29k6K0N1O4M4K6Q8m4J0j07J75o7p9o2l6L3l2M3j1m9K06Klk05J52
$$ 80 32 108 -121 -147 -127 -76 -12 32 58 146 102 112 5 180 113 34 -28 -64 -31 -63 -20 -31 -80 126 128 125 -80 72
3026G2K9R1j10q1K3n8J92k60J08N4k9q2K46j95j07j66L12j4J06j4j20p3J20O6
$$ 72 101 192 82 1 24 -34 158 -102 6 60 31 -51 195 0 -107 -273 39 25 131 117 -3 -76 44 110
3050A10Pk12J32j17Q8j23K70j69J9k6j35K17L9j97p1K33j4Qj33j16K43k9R5j17
$$ 110 117 -95 37 -80 8 -115 155 -14 5 -21 -156 61 100 -97 -168 65 51 59 -74 -190 53 24 119 2
3074Br5J49J48j98J43n0k20J67J54k38J5K7O9q0R7r4N2j86P3J55p0O5n2o6M7P2
$$ 2 -93 56 204 6 149 99 -121 46 200 -38 -23 4 73 -7 90 -4 48 -138 -65 90 20 85 33 -33 14 86
3100H6j91J85O6K1k24J46J0L8k18N0j1O5L9j00l7K46j8j87j61J69o9J07j90L24
$$ 86 -105 80 146 167 -57 89 99 137 -81 -31 -42 23 62 -38 -75 171 153 -34 -195 -26 -95 12 -178 146
3124A46J4n4r5J22j83j30K31j83J65q7L6q4Qj9n8K25p1M4j42o6O6M8N9j70L45
$$ 146 160 106 11 133 -50 -180 51 -132 33 -54 -18 -102 -94 -113 -171 54 -17 27 -115 -181 -115 -67 -8 -178 167
3149A67r4J70k99J39L9l1n7l15K35J8M2N3Qq0J3n2o4J02J2k25J36Q7n9l8J12K1
$$ 167 73 243 -56 83 122 91 34 -281 -46 -28 14 67 75 -5 8 -44 -108 -6 6 -219 -83 4 -55 -93 19 40
3175D0J45j05Q3j54N2k3k3J9j53K59j78nJ46Q5j61q3M4R6m2k8j6k0J69j6m5q1
$$ 40 185 80 163 9 61 38 15 34 -119 140 -38 -43 103 188 27 -56 -12 84 42 14 -2 -22 147 131 86 5
3201ERN7o1p4L3P2L7o8l1J20k7K5j54J00j60L49j84N2j64J55j30R9k59N3J08J12
$$ 5 14 71 10 -64 -31 41 78 10 -21 99 72 97 -57 43 -117 232 48 100 -64 91 -39 60 -199 -146 -38 74
3227G4P3j90p6N5K9Q1N7j30l6N9l4o2J82j01o4J18n3L1k09J06O3Q4l9R4n7j09
$$ 74 147 -43 -119 -64 -35 46 103 -27 -63 -4 -38 -100 82 -19 -83 35 -18 13 -196 -90 -27 57 18 112 55 -54
3253e4k4L7Q2j22Q7j56K37r5M4N4k7j09M6P5m6R0j55j33J39L2o5m1j3J78j12j60
$$ -54 -78 -41 41 -81 6 -150 87 -8 36 90 63 -46 0 75 29 119 -36 -169 -30 2 -63 -104 -117 61 -51 -211
3279b11J75J40j08r2m2J58j4j0j31K11r9P8j11J00J5R2l32J23J19N4j08n6J94
$$ -211 -36 104 -4 -96 -138 20 6 -4 -135 76 -23 55 -56 44 59 151 -181 -58 61 115 7 -49 145
3302A45K07j63m7j74k9rP9J25m7j90J38J08J32l23n7L37k48J76j99J78j78r5J61
$$ 145 352 189 142 -32 -61 -70 9 134 87 -103 35 143 275 -48 -105 232 -16 160 -39 139 -39 -134 27
3325B7k9l1J10r8q0K7K6R8q9k1J48J7k2k04J75J5r3j35K66l3j05J6J83k86J3n4
$$ 27 -2 -33 77 -21 -101 -74 -48 50 -39 -60 88 105 83 -121 54 69 -24 -159 107 74 -31 -15 168 -118 -105 -159
3351a59J29J24j71J25J2O0O5k23K9K9lj25K08j02k9J05j84J19q2J53N4j32Rr3
$$ -159 -30 94 -77 48 60 120 185 -38 -9 20 17 -108 100 -2 -31 74 -110 9 -73 80 134 2 11 -82
3375h2K09p3n4K2k3q2Q0j17K13J8j67J71j75K15m65L22L3k23J11r8J98J95j25
$$ -82 127 54 0 22 -1 -83 -3 -120 93 111 -56 115 -60 155 -310 12 45 -178 -67 -165 33 228 103
3398A03p9qJ03j34P9M9o9L6j16M9l9J6q6O7K4j45K67l2m9J90k35P7n0m8L8o6J94
$$ 103 24 16 119 -15 64 113 44 80 -36 13 -26 -10 -96 -29 -5 -150 117 85 36 226 -9 68 18 -30 8 -58 136
3425A36m8N9q6o0j11J43j55J58L9k78K79n5nl0N9rM7N8k41J63k1J09j09J10l20
$$ 136 88 147 61 1 -110 33 -122 36 75 -203 76 21 16 -14 45 36 83 141 -100 63 42 151 42 152 -168
3450a68J0J62Q5k15J44n2K40q7j67k2K94j22k22K01m3K63l01m5O1j51K20j7j08
$$ -168 -158 4 89 -126 18 -34 206 119 -48 -70 224 102 -120 81 38 301 0 -45 16 -135 85 68 -40
3473d0K8k4J9O4j82N0O9j67K12k0m3J48l17J00J00J3J14j57K0r4J69Q7j70O5K3
$$ -40 -12 -36 -17 47 -135 -85 -16 -183 29 9 -34 114 -203 -103 -3 10 124 -33 -13 -107 62 149 -21 44 67
3498F7m7J66k88p8Q8J43Rk40J28q2K16k14K04n8J7k25L80l24j1Q9J66R5j51j38
$$ 67 20 186 -102 -180 -92 51 60 -180 -52 -134 82 -132 72 14 31 -194 186 -138 -149 -60 106 201 50 -88
3522h8J61j47k0oJ57J10j78J5n7P1Q0n4o0J72k03J05j33J83j18J86j87NK5j3J96
$$ -88 73 -74 -94 -100 57 167 -11 4 -53 18 98 44 -16 156 -47 58 -75 108 -10 176 -11 -6 19 6 202
3547B02k95J31N5p9n5j1K4PK00j53k9N4J5j36K10k03K42r6j98Q1O1p5K43j91j09
$$ 202 -93 38 93 14 -41 -52 -28 -21 179 26 -3 51 66 -70 140 -63 179 83 -115 -34 27 -48 195 4 -105
3572a05R6Q3M3k20R2M8Qj50k1L14j30q4K9J11k3l04K47j06oJ85Q6k60L1K55j86
$$ -105 -9 74 117 -103 -11 37 45 -105 -126 188 58 -26 3 114 91 -213 34 -72 -78 107 193 -67 -36 219 33
3597C3p4L9O9k20%pL80j45L8o3N4k3Lq0j14J67J36j1k52J86j40j2R7j18M8j30
$$ 33 -41 -2 67 -153 -153 -160 220 75 113 50 104 81 84 4 -110 57 193 182 -70 116 -24 -36 61 -57 -9 -139
3623a39L2K08j10L7R4j89O8K6J28k20J23k6k1j00J04R5j49K9m5J12J39j80r6J08
$$ -139 -107 101 -9 28 122 -67 1 27 155 -65 58 32 11 -89 15 110 -39 -10 -55 57 196 16 -80 28
3647B8n4p8K28k13N9k9M4j93K16Q8m7q6l0N6j3RK06l43K80j21Rn5j7K82k32l6
$$ 28 -26 -104 124 -89 -30 -59 -15 -208 8 96 49 -37 -67 -11 -24 -15 191 -152 128 7 16 -39 -56 226 -6 -42
3673d2n7P7k5J00p1J09j02k3j66J25R4R9q6L8K3j19R9j05j59J56J22j74j14J99
$$ -42 -99 -22 -47 53 -18 91 -11 -34 -200 -75 19 118 32 70 93 -26 73 -32 -191 -35 87 -87 -201 -2
3697bJ1o6j68L04J19j89J5k2K8J9q9R8m3M0m4L4k3RJ74k89L2Q6j79L70r5n7k56
$$ -2 9 -57 -225 79 198 9 24 2 30 49 -40 58 15 55 11 45 22 31 205 -84 -52 34 -145 225 130 73 -183
3724a83K45M2j36J44kk8j52M1K4m7K35l66J86r8j95K77J3Q3k30J76M0k01J48R6
$$ -183 62 104 -32 112 110 82 -70 -29 -5 -52 183 -183 3 -95 -290 -13 0 83 -147 29 69 -132 16 112
3748A12j76n4j2R1qj16J5K44j70L76m30N5M1O5K1j3O0j94J92l11J69N4P4m1J2
$$ 112 -64 -118 -130 -39 -47 -163 -148 96 -74 302 -128 -73 -32 33 54 41 101 -93 99 -212 -43 11 85 44 56
3773E6N2k56J18M7o7J43p0j74J38j19K47j8k91L20k40N8j26K28K0q1jj93J50q
$$ 56 108 -148 -30 17 -50 93 23 -151 -13 -132 115 97 -194 126 -114 -56 -182 46 66 -15 -16 -209 -59 -67
3797f7o4Q2J45k09J42Mj07J14r5J77r3J9p7m3P8K2P1r2nk10L06J4j3r2O5j03M7
$$ -67 -131 -49 96 -113 29 33 -74 40 -55 122 29 48 -29 -72 6 28 99 7 2 -208 98 112 99 7 72 -31 16
3824A6q1m8J74o9J27q9j80J71O8o0j5o6J63j19k1J11k38J43mN1J20r8J43k32j03
$$ 16 -65 -113 61 -8 119 30 -150 21 89 29 14 -52 111 -8 -29 82 -156 -13 -17 34 154 56 199 -33 -136
3849a36J42K48j17l37J38J49j96K00r3k90J52K29q0o3l8k04K17o7J14J62L7k72
$$ -136 6 254 137 -200 -62 87 -109 91 -2 -292 -140 89 9 -54 -92 -296 -79 -146 -32 130 167 -105
3871a05L4O3J44J4j77nq2J19J9q5K20l10J08lJ26o8j23K33ok0l7mQq1J00k1M9
$$ -105 -71 -8 136 150 -27 -32 -114 5 24 -61 159 -151 -43 -46 80 12 -111 122 116 96 59 55 63 -18 82 61 110
3898A10q9O7k75J82l5m7J75J57l33k7K52k95p9K27R3k1k18K04L0J96m51J75l5
$$ 110 21 88 -187 -5 -40 -87 88 245 -88 -115 137 -158 -237 -10 83 62 -156 48 78 274 -177 -2 -37
3921c7J68j01j38lJ74J02k19M9J30j59J32K2n7j77K94k05OL6p7J63j58J30M1j26
$$ -37 131 30 -108 -111 63 165 -54 -5 125 -34 98 120 63 -114 180 -25 -19 17 -60 103 -55 75 116 -10
3945a0M7p5O7k06J41j79J94n5R7M3j48j11K66N5k22j2J79j6q3N9l7J02j72K66
$$ -10 37 -38 29 -177 -36 -215 -21 -76 21 64 -84 -195 71 126 -96 -108 71 55 -28 31 -6 96 -76 190
3969A90m7l47K40Q0o5OJ35k90J6PoK60l28oJ29L8J11p5k34K31j35J04r3J92j50
$$ 190 143 -204 36 116 51 57 192 -98 -82 -75 -81 179 -149 -155 -26 12 123 48 -186 45 -90 14 -79 113 -37
3994c7Mrn6J17N3k36K40j40Q4r0J30K7l6n3j11J02P3k2L3n5j8K0j78L00Q6j77
$$ -37 -33 -42 -98 19 72 -164 76 -64 20 -70 60 87 51 -2 -113 -11 62 40 73 18 0 20 -158 142 228 51
4020E1p1J10j79R5l9j33O3J14p9LK07k36Rk3J08P5R6j14m6j91J69n2jJ80k02j53
$$ 51 -20 90 -89 6 -33 -166 -103 11 -68 -65 142 -94 -85 -108 0 75 171 57 11 -180 -11 -63 -64 116 -86 -239
4046b39K07J59l44L72j60q4Q2J41o6j2N6p8j27J14o9r5K25j91Q8J5j6J48N4j19
$$ -239 -32 127 -217 155 -5 -89 -7 134 68 56 112 34 -93 21 -48 -143 82 -109 -21 -6 -22 126 180 61
4070F1J6k2NJ0l13J83K74k02n2J4j3pJ04k37M6M7J87o3j12P1k7j8J71k73K55O3
$$ 61 77 55 60 70 -243 -60 214 12 -40 -26 -39 -46 58 -179 -133 -86 101 38 -74 -3 -30 -48 123 -150 105 168
4096A68o4m4j87J45J80j98M1o7n0J18r6J84jj50l0k2N7J47j40m4q7J67N8k06K5
$$ 168 104 60 -127 18 198 0 41 -26 -76 42 -54 130 129 -21 -51 -73 -16 131 -9 -53 -140 27 85 -121 -96
4121i6J94K4l0j94k2K19l6k68J29K1P3R8Rk07J05J62j96o8l3K00k0J34r6R1N6
$$ -96 98 122 92 -102 -124 95 59 -209 -80 -59 14 112 121 -86 19 181 -15 -83 -116 84 64 198 102 193 249
4146B49l06J38j13q1P0M5O8j32J29q6p1K33j34M2m0k77J94J26j04K7N9j45J40
$$ 249 -57 81 -32 -113 -43 2 70 -62 67 -19 -90 143 9 51 11 -266 -72 54 -50 -23 36 -109 31
4169C1j8J4o4r2J46j6l0m2j35K37k5m2J33r2j8J77j27k8O2k25J20J07j68J49j52
$$ 31 13 27 -37 -129 17 1 -29 -71 -206 31 6 -36 97 5 -13 164 37 9 71 -154 -34 73 -95 54 -98
4194i8j37J13J44k01K19j25npJ22o4j25J67j5J30j74R2q1k4O0K14n6J9lj42j0
$$ -98 -235 -122 22 -179 40 -85 -90 -97 25 -39 -164 3 -12 118 -56 36 -45 -69 -9 205 149 168 165 23 13
4219A3R9j47M3j60J89j17P9J3m7qp5O3J71L6P4j20q2j41O7j3l0O4nL9L4J97j58
$$ 13 112 -35 8 -152 37 -80 -1 12 -35 -43 -118 -55 116 152 226 106 24 -117 -50 -63 -93 -29 -34 5 39 236 78
4246G8R0K0k57l0k5K23J53k91P1j41K11P4K8j63J15k92l2K30p1J72l42J84r9K71
$$ 78 168 188 -69 -99 -124 99 252 -39 32 -109 102 176 204 41 156 -136 -168 62 -9 163 -179 5 -94 177
4270A77k05K2K28l29R9J31j44n1O6Q0q4p2J54kj32k2J65j47M2P4l72M69j70k8
$$ 177 -28 -6 222 -107 -8 123 -21 -72 -6 74 -10 -82 72 70 -62 -84 81 -66 -24 50 -322 147 -23 -51
4294e1J08r7J25J4p9J16L1k07Q3l2pM5j27K31j54Q0j00J53o8L8k74P8L5K35k77
$$ -51 57 -40 85 99 20 136 167 -40 43 11 4 49 -78 153 -1 79 -21 132 64 102 -172 -94 -59 176 -101
4319a01K24J45l29j92J05K24o6P6k06R4J04k35O0R0m8m6J84R7j41p3J68L8j95
$$ -101 123 268 -61 -253 -148 76 10 86 -120 -26 78 -157 -97 -7 -55 -101 83 180 39 -34 134 172 -23
4342b3J62k46L71k60l4j24K68r4j00L5O7K03l14J43j78K34K8l83L97l05J32l3
$$ -23 139 -107 264 4 -30 -154 114 20 -80 -45 22 225 -89 54 -124 110 138 -245 152 -153 -21 -54
4364e4K11j90Q5k47J84l6O6j86J13oO7j43J04M5Ko0J01L1j2L3p9N5j20K25m5k95
$$ -54 157 -33 52 -195 -11 -47 19 -167 -54 -60 7 -136 -32 13 15 -45 56 87 75 108 29 84 -36 189 144 -151
4390a51L7J01Nk6P0M1k80M36p5j48J26j41Q2M6j88M7n4L07k62N5L2J81l38J6p4
$$ -151 -114 -13 -8 -34 36 77 -203 233 158 10 136 -5 77 123 -65 -18 -72 235 -27 28 60 241 -97 -81 -155
4415a55l1K72j7m2KR9m3j0q2n0J36j4R8j90qL3J00r1o5O9Oj93K46N3j03m5J04
$$ -155 -186 86 69 27 29 128 85 75 -7 -57 79 65 163 -27 -35 -2 98 7 -58 11 17 -176 70 123 20 -25 79
4442G9m9j87J7K56K4j82j14J62R9j47o9J4P0K23k63J06M7j42K3j79K97k05J22
$$ 79 30 -157 -140 116 140 -42 -156 6 105 -42 -111 -97 -27 196 -67 39 86 -56 -33 -212 85 -120 2
4465BJ60j77K3N7k5o9k9QL6K55j70O6j3o1p0l8Q4K3J62k28l0K8K37k03j4l4l9
$$ 2 162 -15 8 65 40 -29 -58 -50 -14 241 71 137 124 63 -7 -45 39 62 224 -4 -34 -6 231 28 14 -20 -59
4492e9J83k87J45RO9j80P4J10j05K44j72L4j85O8rJ7m5m0Q0Q0L1j95K29j55P0
$$ -59 124 -163 -18 -9 60 -120 -46 64 -41 203 31 65 -120 -52 -61 -44 -89 -129 -49 31 62 -133 96 -59 11
4517A1p6j07K24n7l8J08o1j9N2K4J2l0j76P1M5P1M3l5P7N6r4p1O3j11J55%m3k30
$$ 11 -65 -172 52 -5 -43 65 4 -15 37 61 73 43 -133 -62 -17 54 97 62 139 195 101 30 93 -18 137 137 94 -136
4545a36M03l02j19K69J6k17J24j53K27o6rP0l3j4P9r3M3k05K54j84M7J14p8j39
$$ -136 267 -35 -154 115 131 -86 38 -115 112 46 37 107 74 60 139 46 89 -116 138 -46 1 115 37 -102
4569a02j12M79l46k9J37p1p9J50j41K71n4j4K2k90J41J07j23m1R1l2P3N5O2k74
$$ -102 -214 265 -81 -110 27 -44 -123 27 -114 157 103 89 111 -179 -38 69 -54 -95 -4 -36 37 92 154 -120
4593a20p4J01J89k9J42k84m9J42Mj1k24K46J6j8q6k14J71J80r1nL3k9J42j13j44
$$ -120 -194 -93 96 67 209 -75 -124 18 22 11 -213 33 49 31 -55 -269 -98 82 -9 -14 19 -10 132 19 -125
4618a25K89J0j76l5J1l7Q1q7l5J04L6k24L42Oj98Ok8Q1p3k2L13k63j58K64p2r4
$$ -125 164 174 -2 -37 -26 -63 18 -69 -104 0 36 -188 154 160 -38 -32 -60 21 -52 -74 239 -24 -182 82 10 -84
4644h4J11J6q1J04j82K62k07mJ30q6J64k98L73l5j18L3L1j38m7J00j22P0RJ08
$$ -84 27 43 -38 66 -116 146 -61 -65 65 -21 143 -155 218 183 65 98 129 -9 -56 44 -78 -8 1 109
4668A09q9J39k03k2J59k56J37K2j02mJ22m8P9j13P0j23M3j29J13J00j01J30K5
$$ 109 20 159 -44 -66 93 -163 -26 -4 -106 -110 12 -36 43 -70 0 -123 -80 -209 -96 4 -97 33 58
4691E8k18K14j8M7k01Q3J35j03J60l03j03L24k69J93P1n9p9N7J53j02o9R8j43
$$ 58 -160 54 36 83 -118 -35 100 -3 157 -146 -249 75 -194 -1 70 11 -68 -11 142 40 -29 69 -74
4714g4QJ45Qn3L7l2m5nP8k30J06M4l5J64r8q8K25l92M53j89Jm5L6Rk0j21J9J43
$$ -74 -66 79 87 34 71 39 -6 -11 67 -163 -57 -13 -48 116 18 -70 155 -237 216 27 28 -17 19 28 8 -113 -94 49
4742D9J24k35J7J25k5J5j92m6L24l86J02P7n6J82k70J09J71P3j34K8n7M8K8j86
$$ 49 173 -62 -45 80 55 70 -122 -168 156 -230 -128 -51 -107 75 -195 -86 85 158 24 52 -5 43 71 -115
4766a15J05j17J19J28j05j29J32J02q7q5k0j3P6J21m9mj33J50l0o7RJ0k2p9N9
$$ -115 -10 -127 -8 120 15 -114 18 120 33 -52 -72 -85 -9 112 63 59 -74 76 46 -21 -12 -2 -24 -103 -44
4791d4J87j78p6K2J3O0O0l0j39J20j00N0P1j62K99k14k2K41j09j45Q7J5K17q2
$$ -44 143 -35 -111 -89 -76 -16 44 14 -125 -5 -105 -55 16 -146 153 -61 -83 158 49 -96 -9 6 223 141
4815A41j09O1m9O7k97J16Q5m4j52K22k30J00O1J00j56L8oJ64Oj46J15Lj49J51
$$ 141 32 93 44 111 -186 -70 15 -29 -181 41 -189 -89 -28 72 -84 -46 -52 112 118 -28 87 90 -59 92
4839I2j66P7j10j64M87k21J02j5l8J35j92l1K0j6nR4r7RJ0M5J15k0j53J7QQ5j20
$$ 92 -74 3 -107 -271 216 -5 97 82 44 179 -13 -44 -24 -40 -45 49 -48 -39 -29 16 131 111 -42 -25 -17 68 -52
4866e2k12M79j69o8OJ23l4M0j52P0R2j38m6QK26l30J49Q4q7R1k8O6o1k2r4J54
$$ -52 -264 215 46 -22 -16 107 73 113 -39 31 123 -15 -61 -53 173 -157 -8 76 -11 80 52 118 57 35 -59 95
4892I5j02jl2P2J49j61o4K06j50kO7q4P8k07P7J45J3j44J96j27L9m5Oj72O1K6
$$ 95 -7 -8 -40 32 181 20 -44 162 12 10 77 -7 71 -136 -59 86 99 -45 151 24 63 18 24 -148 -87 -61
4918f1q6K26p5j95J58m6J28j7j07L36l82J73M8L8k70J83k5J2j02MJ68m2j89J11
$$ -61 -147 79 4 -191 -33 -79 49 32 -75 261 -121 52 100 138 -132 51 26 38 -64 -60 108 66 -123 -12
4942a2Q3k51K23J9k5k1N3o4J73k91M9M1j40K97j92n7N7J34J32l98J09K16l26K09
$$ -12 71 -180 43 62 37 16 69 5 178 -113 -64 -23 -163 134 -58 -115 -58 76 208 -190 -81 135 -191 18
4966A8N9Mk27J48J35k37N1J21k71J75O3j76J45j50K04n3P3k63P6K22k05j20J23
$$ 18 77 81 -146 2 137 -100 -49 72 -199 -24 39 -137 8 -142 62 9 82 -181 -105 117 -88 -208 -85
4989h5N3qP0L9J14j75j19J3J43j2J25k65L5j1N1J19J8p8j3J0l2j04p2J97j1o4
$$ -85 -32 -40 30 69 183 8 -111 -98 45 33 158 -107 -72 -83 -32 87 105 27 14 24 -8 -112 -184 13 2 -62
5015f2n0J61j52l5J25k7Q9N4k53K34j42r7M02j78K0mm6mj27K26l88K43J58%j75
$$ -62 -112 49 -103 -138 -13 -40 49 103 -150 84 -58 -155 247 69 89 85 39 35 -92 134 -254 -11 147 147 -28
5040b8J8n2k2j56N7J85j30J92K2Lj13Q5J23j04r4J48R0k98lJ16j18Mj17l6K20
$$ -28 -10 -62 -84 -240 -183 2 -128 64 86 89 -24 61 184 80 -14 134 224 -74 -77 39 -79 -75 -192 -228 -8
5065hj30O1Q8J9O8ooN3k09L5N5q0J9P5j16P2J07J42K7k66Q6j35K66k38k8J42j76
$$ -8 -138 -77 11 30 98 92 86 139 -70 -35 20 -60 -41 34 -82 -10 97 239 266 0 86 -49 217 -21 -49 93 -83
5092h3R3P0j58L3j39J47J64j32K9j0J11j89QJ03J8l1n9k4OJ26k56N8J97o8Q0L0
$$ -83 10 80 -78 -45 -184 -37 127 -5 24 14 125 -64 -56 47 65 34 -25 -49 -43 83 -173 -115 82 14 94 124
5118A24j48lJ32j18q3KJ25J10k10j75R3J42Q7m6j60J66k9J31jJ17k49Q7k79L4
$$ 124 -24 -27 105 -13 -96 -94 31 141 -69 -244 -151 -9 78 32 -128 38 9 140 139 256 7 94 -185 -151
5142a51K2J48J71l1k47J4J2J45J1j57lp4K85k66J8M0J62k5m1r6m0K8J76J4k02
$$ -151 -129 19 190 159 -88 -74 -62 83 94 -63 -66 -140 145 -121 -103 -63 99 74 33 -63 -103 -75 101 115 -87
5167h7l1R8j31J28q0K37k8m3J16k91K09j06M5o4l4q2J97OL7j83K60l04M4jQ0O0
$$ -87 -118 -20 -151 -23 -103 134 106 63 179 -112 97 -9 36 -28 -62 -144 53 59 96 -87 173 -131 -87 -88 -8 52
5193E2K2j45J30m1j2J00j69p6Q4K06j30k2j43Q2O1Q2o7KM5J81k14j01J28o4J52
$$ 52 74 -71 59 18 6 106 -63 -139 -55 151 21 -1 -144 -62 -1 81 14 16 61 242 28 -73 55 -9 143
5218A43k40O9L5K2O3n2r0J34p6K2r1J20j29k6Q5j12J45o3J36q4j57K22N1j00j23
$$ 143 -97 -28 7 29 92 40 -50 84 8 30 -61 59 -70 -96 -11 -123 22 -41 95 11 -146 76 127 27 -96
5243i6J79k7lP9k15Q8m6k7O5j23J62k00K5L92j72k43Q1J12j5R8j90L0J76j60J45
$$ -96 83 56 53 132 -83 5 -41 -68 -3 -126 36 -164 -139 253 81 -162 -81 31 16 114 -76 -46 130 -30 115
5268A15J0l31K24j4j56J32NO0j4j04q7R2j14Q2rK24k01P2p3J66J6p0k84L14k9
$$ 115 125 -206 18 4 -152 -20 -15 45 31 -73 -160 -68 -182 -100 -109 115 -86 -14 -87 79 95 25 -259 55 26
5293B6qR4m9j86P3J26k75K01k16K48K6n3r3j41J82K3J58k64J44K22k56j28J65
$$ 26 18 112 63 -123 -50 76 -199 2 -214 34 60 7 -86 -227 -45 -22 136 -128 16 238 -18 -146 19
5316A9j08K05j22L9p6J10j26Q6j70J93p2Pm9j1J36l0r1m9J44n4O3OQ5j8q5j61
$$ 19 -89 116 -6 33 -43 67 -59 27 -143 50 -22 -15 -64 -75 61 31 -60 -109 35 -19 44 50 135 117 32 -129
5342a29J81j85J00J24l7q0k43K34K16k76J53l7j47L10k43M0M2K06k59R6j64J72
$$ -129 52 -133 -33 91 54 -26 -269 -35 181 -95 58 21 -126 184 -59 -19 23 229 -30 66 -98 74
5364G4j77m6O5l6L51l70k7J21j38mJ09J72k5%m7j81J13r7Q2J3J64o5J3j23K9p9
$$ 74 -103 -149 -84 -120 231 -139 -166 -45 -183 -187 -78 94 69 69 22 -159 -46 -143 -61 -48 116 51 64 -59 -30 -109
5390a09K28l8j64m3J42r9K35k86K31l9j74K15k00rO7j46J84Q1m8k17O7J30K20
$$ -109 119 81 -83 -126 16 -83 152 -134 97 58 -116 99 -101 -110 -43 -189 -5 76 28 -189 -122 8 228
5413B28l48J81L8M6k29J17r3K2J00l03M21Rj21k8j12l1J42j2j44L5K82k14M1L4
$$ 228 -120 61 99 145 -84 33 -60 -38 62 -241 180 189 68 40 -72 -103 39 27 -117 -82 200 -14 27 61
5437F1n3k2J01k26j09J81j60M5P8L7P2q3N2J0j16J67j50J18mR4j16q1K0J17Lp1
$$ 61 8 -14 87 -139 -248 -67 -227 -182 -104 -67 5 -78 -26 -16 -132 35 -115 3 -1 93 -23 -104 -84 33 36 -35
5463c5k7K25j32O8Om4k94L29j39k0Q7K9j54j2O7K6o3K1J28j61J25Q0p9k5Rj07
$$ -35 -62 163 31 99 105 61 -233 96 -43 -63 24 53 -101 -113 -46 -20 -83 -62 66 -95 30 110 31 6 15 -92
5489i2kJ03l3j65OJ26p5L20j25k55J31K34l00L27l22M1j1J53q0Q7r5R8j37J28
$$ -92 -94 9 -24 -189 -183 -57 -132 188 63 -192 -61 173 -127 200 -122 -81 -92 61 -19 68 -27 71 -66 62
5513F2j31J36L5k21J64pMq5j09J62m0jNk3J37k59J06l7K08m0p7J36m7o4p4j4O4
$$ 62 -69 67 102 -119 45 38 42 -43 -152 10 -30 -31 -26 -49 88 -171 -65 -102 106 66 -11 125 78 14 -60 -74 -10
5540a0r5kJ05j11K53j8j81M9p3J79k28J9K13M4j02J45j25O7j65M3k74L52J01l0
$$ -10 -105 -107 -2 -113 140 122 -59 -10 -83 96 -132 -113 100 144 42 187 62 129 -36 7 -267 85 186 156
5564A56j42l1k1j23J45j15L74m56K64j06N1l8k4J40j10j8J77r4j38J59q3J08J04
$$ 156 14 -17 -38 -161 -16 -131 243 -213 51 -55 -4 -42 -66 74 -36 -54 123 29 -109 50 -33 75 179
5587A79l01L17l8j40M2j41K69o2k09j52L29k6k08J21J09j67Q9o0J67k70J86j38
$$ 179 -122 195 157 17 59 -82 187 125 -84 -236 93 67 -141 -20 89 -78 11 -49 118 -152 34 -104
5609a04k0J52R9j76M8o6R2J04l03K45r9J93j26K14k69J98j78l03L67j51L08l76
$$ -104 -124 28 127 -49 -1 -67 25 129 -174 71 -28 165 39 253 -16 182 4 -299 68 -83 225 -151
5631a51k6J16Q8n7N6j75J52R8j06P9r4Q4k07J64O2rl3Lm9j91K19j83Q3O4rm7K05
$$ -151 -177 -61 27 -30 26 -149 3 101 -5 74 -20 64 -143 21 83 74 41 44 -5 -196 23 -160 -77 -13 -22 -69 136
5658A36k47J60J40l33L6J75k55K63k65J33J4j5K7N6L8p8j8K30k21K2q0jJ43j89
$$ 136 -111 49 189 -144 -108 67 -188 75 -190 -57 -43 -58 -31 25 63 -15 -33 197 -24 -2 -82 -83 60 -129
5682a29J59K2k29J81N1q8m8J82N3p2q4J9k7m2j24J26J55q9j34Q1J05m4OJ25Rk63
$$ -129 30 52 -177 4 55 -33 -81 101 154 82 -2 17 -10 -52 -176 -50 105 16 -118 -37 68 24 30 155 164 -99
5708i9Q9O2k53K47j17J71k94K72kn5n2J26q7j17K25J7l41K05j8J22l0L9mm27M02
$$ -99 -10 52 -201 46 -71 100 -194 78 76 21 -31 95 8 -109 116 133 -208 -3 -21 101 71 110 106 -321 81
5733H1j45K5J70l36J94q9J37j59J50r4j8j6O6Q6j02J33j79K26k25J09l6J09j70
$$ 81 -64 -39 131 -205 -11 -100 37 -122 28 -66 -84 -100 -34 52 -50 83 -96 130 -95 14 -22 87 -83
5756h3J39j06N9O0O6k32J37J13j71J65k5j43o1L42n0m5j3Q5l36PJ74J11k08J51
$$ -83 56 -50 9 69 135 -97 40 153 -18 147 122 -21 -82 260 210 165 152 237 -99 -92 82 193 -15 136
5780A36L5r6J3M8p4L6j60N2K1n2K0K55j93j39K87k10Q2l76L20NJ85k23r5K33j01
$$ 136 171 75 88 136 62 98 -62 -10 11 -41 -21 234 41 -98 189 -21 61 -315 5 10 195 -28 -123 110 9
5805Im6L6N7k60Q7P0N5J35p8j43j7LmJ10j9J60l19L58Mj5n5r3N4j81J6J63j70
$$ 9 -37 -1 56 -204 -117 -47 8 143 65 -78 -95 -92 -96 14 -5 155 -164 194 198 183 128 35 89 -92 -76 87 -83
5832h3O1K0L7k19K65j87J61J2n8R3p3P7j94J92j62N4J48j93j4rJ56o4j8K2k29
$$ -83 -22 -2 35 -184 81 -106 55 67 9 102 29 106 -88 104 -58 -4 144 -49 -63 -72 84 20 2 24 -205
5857b05J28L5q0K17j62lO9o3j9J70j26l7N3j9J41j87J66mr9j8J45m29K7M98k18
$$ -205 -77 -42 -122 95 -67 -70 -1 -64 -83 87 -39 -76 -23 -42 99 -88 78 74 -25 -43 102 -327 -300 198 -20
5882b0J36r2J6j03J09j93k3J93J2j4l3q7n2K82q7O0p1n6J37j25P1rJ2L5j13j95
$$ -20 116 24 40 -63 46 -147 -170 23 35 21 -12 -99 -151 131 44 104 33 -23 114 -11 60 51 63 98 -15 -210
5908b10L07mj87J35k10J33l6L9J17M7j50%L19k67o0n3om5l5P3P5j25K14j59J47
$$ -210 97 93 -94 41 -169 -36 -72 -33 84 131 -19 -19 300 33 -27 -80 -86 -131 -166 -93 -18 -143 71 -88 59
5933E9k13J54L4j46L8J67M3o7j16j67J55J4kK5N1J12R3k12m1Ll1M9Om4k4j67K56
$$ 59 -154 0 34 -112 -74 93 136 69 -47 -214 -59 -45 -47 -22 29 141 234 22 -19 -16 -47 2 8 -36 -60 -227 29
5960B9Qn6Om2N8q1J17R9Pk15j18P1J34lj91J71J6Q6k5o0K7l2P6j01j21J43q4Q9
$$ 29 37 -19 -13 -55 3 -78 39 138 145 -70 -188 -117 17 14 -177 -6 10 96 71 11 38 6 82 -19 -140 3 -81 8
5988Hj75O6J41k3k8j05P0R3J9j38n2K44j22j1J71r3j13J15j3r3n1R9j27J08Q4
$$ 8 -167 -101 40 17 -11 -116 -46 47 66 -72 -124 120 -2 -13 158 65 -48 67 54 -39 -90 9 -118 -10 74
6013G4j76j5k8J31Qk08L14l34J39J61O8j30O9j52R3j3n8OO7j15O8r8J06R3j31
$$ 74 -102 -117 -145 -14 -6 -214 100 -234 -95 66 134 4 73 -79 14 1 -57 -51 16 -99 -31 -129 -23 70 -61
6038f1J3J26k31J94J06n9R0l59J38qq6Q0Q2m7j04lJ99o8K02j91p6J01k01J84o1
$$ -61 -48 78 -153 41 147 88 178 -181 -43 -51 -137 -57 25 -22 -126 -129 70 2 204 13 -63 38 -163 21 -40
6063d0P2Oj39j0K33o5K5J7j97j9O9J08k88J94L6k05J69r6J33q2J64j43Jk5q0P8
$$ -40 32 38 -101 -111 122 57 82 99 -98 -117 -48 60 -228 -34 2 -203 -34 -130 3 -79 85 -58 -57 -82 -162 -84
6089h4L5Ml0J95j21K09l38L15l70L14q8Pq3k2O5J25l8k41K22k38R5J75k49K66
$$ -84 -49 -45 -75 120 -1 208 -130 185 -185 129 41 48 -35 -57 8 133 95 -146 76 -162 -67 108 -141 125
6113A25k72J77J43k6l70L48M8k91P7K16j59k1L12k92J54q2r5n8n9J6N5J04j66
$$ 125 -147 30 173 147 -223 125 173 -118 -41 175 16 -5 307 15 169 87 -8 -66 -125 -109 -54 50 -116
6136a16J82r8pl8j58K02J56m42L19J21j78O9j67OJ99o9j39r3J47J81j70R4k3j14
$$ -116 66 -32 -39 -77 -235 -33 123 -319 0 121 -57 12 -155 -149 50 -19 -158 -251 -104 77 -93 1 -22 -136
6160a36K61j39L7k39J75o5P2R9p9Q7M3l32K98n7p3j13J67j46J78M8o3J87j43P2
$$ -136 125 -14 23 -216 -41 -106 -34 65 -14 73 116 -216 82 25 -48 -161 6 -140 38 86 23 210 67 139
6184A39j07n9n1N6n9r9J85j89P4L45k55j18L8M9o0J54P5k03P5L7j58Q6K53l12
$$ 139 32 -27 -78 -22 -81 -180 5 -184 -110 235 -20 -138 -100 -51 -111 43 118 -85 -10 27 -131 -45 208 -104
6208a04L8J51j00Kn9J29l21K61k5PkJ04o2j77P5R5k55L17j46J03J53k84J42O8
$$ -104 -66 85 -15 -13 -72 57 -264 -3 -28 -21 -23 81 19 -158 -83 12 -243 74 -72 31 184 -100 42 110
6232A10j50Q5j14J76j27n1P4Qr8J37k6j49O9q5L86l71L3L06l35j0J64m0l2p3J31
$$ 110 -40 45 -69 107 -20 -71 3 11 -87 50 24 -125 -56 -141 245 -126 -93 213 -122 -132 32 -8 -40 -113 18
6257A8r5RN2J44j33o7P5kR5j76L1J25pk04K16q4L1q4N4j86J31M0q3K22j76K0j68
$$ 18 -77 -68 -16 128 -5 -72 3 1 96 -80 -49 76 69 -135 81 -3 28 -56 -2 -188 -57 -17 -100 122 -54 -34 -202
6284b02K69J28k57P6l7J04l0o3j89K14m4l0j25J36N7O7j7q4n8O1L5k21K49j00
$$ -202 67 195 -62 14 -23 81 51 -12 -201 13 -31 -61 -186 -50 7 74 57 -27 -85 -24 11 -210 39 -61
6308f1K35j55K78l10R9j89J31k23R5J51j18J05k56K13J96j43k95K32j03J60j01
$$ -61 174 19 297 -13 86 -103 28 -195 -100 51 -67 38 -218 -5 191 48 -247 -15 -118 42 -59
6329e9L4O3m4J92n7p7j00J96k34J36j66R7L0q2n8O9JO3J46k21N7J03k04Kk7K42
$$ -59 -25 38 -6 186 129 52 -48 148 -86 50 -116 -19 11 -71 -129 -60 -59 4 150 -71 -14 89 -115 -113 -140 102
6355A02Np3K4k8j5r5P9L9j69J92lj46P8J37Q4k73j6K72q6n6j55K14k53J58Rr1
$$ 102 107 34 58 30 15 -80 -1 38 -131 61 58 -88 -10 127 211 -62 -78 194 108 52 -103 111 -142 16 25 -66
$$ [...]
8191A93
##END NTUPLES=NMR FID
##END=
