##TITLE=1H_LR-681-K2FC
 CDCl3, 8 sc, 
 23.7.2019
##JCAMPDX= 6.0         $$ Bruker NMR JCAMP-DX V2.0
##DATA TYPE= NMR FID
##DATA CLASS= NTUPLES
##ORIGIN= UXNMR, Bruker Analytische Messtechnik GmbH
##OWNER= root
$$ XWIN-NMR		Version 3.5
$$ Tue Jul 23 15:49:53 2019 Russian Standard Time (UT+4h)  she@DPX200
##.OBSERVE FREQUENCY= 200.13155
##.OBSERVE NUCLEUS= ^1H
##.DELAY= (6, 6)
##.ACQUISITION MODE= SIMULTANEOUS
##.ACQUISITION SCHEME= undefined
##.AVERAGES= 8
##.DIGITISER RES= 18
##SPECTROMETER/DATA SYSTEM= spect
##.PULSE SEQUENCE= zg30
##.SOLVENT NAME= CDCl3
##.SHIFT REFERENCE= (INTERNAL, CDCl3, 0, 15.7039)
##AUDIT TRAIL= $$ (NUMBER, WHEN, WHO, WHERE, WHAT)
$$ ##TITLE= Audit trail, XWIN-NMR		Version 3.5
$$ ##JCAMPDX= 5.01
$$ ##ORIGIN= Bruker BioSpin GmbH
$$ ##OWNER= she
$$ F:/spectra/data/she/nmr/H-F/1/audita.txt
$$ ##AUDIT TRAIL=  $$ (NUMBER, WHEN, WHO, WHERE, WHAT)
(   1,<2019-07-23 15:48:49.06 +0400>,<she>,<DPX200>,
      <created by zg, POWCHK disabled, PULCHK disabled
       configuration hash MD5:
       00 E9 B6 7A A2 85 ED C7 34 08 36 98 17 FE 4E 26
       data hash MD5: 16K
       32 94 91 E4 B9 BE 86 41 65 9D A5 83 8E E7 15 F1>)
$$ ##END=
$$ 
$$ hash MD5
$$ 91 7F CF 32 8C F9 A0 96 44 D4 EA 39 B5 52 78 B4
##$RELAX= 
##$RELAX= 
##$RELAX= 
##$RELAX= 
##$RELAX= 
##$RELAX= 
$$ Bruker specific parameters
$$ --------------------------
##$DU= <F:/spectra>
##$EXPNO= 1
##$NAME= <H-F>
##$PROCNO= 1
##$TYPE= <nmr>
##$USER= <she>
##$AMP= (0..31)
100 100 100 100 100 100 100 100 100 100 100 100 100 100 100 100 100 100 
100 100 100 100 100 100 100 100 100 100 100 100 100 100 
##$AQSEQ= 0
##$AQ_mod= 1
##$AUNM= <au_zg>
##$AUTOPOS= <>
##$BF1= 200.13
##$BF2= 200.13
##$BF3= 200.13
##$BF4= 200.13
##$BF5= 200.13
##$BF6= 200.13
##$BF7= 200.13
##$BF8= 200.13
##$BYTORDA= 1
##$CFDGTYP= 0
##$CFRGTYP= 5
##$CHEMSTR= <none>
##$CNST= (0..31)
1 1 145 1 1 1 1 1 1 1 1 1 1 1 1 1 1 1 1 1 1 1 1 1 1 1 1 1 1 1 1 1 
##$CPDPRG= <>
##$CPDPRG1= <>
##$CPDPRG2= <>
##$CPDPRG3= <>
##$CPDPRG4= <mlev>
##$CPDPRG5= <mlev>
##$CPDPRG6= <mlev>
##$CPDPRG7= <mlev>
##$CPDPRG8= <mlev>
##$CPDPRGB= <>
##$CPDPRGT= <>
##$D= (0..31)
0 1.2 0 0 0 0 0 0 0 0 0 0.03 0 0 0 0 0 0 0 0 0 0 0 0 0 0 0 0 0 0 0 0 
##$DATE= 1563882528
##$DBL= (0..7)
120 120 120 120 120 120 120 120 
##$DBP= (0..7)
150 150 150 150 150 150 150 150 
##$DBP07= 0
##$DBPNAM0= <>
##$DBPNAM1= <>
##$DBPNAM2= <>
##$DBPNAM3= <>
##$DBPNAM4= <>
##$DBPNAM5= <>
##$DBPNAM6= <>
##$DBPNAM7= <>
##$DBPOAL= (0..7)
0.5 0.5 0.5 0.5 0.5 0.5 0.5 0.5 
##$DBPOFFS= (0..7)
0 0 0 0 0 0 0 0 
##$DE= 6
##$DECBNUC= <off>
##$DECIM= 24
##$DECNUC= <off>
##$DECSTAT= 4
##$DIGMOD= 1
##$DIGTYP= 9
##$DL= (0..7)
0 120 120 120 120 120 120 120 
##$DP= (0..7)
150 150 150 150 150 150 150 150 
##$DP07= 0
##$DPNAME0= <>
##$DPNAME1= <>
##$DPNAME2= <>
##$DPNAME3= <>
##$DPNAME4= <>
##$DPNAME5= <>
##$DPNAME6= <>
##$DPNAME7= <>
##$DPOAL= (0..7)
0.5 0.5 0.5 0.5 0.5 0.5 0.5 0.5 
##$DPOFFS= (0..7)
0 0 0 0 0 0 0 0 
##$DQDMODE= 0
##$DR= 18
##$DS= 0
##$DSLIST= <SSSSSSSSSSSSSSS>
##$DSPFIRM= 0
$$ [...]
##$SUBNAM2= <"">
##$SUBNAM3= <"">
##$SUBNAM4= <"">
##$SUBNAM5= <"">
##$SUBNAM6= <"">
##$SUBNAM7= <"">
##$SUBNAM8= <"">
##$SUBNAM9= <"">
##$SW= 24.9336996594482
##$SWIBOX= (0..15)
0 0 2 0 0 0 0 0 0 0 0 0 0 0 0 0 
##$SW_h= 4990.01996007984
##$TD= 16384
##$TD0= 1
##$TE= 0
##$TE2= 300
##$TE3= 300
##$TEG= 300
##$TL= (0..7)
0 120 120 120 120 120 120 120 
##$TP= (0..7)
150 150 150 150 150 150 150 150 
##$TP07= 0
##$TPNAME0= <>
##$TPNAME1= <>
##$TPNAME2= <>
##$TPNAME3= <>
##$TPNAME4= <>
##$TPNAME5= <>
##$TPNAME6= <>
##$TPNAME7= <>
##$TPOAL= (0..7)
0.5 0.5 0.5 0.5 0.5 0.5 0.5 0.5 
##$TPOFFS= (0..7)
0 0 0 0 0 0 0 0 
##$TUNHIN= 0
##$TUNHOUT= 0
##$TUNXOUT= 0
##$USERA1= <user>
##$USERA2= <user>
##$USERA3= <user>
##$USERA4= <user>
##$USERA5= <user>
##$V9= 5
##$VALIST= <valist>
##$VCLIST= <CCCCCCCCCCCCCCC>
##$VD= 0
##$VDLIST= <DDDDDDDDDDDDDDD>
##$VPLIST= <PPPPPPPPPPPPPPP>
##$VTLIST= <TTTTTTTTTTTTTTT>
##$WBST= 1024
##$WBSW= 4
##$XGAIN= (0..3)
0 0 0 0 
##$XL= 0
##$YL= 0
##$YMAX_a= 142726
##$YMIN_a= -177214
##$ZGOPTNS= <>
##$ZL1= 120
##$ZL2= 120
##$ZL3= 120
##$ZL4= 120
##$ABSF1= 10
##$ABSF2= 0
##$ABSG= 5
##$ABSL= 3
##$ALPHA= 0
##$AQORDER= 0
##$ASSFAC= 0
##$ASSFACI= 0
##$ASSFACX= 0
##$ASSWID= 0
##$AUNMP= <proc_1d>
##$AZFE= 0.1
##$AZFW= 0.1
##$BCFW= 1
##$BC_mod= 2
##$BYTORDP= 1
##$COROFFS= 0
##$CY= 11.3945322036743
##$DATMOD= 1
##$DC= 2
##$DFILT= <>
##$DTYPP= 0
##$F1P= 18.9103706918063
##$F2P= -1.10871071338519
##$FCOR= 0.5
##$FTSIZE= 0
##$FT_mod= 4
##$GAMMA= 1
##$GB= 0.15
##$INTBC= 1
##$INTSCL= 1
##$ISEN= 128
##$LB= 0.24
##$LEV0= 0
##$LPBIN= 0
##$MAXI= 10000
##$MC2= 0
##$MEAN= 0
##$ME_mod= 0
##$MI= 1.114404
##$NCOEF= 0
##$NC_proc= 0
##$NLEV= 6
##$NOISF1= 3.799351
##$NOISF2= 2.8
##$NSP= 1
##$NTH_PI= 0
##$NZP= 0
##$OFFSET= 15.70392
##$PC= 1
##$PHC0= -8861.642
##$PHC1= 14.00096
##$PH_mod= 1
##$PKNL= yes
##$PPARMOD= 0
##$PSCAL= 0
##$PSIGN= 0
##$REVERSE= no
##$SF= 200.130013532006
##$SI= 16384
##$SIGF1= 3
##$SIGF2= 2
##$SINO= 400
##$SIOLD= 16384
##$SREGLST= <1H.CDCl3>
##$SSB= 0
##$STSI= 0
##$STSR= 0
##$SW_p= 3612.71676300578
##$SYMM= 0
##$S_DEV= 0
##$TDeff= 0
##$TDoff= 0
##$TI= <>
##$TILT= no
##$TM1= 0
##$TM2= 0
##$TOPLEV= 0
##$USERP1= <user>
##$USERP2= <user>
##$USERP3= <user>
##$USERP4= <user>
##$USERP5= <user>
##$WDW= 1
##$XDIM= 8192
##$YMAX_p= 0
##$YMIN_p= 0
$$ End of Bruker specific parameters
$$ ---------------------------------
##NTUPLES= NMR FID
##VAR_NAME=  TIME,          FID/REAL,        FID/IMAG
##SYMBOL=    X,             R,               I
##VAR_TYPE=  INDEPENDENT,   DEPENDENT,       DEPENDENT
##VAR_FORM=  AFFN,          ASDF,            ASDF
##VAR_DIM=   8192,          8192,            8192
##UNITS=     SECONDS,       ARBITRARY UNITS, ARBITRARY UNITS
##FACTOR=    0.0002004,     1,               1
##FIRST=     0,             0,               0
##LAST=      1.6414764,     0,               0
##MIN=       0,             -177214,         0
##MAX=       1.6414764,     142726,          0
$$ Real data points
##PAGE= N=1
##DATA TABLE= (X++(R..R)), XYDATA
0@%%%%%%%jRj6J6j6K4l2M0m8N6p0P9r0J06j27J51j73J97k27K61k99L40l84M33
31B29m86N46o13O83p63Q51r43J046j161J287j425J578j748J935k145K382k649
48a396K954l308L723m214M811n552O504p778R582j2359J7242k8408J04003K2449
62A08253j05326L5783k0715l6594J9774R3999J3332m3368k9846j0797n5033m2245
74g2783M214K7108J6284K5140N06l4861l0184k992l1648l6187K8655N9234j0277
87e7791l3351K6861K5110n9073n1627L9788M1059k8654m635O3252K8216m2259
99e3104j7758K6955l660k9642J2755L8969J8265J4104K6325L698j5124J80k160
112A9803k6005L747N2026K7065j2831J9711M0859k5926o3346J470L7222j3854
$$ y = [0, 0, 0, 0, 0, 0, 0, 0, -1, 8, -8, 8, -8, 16, -16, 24, -24, 32, -38, 41, -49, 57, -70, 81, -92, 105, -122, 139, -160, 180, -204, 229, -257, 289, -324, 359, -404, 447, -496, 550, -611, 676, -749, 829, -919, 1016, -1129, 1253, -1396, 1558, -1750, 1973, -2241, 2570, -2982, 3522, -4256, 5326, -7033, 10209, -18199, 85804, 108253, 2927, 38710, 17995, -18599, 1175, 95174, 108506, 65138, 35292, 24495, -30538, -72783, -68569, -41461, -25177, -37, 469, -34392, -64576, -67568, -99216, -135403, -106748, -47514, -57791, -91142, -64281, -39171, -98244, -149871, -110083, -69024, -97678, -102313, -39061, -10845, -53104, -70862, -43907, -47567, -77209, -64454, -25485, -7220, 6884, 33209, 36907, 21783, 21963, 19803, -6202, -2455, 49571, 76636, 63805, 83516, 124375, 98449, 35103, 36573, 73795, 59941]
124E9941j7722N1631M8876l0127m2120M656p569m5559j0509L9586K1268m495O515
137G4372l704l9636l5340q301j3278q366L2324L4371j6591k4954N026j9188o0771
150h4036j9291M1298J7596j7818J9268L8136k3061n6097q544J3645j7886q055
162a04845M0291L4429o257n921O699j8223k6101O287J7341L224K0191L8524N636
175A1275k1945K356J1702k4067j8668L4999L8614n883J150L5066N146m0900j6125
188A2720K2923J748j2848K4143L7935m17j6017J370q800k9413r509J6010N632
201D5477L509K4262J1119k6587k3275J09j6957l1596R101L6613K828j7583J0018
214B7038O813l9697l8867P364J0918j2617N188L1096N517k6111j4544n047k1759
$$ y = [59941, 42219, 93850, 142726, 112599, 70479, 75135, 67566, 22007, 11498, 51084, 72352, 67857, 74372, 70668, 31032, -4308, -12609, -25887, -34253, -1929, 32442, 15851, -9103, -4077, -23265, -84036, -103327, -62029, -44433, -62251, -42983, -4847, -27908, -84005, -92549, -78904, -96790, -104845, -64554, -30125, -36382, -42303, -35604, -53827, -79928, -73641, -56300, -53076, -32885, 5639, 11275, -10670, -8314, 3388, -20679, -39347, -4348, 34266, 28383, 29533, 64599, 69745, 28845, 12720, 35643, 37391, 24543, 48686, 86621, 86204, 70187, 71557, 62757, 33344, 23835, 39845, 45477, 48986, 73248, 84367, 57780, 34505, 34614, 17657, -13939, -4838, 31775, 34603, 17020, 27038, 33851, -5846, -44713, -37349, -26431, -39048, -33860, -2764, 2753, -23358, -37902, -42949, -64708]
227f4708j5305J6529J8304L243J1267J3876j6206k7939j751M485j3207N455L8452
240b7505K1334j2874j950J3871j5528l0111O813K9582P757K841K6998J8210j7280
253B2158j7416K640k358q584J4240K7139R503L034J0645n550k4666r897Q940j828
267B8000k763K4264K3803j0730j7106K656p130k9651r397K2478J1627p154O733
280C5630J2948j6051l0060q813j253j0724N55J9109R671p443l472o033k3739j9270
294d8945L993O171k921J1533K2001l257k2147o788L48j6941j1189K0191K3440
307b4511Q05L21J2255l626k3004r779R390N114M634K0097J8597k73n512r64r608
322f064j2760O214J7209Q097Q366J8294N957j7570j2065L251l382q725J2702K5049
$$ y = [-64708, -80013, -63484, -45180, -41937, -30670, -16794, -33000, -60939, -62690, -58205, -71412, -65957, -27505, -6171, -19045, -20995, -7124, -22652, -52763, -45950, -16368, -8611, -5770, 21228, 39438, 22158, 4742, 7382, 5024, -3560, 10680, 37819, 47322, 50356, 61001, 55451, 30785, 20888, 29828, 28000, 25237, 49501, 73304, 62574, 45468, 48124, 40994, 11343, 1946, 24424, 36051, 28897, 35630, 48578, 32527, 2467, -6346, -7599, -18323, -17768, 1341, 11012, 3569, 97, -5936, -29675, -48945, -44952, -38781, -41702, -30169, -8168, -11425, -33572, -40360, -40012, -56953, -68142, -47951, -24511, -23706, -23385, -11130, -14756, -37760, -47539, -38149, -33035, -28401, -8304, 10293, 10020, 4508, 3544, -6064, -18824, -12610, 4599, 12696, 21062, 39356, 45313, 27743, 15678, 18929, 15547, 6822, 19524, 44573]
336D4573N909p200J941r45j9422j6217M503Q636J297Q027J2357k415j4352r831
350A6861r226j3544l148J1325P686k05N046K413j6614j9861m381O33p280L165
364b7130J8463Q918r567p293j092j2293j5759J376J3144O873M951R915K948j1190
378a7736j0110l958m209O16J3014J4690N250L822M111p894j5024l046P529M005
392h940M353J7166J3951m287r173j967m013j0146O7J4807J1840L776M592J836
406C3862q650j2724n591j127J454Q009J1631M165k004l103p721j4855p700M009
420c45N019J861P344R193m545j3974q221l567p724l325R157J1484K361j414j813
435A491p194j1803p639N62L712O420R678M719k110m827o459r596n628M979Q412
$$ y = [44573, 50482, 43282, 45223, 44278, 24856, 8639, 13142, 21778, 23075, 31102, 43459, 41044, 26692, 16861, 7635, -5909, -9057, 2268, 9954, 9749, 14795, 17208, 594, -19267, -23648, -23015, -30295, -27130, -8667, 251, -9316, -16609, -17701, -29994, -45753, -44377, -31233, -24360, -19409, -9494, -6546, -17736, -27846, -31804, -36013, -35397, -22383, -7693, -2443, 1379, 5490, -2404, -17428, -20474, -12945, -8940, -4587, 12579, 26530, 22243, 13070, 11103, 7090, -3056, -2989, 11818, 23658, 27434, 32026, 33862, 25212, 12488, 6897, 5770, 7224, 15233, 26864, 31029, 29025, 25922, 18201, 3346, -4354, -345, 4674, 6535, 13879, 23072, 18527, 4553, -3668, -7235, -14959, -18284, -9127, 2357, 4718, 3304, 1491, -5703, -17506, -25145, -24583, -20871, -14451, -4773, -54, -2164, -6991, -13450, -23046, -28674, -23695, -15283]
450a5283N407O394P311l45j0582q284j598m48N40Q407J3062O031j360l120m394
465A738p288n635J644P333Q206Q273L904j304m468p214p003l498M488Q145O306
480A3627M522L674j996q985r140l030O14J893N543Q915N149l053o725o164n936
495a092n155k57N631P990M971O48l206n597p455p513k727L940O498N541K940J341
511F498l477q296q210l460J215L718N374O435M260j676o531p100m426j408O67
526a6417M969Q771O526l0l676l962m892o214o51N988P498N393L586K036l480p357
542a912n622j161J778N096O924N888K902j035m989o826m428J97K649L959O950
557A0370O666l46n583m930l134n181k445N593P820L227M93J166l561q799n801
$$ y = [-15283, -9876, -3482, 3829, 3484, -7098, -15382, -16980, -17428, -16888, -8481, 4581, 10612, 9252, 6132, 1738, -5550, -11185, -9541, -2208, 5998, 14271, 18175, 16871, 12403, 5189, -1814, -5312, -824, 7321, 13627, 18149, 21823, 19827, 10842, 1702, -1328, -714, 1179, 6722, 15637, 20786, 17733, 11008, 4844, -1092, -6247, -6504, -873, 7117, 12088, 12736, 9530, 3933, -3522, -11035, -13762, -9822, -3324, 2217, 5157, 6498, 3021, -5275, -13485, -16945, -15730, -12012, -6638, -203, 4057, 2381, -4150, -11250, -15676, -17084, -16417, -11448, -2677, 3849, 3819, 143, -3819, -8711, -14925, -15576, -9588, -2090, 3303, 6889, 8925, 5445, -1912, -7534, -8695, -6917, -1821, 5103, 10991, 13893, 12858, 7869, 1043, -3385, -3188, -539, 3420, 10370, 17036, 16690, 11107, 6177, 3043, -2138, -4583, 1010, 8830, 12057, 12550, 13716, 10155, 1356, -4445]
572d445j048J708K804O188M344R9k939m735p009n386K61L620L055M260N248O14
588F639p148o402k532k429k776M741Q814L605j182Qj979p588o032R98L801L110
604f352N303N822M24m208l701l726m580k84O224N272K506M523J935n208p445j755
620e250O11j620K677R187N778k684k371j81n621o980M35O223K662K767N240J669
636A2542n687n323j938l234j477N355O307J811J007J715m100q535l391K809m67
651b606O58P487O293l124m868j121l280o856j350O712M375L95L383K138n314p286
667d364j905q15j829L079P699K210j656K46k121p680n176K887L070l82M165P447
683D875j332p201j992l46n489k449O974O348J85P26L331l114q115k037K712j05
$$ y = [-4445, -5493, -3785, -981, 5207, 9551, 9650, 6711, 1976, -5033, -10419, -10158, -6538, -3483, 777, 6025, 6639, -509, -6911, -9443, -11872, -14648, -9907, -1093, 2512, 1330, 1338, -641, -8229, -14261, -13263, -9462, -6352, -1049, 4773, 5197, 989, -2712, -6438, -11018, -11302, -5078, 194, 2700, 7223, 9158, 3950, -3495, -5250, -4639, -6259, -3582, 5605, 11383, 8699, 6328, 6147, 526, -6454, -6019, 204, 2866, 5633, 10873, 12542, 6855, 1532, -406, -3640, -5117, 238, 6545, 8356, 9363, 11078, 6978, -1557, -4948, -2139, -2606, -1948, 5539, 11832, 8708, 3840, 2719, -561, -7417, -8767, -2055, 2320, 2715, 6098, 8236, 2922, -4364, -6269, -7084, -8913, -5834, 1865, 4075, 2419, 2665, 544, -7136, -12312, -9425, -6355, -6737, -2572, 4875, 3543, -3658, -5650, -5996, -11485, -13934, -6960, -612, -427, 299, 3630, 516, -7599, -9636, -6924, -7029]
699g029J102P828N242k144k200M62m521n542K201O241J260K074O339K140o524
714F929m792J449j875l426M877Q749Q15j900J929j102p932m449K956J728l40M898
730H514N383k573n746j262k259o913j170N815L170j244K384K111n925p781j440
745h936Q19l089P77P419K976l545j491j28o227n968K306M370J0K151O671J26o213
762g972k135R85l528k858P315O885j99R20M182j727p642j230M400P12M20O937
778E465O446j587l346J055j772n661R82O350K689O20M924K007n806n052R36j739
794F511l223L620P074L77l002J299q86q508n717L394K134k360K532N768j345p601
810F7k776p76n621k798M730L861j080N57J912m191p243p99J005k486J411O926
$$ y = [-7029, -5927, 1901, 7143, 4999, 2799, 3261, -1260, -6802, -4601, 1640, 2900, 4974, 11313, 13453, 6929, 2137, 3586, 1711, -1715, 3162, 11911, 12726, 10826, 12755, 11653, 3721, -728, 2228, 3956, 3616, 8514, 13897, 11324, 5578, 4316, 2057, -4856, -6026, -211, 2959, 1715, 4099, 6210, 285, -7496, -8936, -8117, -11206, -10429, -3010, -34, -3579, -5070, -5198, -11425, -17393, -15087, -10717, -10707, -8556, -1885, -1759, -7972, -10107, -9122, -12650, -15508, -8193, -1308, -1507, -587, 3595, 1868, -5774, -7004, -2604, -1892, -1472, 5465, 11911, 10324, 6978, 8033, 6261, 600, 1582, 7932, 10621, 11241, 16165, 18172, 12366, 7314, 8250, 6511, 3288, 6908, 13982, 14359, 11357, 12656, 11770, 3262, -2455, 939, 3073, 713, 3245, 9013, 7668, 67, -2709, -3485, -9106, -11904, -7174, -3313, -4393, -3836, -1924, -6115, -13358, -14157, -13152, -15638, -14227, -7301]
826g301L092l375o46J344n096n882L118N607N70J004O958K302n640l252K216j057
842f038k522M741P776J465l03K696Nn848k377L267J188P37N740N461k025l171
858A0792M81j866o451R74O171K105p29L351K682n812o949L74K64m105J298O537
874I117J964l748r61m69o185o074J246K561n33J586M174q32o159k672n11n378
890a2874j875N022M160j259N89K843l246p264j343K621j032K78O179N022k528
905d707k261Q46k158n018J173N538K632J446M750K300m203l308J312q23j257M166
921D28O969J777p94K356o49n859k777L598K107k41M296N692j143m794j005r24
937I037m669r19M755L566n66J339J370m387o301j577K53k157R65N084K154l718
$$ y = [-7301, -4209, -7584, -8230, -6886, -11982, -17864, -14746, -9139, -8569, -7565, -607, 1695, -3945, -7197, -4981, -6038, -8560, -3819, 3957, 5422, 5119, 7815, 7820, 1972, -405, 2862, 4050, 4787, 10527, 15988, 13963, 10792, 11273, 9407, 2956, 3930, 10101, 12206, 11477, 14828, 17510, 11698, 4749, 5123, 5387, 1282, 2580, 9117, 11081, 7333, 6372, 5903, -282, -6356, -5110, -2549, -3082, -1496, 2678, 1846, -4313, -6985, -7496, -12874, -14749, -9727, -5567, -6826, -6237, -3394, -6640, -13904, -15247, -12626, -13658, -13380, -7201, -2179, -4707, -6968, -6122, -8280, -13298, -12125, -6587, -3955, -2509, 2241, 4541, 338, -2970, -1658, -2481, -3738, 428, 7397, 9174, 8380, 10736, 10087, 4228, 1451, 5049, 7156, 6915, 11211, 16903, 15760, 10966, 9961, 9037, 4368, 3449, 8204, 11770, 11204, 12543, 13913, 9526, 3225, 1648, 1901, -256, 709, 5793, 7947, 4229]
953D229j725j291n668m855Q86L101o59Q89M381p37n971l601l33k955k254L862
969a2701M994M73l52J419k019n652k136K656N36J659N187M343j146k186L22j762
985f365l582J420N788L445J739L622K427l752l393O15M12k53L153O819K583j310
1001A3368K78o65m542l066J735K999P33K807M136j339m803k463j488l826j082
1016B782L787K883k46j5P6m194o312k527K06j160L53M138J744k679l018j903m154
1033a0239m593K76L247J325R95L115m31m592l217q55j289p44L855N503J686m03
1049f361R59j352m050j362K521K541K494L989M759k90k300q06q93j853J107N342
1065D445L680J860K823O33k802l746o58O35J13K575M820K621j668j542j476m155
$$ y = [4229, 2504, 1213, -4455, -9310, -8424, -5323, -5982, -5093, -712, -1449, -7420, -11021, -11354, -14309, -16563, -12701, -7707, -7234, -7586, -6167, -8186, -13838, -15974, -13318, -12782, -11123, -5936, -1593, -2739, -4925, -4603, -6365, -9947, -8527, -2739, 706, 2445, 6067, 8494, 4742, 1349, 1964, 2376, 2123, 5276, 12095, 14678, 13368, 13646, 12981, 8439, 5373, 7108, 10107, 10840, 13647, 17783, 16444, 11641, 9178, 7690, 3864, 2782, 6569, 9452, 9206, 9191, 9267, 5073, -1239, -3766, -3560, -4720, -4367, -229, 1515, -1164, -4182, -6085, -10239, -14832, -14556, -11309, -9984, -8989, -5874, -6305, -10897, -14114, -14969, -16258, -17002, -13147, -7644, -5958, -6361, -5402, -6754, -10804, -12166, -9645, -7104, -4610, -621, 4138, 3848, 1548, 742, -151, -2004, -897, 4445, 8125, 9985, 12808, 13441, 10639, 6893, 6235, 6870, 6983, 9558, 14378, 16999, 15331, 13789, 12313, 8158]
1081H158l596R18K123J448J654J934j346m740l614k347k408j075K363K847J28
1096B447m53j298l626n244k310J23L31J202L205K286j949l041k138k655k920R91
1112a5049L718K687J662J957L13l172l243m34j28J357L695M468K334P53l79j744
1128a205k948j097J730L294L080L543L546p26k468j819j212j501J085M215L633
1143A1150J868M11l84l182l470k020L19J012K148L516J378j155k893k754l529
1158B415k506N75J598K399J341Q60j780m037l394k817j287j63K593K698J209q96
1174a192j804l124l667k489O25K046J993L158J146p24k521k840k304o72Q92L135
1190h342L280K681J293r33k403k650j402P60K397L397M015K373K52j688k499j678
$$ y = [8158, 4562, 5480, 7603, 9051, 10705, 12639, 11293, 6553, 2939, 592, -1816, -2891, -528, 2319, 2447, 1994, 696, -2930, -8174, -10484, -10361, -10030, -8828, -5623, -3337, -5286, -8327, -10465, -13120, -16040, -15049, -11331, -8644, -6982, -5025, -4712, -7884, -11127, -11561, -11689, -10332, -6637, -2169, 165, 918, 539, -1205, -4153, -5250, -3520, -226, 2854, 6397, 9943, 9217, 6749, 4930, 3718, 2217, 3302, 7517, 11150, 13018, 13429, 13045, 9863, 6393, 4373, 4692, 5704, 7852, 11368, 12746, 11591, 8698, 5944, 2415, -91, 484, 2082, 4481, 5822, 6682, 4902, 865, -2529, -5346, -6633, -6796, -4203, -1505, -296, -1192, -2996, -6120, -9787, -12276, -11651, -9605, -7612, -4454, -3308, -4032, -6553, -9393, -11697, -12369, -11477, -8342, -5062, -2381, -1088, -2021, -4424, -7074, -8476, -7716, -5319, -1922, 2093, 4466, 4718, 3030, 531, -1147]
1206a147r36J214L160L691K860J475j14k761k474j944o30J917K892K935K080J11
1222A2329j727l231l145k040J06J859K678K130P83j436k543l956k487j695J79
1237b196K033K540R92K99k316l249l818k525n78J470K195K001J377o32k381l645
1253h433k456j481O34K393K833K621P10n49k293l123j365r3J891L324L307K689
1269F09N91j513j909j816j176Q22L224L687L035J135Q99k010k759j262k83J426
1285B700K818L725K452J06j103k339k950k497N38K213J769K522J502o63k984l453
1301D356k325j890q2K168K400J250j12j390l179m305k368m72J85J619K873J415
1317A43j050k622k615l225k141L81K535K393J669J727m37k992k953j552j10Q69
$$ y = [-1147, -2083, -869, 2291, 5982, 8842, 10317, 10203, 7442, 4968, 3024, 2394, 4311, 7203, 10138, 12218, 12329, 10602, 7371, 4226, 2186, 2292, 4151, 6829, 8959, 9742, 8306, 5763, 1807, -680, -2375, -2196, -163, 2377, 3369, 3668, 1352, -1897, -5715, -8240, -8818, -7348, -5153, -3152, -1775, -2407, -4788, -8433, -10889, -12370, -11736, -9343, -6510, -3889, -3179, -3728, -6021, -9144, -10509, -10602, -8711, -5387, -2080, 609, 1200, -313, -2222, -4038, -5214, -4392, -1168, 2519, 5554, 6689, 7588, 5578, 2819, 1557, 1274, 2700, 5518, 9243, 11695, 11801, 10698, 8359, 5409, 2912, 3450, 5663, 7432, 9954, 11456, 10793, 7809, 4356, 2031, 141, 59, 2227, 4627, 5877, 5765, 4375, 1196, -3109, -5477, -5949, -5764, -4145, -1272, 143, -907, -3529, -6144, -9369, -11510, -11129, -8594, -6201, -4532, -2805, -3242, -6234, -9187, -10739, -10849, -9980]
1333i980L011M109K196J8n75j847k645j349J530K622K592L075K939k35k208j852
1349A401j202j029Q78L719L797J481R69o63k453l272j348M72J240K238L152J805
1365A1185j298k287k136k765k756N34K415J935J022J133j168l559l417j913j205
1380d280oK407L030P53j031j402k301m225k040R77J560J383L289J502j522k766
1396d672k005j319k098O84L659L180J188J174l17l166k660p76P79J143L083L898
1412A775J840p46j276j076l124j483K018L029K175K184J990k57l418k149n66j146
1428b30R90L238L349N42p7p19k626l487j581J797J118J331L184J205j698k766
1444C570k149k222k202J051L100J763Q59P05j171l614l302o58m87L24K931L182
$$ y = [-9980, -6969, -2860, -664, -646, -1221, -3068, -5713, -7062, -5532, -2910, -318, 2757, 5696, 5461, 3253, 1401, 199, -830, 48, 3767, 7564, 9045, 10014, 9351, 6898, 3626, 2278, 2750, 3990, 6228, 9380, 11185, 9887, 7600, 5464, 2699, -57, 477, 2892, 4827, 5849, 6982, 5814, 2255, -1162, -3075, -4280, -4286, -1879, 1151, 1904, 873, -529, -2830, -7055, -9095, -8118, -6558, -5175, -1886, -384, -1906, -4672, -6677, -7996, -10094, -9410, -5751, -2571, -1383, -209, -526, -3692, -6352, -7128, -6349, -5206, -2123, 1775, 3615, 2869, 1593, 517, -2607, -4090, -2072, 957, 3132, 5316, 7306, 7049, 3631, 1482, 916, -230, 760, 3998, 7347, 7889, 7812, 7093, 4467, 980, -601, 1196, 2314, 3645, 6829, 8034, 6336, 3570, 1421, -801, -3003, -1952, 1148, 2911, 3770, 4475, 3304, -310, -3612, -4270, -4757, -4433, -1502, 1680]
1460A680K75j327j657k078l224j927J766K290J457K273J791j660l354j838p53
1475f286j397R95L949K903J94M09p40k612l110l70J639J196K061L921J481j732
1491B501j481j331k415j187K186L678J574J237J805q39l542k261K33r5P93L021
1507C877L174P30j482o66k437l240r04J703J634J263K699J272k287l291j409j727
1523a091j483O36L432J693k89M75j107l444l598m77J041K91K006L340J83k192
1539e84j805j731k638j361J621L096J151J344J290j345l729j487m21k05J146L558
1555b100K947K07m14n20k356k784N3K356J495K133K923J284k090j882j102r22
1571g72j494K453L554J541Q31R72j257l211k362J5P31Q07K694K474p1j852r45
$$ y = [1680, 1955, 628, -1029, -3107, -6331, -8258, -6492, -4202, -2745, -472, 1319, -341, -3695, -5533, -6286, -7683, -6688, -2739, 164, 358, 767, 27, -2585, -5695, -6065, -4426, -3230, -1169, 2752, 4233, 2501, 1020, -311, -2726, -3913, -1727, 1951, 3525, 4762, 6567, 5728, 2186, -75, 158, 63, 856, 3877, 7051, 7781, 6299, 5633, 3196, -44, -948, 755, 2389, 3652, 6351, 7623, 5336, 2045, 636, -1091, -2574, -1938, 1494, 3187, 2898, 3373, 2266, -1178, -4776, -5253, -4212, -3921, -1915, 1425, 1608, -584, -2389, -4120, -6758, -8119, -6498, -3402, -2251, -907, 383, -962, -4691, -6178, -6599, -6804, -5658, -2100, 847, 1054, 640, 120, -2236, -5020, -4967, -2611, -1116, 1017, 3940, 5224, 3134, 1252, 150, -772, -2266, 187, 3741, 5282, 6113, 7085, 5828, 2617, 255, 270, 1001, 1808, 4502, 6976, 6905, 5053, 4108]
1588D108j896l217m51K057J968M93J464J002k584l278j535r34j082J071L316J506
1604B008l27o81r57l047l143K77J307J024J713L004J3k269k110j351j860m48J860
1621d987L376J108J060J033j820l084j363L11J30J228L371K742l37j411m85j838
1637i66k534K59K331J779J579J977Q19k042k382j128p60p94J860L429J409R8K89
1654E223j448k787k676Q23P14R77K148K487M7k230j831j870j776p16K699K003
1670A787P15J037N58k081l255j511K42l60R98K877J925n12r58j405k322k003q3
1687d351J988J200J344K082r4k127k530j202r00m50K052K932P18L94k86j176k716
1704c122j995P56O58J242K270K315j59j654j053j422j846J81K151K042J363J390
$$ y = [4108, 2212, -1005, -1456, 601, 2569, 3062, 4526, 5528, 2944, -334, -1869, -2803, -3885, -2814, 502, 2008, 1681, 1000, 43, -3004, -6147, -5870, -4563, -3539, -1826, 1178, 1191, -1078, -3188, -4539, -6399, -6847, -4987, -1611, -503, 557, 1590, -230, -3314, -4677, -4366, -4236, -3008, 363, 3105, 2768, 1357, 872, -966, -3500, -3241, -910, 869, 2448, 4425, 5244, 3202, 820, -308, -1068, -1862, -2, 3427, 4836, 4934, 5223, 3775, 988, -1688, -865, -151, 826, 2974, 5461, 5508, 3278, 1447, -423, -2199, -2915, -216, 1787, 2502, 3539, 4097, 2016, -1239, -2750, -2508, -2868, -1870, 1007, 2932, 2420, 1462, 57, -2265, -4268, -4351, -2363, -1163, 181, 2263, 2169, 42, -2488, -3690, -4590, -5040, -2988, -56, 662, 1056, 770, -406, -3122, -5117, -4361, -3703, -2461, -191, 2124, 1965, 311, -742, -2164, -4010, -3829, -1678, 364, 1727, 3117]
1720C117M33j942k535q05k72J81J903K881J277k36n1j122k001j955J35J712J280
1737B000J563K260k40j846j850j373j420k02K303J995Q80P31k74j988l018j281
1753a760j42L81Q44K325J483o81j298j849j846j916j82J824J356J113Q14L37k486
1770a683k012j216q95mK106K195Q99J69j10j299k488j283O47J300J328K575J144
1787A373K1j475j236q52j141M62K031K629J364P65P3j736k063p25K49M82J806
1804B027K505J633n61j084j147j934j563M49J902J291J230J156n46j961k072j379
1820e4j332N43J555K092P74n04q93j695k679j121P9N94J347J751J068j107j612
1837a194j281k033j145M48J790J411J114Q42j22k150j856r40q8O30J679K481O32
$$ y = [3117, 3550, 1608, -927, -1732, -2004, -1823, 80, 2961, 4238, 4002, 3951, 2829, 828, -1127, -992, 720, 2000, 3563, 5823, 5583, 3737, 1887, 514, -906, -1108, 1195, 3190, 4070, 4801, 4527, 2539, -479, -1760, -1902, -1521, -677, 1648, 3131, 2450, 1152, -697, -2543, -4459, -4641, -2817, -1461, -348, 466, 803, -1683, -3695, -4911, -5806, -5810, -3704, -1509, -610, -441, -551, -1850, -4338, -5621, -4974, -3674, -2346, 229, 1373, 1394, -81, -1317, -2169, -3310, -2848, -817, 1812, 3176, 3941, 4014, 2278, 215, -510, -261, 221, 2027, 4532, 6165, 5604, 4520, 3373, 1439, -124, 325, 2227, 3518, 4748, 5904, 5358, 3397, 1325, -54, -1386, -843, 712, 2804, 3578, 3074, 2181, 486, -2193, -3314, -3235, -2641, -1294, 457, 1525, 418, -1194, -2475, -4508, -5653, -5205, -3415, -2004, -890, -48, -170, -2320, -4176, -5116, -5204, -4574, -2895, -414, 218]
1854B18J89o57j196j729j068Q21J538J892J546J096l09j147j677m78q16O25K261
1871A109J782J292N9k46j539k042p25L52R91J888J776R43q01j453j320j405j157
1888d96M31J247K034P90N68j187j594k075q91k89J72J259J703R26m38j279j834
1905i53j719j023N58Q49J193J332P57j049j460j532j224l98K38J695J474J097
1921a65M1o27j314k101o25K62R20J599J679J157n29j252q90j046m91M34J794J886
1939G32J167P65p32j279j279l86k63R80J811K217P81k84q79j508j043n79K89J278
1957A788J502J176Q94n82j635j287j174o58O19J335J440O69P6r58j615k033j049
1974a492j67Q03J352J168L57m65j517j756j444r40R6J557P64J237K05r16j678
$$ y = [218, 407, -250, -1446, -3175, -4243, -3422, -1884, 8, 1554, 2650, 2341, 1194, -483, -961, -1777, -1152, 1109, 2891, 4183, 4242, 3996, 2457, 415, -310, 42, 1033, 2921, 4697, 5640, 4839, 3386, 2066, 661, -496, -65, 1182, 3216, 4006, 4574, 3387, 1793, -282, -1173, -1462, -1290, -31, 1672, 2598, 2160, 881, -953, -2672, -3695, -3137, -2288, -1095, 237, 994, -55, -1515, -3047, -4271, -4669, -4431, -2736, -1262, -165, -124, -751, -2065, -4166, -4791, -4529, -3609, -2010, -331, 826, 297, -955, -1845, -2891, -3382, -2948, -1154, 732, 1899, 2664, 1932, 653, -626, -1012, -1275, -295, 1516, 3733, 4514, 4230, 3351, 1843, 800, 221, 510, 1788, 3290, 4466, 5360, 4778, 3143, 1856, 682, 24, 643, 1978, 3418, 4087, 4163, 3205, 1590, -443, -1492, -1659, -856, 496, 1664, 2021, 1556, 39, -1717, -3161, -4101, -4005, -2448, -1684, -447, -242, -1158, -2836]
1991b836j446j099k53P56J655J366Q45p0n95j417j200o18K51J798J846R91O86
2008F60j57r53j246q29Q7J354J252J737J718L1n00j050j360n38N11J294J114J691
2026D816N76j9j285j453q48n64O18J217J238R98L9j236j253j638j322j50P66P07
2044A207Q05O49j09j508j556j293j277k21J091R86P43M72o97j672j377j203k37
2061e197L70J157J253J244k49n37j444r51o25M5J324J038J661R81m92o60j039
2078b121p62n4M97J689K001Q35N55j59j305j166m38M31R70J593J459P77k06j087
2096C509r91p75p81J71J475J153J034m5n06r57j911p67j20k02J442Q70M46q7j015
2115A943j523j600q15R6N26P33J317L08o01j519j202j266n04K11J253J280M27
$$ y = [-2836, -4282, -5381, -5634, -4878, -3223, -1857, -1012, -1082, -1677, -3094, -4294, -4912, -4661, -2863, -1017, -26, 660, 503, -450, -1696, -2525, -2438, -1084, 168, 1905, 3623, 3654, 3154, 2104, 744, 206, 717, 2011, 3125, 4816, 5392, 5373, 4088, 2635, 1787, 1223, 1841, 3058, 4296, 5294, 5333, 4097, 2844, 1206, -116, -266, 500, 1207, 2012, 2661, 2552, 1044, -512, -1805, -3082, -3303, -2212, -1226, -483, -11, -708, -2380, -3757, -4960, -5197, -4827, -3670, -2417, -1173, -1422, -1959, -3403, -4354, -4979, -4934, -3610, -2572, -911, 70, -422, -1082, -2121, -2883, -2937, -2440, -751, 1250, 2085, 2640, 2481, 1176, 10, -428, 3, 973, 2566, 4025, 4802, 4596, 3509, 2518, 1743, 962, 1133, 2608, 3761, 4795, 4750, 4244, 3287, 1376, 609, 489, 287, 1729, 2599, 3045, 2958, 1943, 420, -1180, -1995, -1899, -1373, -640, 677, 985, 384, -1135, -2337, -3603, -4107, -3896, -2643, -1363, -936]
2132i36L79o19j151j463p06K50M61R65J825N23mp88o95j314m96P20J570J182J139
2151H42O64l13j318j028k60j13P31J652J307Q30j31l16j022j242n86N32Q92J242
2169B363J219N65k92j378p72j219j62L2J530J472j44K17k3j491j660n09J02K9
2187a21Q83J445L27o57j005q54j445r16J16J056O67O58N75o84j326j264r62j72
2205c679K02J267J471J49N9n05j201j508j52P1J037P21J429Q64o33p14j124n96
2223b842l87L94J967R89J002N36n48j062j149M1N60M06J361J646J61N6k08j393
2241A530j079QQ78O35P19J077P77o78j584p90p33l28K71J066R60Q67j43j109j107
2260A237j670n74R1N32O38P46N41q54j102q24j712o13L84J042R14O25J68p66j303
$$ y = [-936, -557, -1176, -2327, -3790, -4496, -4246, -3785, -2820, -995, -472, -476, -1264, -1959, -3273, -3769, -3049, -1479, -297, 842, 1506, 1193, -125, -1153, -1413, -1526, -795, 857, 2164, 2994, 2863, 2547, 1525, 283, -303, 229, 1121, 2363, 3582, 4147, 3855, 2477, 1705, 486, 324, 356, 1886, 3358, 3214, 3431, 3408, 1917, 257, -252, -150, -121, 762, 2207, 2534, 1877, 872, 18, -1427, -2343, -2227, -1171, -504, 154, 729, 45, -1281, -2545, -3507, -3679, -3477, -2210, -739, -590, -531, -1036, -2237, -3745, -3897, -3826, -2789, -2068, -639, 225, -408, -1122, -2246, -2842, -3229, -2835, -868, 121, 1123, 1659, 1111, 49, -1100, -1059, -499, -93, 1268, 2914, 3075, 3131, 2923, 1530, 451, 459, 1337, 1972, 2691, 3768, 4545, 3867, 2283, 1493, 760, 432, 703, 1769, 2729, 3596, 3453, 2344, 1237, -433, -1007, -916, -384, 254, 1000, 1541, 687, -415, -1239, -2951, -3564, -3180, -2138, -1224, -599, -431, -1197, -2500]
2279b500p66j056K75J67J631Q65O10k99m16j363p21k04N50J153J129J185O72m30
2297D82j115m71m65K84N19J891Q80L34M70j74j092j101J18R6L77J075J703J20
2315C931q4j146q02j099k66O06P56J123n2M33o63r66j487n47j76J09J178R26j44
2334A630k28r71j377j161j57L29K07O24J247J1j025j059p98n38m68P82R63J052
2352i37M68K05n69j424m95n3mN08J425J406l92j5o75n46n49k29J018O82J340P87
2372A951P3l56r42r33j91N7O64J471P71L73J90q06j039j079o4O7O80P95J169m8
2392B803n92r48r68n54l60L99J041N63L10J18p73j242p20m81r5O00R32Q75L8n45
2412D01m50j215j047j57N01O67Q56N39M05n53j058l98p70l02P18R69O24M78J91
$$ y = [-2500, -3266, -4322, -4047, -3880, -2249, -1384, -774, -1073, -1489, -2852, -3573, -3777, -3227, -2074, -945, 240, 912, 482, -633, -1104, -1569, -1285, -766, 1125, 2005, 2339, 2809, 2635, 1543, 442, 560, 656, 1033, 2108, 3811, 3931, 3847, 2701, 1899, 800, 534, 1140, 1896, 3019, 2967, 3400, 2737, 1771, 284, -263, -439, -330, 848, 1774, 1630, 1402, 431, -946, -2107, -2264, -1935, -1728, -1104, 143, 154, -871, -1930, -2728, -3266, -3734, -2952, -1989, -937, -469, -264, -833, -2257, -2752, -2805, -2809, -2301, -876, 530, 138, 123, -552, -1098, -1647, -1876, -858, -176, 1164, 1951, 2024, 1668, 726, -207, -398, -341, 323, 1794, 2565, 2938, 3128, 2322, 1283, 204, 140, 207, 887, 1682, 2851, 2803, 2211, 1263, 295, -259, -619, -220, 821, 1384, 1694, 1812, 1039, -203, -923, -1404, -1499, -899, 33, 908, 946, 401, -49, -1264, -2311, -2468, -1967, -1300, -444, 95, 500, -53, -1111, -1509, -2279, -2581, -1863, -894, -270, 208, 399]
2431C99j26j317q95J00N35J90P34J483j34l40m23j143o02J54O01J182P02M44L70
2450A914l90j266m35k52N4L30J182Q38J99k78l63q93j032R0M77K05Q57J129J33
2469B499r02o54j020p13lP31Q36M58K36k88l87j316n60l87J96N44J079N24j34
2488G39m31o70o94r58k83P48J042K19P57j7r44p05n61l60k63P89J120P19M4k45
2508D6l99p81o53J4L59R83O43R04K93q09n58p11n68L25N15J405L89L60J04l24
2528A537r87p03K35l4O07R20J013k81l5n95q85r64K30L45N28Q05L86J15j245p81
2548B11l43q73p3P74R24K99K29n34o30r45r31P9J19O40N21Q88l09n99l08j094
2568a955m55J55P33O51Q21L03m4o56j009L2m12PQ45Q61R70J5j53n09n01p11P8
$$ y = [399, 273, -1044, -1939, -1839, -1304, -1114, -380, 1103, 969, 629, 206, -937, -1539, -1385, -784, 398, 1100, 1544, 1914, 1524, 258, -177, -429, -375, -45, 1137, 1975, 2174, 1896, 1533, 640, -392, -302, 175, 380, 1237, 2366, 2499, 1597, 943, -77, -790, -793, -62, 774, 1232, 1468, 1180, 793, -523, -1083, -1470, -1274, -730, 349, 873, 739, 308, -362, -1056, -2014, -2297, -1549, -507, -288, 469, 452, -492, -1197, -1758, -2118, -2381, -1592, -472, 247, 291, 46, -353, -1134, -1787, -1773, -1414, -431, 212, 1116, 1409, 600, 42, -669, -1237, -912, -397, 1008, 1397, 1757, 1861, 1537, 550, -153, 82, 48, 655, 1575, 2588, 2307, 2272, 1677, 792, -172, 58, 403, 931, 1736, 2122, 2237, 992, 211, -132, -1005, -1078, -304, 620, 919, 1148, 614, -16, -961, -1892, -1813, -1694, -1054, -533, 355, 46, -553, -861, -1955, -2410, -2255, -1522, -871, -50, 253, 209, -447, -1456, -1424, -1836, -1829, -984, -123, 847, 862, 709, 200, -301, -1012, -934]
2589i34N89P16R77N82Q4r32l50o59k95J78O82L65J023K14k36p35q42o95l43K70
2609c41Q26P05N19j3m72j041o74p00L90M16O23O99o3L7r66o81n22m47J8O84R20
2630h3N64J55q08l73r29l04L0K85Q49P43M56N5m26j039l42l88M91L10N36P41N90
2651A113n29m50p87n51K39L18Q61M24J015j71o22q00n16m28J72M86Q61L03N94
2670A532k54o39l67j017j15J78Q57O17N72l39k22m05r12n28K28N14N51O90N36
2689A477k76k73j083o17k52L75K96Q47R65k63k86l84q98l95j10K3Q40N15L40L12
2709A153n73q98m79n00O6L87R21L00L92K0q52l58p19m20L05L92R92K88J09k16
2729C10n34n88p68j97O59R20L75L83K55o07o47n42k73K42N19P64O15M15l18j015
$$ y = [-934, -345, 371, 1348, 1930, 2014, 1082, 732, 73, -222, -44, 638, 1003, 2026, 2240, 2004, 1269, 427, -268, -611, -341, 485, 1190, 1709, 1696, 1224, 183, -491, -1191, -801, -385, 238, 937, 874, 911, -55, -736, -1258, -1705, -1687, -1003, -83, 481, 636, -172, -545, -1474, -1778, -1748, -1463, -614, 129, 585, 640, 214, -825, -1167, -1555, -1064, -754, -218, 523, 1113, 584, 134, -653, -1204, -965, -647, 214, 638, 1653, 1482, 860, 60, -456, -884, -712, -226, 635, 938, 1532, 1278, 639, 272, -745, -860, -682, 175, 792, 1364, 1025, 803, 398, -514, -1042, -814, -300, 251, 941, 1477, 1201, 928, -155, -772, -1024, -649, -353, 494, 1459, 1196, 910, 526, -372, -767, -877, -854, -14, 501, 841, 1153, 580, -318, -797, -1297, -1231, -844, 77, 377, 769, 789, -63, -421, -1140, -1560, -1255, -863, 129, 417, 526, 310, -224, -812, -1580, -1777, -1118, -198, 177, 560, 815, 208, -439, -981, -1254, -1012, -493, 271, 886, 1301, 983, -32]
2749c2k50o3o5k12J083N63L72K17n65o44m76k84K60K10Q98M18K12r9n65p55o73
2770d50q9J98M73Q70j79K80k72q82m69l77q0K55M00O48M02l36n12o37o28k14j18
2791a717N48L29R88R4j12o54o44m44l48M38Q86L91O94P7k95n67n94j66N4L00R06
2812A64O10J37K94p66l91n04J34K12K63P21N06K57j73o28l40p29K7L65P25N00
2832A384L14j14n19n76o52k22j07N61K17N64L80m2q84p26o53J92K59N08N21L28
2852G33l2m29o85o46l69j1L35N61P75J43K13p17q04l29N0j14K06R49M60J99j40
2873C48o03n63n70L34K27O75N11M20Lm83o41l43j09J99M56O29O99J50k33q67m92
2894b53m0j57L09O11O51L36qp11l56k67n18K9L75P57M70Lp3m22j001q7j11K15
$$ y = [-32, -282, -345, -410, -622, 461, 1024, 1396, 1613, 1048, 404, -72, -356, -96, 114, 1012, 1430, 1642, 1543, 978, 223, -450, -539, -341, 132, 1002, 823, 1103, 831, -51, -520, -897, -977, -722, -322, 326, 728, 392, -120, -757, -1385, -1599, -1717, -1169, -840, 148, 242, 130, -524, -1168, -1612, -1960, -1522, -636, -245, 449, 526, 231, -336, -930, -1096, -1042, -742, 164, 774, 911, 1205, 439, 48, -456, -322, -110, 153, 874, 1380, 1637, 1464, 836, 496, -233, -206, 159, 884, 1384, 1698, 1584, 1065, 489, -163, -385, -492, 69, 286, 850, 1230, 1188, 304, -422, -1075, -883, -624, -116, 405, 733, 701, 272, -413, -1059, -1428, -1439, -1104, -543, 232, 375, 588, -129, -933, -1262, -1212, -1326, -1120, -171, 289, 488, 348, -255, -818, -1388, -1054, -827, -152, 359, 779, 782, 299, -342, -685, -794, -595, -139, 490, 1189, 1339, 1106, 239, -253, -293, -450, -141, 470, 1121, 1457, 1449, 738, 382, 115, -403, -374, 1, 758, 1228, 1231, 1158, 736, -265, -352, -463, -248]
2916b48K24Q71J31K58o43n16n89j93p1M54O6N10M79k64k61n71m49n08J14M99P03
2937dJ16JJ56p53o21j96N1K78L43L46L29j27k45m23l29k64J55J65R13M98L5j54
2959B70m06n00o3P2J29M58M67N55k0n1m84l85k12J17L04M49M43N48j37k78q08
2980D68j64j51l11J159J7M69J90n3r43l44k74j83K38K06M17J87q8n12k96q18k7
3001h13j8K98jO76J52n54m50l14o01r4J03N34K69M71k7m59j95n06l55K69M29M79
3023g07J98J75L94k53l56l25J07pP99J84M23J67Q7l28l14l02l2N10J87P12M82
3044A801%m33J83o25n22lM07M37N99J26o8q60m07n10j74K40M62L65M0j05r4o42
3066B17q11k98L24k35N28L88L53o47n40k53n43k42L29J87L15N21J82m53j96n63
$$ y = [-248, -24, 847, 978, 1236, 593, 77, -512, -705, -776, -322, -256, 254, 733, 469, 208, -363, -812, -1320, -1206, -707, -4, 112, 113, 269, -484, -1105, -1301, -1250, -972, -629, -283, 46, -81, -326, -749, -1078, -1342, -1187, -1022, -109, 389, 424, 270, -136, -636, -699, -627, -498, -40, 427, 982, 962, 911, 427, 42, -170, -53, 251, 700, 1143, 1691, 1554, 1276, 468, 304, 153, -158, 1001, 1018, 1487, 1677, 1624, 681, 337, 63, -120, 118, 324, 741, 928, 840, 328, 32, -786, -813, -831, -533, -534, 142, 294, -260, -710, -1024, -1625, -1719, -1616, -1082, -813, -342, -369, -828, -1023, -1529, -1884, -1615, -1186, -707, -509, -334, 60, -193, -549, -874, -767, -774, 25, 209, 632, 799, 886, 558, 244, -58, -90, 420, 607, 1319, 1801, 1801, 1368, 1551, 926, 404, 401, 808, 1245, 1844, 1970, 1902, 1042, 635, 125, -49, 191, 653, 1018, 1058, 953, 859, 217, -594, -892, -568, -803, -275, 113, 466, -181, -721, -974, -1517, -1759, -1430, -1243, -928, -407, -225, -678, -874, -1437]
3086a437j92j84n4P01Q03K03rl13j53k66m50O82P8O20N85L05j37k67p1o38J63
3107c1N3P02N75K33l25L09n52k19j13k78K84M49M50J88k38o32k52m98j36K76K22
3128D67J30N54N0k98n83o53k23O4l3P03Q2L1J10p75l34n12q5K27J03L51M03M97
3150B76p77j13o05k48jJ56L84J92Q44j48m38m84l87Q2J32J32N57O04M82p64J21
3171cl97l85O3L00M74K65M42K67L0o13l00J3p5j37P14M71J04R6j86n98r8k31P5
3194B91K03N72K78Jl02k11o62j71l49L20K84N62p2K95k00q50l45o2Pm5K14L48
3216A06J52k57o1r22l7m31R6L25M97M07J59l73o19j92j28m06M62L21P69j12j19
3237c63j98n60Rl83M71K44L57N24O3J82m06q4l22R0K23N33M75K69j66K89n17m27
$$ y = [-1437, -1629, -1813, -1867, -1166, -363, -160, -169, -482, -635, -901, -1351, -669, -591, 29, 614, 919, 782, 515, 444, -194, -31, 22, 724, 1299, 1532, 1207, 1516, 964, 745, 632, 354, 638, 1087, 1537, 1725, 1487, 855, 603, 105, -31, 245, 467, 597, 1151, 1201, 903, 320, -333, -556, -492, -525, 178, 260, 291, 401, -374, -708, -1220, -1305, -1078, -975, -624, -221, 276, -501, -614, -1219, -1467, -1468, -1312, -928, -736, 108, -40, -478, -962, -1349, -1267, -1135, -1003, -446, 158, 640, -124, -3, -400, -785, -722, -422, 52, 317, 759, 1026, 1056, 443, 143, 156, 81, -56, 658, 1129, 1233, 1329, 1143, 545, 447, 216, 291, 494, 1066, 1344, 1345, 1043, 832, 170, -1, -350, -30, 254, 816, 744, 1039, 839, -11, -356, -418, -411, -456, -242, 106, 258, 1, -60, -982, -1019, -1450, -1354, -1029, -532, -125, 34, -339, -958, -1150, -1278, -1684, -1222, -901, -132, -244, -363, -561, -1121, -1112, -1495, -1024, -780, -423, 101, 164, 346, -60, -144, -466, -376, -153, 380, 855, 1124, 958, 1247, 730, 303]
3259C03N3P6M94K88K01Pn8j74l39n89J21J32K83J76M32Q9o65j73l85m84l7J15
3281a34L01K83J9j99l26n81n20J00l50M03N47j44K89k08m8o17j94k71n3N81M53
3302f69j16L12j64l81m05j81K08K24P17M95J16k73M1l71l7K46j17Q84k34N97j9
3323H73J1k89j17l49J85J60P82J81J13K30k72n85l99K41j09j29O10M41k56j30
3343A192k14n40l99k01K26M88l8J0q2l21L0k83q33K21Q2N11K78m14j38k54l98
3364a077j32n17M49J86L50L18k07K50n45k1m16L94M8jN58K87j0j64j7m32k15L65
3386e49J63Q94j20K37L27o88O6n66M20K8L99L03J6K41j91l05m82k3J07J44N14
3407I35J95j65K57m88k24l93K5j13L77O53l41K34m68k82l59l94p8K80L64p2L84
$$ y = [303, 356, 432, 926, 1214, 1415, 1422, 1364, 1190, 851, 262, 383, 515, 798, 974, 1406, 1495, 830, 657, 272, -212, -249, -134, 167, 450, 469, 270, -56, -637, -1157, -1057, -1407, -1004, -457, -601, -312, -520, -568, -1185, -1379, -1650, -1703, -1122, -669, -785, -473, -637, -1018, -1423, -1604, -1396, -1172, -455, 40, 156, -117, -76, -447, -484, -238, -355, 529, 295, 892, 873, 884, 595, 478, 129, 314, 474, 1256, 1437, 1550, 1780, 1508, 923, 524, 765, 656, 527, 1137, 1578, 1322, 1192, 978, 438, 39, -162, 64, 552, 514, 524, 442, 121, 151, -132, -965, -744, -662, -151, 127, -287, -425, -679, -1077, -1209, -1726, -1277, -1091, -741, -423, -630, -380, -925, -946, -1362, -968, -920, -921, -363, -76, -86, -250, -267, -699, -914, -549, -386, 508, 388, 625, 952, 264, 330, -236, 184, 212, 611, 914, 930, 1171, 980, 675, 193, 170, 277, 421, 935, 1130, 965, 1222, 734, 510, 117, 142, 29, 406, 1059, 718, 952, 484, 202, -157, -551, -629, -349, 15, -57, 327]
3428C27k66k16k50m87l60N07J5N11J18k48K47n51J76m86m2L88J29M30J3j67l58
3449e70r7l28K91J33j1L81N26j07j6j54k43l75o7J97J65L66O39K5k05k01n05j73
3471c29L36L03J7M83K08k14j48m37J85m85J16N0M06O46N6l70k60j23m90L8l4N49
3493E03p5K73K99m46n02l82o3J04L2P7J15L23n4m11n60Q5j26J1J15L60K01p8j70
3516c69l69j66j00M5O9K53J87K07K24l02l72N6k83Q9N28L83K49j04J97m63O1j92
3538a72J29j95P32L25NK6l10o4k7k28K86pK81J53J61k4l85J17m66j69K37L43l13
3561D35L41P6k34l02k78r3M5J26j00K97K35l71l27l77K4j09j26J81J48J24oj85
3583d76k50j59l21L56k50J94J29M88j42PM8k87j61q2J84J03P51R9K01m76j47m57
$$ y = [327, 61, -155, -405, -892, -1252, -745, -730, -219, -101, -349, -102, -653, -477, -963, -1005, -617, -488, -58, -45, -212, -570, -667, -995, -704, -571, -582, -201, 325, 218, 202, 48, -195, -570, -637, -440, -275, 91, 730, 755, 550, 349, -156, -329, 7, 310, 327, 810, 1018, 804, 656, 219, 404, -81, 35, 85, 491, 1137, 1193, 823, 563, 440, -50, -12, -46, 503, 428, 701, 1000, 554, 52, -330, -393, -289, -257, -180, -65, 258, 204, -207, -767, -682, -808, -797, -682, -322, -121, -199, -369, -738, -904, -1004, -959, -890, -637, -450, -243, -19, -321, -693, -637, -920, -831, -303, 80, 329, 225, 422, -41, 20, -172, -43, -238, 494, 819, 824, 850, 540, 476, 449, 221, 507, 500, 781, 934, 1095, 1071, 686, 803, 337, 168, 405, 748, 435, 776, 852, 618, 316, 38, -55, -10, 116, 16, 313, 548, 177, -150, -527, -503, -612, -738, -557, -409, -285, -291, -476, -726, -885, -1206, -850, -1100, -906, -777, -289, -431, -424, -376, -663, -824, -906, -722, -619, 132, 231, 432, -44, -191, -648]
3605f48M33J43J74L74L95m43K18k26k24k00L4P9Q13j95L91K63l24p41n9j59O9
3626A67L66N9L15N6l11l73n0l77l7j06N48l1K69k37j70k66o22J93n6M18jK62K76
3649B92j34o25k05K21j63J52Ro9L28r0qj49J02m01K38Q3J15L43r8J97j73l01n6
3672c92J60j05K34N00j2K97l27L7l85k63L13n0J57L08J63k91j06j07k2l90K70
3693a1J4L70J62j00J18m80j32J15r3j35M62j02N42k10n4l34l89Q9j48K54%K16
3715A54J93l45P3n01n9j7O7K01l9L38N5j07k7l98k52J31j3M62j77K55M13l16m07
3738c16K1k75n2K73M9L92K98l30j30m35j76L11P3J29J74K16L4j08j33k63j70O6
3760c52J3M53N06O9l15j94J20m93J39m5K32L30M06n8l16j91l21J12QJ62P0J18
$$ y = [-648, -215, -72, 102, 476, 871, 428, 646, 420, 196, -4, 30, 109, 922, 727, 1118, 1381, 1057, 316, 257, 98, 167, 533, 592, 907, 963, 652, 279, 229, -148, -185, -291, 257, 226, 495, 258, 88, -178, -800, -607, -663, -245, -246, 16, 292, 158, -467, -672, -451, -614, -462, -453, -522, -194, -284, -292, -441, -339, -740, -502, -419, -304, 39, -59, 138, -35, -336, -392, -232, -337, -103, 397, 385, 682, 355, 392, 7, -256, 57, 7, 164, 472, 635, 344, 238, 131, 109, -281, -11, 3, 373, 535, 435, 553, 73, -59, 56, -37, -172, 290, 188, 730, 520, 466, 132, -257, -168, -316, -62, -62, 154, 347, 2, 75, -426, -485, -502, -435, -234, -273, 65, 120, 13, -14, -412, -664, -533, -546, -84, -261, -6, 407, 91, -316, -295, -570, -622, -349, -300, 92, 390, 60, -70, -505, -681, -370, -297, -168, 6, 222, 256, 148, 15, -248, -418, -352, -339, 114, 620, 689, 374, 180, 300, -193, -54, -99, 133, 463, 869, 811, 495, 304, -17, 95, 103, 265, 335, 453]
3782D53K29k43k99k86K64k91pK23J7M9K44j91k90o0k02p9Q0m5L39N50n43k09Q7
3805b10l18l44J74K04K61l3n3J10p4l35n1K2L44j37J05J35J65O9K1k44l19J67
3827c41N5L93P9L41r6k3k15l17L35k43K90J55K64r8K47m90k57m7J52j43J49L97
3849E87n2O7l8l35k52k38J44K12l0K01J15k60k46M5j62j59L64l74N67p7k95K98
3871H2p19L68j5m15N6K75L2L38j69J39l48K96k79M8K94k0K25K32k60k44K3j93
3893b54j15R6O0J37K24K13nk71k74L03k90J43K90Q9J26pp8l78K85n96J77M36l05
3916FM54l63M02o81K11k16J33L2r0L31Q2K97m28k9l06N5k86K48j68O45N3L6n18
3939a00Q1r8k38M43k85K25L1K68j91l52K01l28K49l94K27L98N3R5m79l6P6J10
$$ y = [453, 682, 439, 140, -146, 118, -173, -180, 43, 60, 109, 353, 162, -128, -188, -390, -469, -389, -434, -95, 455, -88, -297, -210, -528, -872, -698, -494, -233, -266, -319, -209, -283, -618, -669, -647, -303, -440, -335, -200, -35, 34, 55, -189, -508, -341, -286, 107, 186, 527, 431, 408, 193, -124, 211, -32, 258, 413, 677, 579, 826, 336, 79, 32, 184, 41, 190, 587, 535, 602, 564, 229, -23, -261, -117, 95, 65, 266, 381, 121, -125, -80, -242, -401, -37, -411, 156, 79, -216, 82, -637, -269, -284, -699, -643, -368, -336, 2, -167, -28, -376, -80, -359, -311, -17, -37, 188, 420, 160, -84, -61, -254, -369, -273, -213, -76, 148, 361, 356, 85, -189, 114, -176, -33, 257, 346, 472, 465, 387, 9, 294, -302, -125, 311, 6, 460, 97, 499, -182, 29, -187, -54, -22, -112, 219, 301, 598, 170, 141, -165, -110, -396, -148, -316, 329, 382, 418, -100, -19, -117, -355, 88, -197, 28, 59, 327, 136, -216, -15, -343, -94, -488, -261, 137, 190, 285, -194, -230, -154, -44]
3961d4m39L62N8K63N1l47J42m14M0J57L14m3M6J07j48k59K75l20j0j00K08n5L80
3984B24KJ12Q8o56l02L44j06M02J34j97L82l11j80L74l71j40L05K46n6K12p3K8
4006D61o02L86k43O4p0K91m0l5r0J28m14o5J66j88K47r4K80j28p0j79j88J24m2
4029c01J9j22L77J42k54j43j64J35k59J83K30M4j44J49K08m84R8j55N64m99P68
4050C92j90J06k43L9k22j21J17Q3J44J81M13m66M3K13j48j9l03M20l53K51j9j3
4072C05J09Q5l80J6k18O3N8Q9K03K97l35l39L2l22J63r0M46J22l43Ml68M58l77
4095c22j20K9Q4L5J53koj08m8k86L58J08n2J46o5l8M6k50k25L30J96LK27l17J04
4120b0J83K9k97n2J03k17L50K01j13L45l09o8Q2l34L70l2p2Q6l5M64m39Q8m88
$$ y = [-44, -483, -121, -63, 200, 251, -96, 46, -368, -328, -171, 143, 100, 146, 253, 105, -154, 121, -199, -209, -309, -101, -156, 224, 226, 338, 426, -230, -532, -188, -294, 108, 242, 45, 427, 116, -64, 310, -61, -201, 104, 350, 294, 506, 433, 461, -141, 245, 2, 66, -4, 287, 247, 212, 122, 250, -164, -229, -63, -251, -4, -98, 182, 54, -16, -195, -383, -259, -301, -282, -404, -27, 115, -139, -282, -446, -311, -570, -387, -157, -113, -257, -108, 100, -384, -286, -441, 123, -376, 392, 202, 308, 65, 104, -118, -239, -122, -39, 105, 286, 699, 233, 276, 489, 341, 322, 19, 439, 86, 337, 318, 305, 414, 499, 119, 135, -83, -20, 38, 127, 330, 627, 292, -47, -15, -337, -174, -264, 182, 304, -39, -35, -403, 55, -322, -442, -413, -329, -294, -141, -143, -149, -257, -305, -591, -233, -125, -177, -31, -96, -134, -88, -338, -563, -233, -37, -34, 193, -124, -20, 163, 192, -105, -157, -54, -271, 79, 280, 167, 512, 203, 135, 217, -117, 253, 221, 149, 235, 200, 664, 225, 313, -175]
4143a75J09j96M17L45k92k14M46n94j07N27l12j08J89P5j33L09j04n21J9Q9m3
4164b74J51J76J8n5L10p37K06K44l93PK66K9K28j57k30J83q0m39M90P3j75J53
4186fO5k02Q5j57j26R0K43j46M48l09K63m78J51j28L9J30M7M26j67r6j27L55l53
4209D7jk27N38j42o5J11Nj40J64k28j30K01j51M01k11K42j22k00k39L28N6k87
4231e0K78J58p4j34J0k63J35j85k97K27P8L44k6j68j35o8m1l94J57J33K43j76
4253b48J71K17k16l74J65j60L27k47K73J98j95P7p6l74L39q4m0J46J48n9J54J48
4275B90m01Q5R4ML3J69J75k36K01j49k59p5j01M82L4j5J80j55pJ5k31o6K00n1
4299B16J98J06p4j96j86j46l6o8J76L07k42j1n6J86k92q2j77j95L37j6L04k21
$$ y = [-175, -66, -262, 155, 500, 208, -6, 440, -154, -261, 266, -46, -154, 35, 110, -23, 286, 182, -339, -320, -231, -274, -123, 53, 71, 16, 326, -411, -205, 39, -354, -347, -81, -52, 176, 19, -211, -28, -108, -547, -57, 16, -159, -6, 59, -143, -58, -215, -341, -251, -8, -154, 294, -15, 248, -230, -79, -207, -168, -38, 9, 435, 268, 172, 45, 400, 47, 46, -181, 357, 215, 150, 261, 266, 126, 290, 62, -68, 133, -18, 383, 172, 414, 292, 92, -147, 181, 237, -50, 228, 386, 312, 178, 188, -75, 60, -125, -422, -195, -117, 227, 201, 33, -102, -170, -211, -605, -448, -315, -72, -248, -77, 140, -76, -450, -285, -445, -118, -365, -92, 106, -89, -12, -88, -462, -123, -207, -247, -101, 47, -12, 142, 290, -111, -26, 68, 72, 105, 274, 449, 213, 414, 265, 6, -69, -170, 312, 346, 331, 511, 356, 349, 364, 133, 67, 267, 216, 414, 520, 446, 250, 64, -82, -118, -186, -10, 297, 55, 44, -12, 174, -118, -200, -377, -572, -235, -251, 53, -168]
4321a68P3k1M8j22l00M9L18j18K29N3k92R5l03Q6J48J67k50K78K60R4k66R0j66
4344a8K58k90K55j54K12J1J92l74NQ6Q9k8K6J14L9j90L69l78l10L51l58K04M9
4367A60LQ5J93k89j30j85L82m01o3K56K06j71r3j07k08o4L16j39o4q1N07k09k6
4390a22k34N41n41K30n7K40Q1P1m6l68J27j07J35j81J69M9Q2j78K50k80k0K74
4412A15j15j03J13L06j54J90k46j12m94O85R2j83J6J72K03m69N0q1k1N8K8R2j27
4435A5Q0O9p3P4O4l05N22m94K47K5N7j05k58J07k36M3p4K20l8R5k43P9k0M4k27
4460c32J57L97j29l1j11J26Q4l55j20j72L0L82J79l06J39K04n8k34j98M4J75n9
4482a88L05k60N9R4K01l85L1q4q8L63l58K57j16l8J69J04o5J27q5K59NK08p2m23
$$ y = [-168, -95, -116, -68, -190, -490, -441, -123, -241, -12, 41, -251, -156, -459, -373, -225, -58, -308, -30, 230, 324, 58, 148, -18, 240, -50, 205, 51, 263, 274, 466, 92, 97, 183, 272, 244, 270, 384, 423, 233, 602, 224, -86, 265, -93, 111, 160, 163, 248, 441, 152, 22, -163, 219, -182, -245, 11, 217, 46, -47, -154, -362, -426, -110, -249, -313, -394, 113, -96, -122, -356, 185, -356, -126, -183, 57, 138, 209, 163, -205, -78, -185, -50, -231, -62, -13, 69, -109, 141, -139, -159, 115, 0, -103, 10, 316, 162, 352, 106, -6, -500, 185, 277, 94, 110, 282, 485, 16, 66, -15, -36, 22, 50, 142, 15, 95, 164, 91, 165, 229, -76, 446, -48, 199, 224, 281, 176, -82, 25, -211, -168, -242, -22, -60, 35, -208, -129, -149, -105, -332, -175, 222, 93, 62, -49, 77, 161, -194, -314, -486, -456, -74, 105, -201, -62, 142, 84, -150, -348, -304, -129, -188, 117, -143, -84, 10, 211, -174, -143, -227, -315, 48, -310, -53, -169, -207, -38, 66, 1, 128, 43, 302, 307, 515, 443, 20]
4506B0j52M3N5K36j53M31m15K35J78n41J37N7J95k80P0J0P0K7k76m8j39K90r0
4529d0j73K92m7r1J76j39q3j23J94Pj59J36K26j13k09Jj19j62R6l9L93p0o1M41
4553C34q36K83J51l5k09M7K71J61q0n6P7m42M63j88M29j62q1N7l7k40K10J65j21
4576A61J6K8L2m0j61J24J54l89Q6q6L31l57M70K72m78Oj41l33K76l83K75K16k06
4599a27N9Q1k03Q4k83K07N3J36j22j44K58l4k24o1J83p0J11M0J14o3j8k3k16m9
4623c11J32J08Q8K06j99k13j10K84P9Pk37J24K1K51O0N3m3k02K8l8O7J81n1o3
4647B22l5k1J71k9m6j78J10k58K80k00PJ20j43k3K32k82j08M48j34n6J84j19l82
4670b40J27j26K37Q8m9k02r6L76l02j04n8N97m38L56k06R5r3o7Ml0N8k06L09r5
$$ y = [20, -132, -89, -34, 202, 49, 480, 65, 300, 478, -63, 74, 131, 326, 46, 116, 126, 196, 223, -53, -101, -240, 50, -40, -213, 79, 32, -59, 117, -22, -105, -228, -34, -27, -186, -50, 176, 63, -146, -145, -264, -426, -330, -369, 24, -46, -107, 334, -502, -219, -68, -103, -312, -265, 6, 167, 87, 31, 108, -334, 129, -59, 370, 208, 127, 184, 147, -93, 117, 282, 161, 177, 205, 237, 197, 36, 160, 314, -75, 11, -75, 256, -101, 369, 641, 163, 169, 28, -305, -29, -412, -137, 79, -127, -68, 13, -190, -106, -389, -182, -129, 7, -115, -259, -1, -35, -259, -320, -137, -207, -96, -56, 58, -5, -23, -46, -262, -311, -179, -71, 17, 223, 24, -189, -299, -15, 64, 71, -166, -42, -21, 230, 290, 343, 300, 98, 126, 88, 155, 336, 285, 222, 187, 166, 337, 308, 262, 84, 194, -64, 216, 16, 23, 143, 0, -23, 209, -73, -181, 267, 133, 77, 261, 142, -240, -113, -239, -2, 86, 37, -165, -261, 115, -187, -291, -349, 248, -190, 166, -40, 55, -38, -105, -101, -131, -73, -279, 30, -65]
4694f5L1M31k03m40J35j86L39j61R2R0lJ36k91K05k75n3P0J36J1L1q0M61l18j2
4718H1k15J83n5K10j65J94m3j43J56m20R6k4K37j30J44j01J94j13J31p4k43K68
4740A68k26J87K85j39k83n0J34j33j54K84K95j21l03K04q9o5j07rP2n2m3M02j97
4763F0M2m41K29j72J7P2j2J53j16J59j31j18J15J51K41l49K03K8J3k67J33PnK1
4787C3j64j06Q3J32o1L26N9k31j34L7J47L0j5mPK4l76J99K49k59J89o0N2R4k06
4812D5j55l2L9J5P2K6L22l15NL41j86j15j04m29L12J23O3m9j3j64L52n09J43j34
4836c47K93Oj82L77N5j54k77O3l18M59m2J49P6j28J42j32J43m88N7L77J32O7k78
4859E0n9J94j3l68J94Q7J89j39J9N2j04J52K4k77N5r6k90L98J38k13m8m3N4K0
$$ y = [-65, -34, 397, 194, -246, -111, -297, 42, -119, -27, 63, 60, 196, -95, 110, -165, -218, -148, -12, -1, 30, -50, 411, 93, 81, -134, 49, -6, 204, 39, 233, 190, 47, 203, -217, -121, -145, 92, -38, 106, 5, 199, 86, 217, 143, -100, 168, -58, 129, 414, 275, -8, -58, 76, -57, -211, 73, 368, 247, -56, 148, 59, -6, -113, -122, -50, -102, -145, 257, 60, 102, -339, -110, -282, -265, -193, -205, -52, -168, -9, -140, -258, -143, 8, 249, -100, 103, 131, 144, -123, 10, 17, 12, 33, -131, -237, -154, -22, -83, 243, 302, 71, -63, -26, 121, 151, 136, 132, 139, 163, -213, -14, 235, -24, 165, 105, 157, 251, 45, -110, -142, -103, -88, -16, 10, 332, 17, 22, 363, 177, 62, -42, -471, -159, -36, 27, -22, -35, -199, 153, -356, -213, -347, -54, -48, -230, 147, 202, 48, -229, -166, -484, -25, -67, 82, 158, 30, 172, 40, 183, -305, -248, 129, 261, 328, 50, -9, 185, 172, -196, -2, 85, 274, 135, 154, 206, 102, 254, 278, 1, 56, -40, -330, 68, 206, -7, -55, -98, -44, -24]
4883b4j48J22O9J35Nl09N4j7k60N40k57K88n14J07L82l00J92k22r8J46K17j11
4905cm4j09L35k43J1k33N8K33l36M17R1J89r6n10M82l41N3J27l82K27K67j71K01
4928B23m43J33Kk11N15l77K52J09j79J42r6p5l4J42m05N75l85N2P9Pk23M91m15
4951a21R8L0M7K8J85k78J18K37k85R0n9J90m79J45J5r6J06k46L81j91O7o3M23
4974C42l99K02M2k82m7L12k17l99L24K57j05l70L43k3K53p7k00O8kj14K82k4j44
4997B2k55O0K49J6K05l0M6l23N4j36L9J37o5q8j86M24q9R4l76J02O2j25L22k49
5021i0p4N42k32Ml03m9R5j0Q2o3M69m20L9O4qj02N4j05OJ78l7P8P1l48J35k95
5047c19K00J98J26l6m79J09J77K29k64k3K57l64K59j95J59j86m9M09l08P1l1J42
$$ y = [-24, -172, -50, 19, 154, 159, -150, -96, -113, -373, 167, -90, 198, -316, -209, 173, -127, 65, -157, -255, -109, 108, -3, -47, -156, 179, -64, -53, -286, -228, 5, -331, 86, 177, 366, 270, -240, 242, -99, -46, 81, -301, -74, 193, 22, 223, -220, -87, -85, -296, 219, -158, 94, 203, 24, 166, 70, -5, -39, 103, -302, 273, -112, -60, 19, 26, -197, 294, -121, -23, 7, 54, 82, 267, -11, 107, 344, 59, 149, 90, 280, -199, -54, -39, -135, -29, -275, 106, -85, -18, -81, 342, -57, 145, 187, -95, -142, 170, -47, -446, -122, 135, 30, -340, 3, -20, 233, 156, -44, 24, 22, -92, 190, 166, 22, -233, -173, 76, 92, 297, 267, 313, -10, 44, -92, -53, 84, 19, -69, -255, 169, 80, 174, -202, -100, -38, -163, 159, -90, -164, 378, 146, 150, -153, -202, -107, -117, -35, -98, 371, -49, -10, 54, 46, -56, -2, -107, -101, 77, 40, 118, 189, -159, -24, -319, -119, 79, 205, 169, -310, -201, -24, 205, -59, -82, 175, -189, 70, -125, 34, -152, -201, 208, -100, -29, -60, 82]
5069H2q5j30K3J41l56K13n7N20j24k51M54l36q8o0j7kL73l77j3L11k47J45j11
5092Hr9J99j5j08J41j00l6QJ07M5k80J7J00q4L65J0j32l52J44j32KQ2J93lJ96
5117B76n3l65K89k23n1J36j2k4J54k84Q3K46n22l3J60Q8J58J07K61l50q9K26J
5140A79J11m03J39J7R8j48o9R8L3J14m13K45j04Q2l6Q5J8n1m3Ln2l3l5J15J71
5165A21oo9j04jk00J75K04l16K13L33n87J41o4L16k10J65o41N89m2R7O7m64J50
5188a33K18L3j45n6L36j98l6k71K00j94K89n9j83K10j58M12l30j49L06P7j56o9
5210e6J8K5J19K0j01j62K8J56k44J13n0Q3K69j45j17J16k01j28l6N27k31j8R1
5233G6J63p6m7k10L76m37O1q4L90j53j26L13j15J59k51k5m6p5J54j11K22j53J67
$$ y = [82, -3, -133, -110, 31, -325, -112, -169, 351, 227, -24, 430, 94, 6, -54, -71, -73, 300, -77, -90, 221, -26, 119, 8, -91, 108, 93, -15, 126, 26, -10, -2, 105, 150, -130, -113, -13, -97, 268, 278, 146, -206, -62, -194, -192, -110, 83, 80, 276, 223, -142, 147, -76, -127, 9, -3, -27, 127, -157, -74, 172, -350, -383, -223, -135, 23, 130, 391, 41, -48, 178, 179, 290, -113, 26, 43, 141, -7, -76, 22, 55, 169, -244, 1, -103, -21, -57, 28, 46, -5, -48, -45, -97, -130, -165, -50, 121, 115, 46, -58, -59, -259, -84, 120, -196, 17, 350, -237, -96, -160, 156, -54, 111, -530, 59, 17, 114, 181, -283, -133, 85, 118, -27, -83, 253, 55, 19, -252, -52, -246, 43, -16, -199, 11, -147, 265, -65, -214, 92, 169, 13, -56, -38, -13, 106, 126, 25, -137, -109, 47, -197, -84, -134, -51, 218, 73, -44, 72, -129, -257, -293, 234, 3, -15, 76, 239, 163, 116, -94, 282, -155, -94, -178, 212, 59, -67, 246, 131, 290, 39, 14, -32, -107, 47, -64, 158, 5, 172]
5256A72qj79j24R8q6K30mJ12l00P0k0N2K3K18k02J8m0l4N9k40k58L99j18J80m9
5281c1J3j30K35k07N8k21K45j69j02J89N14o00p9K46J23r2K31qj44J59n07O1J58
5304e8J84k08J25k81O02q3l8K6m04K09Q6J00m7J17n48M19o4k19L77l62K00k43
5326a10J48J64j07p5O8j3j20l93M34j41J03j03J6J44k58K90k11L00k57K15k48
5347a54J10j18J31j3j06m1J71O6N2k62J91L20k69k96K62m7O7j59j21L69j75K17
5369A95o0n3J05J43m93M57k12J1J8j89M05j91pj71o5J58K01m67K22q1Q2r0j84
5392b66L12l16K33J81J73k75J96j33j74J90k68j26K35J26j20j9J11k05L60m17
5412b02K61m9q0j60K03J59k1J55l39j45J14J84j93L09m05K56K0l3l14J99j02N15
$$ y = [172, 164, -15, -139, -41, -127, 103, 99, 211, -89, -19, -39, 13, 36, 254, 52, 70, 30, -4, 55, -185, -443, -44, -162, 18, -31, -18, -148, 87, -120, -62, -283, -38, -207, -309, -120, 394, -206, -285, -39, 84, -8, 223, 215, 71, 230, -277, -216, -58, 126, -82, 43, -238, 364, 281, 243, 269, -135, 74, 160, 260, 213, 330, -218, 201, 137, -82, 295, -67, 133, -110, 38, 202, 95, 20, 88, 75, -45, -438, -4, -145, -42, -145, -129, 15, -243, 47, -164, 136, -121, 94, -154, -44, -162, -31, -44, -150, -191, -20, 46, 98, -164, 27, 347, 78, -218, 44, -3, 64, -95, -216, 153, -22, 195, 135, 82, 187, 330, -163, 294, 82, 93, 111, -78, 327, 136, 129, -42, -107, 51, 252, -215, 7, -74, 8, -82, -266, 46, -270, -37, 144, 317, 42, 238, 105, -69, 121, -147, -273, -38, 88, -32, -51, 60, -145, 215, -202, 59, 10, -70, -230, -27, 132, 111, 266, -73, -218, -104, 80, -113, 196, -209, 47, 67, 34, -280, -81, -183, 332]
5434C32n74L23q0k00J01q5L84j82K09j45mj22J14R0m49K27J16l49M10j13M8J43
5456A94l37R3K84j76J50j8j24j66P4K93k74l7L67N4l51L5k4r4r7K17o9k6J91j76
5480a7o3J84Q2k73L03k37k03J33n5L52o6P6j15k23K50J63l24j04K19k72L51j08
5502E3n4%P6j94k76K20j9M36j32J77m56L8m9J69r2K71q7k44J93j55O2q3K14j30
5526f2M59k95l08L88l9p1L8Q8r3q0L5J86p8m2q0M4O5j40J14j93R5n6J09L01k80
5551A05J84j72k19J02q1M4O3Q2j71M4J1k90P8o2P9J18j84J10K12r3N0J32p37P68
5575A73j32l66M52j38Q2J1n0j42J79J52j92nj21L4k2k6o6L7J68P1N4j2q8m9J61
5600A65j01O7j95N7K02Q4l20j60R0J64L5j52p3L21j05K23k03k5k15R7J45r7k6
$$ y = [332, -242, 81, 1, -199, -98, -183, 201, 19, 228, 83, 79, -43, 71, 161, -288, -61, 55, -294, 116, 3, 51, 194, -143, -50, 234, 58, 208, 190, 66, -100, -26, 267, -7, -44, 323, 377, 26, 61, 37, -57, -154, 63, -6, -32, 159, -17, -80, 104, 186, -87, 216, -21, -224, -91, -146, 206, 140, 216, 101, -122, 128, 291, -33, -137, 82, -190, 161, 53, -1, -1, 75, -119, -395, -175, -194, 242, 110, 287, -169, -131, -180, -11, -103, 168, 81, -163, 30, -125, -63, -146, 68, -62, 397, 102, -206, 182, 143, 72, 110, 198, 105, 25, 60, 246, 168, 126, 46, 90, 155, 15, 129, -64, 31, -25, 84, 385, 105, 289, 117, -102, 0, -81, -37, 26, 108, -63, -19, -8, -298, -220, -282, -203, -85, -269, -159, 53, -40, 10, 142, -595, 173, 41, -325, 127, -11, 71, 82, 32, -110, 69, 221, 29, 24, -97, -63, -85, -111, -177, -140, 28, 99, 153, 141, 53, 4, 165, 64, 131, -64, -7, 195, 279, -41, -201, -111, 53, 88, -64, -137, 184, 79, 302, 99, 74, -141, -44, 101, 4, -22]
5623b2j38R2N8J25n51J42L78k05J42K06l77R0N7j04K6MK91k83L01j51j77P4K07
5646A85m69J14O2nj22J85K34j36j28j12K57j28j31O29m44J31k92L6J71J69k9q
5668A69j86J54j54K1Q5k36K51l8m5j18O3O3lj62L05k97K70k28j33J50L16l60J09
5691dK99k87J75j14j78J65o4j74J44%N6J54k80j7O0rJ67j27r6J90k6O5J09l07
5715i9K25j15J32m26Q5J40j46L08R0k56K6J25m4j88K53J78m00k16J02N59l97J35
5737G1k74J46L00m42J43j31P7K42j89K6K44k22l16N01J14j01Q0j19k70N50m29
5758Aj47K26j47j42k35L88K34j21p9N1k0m7JJ75p2j08K12Jo6l25j3J62pN0K10
5783A82m12O02k94j25J78k8j30J55J91l48k57P3L16o2J25K0k08L6K39k09r5K32
$$ y = [-22, -160, -68, -10, 115, -436, -294, 84, -121, 21, 227, -150, -60, -3, -107, -81, -77, 214, -69, 232, 81, -96, -22, 185, -284, -170, -108, -113, -235, -50, 184, 48, -80, -192, 65, -63, -194, 435, -9, 122, -170, -134, 37, 206, 177, 169, -17, 137, -17, 4, 89, -147, 104, 66, 21, -97, -34, 29, 26, -136, 169, -128, 142, -86, -219, -69, 247, -113, -4, 295, 8, 183, 69, -109, 56, -8, -182, -38, -38, 18, 172, -108, -125, -65, -74, 93, -34, -130, 60, 34, 99, 208, -99, 126, 11, 143, -283, -198, -58, -204, 104, 194, -62, -36, 89, 45, -143, 110, 288, -112, -328, -226, 333, -64, 71, -203, -57, 243, -199, -56, -187, -110, 132, -57, -31, 213, -9, -325, 176, 290, 189, 269, 150, -120, 430, 1, -146, 80, -67, -209, -444, -56, 178, 57, -22, 29, 9, -38, -37, 138, 66, -42, 170, 171, 105, -220, -233, -71, -78, -28, 182, -230, 372, 78, -47, 131, 103, -27, 128, 319, -29, -286, -213, 103, 41, 166, 186, -22, 14, 253, 44, -51, 181]
5805A81k39P2j54K01K5k36L65j28P3l95j93M03O3l16L55l54L34J15l1j17j72J7
5827a31K51J38m85K25j53K42K8j15K29l67J19j7K9K4J65nm95M38l11J64Lk62M25
5850A39j51J27j70K12o2K5k58M48q4m73K62q1k87M07q1m7J95k47J82l63L71p9
5872a5m6M5j04p7L11j14J24m9j57P7l4K68k00j23K19o9K83j19k04j85M9J03K47
5895B30l29P9J0j06J1J94J6J28j90j00J33j51M5j33K65j01l31J56K96M9n48M68
5917I1j35K90l76P3R4k4K30j01kj90n1j8K12k48L08M3m7o9q9O9K31m01R5j37M61
5942C09l36L33o53J75L35n8j04p4j7M0j51K33R0l64K48m4j00K55k81K02k7o0p3
5965a22L40k24m41L43oJ84J5j24j28J25j9J39l67L07O3r6J80M5q7J01k1k76J57
$$ y = [181, -58, 14, -140, 61, 86, -150, 215, 87, 160, -235, -428, -25, 38, -278, 77, -277, 57, 172, 141, 24, -148, -131, 120, 258, -227, -2, -155, 87, 115, 0, 229, -138, -19, -36, -7, 17, 182, 177, -318, 120, -191, -27, -24, -286, 139, -12, 115, -55, 157, 95, 120, -138, 310, 226, -247, 15, -66, -353, 54, -27, -74, 121, -126, 56, -307, 64, -15, -61, -16, -120, -197, 114, 0, 124, 75, -82, -5, -39, 229, 29, -94, 125, 56, 339, 220, 16, -169, -120, -17, 230, -99, -20, -10, -116, -105, 89, 105, 233, 43, -57, 76, -75, -30, -163, 102, 1, -330, -174, 122, 171, -377, 91, -44, 246, -130, -57, 37, 13, 243, 142, 140, -50, -101, -119, 93, -155, 153, 196, 149, 80, -9, 60, 291, -110, -15, -152, 309, -27, 306, -347, -172, 163, 105, 1, -73, -90, -50, -201, 32, 122, -242, 6, -38, -138, 117, -164, 38, 11, -49, -122, 218, -6, -447, -104, -110, 74, 89, -35, -163, -38, -57, 82, -285, 22, 85, -11, 169, 214, 127, 228, 207, -69, 88]
5988H8m35M38j15j81K1L43k97J01l8O1Qj72J06p3L17j00j21j80L99j68p4j64J66
6011g0j52K30J0k81J36J01J69k04Q0J79j05r1j66J75L46o48J41P9j98M01j84j6
6033f8K8l2j26K74j09O6K4j1Q8k49K11R0j24J68k33J85j41k43L7K18J4l81L46
6056C2l6K91M1k95k20K03M6J26m45K95N8Ql94K69J1l08K61L34l61N1L72n03K05
6079D1M6j09k58J11K47j44K2j02P1m6j69L44L4k51J23o0L98P2k91L2J54l52q4
6102a71rJ20J84j76n8r6J32j13L15j74J31J26q1j15K18p3l39J10p1pn6J24n4J68
6126C5k67o0M27j42j6PK30j61k57J60K06l12L83k90j67L64k16r9l6n1J72J04k37
6149b23J60L67l60n9K33K86n79L57l03j68M52l08mJ6K68l18J91m0J9K23n37J90
$$ y = [88, -347, 91, -24, -205, -184, 159, -138, -37, -75, -14, -6, -178, -72, -145, 172, 72, -49, -229, 170, 2, -72, -236, -70, -222, 8, 18, -263, -127, -26, 143, -61, 19, 198, 93, 2, -164, 11, 357, -291, -150, -71, -269, 132, -52, -68, -40, -72, -198, 76, -33, 33, 57, 46, 134, -115, 96, 186, 62, 230, -3, 182, 41, -202, -165, 53, 67, -314, 32, -4, 287, 328, 33, -187, 16, 62, 188, -257, 38, 96, 104, -290, -21, -10, -318, -57, 277, -84, -33, 339, -164, 41, 87, -22, -280, -169, 78, -66, -44, -146, -75, -121, -290, 54, 88, -163, -40, -100, 298, 370, 79, 111, 265, -87, -171, -180, -60, 124, -52, -110, -206, -74, -187, 128, -46, 85, 211, 130, 15, 233, 160, -179, -69, -140, -147, -203, -79, -133, 35, -232, -292, 135, -7, -23, -16, 214, 53, -204, -44, 162, -150, 233, -57, -224, 140, -76, -175, -211, -262, -90, 14, -223, -63, 304, -56, -115, 118, 404, -175, 182, -121, -289, 163, -145, -149, -133, 135, -183, 8, -32, -13, 210, -327, -137]
6171a37o1L62p4r8k97L34R9l33L70j68J56J03l1m78J17K5O3j97N7j24qK30k3k64
6195c77M29kj0j51Q7l0J36J07P3m20L11J18k17q7P9j88J91k67K76KM6j4JR9j17
6220G5N0K53n34m7N4K01n63K29K52M6J5j14J64Q2k92j0K64K5j54J10Q1J00m16
6243a29J36p2j75M20k33J12j01m0L59l24N8K23j72k21K57k95k07N20j64Q1j3j15
6265i5j26M04j18O6k93oK85O0k03K94m79QM66l07J27q8K67K7l5K01l95j58J44
6288D6K72l24P6j05l5o9j24J98O3K4J9K99j87O6l21L49k48Qj8L29k67o4j29J20
6312b2J72k37j40O4j6K60q9j1n2m4o4l7M72j04j67k0rm1K4Q2P1j45m9J05M9j13
6338f1J4n1l27L60J44qJ14k92mp0K13j81J24J91J45o8m79J91L5L4p5j25j23N36
$$ y = [-137, -198, 164, 90, -8, -305, 29, 128, -205, 165, -3, 153, 256, 225, -253, -136, -111, -48, -245, -188, -312, -320, -90, -113, -377, 52, 50, 40, -111, -24, -54, 82, 189, 262, -158, 153, 271, 54, -33, 46, -142, 49, -218, 58, 60, 106, 92, 93, 192, 75, 125, 378, -156, -203, -149, 52, -511, -282, -30, 16, 31, -83, 81, 163, -129, -139, 125, 150, -4, 106, 187, 287, -129, 7, -65, -240, 180, -53, 59, -42, -82, 277, -47, 11, 234, 62, -159, 98, -197, -404, 116, -48, 33, 20, -95, -221, 183, 65, 131, -162, -168, 117, 177, -26, 268, -211, -203, 263, -44, 83, -5, 262, 289, 254, 455, 60, -98, 46, 318, -6, 70, -35, -70, -139, -263, -65, -2, 22, 41, 340, 153, 219, -102, 247, -1, 7, -11, 318, 51, -13, -142, -22, 150, -87, -227, -163, -179, 81, -8, -19, -71, -115, -179, -216, 256, 152, -15, -35, -44, -85, -61, 21, 92, -53, -102, 3, 52, -61, -47, -98, -425, -65, 79, 71, 185, -107, -111, -181, 32, -149, -25, 166, 311, 243, -236, -45, -10, 24, -51, -176, -299, 237]
6362B37m69J91k62O1K44p9j4J09R0r1L7mj44j1n5N2L14k70L1K29M1k60Q9P8j24
6387B0k77j9O8K27K37M9k39j01J54l93J95j4K23K44k44k06K34ok17j49O03j92
6409A97l97M54j36k7J2K9k91J20J53j04p9R7L23k61p1O6J59l39j3lj9L75j78j53
6433h6K49l53J38M6l33L13O7n6j63J91J40K65m12k49K20jq7L99l39m5KJ00J66
6456A72r5r6J76j61j8M1n9J68l1j56j55K71J11k71J72J01j52J26n1k42J7J78k72
6479b26P2R2j47J4O9K0j36K61j21N1J06l08M22l9k41R5q0L02L0l07L12l72m4L3
6503a42L44k23M59l89RJ29l6m7j04j61K71j31JLk96L84r0M78l28k51O6j70M3K09
6527B8r3M4O5j01L57k57k59M12l89j22M92j05l04K65k05p9k5L42Km2ql63J12L20
$$ y = [237, -232, -41, -303, -242, 2, -77, -91, 18, 108, 17, 54, 50, -94, -105, -160, -108, 206, -64, -33, 196, 237, -23, 66, 144, 20, -257, -276, -208, 19, 256, 305, 66, -35, 119, -274, -79, -93, 130, 374, 130, -76, 158, 152, -65, -214, 389, 197, -200, 254, 118, 91, 103, 132, -159, -39, 114, 10, -69, 28, 351, 90, 19, 85, 244, -95, -108, -111, -130, 245, 67, -86, 163, -190, -52, -6, -339, -26, 41, -15, -178, 13, 153, 418, 6, -243, -23, -24, -111, 288, -51, -96, -94, 6, 172, 77, -19, 157, -4, -22, 19, -40, 128, 97, -59, -214, 57, 168, -103, 69, 170, 18, 144, 93, -149, -132, 46, -226, -154, -62, -209, -195, -126, -106, -242, 19, -102, -51, 55, -253, 169, 130, -111, -16, -96, 206, 236, -71, 241, -131, -175, -142, 202, -21, 438, 49, 58, 187, 151, 104, 0, -161, 110, -21, -20, -17, -313, 71, -19, 459, 131, -120, -54, -224, -181, 28, -65, -21, 44, -57, 300, 43, -216, 196, -193, -315, 177, 72, -232, 33, -172, -251, -276, 66, 68, 26, 18, -345, -233, 87]
6551H7J51J51l55KL6l09L36j47J42J3pj04j64L4k9K30k08J65j63M4M52n83L61
6574A35k84K4l2K46K85q79K77J88q8K39k02j01j91M31L0j39J9J71k73Q3m1j33
6596b35M10j34J43k0j71n8L21n51M32q6j10J56l31J62P8k95M44J65l42P7m1j1
6618Ck95L85l39J23j71L98k58j67M95m6l28M28m07q7P0L79m8L7l64K07L7j09N1
6641fM70r1m67j26K62j77M02j99J70j29r8J44k53m3J37k59L05J1P6J06J11l16
6663C0p6P0j08L33Mk05k15K05q1P2l4M2J7J4j50J59k30K4J80J86o8l86K80o9J49
6688A43n5K76o47J42p2L26j64k65K26pM82n13J47L3j44J31J61k49k58K51M22n31
6710a65K47j84n4Q1J09j28K44j23Q1l12K22Jp8m5J81Q7J63k76k09K69rj11j3J86
$$ y = [87, 238, 389, 34, 36, 72, -237, 99, -48, 94, 107, 100, -4, -168, -134, -163, 67, -141, 24, -139, -95, 357, -226, 135, -149, -125, -157, 89, 374, -505, -228, -40, -128, 111, -91, -192, -383, 48, 78, -61, -42, 129, -144, -61, -102, -235, 175, 41, 184, 164, -7, -65, 256, -295, 137, 51, -59, 97, -234, -72, 6, -289, 155, 320, -22, 55, 14, 3, -292, 93, -246, -123, -294, 104, -154, -321, 174, 128, -200, 228, -179, -266, -196, 183, 135, 172, -192, 15, 52, -57, -6, 464, 373, -94, -220, 42, -135, 267, 68, 238, 109, 11, 155, -98, -141, -4, -263, 42, 53, 129, 235, 346, 30, -46, 24, -84, 249, 253, 48, -167, 38, -43, 29, -5, 37, 54, 68, -82, 77, -153, -129, 51, 237, 169, -217, 63, -6, 143, 88, 364, -283, -141, -213, 113, -51, -316, -90, -97, 385, -128, 19, 52, -92, 39, 200, -49, -307, -56, 366, -165, 82, -102, -156, -75, 34, -94, 150, 27, 108, -204, 18, 19, -59, -104, 77, 164, 327, 51, -158, 111, 102, -9, -22, 164]
6734A64j63k11J96r4Q3K58l25Q3P0J95k16R2j0j36Q1J89o4k21j12K25j39j0MJ91
6758A30k24M8P7j29K31j78J74J34k81K2J31Mj3N9n7j7mK50m97J94n3o1K48k40
6782e2j1k56K19R8R5j02j3J43pm7J16k61j55K07j46K14J56j54M2k06L4m9J33j44
6806a46J18K33K10p5j28l98J14L23k08J68j69j25J06rk58L30K6j81j4Oj13L93
6828B03j40j02O7j87M2L83k93M5r8j16L14k97K27m5l38K07K39j29j00K16l15K75
6850E8L5j47M7K95n30K86j20K65k84k07M10J13j54J17n7j0N7k76m8j18L67j41
6872d2l7J02M5j18lK36l53K46L0k11J20l0q0P1j8J31k6q4J13k07M9M7J24l8M6
6897A13k26JR7K32k79l9M65m50L67l15PJ03m1J2j74K03o1M5k92J4J97J88k65J
$$ y = [164, 1, -210, -14, -108, -25, 233, -92, -9, 61, 256, 40, 132, 122, -14, 67, 256, 192, -29, -141, 84, -55, -65, -61, 130, -94, -46, 31, -98, 133, -45, 129, 263, -18, 4, 135, 139, 126, 185, 128, 111, 107, 357, -140, 54, 1, -60, 188, -52, -63, -319, -100, -2, 93, -9, -22, 121, 114, 67, 183, -78, -233, -26, -172, 42, 198, 44, 86, -120, -86, -135, -2, -146, -28, 205, 415, 340, 212, -186, -72, 251, 43, 211, 42, -83, 23, 14, -244, 86, 112, -69, -83, -77, -190, 203, 63, -39, 28, -159, -117, 266, -27, 18, -80, -196, 118, -179, 48, 3, -335, -128, 111, -18, -118, 98, -217, 58, 93, -54, -7, 288, -242, 44, -76, 189, -95, -302, 108, 221, 67, 184, 127, 117, 174, -102, -150, -268, 99, -42, -79, 23, 68, -50, -53, 183, -170, 76, 106, -105, 15, -15, -95, -24, -42, 89, 63, -21, 92, -115, -66, -19, 105, 67, 113, -113, -112, -15, 217, -62, -101, 364, -86, 281, -34, -27, 76, 35, 47, -127, 76, 15, 60, -232, -218, -21, 167, -98, -97]
6921i7N8L4P4O4o5q1o2L1L27j93j80ON0M72n99p6J49l2J03P7o2J33k63J96P2k24
6947h8Q6M9nJ51n48N77k05k23J75Q3k56K94J2p0j92L2J44O3J4O2j42l4Q0J6k69
6972a94K54j88l3Q0j36J92j73L73j76k1J89j64j93L26k22J45J44l62J91l31L77
6993G8p9J6r2J66k06O0j52J64L79l52J36k02%r4K93Q0J3n97O41R5k94k72L62k33
7017i0J60R7j10j67L06l00J6J63J01r1k60M17j67j16q2J63p3K88k8m10J71K9j80
7040a63j75R9J93j24K71j08N3m8j38J41J60k05J96N3n19J48Q9r0J22r7p6L84k68
7063a02J28R4j51j04K07K24m86M83j43k20j67k38N80k98L94m46J65J04j03J36
7083E7j16J81k80m2K09K1L68l38j26P1L55k95l30l4P2L53J38l75Q9Q0l35K53j06
$$ y = [-97, -39, -5, 69, 133, 68, -13, -75, -44, 283, 90, -90, -84, -34, 438, -161, -237, -88, -120, -17, 60, -2, 131, -132, 64, 136, -88, -2, 47, 42, 193, -355, 222, 17, -206, -31, 52, -204, 90, 102, 32, -160, -128, 16, 79, 93, 155, 13, -21, 59, 75, -194, 60, -128, -161, -81, -217, -25, -198, 175, -1, -22, 167, 3, -190, 136, -86, 59, 203, -159, 32, -299, 78, -1, 15, -77, 89, -117, -57, -209, -45, 334, -18, 118, -84, -84, -178, 115, 195, 208, -389, 252, 347, 53, -219, 143, -90, 70, 167, 57, -110, 196, -104, -88, 75, 176, 85, -175, 242, 75, -41, -123, 40, -33, 255, 227, -183, -12, 17, -163, -338, -239, -46, -170, 101, -7, 46, -2, -140, 1, 161, -44, 152, 205, -314, -166, -77, -167, -45, -142, -218, 166, -102, 26, 120, -31, -135, 72, 296, -190, 293, 150, -70, -237, -475, 105, -193, 201, -245, -80, 24, -79, 57, -59, 122, -158, -200, 9, 30, 398, 60, -66, 5, 360, 65, -265, -299, -227, 126, 264, -111, -22, 58, -277, -24, -130]
7106a30L04P1r9J25k5l53K05l23K86J88l84J96j18L82l67j18L89j12p7j15L3m38
7128d80L81J8L80m04k0K54J6l04L42j6l42J95J81j14J08o9l28M97k47p8P9k5k27
7151b03K58k64M68m27J7J24k6R9j7J60k38JJ94k11K33l48J36K29j62p5K22j69
7173Aq4J03r8k1K17m7j24l4J62j78oJ72K5l72K24j08J52l7m7L29l28L46j72jq2
7198hM8J7k67L64k49J83j31J14K22k59q1K54j23j50L9m6o9R2J23j45M0R5J41l59
7222a55J39M3J1k68N3J37l5j7J20j03l7O8n5J54l85L34l44L81j08L87k18q6m2
7245b6l9k52L09O0M7j20l24J74M98k06J22j51K06l27k11J46l7K11pl4j4r8K05
7268A32n17K30m0M58l11j13K61m64P22l45j97L78k66J70o0l67M15RL94n56j59
$$ y = [-130, 174, 245, 146, 271, 246, -107, 98, -225, 61, 249, -135, 61, -57, 325, -42, -160, 229, 117, 40, -75, -42, -480, -99, -81, 299, -105, -125, 129, 145, -159, 183, 167, -175, 20, 201, 87, 195, 126, -202, 295, 48, -30, 49, 24, -203, 55, -209, 259, -168, -151, -27, -53, 46, 29, 189, -49, -48, 146, -65, 168, -180, -44, 185, 23, -52, 170, 1, -83, 20, -78, -99, 118, 71, -53, -87, 75, -103, -109, 63, 88, -284, -60, -168, -16, -53, -100, 229, -99, 247, 75, 74, -8, 40, 57, -210, 154, -95, 88, -43, 71, 293, 34, -47, 207, 84, -66, -27, -73, -142, -50, 73, -72, -32, 63, 204, -155, -16, 27, 38, -230, -177, -40, -75, -92, 28, -75, -112, -44, -99, 55, -330, 4, -340, 41, -67, 320, 102, 16, -26, -65, -317, -8, 52, 99, -21, -345, -171, 327, 121, 243, 92, 298, -29, -240, -94, -131, 80, 73, 39, 25, -73, 132, -385, -155, -195, 263, -48, -161, 100, -364, 358, 13, -184, 194, -72, 98, 38, -329, 86, 95, 489, -67, -226]
7289b26K43k1m9K86k21J51l76M45k77j15L79m07L0K24m9J89j4m57M56o2j19J44
7311A54k3m0j48J27j43R5j63K10j66J00R7l7j55N9j5J16k0k00OQ8J16J20q1p5
7335B2m4j12QR8k7K41k30q6j23J68L24k21K96k74l84K20O1O6q6J90k8J98k81J44
7359A40k75ON77m38j09J49J77k86k00P05p44n1K40M50k65L5n9j22J62J3l4j84
7381a13j22m3J32kK61j12k4N4J72j85j10L99l42L02j91P7m53M60J37l07l63R5
7403b78M10j92q5K37r6K93l52J18J8q5K54l51M26j04j56j12mK45l16J99J8j12
7425b5J58j46J38r5kj65k23L46J08j24J48l87L6R5Q6K18j44j9J1P5L6j87j65L28
7449A01J46k71J51K91m82l1K39R8n43L96k02L44l79J59p8j07M41ql07Pj50L18
$$ y = [-226, 17, -4, -53, 233, 12, 163, -213, 232, -45, -160, 219, -188, -158, 66, 17, 206, 192, -265, 191, 129, 10, 154, 131, 91, -57, 70, -73, 22, -141, 69, -97, 3, 100, 63, -92, -33, -48, 68, 48, -152, -146, -58, 58, 178, 97, 22, -22, -134, -126, -28, -55, 186, -44, -130, -253, -85, 239, 18, 314, 40, -344, -124, -63, 3, -83, 107, 79, 277, -4, 140, -135, -129, 448, 10, -99, 50, 227, -59, -259, 446, -298, -349, -109, 341, 76, 111, 52, -70, 92, 105, 71, -113, -235, -278, -146, -148, 113, 1, -23, 31, 203, 18, -92, 307, -35, 267, 76, 153, -300, 160, 297, -10, -373, -278, 132, -60, -145, 92, -4, 289, -63, 55, 73, -12, 242, -109, 317, 213, 57, -55, -59, 186, -130, 69, 87, -25, 133, -13, 125, 30, 28, -137, -360, -14, 94, -30, 118, -269, -233, -138, -52, 166, 22, 3, 14, 89, 125, -62, -227, 101, 247, -24, 127, 418, -64, -95, 144, 242, -301, 95, -107, 237, -142, 17, -61, -168, 273, 265, -42, -35, -185, 133]
7471A33j54M4P3l09M21j44pm26N72l77M67l32k3L6M0L1m5j82L64m07M31k89K55
7494A72o2k31M0M41k71J26Qj83J83m51L66J25k56k62J40j35J42P5j64L64p8k64
7516a75M80n21N50m96K9j55M86l29k3M00n8q7p7RN0J2k02k50L09L14j62k09J62
7539E7J5r0N3K29k38j45K9K33J50j35j37j04J44j03K62j0j54j71j26N53j57j41
7561A4r8K33k27J11J15r2j82K91l07p3J62J27q8n3Q6n2O8j43pQ6n5O3J92j49K15
7586B37l46J52k79K70J58l34K72p8K8j45q2J72R6P4j62K08l29p4j21N05m95K98
7608B5j90Q4P3J77l38K87O2j72J41k41k27J03mP9J89j46K03L9m06L21m49K42Q
7631a40O7M33j95J23r4j15J08j50Q9o2j03Q1k59L85p4l25M13l7K4n1j73N9R9k5
$$ y = [133, -21, 23, 96, -213, 208, 64, 57, -369, 203, -174, 293, -39, -62, -26, 14, 45, 0, -182, 182, -225, 206, -83, 172, 110, -121, -81, 360, 89, 215, 223, 40, 223, -228, 138, 263, 7, -255, -115, -250, -108, -33, -197, 167, 89, -175, 305, -216, 334, -162, -133, -288, 198, -131, -154, 246, 188, 101, 24, 33, 83, 95, -107, -357, -48, 266, 104, -105, 57, 72, -18, 35, 264, 26, -119, -90, 143, 293, 158, 21, -83, 61, -42, 220, 210, 56, -115, -241, 312, 155, 14, -84, 149, -78, 33, 148, 56, -126, 165, -142, -215, -53, 74, -14, -67, 19, -33, 35, -108, -115, -29, -84, -21, 171, 22, 237, -109, 43, -236, 34, 192, -142, 130, 52, 80, -65, -147, 25, 121, 195, 33, 241, -88, -162, -283, 222, -273, 25, -165, -81, -8, 169, -169, 118, 180, 8, 149, -92, -319, -216, -220, -141, 48, -98, 105, 144, -262, 59, -390, -148, -140, -73, 360, 165, 288, 194, 79, 187, 37, 126, 64, -39, 42, -217, 168, 94, -231, 182, 145, 169, 118, -55, 4, 103, 78]
7655G8j84J77K23j53J70l96L73k61n9L7k30N1J77j37K50j73J05p9N4l5J18L42
7677D48k96k65j72K11j20O2O7j56J12l00L90j51J18k27Q1j57K63K03k98Q3K34
7698A30j69J13J85r6R9l70k1j09K98o2l06L12j02j60M09k42J64O8k48M17l57J41
7720I4N0j44J46k02O5l26K87R3j66k9Q4J77j87k1J78k89R7L4J94l39J82k32N10
7743B56m34J14n1K55O3k49M02J5l73k42K39J06k3K62n81K18lP7J39J9j55PL3N9
7767A53k71j09K26k47K43J17j91L4j75K02K23r8n5J2n3j47K73k03Q4jJ37k72M3
7790g5P9L08k71%K09k14j08K22k32J48L16k36j79j80J08L82l00j48J32J06K46
7811C13n14K26p6j1K50l44K47l7j12Q0K00m76K04L9K2L61m12J12q8Q0L7J65j67
$$ y = [78, -106, 71, 294, 141, 311, -85, 288, 27, -32, 5, -225, -174, 3, -134, 116, -57, 48, -31, 23, -12, 106, 448, 152, -113, -285, -74, -194, -132, -65, -221, -109, -409, -19, -170, -52, -279, -198, -355, -92, 111, -187, -104, 130, -39, 74, 259, 163, 262, -108, -129, -238, 60, -2, -308, 4, -98, -258, 151, -91, 73, 141, -107, 310, -47, 94, 144, 0, 146, -56, 9, -317, -30, 63, -103, -132, -48, 129, -58, -79, 99, -190, -93, -59, 135, -204, -22, -254, 256, -178, -64, -115, 140, 203, -46, 356, 371, -2, -244, -5, 101, 78, 340, -241, -23, -26, 51, 190, 209, 54, 61, 94, 153, -118, -227, -1, -248, -5, 112, -79, -45, -220, -18, 205, 107, 52, 64, 11, -136, 137, -66, 18, 17, 154, -118, -75, 4, 312, 41, 41, 250, 36, -72, 150, -82, 66, 382, 146, -33, -213, -105, 277, -23, -171, -39, 67, 313, -201, 25, -51, -62, 188, -156, 91, 54, -58, 22, 222, -254, -50, -11, 11, 372, -40, 72, -16, 64, 101, 266, 99]
7834I9J18j17j04N8m6k65NJ90K0k91N11p6k0o5J6O0k43L3o6N61o28K39K85l06
7858c2J22k0k89K08L3j57J98l28K12Qj51L41l8oK4R1j37J87n27Q7J82OP1P4p5
7883H4q4K15k4j13j59R8j19J68L89o42K20j43j46L03lJ58j87K26n65L85j13K20
7905A68k30P6kk0J17j44M5R3k18L03j56j50PN6P5J33j82k57K32mOJ40rj95n2m8
7931b16L00n41O04J9j8k22l3K10j93J78L2l1k39L4K50p0j84j70L76j14J38k83
7953a73J44J61k35M89n30N13o15K64mJ26j19nk23J73k17L51n7J46k93LKR9j5r6
7977a11K74n4k72K69J65l09L6K10j84o6r2k6o6J31L36l89K36K09n22K76J14l77
7999b12J68K87k47o4K63j21O5k16p1o9L75j02n3j04k03J54o7L72j92J8J09k72
$$ y = [99, 217, 100, -4, 54, 8, -257, -252, -62, -42, -333, 178, 102, 82, 17, 33, 93, -150, -117, -183, 378, -250, -11, 274, -32, 90, 70, -219, -11, 22, -135, 63, -265, -53, -45, -196, 145, 107, 101, 125, 216, 79, 266, -261, -174, 8, 14, 85, 159, 84, 0, 215, 191, 78, -81, 17, -102, 66, 455, -187, 33, -110, -256, 47, 44, 202, 15, 241, -324, 61, -52, 168, -62, 14, 12, -8, 109, -35, 10, 103, -115, 188, 32, -118, -111, -55, 20, 153, -29, -286, -54, -58, -52, 88, 79, -116, -168, -216, 84, -457, 147, 166, 148, -74, -107, 103, -90, 88, 120, 89, -150, -116, 134, 64, -120, -290, 86, -28, 110, -173, -29, 132, -103, 386, -144, 369, -246, 18, 14, 140, 21, 16, -207, -34, -251, 100, 43, 189, -104, -101, -99, 0, -15, -111, 163, 109, -163, 106, 271, -38, -2, 208, 24, -42, -134, -160, -226, -95, 241, -148, 88, 297, -225, 51, 165, -212, -44, 243, -4, -68, 195, 74, 139, -77, -148, -217, 158, 56, 3, -101, -304, -150, -217, 155, -37, -19, 90, -182]
8021a82K08L06m52L70j42Q2k41j15N8J09q5Q9m2k57K26M20l64K53k19j59O0NK74
8044B02r1O0j70PP2m3K29j58k36M8qk76K46K85j98O5j78Q6J6k21L69j2n6r1K37
8069A84k29j77L67J10k84K5J48l37J45M1k7K95J7p1l38N2J18n0j48J88M8j10J85
8092A52L0l22Q4k02M39j17K2M2j18K98m52J89j16k8K58M9m60K91l9K0m41L12J24
8115A5k03L05k39K07k38J16K76k50j45J27J27k33j0L21j50j00J67j11K45k05q6
8136f4K00L6j29K0nk73J20L84j88l85M85k1j75J37l2j08k0nJ8K23j35m10K43J04
8160B0M6jk2k50mL34j77J61m9L4k12J3R6o4J39l05J79n3q7K97K7k02K86n03L38
8185D1m4p2P5m45K57K85
$$ y = [-182, 26, 332, -120, 250, 108, 190, -51, -166, -108, 1, -84, 5, -37, -294, -68, 352, -12, 241, 22, -137, -77, -72, 202, 111, 171, 1, 8, 80, 37, 266, 108, -128, -80, -88, -364, -118, 167, -31, 34, -144, -58, -42, -263, 106, 94, 38, -53, 184, -45, -222, 145, 255, -29, -4, 144, -193, -48, -7, -34, 261, 278, 207, -131, -79, 39, -11, -159, 29, 77, -33, 152, 182, -140, -56, -258, 181, 64, 86, 128, 10, 308, -144, 45, -71, -99, 159, 208, -252, 39, 0, 20, -421, -109, 15, -188, 117, -122, 85, -153, -37, 239, -11, -156, -29, 98, -135, -145, 176, 26, -74, 93, -18, 227, 22, -64, 136, 172, 43, 63, 58, -215, -95, 289, 101, -284, 201, 180, 5, 142, 110, 2, -18, -23, -5, 218, 83, -327, -84, 20, 66, 65, 43, -207, -211, 123, -54, 107, 58, 92, -120, -107, -11, -75, 64, -241, -62, -115, -202, 95, 122, -80, 206, -297, 41, -3, -75, 0, -445, -188, 97]
8191I7
$$ Imaginary data points
##PAGE= N=2
##DATA TABLE= (X++(I..I)), XYDATA
0@%%%%%%%%jLj0J6j6J6k4L2l3M1m9N7o5P4q9J03j20J38j54J72j96K22k49K80l15
33a67L53l95M42m90N43o03O68p40Q19r06J005j114J233j370J527j704J911k156
51a144K448k803L250l831M621n762P566j0867J8881p3499j16074P1229K7633j3278
65i1630K4606P6540j3603p9092m2567N164k0804q951L9982N0668J5487M677j2091
78e1614l6160k2058J7020N501l044M4667O2298j1112m2792J8333K9448m1533l1680
91f2726O0681O0629k0732j1846N2305J8969n4475k4760L5219J1202k1575J8577
103F1468M3904R424j0115J398j1804k9162q308L562j1837P130M4139J3641l5526
116G7914j2977J4199l7149o3824P342N0005n767k5788L0699K5491n4213o0701
$$ y = [0, 0, 0, 0, 0, 0, 0, 0, 0, -1, 2, -8, 8, -8, 8, -16, 16, -17, 24, -25, 32, -33, 41, -48, 55, -65, 73, -81, 91, -105, 117, -132, 148, -167, 186, -209, 233, -257, 286, -317, 351, -389, 430, -476, 529, -585, 648, -722, 805, -899, 1012, -1144, 1304, -1499, 1751, -2080, 2541, -3221, 4345, -6522, 12359, -61140, -177214, -105985, -78352, -91630, -67024, 9516, -4087, -83179, -125746, -120582, -141386, -150337, -110355, -59687, -44200, -39523, -51614, -87774, -109832, -92812, -87311, -90355, -45688, 16610, 5498, -37294, -18961, 10487, -31046, -62726, -2045, 58584, 37852, 26006, 78311, 97280, 42805, 18045, 53264, 64466, 42891, 61468, 105372, 114796, 104681, 106079, 94275, 65113, 56805, 60367, 48530, 55660, 99799, 113440, 77914, 64937, 79136, 41987, -21837, -14495, 35510, 29743, 3955, 34654, 60145, 5932, -54769]
128e4769L974Q593k7731J965M6439J7621k5819j6832j1599l4722k2435J6059J7188
141h2068Q505L0673K4692k7055l7166L125r76l1495P975O4695L1722k0398M686
154b3085K7078k5394n0130Q890M2156P456K800M1547K9270k1170k1640L912p495
167A4195j3422J9567L1976R177Q625K0667q871l4872o786J4540j2674j0945L5767
180F6944L3191j9020k1645J3850o841m6375j6082L0215J0618j5405J2209K2731
192F4390j9454l7332j0426n439k1244j875K4992R590o302N351l952l6057k7282
205f5040P019J233j4025J7555L8882j374l0487k067N488l1111k4136K6395L2274
218c9394j917L586K4816r59l2341j3450J0505n60K777K9291K6608j62r86M525
$$ y = [-54769, -50795, -42202, -69933, -67968, -21529, -3908, -29727, -46559, -58158, -92880, -115315, -99256, -82068, -73563, -42890, -18198, -45253, -82419, -79294, -80270, -111765, -103790, -39095, -7373, -27771, -23085, 3993, -21401, -71531, -62641, -20485, -13029, -10229, 31318, 60588, 39418, 17778, 21690, 14195, 773, 20340, 52316, 61493, 70118, 90785, 81914, 47042, 40256, 54796, 42122, 31177, 66944, 100135, 81115, 59470, 73320, 66479, 20104, 4022, 34237, 44855, 29450, 41659, 64390, 44936, 7604, -2822, -8261, -29505, -31380, -6388, 3202, -3100, 2251, -1701, -37758, -65040, -58021, -56788, -70813, -53258, -14376, -15750, -46237, -48304, -42816, -73927, -98063, -71668, -39394, -41311, -37725, -12909, -13868, -46209, -59659, -49154, -49714, -46937, -17646, 8962, 8800, 7814, 12339]
232A2339j6333k2064R359K2492L526R732L3967J2661k6118j4759R634q047k0403
245E986J6919L7103O822j0244R685L336k8722k3466O931P768k780J2548K0174
258F2060l307j7024p173j3075k4638o095J6067N654m042J2491J0152k3777k9589
271b2296j318j027j8866l34K8700J2364j4895n778M242j8794k6911J304J5565
284d8044L205N650J9095N684j5255j0499k828j1668n191J9492J9652L682Q158
297h867J3975p722k4193l673J2930n79J189K6977K4444n513j1020M135m189j8865
311i71j017K0985J3894M127J1656Q509j2966j6455m054m165n097J1137J9718L633
325D8934l803K672p050k4579j4438P550M107m554J0672J7935o224k1436r134l553
$$ y = [12339, -3994, -26058, -16699, 5793, 9319, 19051, 53018, 65679, 39561, 24802, 34436, 26389, 5986, 22905, 60008, 66830, 56586, 66271, 69607, 40885, 17419, 24350, 32118, 29338, 41886, 62060, 58753, 41729, 34556, 21481, -3157, -9252, 6815, 12469, 8427, 20918, 31070, 7293, -22296, -23614, -24641, -43507, -43841, -15141, -2777, -17672, -23450, -19208, -38002, -64913, -63609, -48044, -44839, -39189, -20094, -14410, -29665, -40164, -42992, -54660, -59851, -40359, -20707, -17025, -8867, 5108, -2614, -26807, -30480, -17550, -18129, -16940, 10037, 34481, 28968, 17948, 22083, 17894, -971, -1988, 18997, 32891, 37018, 48674, 57183, 44217, 27762, 23708, 19543, 14446, 25583, 45301, 48934, 45131, 47803, 40753, 16174, 1736, 9286, 13393, 8839, 19511, 37446, 31222, 9786, 652, -2901]
339b901j6206r938J3156J4359j95p30K814j0959j9768q770j61j737O004J6133
353a8899Q043n080l407k815j4967j3286O763J3937L343O460J6970L769j5346j0699
367b5214K609j988m416J1900K1262P971q28K392k522j2837p378N006O690P422
381A0069J4200J1148k603o986l690q204j1532L172J4778P302K027Q179K832j3861
395B6831j6880k827P88l584M397J5095P176o494o994o095j2295j1153MO776N369
410A14O837N305l971j0624r133p134q008m6J1256R225J001J626J572r586j5330
425b6896m431M873K349L937J1644J0331l074q235m883n157o205J698R789R886
439d374P379M631o83p399p303l692j905K833J0965J1498M002k43j28n570j1185
$$ y = [-2901, -19107, -29045, -15889, -1530, -1725, -2455, 359, -10600, -30368, -39138, -39299, -41036, -35032, -18899, -10856, -15936, -19343, -22158, -37125, -50411, -43648, -29711, -26368, -19908, -2938, 831, -14515, -25214, -22605, -24593, -29009, -17109, 4153, 12124, 11296, 13688, 11166, -1671, -9049, -4043, 2647, 10069, 24269, 35417, 32814, 25828, 22138, 13934, 2402, 5574, 20352, 27654, 29681, 37860, 40692, 26831, 9951, 7124, 7912, 4328, 8725, 23820, 30996, 24502, 17508, 11413, -882, -12035, -12031, -5255, 114, 6951, 12256, 8285, -2339, -11472, -18606, -26614, -26660, -15404, -6179, -5178, -3552, -1980, -11566, -26896, -31327, -26454, -24105, -20168, -8524, 1807, -1267, -9502, -14385, -19542, -25747, -24049, -14260, -4374, 3005, 7636, 6953, -446, -7749, -11441, -13346, -10513, 452, 11950, 15952, 15709, 15581, 10011, -1174]
454a174n710N458O931M184P870Q335j671r370p749m465l533M37P432R139N321
469B1435P65l994p839q452n618j492K496P872Q297K417l150l828p080r542o154
484a3867L076O962M446L960M063j712q601j0028m037p00J499N063P846N891m12
499C449n212p200n883l838p00M677Q195P474K172k156l419n783o739k864L694
514a4133P332O863M543K443q72o141p399m231J837M684N383O855O532O32n953
529H375o909m071j632L2M671Q727P098M42k725l455o388n976k106M402N905N474
545A1864L859M57l324o642o526m476j11N150N097L783K820J1n645r208m601k44
561g736o4J923P623O238j166n135l648n029o304j876M331O006M106K996J037l975
$$ y = [-1174, -6884, -1426, 5505, 9689, 17559, 25894, 24223, 14853, 7104, 2639, -894, -457, 6975, 16114, 21435, 22200, 18206, 10367, 1915, -3703, -5195, -2699, 5173, 13470, 15887, 12737, 8909, 1829, -7713, -13867, -10791, -3829, 617, 4577, 8640, 6928, -1673, -11701, -15738, -16438, -14939, -9876, -2030, 3861, 3449, -1763, -8963, -14846, -18684, -19384, -14707, -6512, 962, 3134, 978, -2441, -8224, -14963, -17827, -14133, -6801, 62, 4605, 7048, 6176, 35, -7364, -11595, -9758, -5074, 309, 7164, 13696, 14328, 8375, 1466, -2605, -4237, -4205, 466, 9193, 16291, 16733, 14008, 10553, 4165, -1811, -3917, 485, 6390, 11864, 15723, 16180, 12856, 6214, -312, -4788, -4899, 251, 5348, 9131, 11951, 11962, 6317, -2891, -7492, -7736, -7800, -5877, 1746, 7984, 6818, 1683, -1965, -6994, -13298, -15174, -10843, -4837, -731, 2265, 3302, -673]
577f73o740m318l275M13M825P608L202J350Q39l680q054n073K502L050K326O046
593C48P790L33o173l468k075m634j381N452P721L349K212J700l739p246l737n12
609d060N91L698P292M799j196j304k319o631o549J813N199J318L217O787M46o845
625F256n505j332l228k857M401P999K404o92K25k321p484m912N21J682J685O139
641B981M911j707l653j919m651o552L47O139L496N71M572K531o648p791q31K69
657g935k651K353Q815M340k927j342o97n962o263J565M271J732L621O053k50n441
673g18k945j661m817r36O666O055O35J591L395l674q421j868L065l56Q53P940
689D804O090k594l220J19l208o260Q24O542K598J404N074J482n564m913n53j968
$$ y = [-673, -7413, -11731, -15006, -14593, -9768, -2160, 1042, 2392, 3231, -449, -8503, -13576, -11074, -8024, -5698, 348, 8138, 8471, 2298, -1170, -3245, -7879, -9260, -3808, 3913, 7262, 9474, 11174, 7435, 189, -3548, -4060, -3469, 229, 7521, 12320, 11124, 9820, 7501, 870, -5679, -3866, 1333, 2651, 5868, 12655, 13101, 6256, 751, -581, -3809, -6666, -2265, 5734, 8138, 7446, 7671, 5350, -2134, -7046, -6525, -4843, -3158, 2981, 7892, 6185, 2532, 613, -4038, -10590, -10243, -4104, -608, -37, 4535, 7066, 418, -7373, -8204, -7935, -10586, -8233, 582, 4922, 1995, 653, -44, -6006, -12269, -10704, -6433, -4701, -1080, 4973, 4723, -718, -3663, -5324, -10141, -11077, -4411, 1644, 2279, 3870, 7265, 3591, -4830, -6698, -3633, -3989, -3136, 4804, 10894, 8300, 5080, 5199, 1991, -4269, -3445, 3097, 5695, 7099, 12173, 13655, 8091, 3178, 2625, 657]
705F57k079M190P510P29j760J832j865q322m676L331J578j098M563N970k226o974
721A360j519j908o511j889N935M248j094J875K255n508p688j379R57k547J637
736a1776P663L174l676j006N70n671o088K460N670O16K119O577J480o345k976
751g209J246k230k097O134P254Q90L90L422j372p185j627M005M78K29P537N949
767A5814k713l473J528k510o615N54P245K270q21M061K644o096o802L08o98l706
783I90K161O609J846l649j83j349p549n472K240J638j767L096N504k399p436j256
799f976q15o160l110O540M619j848M61L672l467p963j502K790q98O21O728N057
815b251k311k121J333l856m201K331N350J805J909O822J398n430k104K013j784
$$ y = [657, -1422, 2768, 10278, 11007, 9247, 11079, 9214, 892, -3784, -453, 1125, 27, 4590, 10560, 8334, 1360, -159, -2067, -8578, -10467, -4532, -284, -1378, 497, 2752, -2756, -10444, -11823, -10866, -13413, -11776, -4113, -939, -4615, -5621, -5051, -10722, -16810, -14350, -8680, -8064, -5945, 632, 2112, -4233, -7209, -5963, -8193, -10290, -4156, 3098, 3988, 4378, 7800, 6428, -757, -2384, 1621, 2099, 2328, 9865, 15814, 13101, 9628, 11156, 8646, 2031, 2585, 9830, 12100, 11279, 15340, 17984, 11888, 5086, 5394, 4696, 990, 3151, 9760, 11606, 7957, 7774, 6425, -1124, -6596, -4356, -2718, -4485, -1389, 4115, 1716, -5720, -6976, -7791, -13951, -17061, -10521, -5902, -7750, -7289, -3617, -7084, -15047, -16549, -13759, -14657, -14036, -7308, -2251, -4562, -6683, -5350, -9206, -13407, -11076, -5726, -3921, -2012, 4810, 6208, 778, -1326, 687, -1097]
830a097k649O108P959k6p60L061J24p131l446M352K083j149M399O403j566n325
846A1340n00j398n330j425M832L195r89K289J523n526o564o55m00l803J171O833
862D593R56l721r98k9o821o515K087L752j448J000N488oo566l080k2l051k872
879a7253M603N628J72J16K320k034o122j259K456j7Q77P055M401j779k103J555
895a384k451m783J943O056K315P17N233K794m519m383J728Ok258L105P412K365
911A3896k098J492m60n620l670K450K068j76L591N309j865n136j471j439n138
926A733j746N115L076j009P29J881m798p413j493P00k307K33N380K241l267k253
942c198j027m505n311Q42L487M18J137M456k32n410k992l40k575j578M585N820
$$ y = [-1097, -3746, 2362, 10321, 10295, 9535, 12596, 12720, 5589, 2143, 6495, 8578, 7429, 11828, 18231, 16665, 11340, 10840, 9442, 4112, 2687, 7519, 10714, 9725, 12014, 13537, 8011, 1447, 792, 392, -3411, -2240, 4593, 5549, 1828, 830, 801, -6020, -12535, -10448, -6696, -8144, -7144, -1656, -1662, -8228, -11308, -11330, -14381, -17253, -12650, -7022, -6850, -6734, -4414, -6448, -12570, -13829, -11373, -11390, -10513, -3458, 943, -836, -2939, -1384, -3835, -8618, -6675, -619, 1696, 2413, 7646, 10440, 5921, 1538, 3266, 3272, 1014, 4119, 11531, 13896, 11798, 13290, 12830, 7210, 3540, 5990, 8058, 7882, 11473, 16782, 14917, 9781, 8310, 6871, 1733, -13, 5102, 8178, 7169, 7898, 9779, 4981, -2432, -3925, -3225, -5532, -5299, 81, 2322, -945, -3198, -4225, -8730, -14041, -13199, -9712, -9294, -8157, -3701, -3933, -9343, -12335, -12675, -15250, -16828, -12243, -6423]
958f423M28o2K100j043n549k119L234J608Q77N628N469r38k689K16j211l278J048
975b704N684L462J314L555K040m055l607L06O90j439L060N849K519j754l24q61
991A3735n266l854J532K503J99K124L748j196n105l559j364m086j900L448L473
1006D432j050k28J91m163o739k009M59j252M16M735K307k605k870j577l367m389
1022a7709O15M182K118J198K984Q93l889l420n25k18j53L783N982J972K15J083
1038h89p92l935j343K771K998J817M570M755p30k491o17p89k541R19N005L771
1054A2479J222K033P88l194m521r98kj94K181M269J641j834k182k303m336l947
1070A102R23J673O39J570J998j510n090l917k043k769j412K761L419J22o09j186
$$ y = [-6423, -5995, -6057, -3957, -5000, -10549, -12668, -9434, -7826, -6949, -1321, 4148, 3210, 521, 737, -474, -3752, -2704, 2980, 6442, 7756, 11311, 13351, 9296, 5689, 5995, 6685, 5246, 8306, 14155, 16674, 14920, 14596, 13735, 8469, 4615, 6147, 8650, 8849, 10973, 14721, 13525, 8420, 4861, 3497, -589, -2489, 959, 4432, 3382, 3154, 3345, -818, -7557, -9566, -9107, -10359, -9943, -5208, -2901, -5506, -8376, -9953, -13320, -17709, -17094, -12912, -10794, -9596, -6612, -5719, -9608, -13028, -13553, -13771, -13924, -10141, -4159, -2187, -1972, -889, -1681, -5616, -6959, -4188, -1190, 627, 5197, 9952, 9222, 6731, 6114, 5325, 2784, 3703, 8708, 12479, 13701, 15734, 16522, 13328, 8807, 7809, 7807, 7613, 9794, 14063, 15704, 13870, 11688, 9385, 5049, 1102, 2025, 3698, 4337, 5907, 7905, 6395, 1305, -2612, -4655, -7424, -8836, -6075, -2656, -2534, -3143, -4329]
1086d329l002n179k347M37J117J562M070K300j292k709j833k142k250J271M046
1101a0280L265K416K121P54k989k812k3N95Q21L553N208K812j2m51p14l048j564
1118c48J904L207K757L203L020n68l127k535r51j814M69L653L322Q98P03p34l443
1135I616m474k041K57L47J667L376J321k035k974l014l598l038K55K187J744J267
1151H63Q59j376l730l908k585q42m9K927L226J349p07j697k443l603j928J049
1167a2595J741L187K797K350o30k313k376j729n32J000M126L304K748R30k65k166
1183d23k593j023P75J868L498M053K388l4j344k161k794j047J618K819K937K783
1199A1320J277p45l163k850k044p04R76K687K731J665k09j828l712l242k700J10
$$ y = [-4329, -7331, -12510, -14857, -14420, -13303, -11741, -7671, -5371, -6663, -9372, -11205, -13347, -15597, -14326, -10280, -7015, -4599, -2478, -1724, -4713, -7525, -7548, -6953, -6132, -2579, 2629, 5441, 5429, 4978, 4264, 1216, -348, 1556, 4763, 7520, 10723, 13743, 13175, 10048, 7513, 6562, 4748, 5217, 8870, 12192, 13090, 13793, 13059, 9616, 5142, 3101, 3358, 3705, 5372, 8748, 10069, 8034, 5060, 2046, -1552, -4590, -4335, -2148, -404, 863, 1722, 346, -3384, -7292, -9877, -10719, -10768, -7841, -4615, -3266, -3973, -5670, -8113, -11716, -13644, -12595, -10854, -7667, -4870, -2520, -3150, -5463, -7839, -9568, -10100, -9100, -4974, -1670, 1078, 2008, 1743, -423, -3016, -4039, -3264, -1396, 2102, 6155, 8543, 8509, 7165, 5004, 2210, 1163, 2781, 5600, 8537, 11320, 12597, 11852, 8689, 5839, 3795, 3091, 4067, 6754, 9485, 11150, 10941, 9113, 5401, 2159, -541, -431]
1215d31J415K465J862J159j535l190l930k688j561K17J927K644J159K48j753l361
1231e353l407k611k55J952K146L051J643o67j965l053k172j131O35K772L395K798
1247b222J278n13k029k581j603L17K056L281L634L138K17j138k234j885j355J033
1263f06L258L213L004J739J58k388l067j571o58J114K521L614J507J25j390k835
1279G738k994k952K20J535J947J911J383p86l383l246l095j746k73J878K490J575
1295B202l35j449k834m377k576n1Q60J545K859K162j060k382k389k560k150M28
1311a2107L140K727K380J413R7k894k326j706M74J032L412L712K814L96n58j510
1327D96k818j342J471K798K465L180K641j36k214j680k306q80O78L811K879J580
$$ y = [-431, 984, 3449, 5311, 6470, 4935, 1745, -2185, -4873, -6434, -6217, -4290, -1646, -487, -239, -1992, -5353, -8760, -11371, -11626, -9674, -7528, -4477, -2834, -3501, -5466, -8519, -10691, -11822, -11187, -8415, -5020, -2222, -944, -1457, -3486, -6067, -7670, -7353, -5297, -2016, 1618, 4756, 4973, 3835, 1601, -284, -1639, -606, 2652, 5865, 8869, 10608, 10766, 8378, 5311, 3740, 3082, 4196, 6717, 10331, 11838, 11963, 10573, 7738, 4744, 1792, 2012, 3547, 5494, 7405, 8788, 8002, 4619, 1373, -1722, -3468, -3741, -1863, 627, 2202, 1867, 418, -2416, -6793, -9369, -9420, -8560, -7015, -4156, -1994, -3054, -5436, -7825, -10385, -12535, -12107, -8967, -6240, -3860, -2447, -2350, -5244, -7570, -9276, -8802, -7770, -4358, -646, 2168, 2564, 2006, 496, -2322, -3664, -2193, 605, 3070, 6250, 8891, 8755, 6541, 4861, 2555, 1675, 2353, 6164, 9043, 10623]
1343A0623L92j07k747m403j505M65N88K269L262J077j120k817k466l674k457M8
1359b572K525J863J071J281j193l881l583j572j293P5K153L209J384j226r99k220
1375d978l832k035J053K015J964K700K082q64k312k186j659j325J298L597L183
1390a299J668J346j63k750l118j76J160P65K887L931K033r64j247j300k829j244
1406a300J506L202K224J875J505p02l069k547j055r04M66L115L249P73o29r93
1422F716k774l835j478J001J280J521K668J511j955l180k063k170k425O87L386
1437a110J835M37P59p80l664l012q67j2J44K655L218J004j277j276k073l502j224
1454h745J913K602J455K272J875j419k988j654q96r53R94L945K981Q44j3j51k379
$$ y = [10623, 11015, 10908, 8161, 3758, 2253, 2718, 3306, 5575, 8837, 9914, 8794, 5977, 3511, -163, -2620, -2572, -47, 1816, 2887, 4168, 2975, -906, -4489, -6061, -7354, -7279, -5126, -1917, -533, -1759, -2758, -4978, -8810, -10845, -9792, -7777, -5813, -3113, -1031, -1895, -4207, -6393, -8052, -9377, -8079, -4482, -1299, 369, 1715, 1552, -1198, -4316, -4492, -3332, -2567, 320, 4251, 6284, 5320, 4073, 2773, -56, -1300, 206, 3408, 5632, 7507, 9012, 8310, 5241, 2694, 1639, 735, 1201, 4316, 7565, 8338, 7709, 6716, 3942, 107, -1371, -370, 910, 2431, 5099, 6610, 4655, 1475, -588, -2758, -5183, -4496, -1110, 725, 1162, 1921, 1141, -2523, -5535, -6402, -6414, -6270, -3615, -397, 607, -670, -1946, -4019, -7521, -8745, -6832, -4230, -2775, -503, 1372, -47, -3035, -4689, -5585, -6538, -5544, -1599, 1382, 2226, 2213, 2062, -317]
1471c17l078o21J543J490K029L799J683k037j680j341k122j584K216L682J452
1486E114R29J829j365l398k470k16k60L72L204L194Q6j156p43k411l538j213J446
1503e96K004J312J911P31j831l365j841j573j523R92L214K025j30pr03l376l352
1520f308l62P16N76K261L018N52j856j615j364k737j467K404K694J826J291J614
1536A243j199l277k186K66J41Q72L620K943O20n54n39k134k545m50K417J610J896
1553B744L151J197k376k000j299j111p33J415L384K093K12O73r51l546l139O74
1569C88L86O36K224K845J4j890k033j432l719r07K160J685J135J347R67k214l398
1586a806k084q22m51P98K967J980l17j89j192k810l038k33J543J315J846L022
$$ y = [-317, -3395, -4016, -2473, -983, 1046, 4845, 6528, 4491, 2811, 1470, -652, -2236, -20, 3662, 5114, 6043, 7872, 6507, 3109, 639, 423, 163, 535, 3739, 6933, 7019, 5863, 5120, 2709, -829, -2042, -596, 1408, 2720, 4631, 5362, 3531, 166, -1675, -3248, -4771, -3779, -565, 1460, 1330, 1323, 420, -2956, -6308, -6670, -5954, -5378, -3117, -99, 453, -1403, -3018, -4382, -7119, -8586, -6182, -3488, -1662, -371, 1243, 44, -3233, -5419, -5153, -5012, -4140, -520, 2423, 3043, 2489, 1950, -184, -2729, -3179, -762, 848, 2744, 5895, 7092, 4716, 2716, 1417, 306, -427, 988, 4372, 6465, 6677, 7350, 6399, 2853, -286, 388, 774, 1410, 3634, 6479, 6493, 4603, 2570, 1138, -2581, -3488, -1328, 357, 1492, 2839, 3806, 1592, -1806, -3890, -4712, -5163, -4365, -1398, 582, 265, 76, -1116, -3926, -6964, -7197, -5654, -4339, -2493, 529]
1602E29M36j974k217q61j537r66K112L473J563P66P75j006l453j592L93R35J063
1619a561L111K997k13j394q70j271k649k67K532J721J663J738J088k282k543j781
1635A9l07o09J215L306J541k29m2j161l143k362o9J330O13K190K277j08k159j547
1653G55j746k088r30K105K620O99Q50O91j693l267k081R9m09J345L135J971o16
1670A440r06j166k456k183r7K033J451J462K157K72j918k511j053j072l52J878
1686c021L183J213L35J57j521k584j595K87Q41J375K204K454n67j392p00j404
1702g35k424LK490K174J175J376O13k080k211j248m2m51J756K830J678j87q14
1719C903r73k329j996M05J406J188J941J681m17k090j664j395j408n82K497J669
$$ y = [529, 965, -1009, -3226, -4087, -5624, -6590, -4478, -1005, 558, 1324, 2099, 1093, -2360, -3952, -3559, -2624, -1561, 1550, 4547, 4334, 2940, 2070, 799, -1850, -2117, 415, 2136, 3799, 5537, 6625, 4343, 1800, 19, -288, -897, 318, 3624, 5165, 4936, 4894, 3733, 590, -1772, -1841, -511, 102, 2292, 4569, 4461, 2302, 755, -991, -3079, -4009, -1904, 716, 1415, 2265, 2956, 1263, -2004, -4085, -3986, -4395, -3050, 85, 2056, 1440, 534, -632, -3088, -5271, -5368, -3335, -1884, -422, 1735, 2007, 89, -2422, -3475, -4547, -4899, -3021, 162, 1375, 1710, 1867, 346, -2238, -3833, -3546, -2705, -1330, 874, 3328, 2761, 1369, 669, -735, -3159, -3156, -666, 1508, 2683, 4059, 4672, 2592, 381, -867, -909, -1360, 396, 3226, 4904, 4717, 3903, 2930, 601, -1395, -990, 416, 1604, 3545, 5226, 4809, 2719, 1055, -340, -1748, -2330, 167, 1836]
1735A836J285k10K90j832l262j526J37J53J111K395J829q93j462j415k062k258
1751e884M91J984J168J359J293K0k180k046j184m61o1J924K965J254j70m13r52
1768h93k224j455R69J224J534K049K221k34j462j441j292o54P8K293K404J109
1784D226R24m2j429k758o28n6O39J499K404J303m32j290j239k059j580K73J571
1801A326J095J593P68l35k257k045j561q10j73J568K016L84m4p23j673k605j406
1818d882J58R32J192K036R45o23j962j283j365j481O07J792J926J127P75j11j721
1835a938j604j189L20N86K044K533R91o23l32r71j657j155J063J736J397J951
1851C152J220k86j639j488j018k69M47J838K045J116P3o56j320k266j007N95O43
$$ y = [1836, 3121, 2911, 3201, 1369, -1893, -3419, -3282, -3129, -2018, 377, 2206, 1313, -149, -1564, -3626, -5884, -5393, -3409, -2241, -882, 411, 431, -1749, -3795, -4979, -5440, -5501, -3577, -612, 642, 472, 59, -893, -3117, -4572, -3603, -2379, -845, 1204, 3425, 3191, 1729, 288, -1004, -1658, -1580, 713, 3117, 4226, 5150, 5108, 3679, 921, 293, 237, 876, 2375, 4779, 6082, 5650, 4360, 3121, 1062, -518, -245, 1326, 2421, 4014, 4782, 4447, 2190, 145, -1416, -2226, -2399, -831, 1185, 1569, 1525, 802, -871, -3476, -4882, -4724, -3792, -2600, -564, 381, -242, -2204, -3487, -4852, -6333, -5726, -3934, -2008, -881, -106, -217, -1938, -3542, -4731, -4411, -3825, -1781, 752, 1743, 1120, 788, -183, -1840, -2995, -1932, -196, 1201, 3152, 4372, 4086, 2447, 959, -59, -328, 119, 1957, 4002, 5118, 5191, 4535, 3215, 949, -58, 537, 1180]
1868A180J331J573J078q12j391j486j995j026M87J627J306Q97K08p72j881j756
1884a432j442k86N80J252J974M52r0j298j774j433j280N09Q20J551J306O83l89
1901b97j437j787r86o80M79K127J824Q35M56k76j711j968m09K60J220J589J831
1918A070Q23n8j034j222j421j78P08J382K002J362J77p5j457j446q21p2P15J866
1936B321J590J116l24j064j130j215j249L87J509J008J387N90r15j456j536j648
1952f29l78N15J134J513N43l8q39k088j652j132j13Q14J428J255L71n74j391j989
1970c250j353l74L53J061J775R68M6p15j243j426o71l77Q45J468J792Q33K03n24
1988e89j358j118m31K32J718J840J590N15P5j071j392o44r4J120J452J766J171
$$ y = [1180, 2511, 4084, 5162, 4350, 2959, 1473, -522, -1548, -1061, 566, 1872, 2769, 2977, 2205, 324, -1432, -2874, -3160, -2580, -1328, 646, 1098, 1008, -290, -2064, -3497, -4777, -4268, -3448, -1897, -591, 92, -297, -1734, -3521, -4507, -5187, -4708, -2581, -757, 78, 534, 258, -1453, -3421, -3830, -3570, -2350, -761, 1070, 1893, 1835, 801, -421, -1842, -2020, -1312, 70, 2072, 3434, 3611, 3536, 2079, 633, -188, -260, 455, 2321, 3911, 5027, 4703, 3639, 2509, 1294, 45, 432, 1941, 2949, 4336, 4926, 4011, 2555, 1019, -629, -1007, -492, 642, 2155, 2698, 2660, 1821, -267, -1919, -3051, -3164, -2350, -922, 333, 704, 130, -1261, -3250, -4603, -4977, -4624, -3563, -1788, -820, -774, -1489, -2732, -4158, -4829, -5206, -4361, -2893, -1101, -268, -65, -589, -1947, -3065, -3496, -3264, -1546, 294, 1884, 2399, 2474, 1403, 11, -633, -727, 393, 1845, 3611, 4782]
2005D782J29q85q60j562m67L35P56J749J163O48m80j233j595j091o79m7J133J637
2023C433J34L04j307j104j613j228m40M7J317J409K59n37j231j678j673o25l05
2040d838J059J674O38J66l7j619j555q89q6N83J233J314J323o9n97q65j123n57
2058d245J02J811J249J567J261j99q62j254n53l07N96J797J496R99P49l44j066
2075B797j444l50R7P26J405J422J059m36j001j450j068p83J60Q88J257O30O29
2092D538n80j502k062r57n78L57J049J126L04l05j079j435j148j267J00Q46Q87
2109a706Q43L35J7j729j194p98m74j44J578J287R03L58p6j400j596l70L51O06
2127c209J304J568J087k68o96q30j085m01O78J491J330J052O41J62j595j026m85
$$ y = [4782, 4911, 4026, 3166, 1604, 1137, 1472, 2228, 3977, 5140, 5788, 5308, 4075, 2480, 1389, 710, 663, 1796, 3433, 3567, 3871, 2564, 1460, -153, -1381, -1821, -1774, -457, 952, 1211, 674, -557, -2235, -3908, -4533, -4838, -3779, -2105, -1467, -1301, -1338, -2957, -4512, -5401, -5487, -4904, -3671, -2357, -1034, -1103, -1700, -2565, -3688, -4245, -4143, -2332, -1083, 484, 1745, 1546, 684, -570, -1123, -1430, -834, 963, 2459, 3458, 4207, 3863, 2797, 1353, 1003, 1100, 1826, 3231, 4653, 5712, 5276, 4275, 2825, 1757, 974, 1134, 2022, 3279, 3909, 4538, 3958, 2456, 394, -563, -1141, -784, 265, 1391, 1695, 1390, 311, -1124, -2272, -3539, -3439, -2593, -1706, -863, -528, -511, -2240, -3434, -4232, -4706, -4850, -3272, -1985, -1082, -724, -800, -2200, -3796, -4166, -3815, -3209, -1905, -337, 750, 482, -214, -1044, -2129, -2530, -1852, -361, 969, 2021, 2662, 2824, 1229, 203, -282]
2144b82L4N93J235J425P55K15m26j308j077r96P01N03J073J395Q14j192j188j047
2162A227j001k77RJ285R60O93k02r54q45j890o03k92K91J123J319J55k93q65r99
2181a159j575o57L05J069O26P17J057r23j470j093m61m72O04R96J397M97K90l59
2199f11j203j111n46L93P41J337J347N66n1q67q68r20L89M52J325J151O36N51
2217B711l18p94j359l30J61Q46J214J325N83k33p73o93j430l77L07J151Q53P93
2235C637N90r38j189j388o74n30L73J339O89J78N9r21j316j577m97K67J39R27
2253h32R73K33q86j119o96j172o74N59J233O45M79M78n94j282p23l23N3q8J914
2272a822R15O54j67j48j025j338K41N55J213J266J416N01n73q30q59l81l15J000
$$ y = [-282, -248, 345, 1580, 3005, 3760, 3975, 3549, 2241, 1164, 168, 869, 1372, 2445, 3840, 4654, 3462, 2274, 1227, 226, -51, -42, 1243, 2203, 2896, 2694, 1740, 895, -995, -1598, -1890, -1599, -476, 843, 998, 705, -160, -1159, -2734, -3391, -3086, -2017, -1391, -674, 383, -540, -2010, -3103, -3564, -4036, -3432, -2436, -1039, -542, -252, -611, -1814, -2925, -3471, -3078, -2337, -1000, 347, 913, 862, -5, -873, -1793, -1404, -952, 373, 1524, 2160, 2711, 2393, 1599, 240, -90, 71, 917, 2131, 3456, 4039, 3806, 3033, 2340, 910, 533, 840, 1991, 2844, 3637, 4227, 3289, 2100, 712, 38, -492, -119, 1220, 1909, 2087, 2146, 1225, -91, -1668, -2165, -1898, -1759, -832, 141, 374, -512, -1631, -2327, -3499, -4173, -3614, -2381, -1736, -1257, -779, -1373, -2655, -3378, -3701, -3648, -3736, -1822, -907, -253, -420, -568, -1593, -2931, -2690, -2135, -922, 344, 1760, 2261, 1688, 858, -1, -382, -697, 303]
2290C03J822Q40M47J31k19j401r05l40O54K22J307J185Q8o95o12r05j236q43P54
2309E97R10L07P16J45r93j641p15o90k66K47J064Q61k56l3o18j402j390l80M09
2328c128N36R39J060o8n84j023n00q75j96O88J241Q54M03M08l30r75j112N0N34
2347b078L74J516J492P2J25r82o57q98j68J057R73R25J109K63k64j580m98l47
2365D34j44L43J297J247N1j17l29j512j130r3J25P73N59J063Q6j018p22q56j204
$$ y = [303, 2125, 2965, 3412, 3543, 3324, 1923, 1018, 678, 1332, 1554, 2861, 4046, 4134, 3439, 2827, 1922, 686, -157, 597, 1507, 1814, 2530, 2675, 1682, 41, -674, -1364, -1630, -1383, -319, 542, 286, 253, -365, -1767, -3157, -3537, -3128, -2592, -1653, -593, -661, -1245, -2268, -2768, -3643, -3839, -3151, -1910, -1056, -653, -245, -575, -1550, -2662, -2612, -2078, -1704, -188, 1304, 1376, 1501, 519, -138, -1036, -1204, -147, 826, 1751, 2860, 3123, 2859, 1279, 781, 434, 290, 633, 1930, 3177, 3228, 3111, 2782, 1270, 140, 47, 172, 945, 1504, 2567, 2653, 1635, 913, 57, -1147]
$$ [...]
8191I4
##END NTUPLES=NMR FID
##END=
