##TITLE=1H_LR-681-K2-C3
 CDCl3, 8 sc, 
 25.7.2019
##JCAMPDX= 6.0         $$ Bruker NMR JCAMP-DX V2.0
##DATA TYPE= NMR FID
##DATA CLASS= NTUPLES
##ORIGIN= UXNMR, Bruker Analytische Messtechnik GmbH
##OWNER= root
$$ XWIN-NMR		Version 3.5
$$ Thu Jul 25 13:47:08 2019 Russian Standard Time (UT+4h)  she@DPX200
##.OBSERVE FREQUENCY= 200.13155
##.OBSERVE NUCLEUS= ^1H
##.DELAY= (6, 6)
##.ACQUISITION MODE= SIMULTANEOUS
##.ACQUISITION SCHEME= undefined
##.AVERAGES= 8
##.DIGITISER RES= 18
##SPECTROMETER/DATA SYSTEM= spect
##.PULSE SEQUENCE= zg30
##.SOLVENT NAME= CDCl3
##.SHIFT REFERENCE= (INTERNAL, CDCl3, 0, 15.7039)
##AUDIT TRAIL= $$ (NUMBER, WHEN, WHO, WHERE, WHAT)
$$ ##TITLE= Audit trail, XWIN-NMR		Version 3.5
$$ ##JCAMPDX= 5.01
$$ ##ORIGIN= Bruker BioSpin GmbH
$$ ##OWNER= she
$$ F:/spectra/data/she/nmr/H-F/1/audita.txt
$$ ##AUDIT TRAIL=  $$ (NUMBER, WHEN, WHO, WHERE, WHAT)
(   1,<2019-07-25 13:46:09.60 +0400>,<she>,<DPX200>,
      <created by zg, POWCHK disabled, PULCHK disabled
       configuration hash MD5:
       00 E9 B6 7A A2 85 ED C7 34 08 36 98 17 FE 4E 26
       data hash MD5: 16K
       FC E5 05 B0 02 18 2C D1 14 2C FD 57 19 9F 07 9C>)
$$ ##END=
$$ 
$$ hash MD5
$$ 7F BC F1 54 1C 18 C4 60 93 B9 A5 8B 8E 30 33 BC
##$RELAX= 
##$RELAX= 
##$RELAX= 
##$RELAX= 
##$RELAX= 
##$RELAX= 
$$ Bruker specific parameters
$$ --------------------------
##$DU= <F:/spectra>
##$EXPNO= 1
##$NAME= <H-F>
##$PROCNO= 1
##$TYPE= <nmr>
##$USER= <she>
##$AMP= (0..31)
100 100 100 100 100 100 100 100 100 100 100 100 100 100 100 100 100 100 
100 100 100 100 100 100 100 100 100 100 100 100 100 100 
##$AQSEQ= 0
##$AQ_mod= 1
##$AUNM= <au_zg>
##$AUTOPOS= <>
##$BF1= 200.13
##$BF2= 200.13
##$BF3= 200.13
##$BF4= 200.13
##$BF5= 200.13
##$BF6= 200.13
##$BF7= 200.13
##$BF8= 200.13
##$BYTORDA= 1
##$CFDGTYP= 0
##$CFRGTYP= 5
##$CHEMSTR= <none>
##$CNST= (0..31)
1 1 145 1 1 1 1 1 1 1 1 1 1 1 1 1 1 1 1 1 1 1 1 1 1 1 1 1 1 1 1 1 
##$CPDPRG= <>
##$CPDPRG1= <>
##$CPDPRG2= <>
##$CPDPRG3= <>
##$CPDPRG4= <mlev>
##$CPDPRG5= <mlev>
##$CPDPRG6= <mlev>
##$CPDPRG7= <mlev>
##$CPDPRG8= <mlev>
##$CPDPRGB= <>
##$CPDPRGT= <>
##$D= (0..31)
0 1.2 0 0 0 0 0 0 0 0 0 0.03 0 0 0 0 0 0 0 0 0 0 0 0 0 0 0 0 0 0 0 0 
##$DATE= 1564047969
##$DBL= (0..7)
120 120 120 120 120 120 120 120 
##$DBP= (0..7)
150 150 150 150 150 150 150 150 
##$DBP07= 0
##$DBPNAM0= <>
##$DBPNAM1= <>
##$DBPNAM2= <>
##$DBPNAM3= <>
##$DBPNAM4= <>
##$DBPNAM5= <>
##$DBPNAM6= <>
##$DBPNAM7= <>
##$DBPOAL= (0..7)
0.5 0.5 0.5 0.5 0.5 0.5 0.5 0.5 
##$DBPOFFS= (0..7)
0 0 0 0 0 0 0 0 
##$DE= 6
##$DECBNUC= <off>
##$DECIM= 24
##$DECNUC= <off>
##$DECSTAT= 4
##$DIGMOD= 1
##$DIGTYP= 9
##$DL= (0..7)
0 120 120 120 120 120 120 120 
##$DP= (0..7)
150 150 150 150 150 150 150 150 
##$DP07= 0
##$DPNAME0= <>
##$DPNAME1= <>
##$DPNAME2= <>
##$DPNAME3= <>
##$DPNAME4= <>
##$DPNAME5= <>
##$DPNAME6= <>
##$DPNAME7= <>
##$DPOAL= (0..7)
0.5 0.5 0.5 0.5 0.5 0.5 0.5 0.5 
##$DPOFFS= (0..7)
0 0 0 0 0 0 0 0 
##$DQDMODE= 0
##$DR= 18
##$DS= 0
##$DSLIST= <SSSSSSSSSSSSSSS>
##$DSPFIRM= 0
$$ [...]
##$SUBNAM2= <"">
##$SUBNAM3= <"">
##$SUBNAM4= <"">
##$SUBNAM5= <"">
##$SUBNAM6= <"">
##$SUBNAM7= <"">
##$SUBNAM8= <"">
##$SUBNAM9= <"">
##$SW= 24.9336996594482
##$SWIBOX= (0..15)
0 0 2 0 0 0 0 0 0 0 0 0 0 0 0 0 
##$SW_h= 4990.01996007984
##$TD= 16384
##$TD0= 1
##$TE= 0
##$TE2= 300
##$TE3= 300
##$TEG= 300
##$TL= (0..7)
0 120 120 120 120 120 120 120 
##$TP= (0..7)
150 150 150 150 150 150 150 150 
##$TP07= 0
##$TPNAME0= <>
##$TPNAME1= <>
##$TPNAME2= <>
##$TPNAME3= <>
##$TPNAME4= <>
##$TPNAME5= <>
##$TPNAME6= <>
##$TPNAME7= <>
##$TPOAL= (0..7)
0.5 0.5 0.5 0.5 0.5 0.5 0.5 0.5 
##$TPOFFS= (0..7)
0 0 0 0 0 0 0 0 
##$TUNHIN= 0
##$TUNHOUT= 0
##$TUNXOUT= 0
##$USERA1= <user>
##$USERA2= <user>
##$USERA3= <user>
##$USERA4= <user>
##$USERA5= <user>
##$V9= 5
##$VALIST= <valist>
##$VCLIST= <CCCCCCCCCCCCCCC>
##$VD= 0
##$VDLIST= <DDDDDDDDDDDDDDD>
##$VPLIST= <PPPPPPPPPPPPPPP>
##$VTLIST= <TTTTTTTTTTTTTTT>
##$WBST= 1024
##$WBSW= 4
##$XGAIN= (0..3)
0 0 0 0 
##$XL= 0
##$YL= 0
##$YMAX_a= 132715
##$YMIN_a= -187054
##$ZGOPTNS= <>
##$ZL1= 120
##$ZL2= 120
##$ZL3= 120
##$ZL4= 120
##$ABSF1= 10
##$ABSF2= 0
##$ABSG= 5
##$ABSL= 3
##$ALPHA= 0
##$AQORDER= 0
##$ASSFAC= 0
##$ASSFACI= 0
##$ASSFACX= 0
##$ASSWID= 0
##$AUNMP= <proc_1d>
##$AZFE= 0.1
##$AZFW= 0.1
##$BCFW= 1
##$BC_mod= 2
##$BYTORDP= 1
##$COROFFS= 0
##$CY= 11.3945322036743
##$DATMOD= 1
##$DC= 2
##$DFILT= <>
##$DTYPP= 0
##$F1P= 18.9103706918063
##$F2P= -1.10871071338519
##$FCOR= 0.5
##$FTSIZE= 0
##$FT_mod= 4
##$GAMMA= 1
##$GB= 0.15
##$INTBC= 1
##$INTSCL= 1
##$ISEN= 128
##$LB= 0.24
##$LEV0= 0
##$LPBIN= 0
##$MAXI= 10000
##$MC2= 0
##$MEAN= 0
##$ME_mod= 0
##$MI= 1.114404
##$NCOEF= 0
##$NC_proc= 0
##$NLEV= 6
##$NOISF1= 3.799351
##$NOISF2= 2.8
##$NSP= 1
##$NTH_PI= 0
##$NZP= 0
##$OFFSET= 15.70392
##$PC= 1
##$PHC0= -8861.961
##$PHC1= 12.00097
##$PH_mod= 1
##$PKNL= yes
##$PPARMOD= 0
##$PSCAL= 0
##$PSIGN= 0
##$REVERSE= no
##$SF= 200.130013532006
##$SI= 16384
##$SIGF1= 3
##$SIGF2= 2
##$SINO= 400
##$SIOLD= 16384
##$SREGLST= <1H.CDCl3>
##$SSB= 0
##$STSI= 0
##$STSR= 0
##$SW_p= 3612.71676300578
##$SYMM= 0
##$S_DEV= 0
##$TDeff= 0
##$TDoff= 0
##$TI= <>
##$TILT= no
##$TM1= 0
##$TM2= 0
##$TOPLEV= 0
##$USERP1= <user>
##$USERP2= <user>
##$USERP3= <user>
##$USERP4= <user>
##$USERP5= <user>
##$WDW= 1
##$XDIM= 8192
##$YMAX_p= 0
##$YMIN_p= 0
$$ End of Bruker specific parameters
$$ ---------------------------------
##NTUPLES= NMR FID
##VAR_NAME=  TIME,          FID/REAL,        FID/IMAG
##SYMBOL=    X,             R,               I
##VAR_TYPE=  INDEPENDENT,   DEPENDENT,       DEPENDENT
##VAR_FORM=  AFFN,          ASDF,            ASDF
##VAR_DIM=   8192,          8192,            8192
##UNITS=     SECONDS,       ARBITRARY UNITS, ARBITRARY UNITS
##FACTOR=    0.0002004,     1,               1
##FIRST=     0,             0,               0
##LAST=      1.6414764,     0,               0
##MIN=       0,             -187054,         0
##MAX=       1.6414764,     132715,          0
$$ Real data points
##PAGE= N=1
##DATA TABLE= (X++(R..R)), XYDATA
0@%%%%%%%jRj6J6j7K5l2M0m8N6p2Q7j02J18j36J60j85K10k40K75l15L60m08M59
31B43n18N81o49P25q09R01j002J112j233J368j513J675j856K055k278K528k811
48a481L136l510L946m464N095n879O881q219J0104j2987J8008k9276J02190j4390
62F9154j04906J00690j7915r2666J1152J26240j209o8608K995K8305o7822n6549
74g1139J5745J4663j5133L3893K8053l7758k9398K8982k5075p2127J9636Q2130
86b7528j9943n7052N2255N8847q0043p3684O5350N3219o2637j0891J01129L1746
98C0768p6926j6865N1663j8557n3426L2532O1991L520M565L9518n137m3854L121
111A2913J4635l5169j602P7260L2369m6286Q072N8518l5883q8495J9806O8663
$$ y = [0, 0, 0, 0, 0, 0, 0, 0, -1, 8, -8, 8, -9, 16, -16, 24, -24, 32, -40, 47, -55, 63, -73, 87, -98, 112, -128, 147, -168, 192, -216, 243, -275, 306, -343, 382, -427, 474, -528, 584, -649, 719, -794, 881, -975, 1080, -1198, 1330, -1481, 1655, -1855, 2091, -2373, 2722, -3157, 3724, -4495, 5609, -7378, 10630, -18646, 83544, 69154, -35752, 64938, 47023, -45643, -34491, 91749, 90540, 21932, 24927, 53232, -14590, -71139, -55394, -40731, -55864, -21971, 6082, -31676, -61074, -32092, -57167, -129294, -109658, -27528, -47471, -104523, -52268, 6579, -73464, -147148, -81798, -28579, -91216, -102107, -978, 30768, -46158, -63023, -11360, -29917, -83343, -50811, 11180, 14700, 19265, 58783, 53646, 9792, 12913, 27548, -7621, -9223, 68037, 100406, 54120, 62192, 120710, 84827, -3668, 16138, 84801]
123H4801k8421m0735O5114N1956o4120n1194L8334K061o4044k23O1878J44l9252
136A6299J6011J4810n1980l5314K5312K33k9944K5502M2803l1014m0424K2595
148b5111K456o3715j4620O3924J3238m4216J9808N4063l2220o5470J7195L4488
160d0180l1877j5541N7745L2196l0723l368K8139k0644l8019K1705L1887j3267
172b1947O649N0154O408m0055K564K8620k5311k8175M2826M1198k3537q966M2135
185G2563j582n5322m270M0694q514k7919L5035L9121k9646l1726J9809j098m4072
198C073l226L8769N2k0839K0054J5368m0908k9619J9408k818l6149J2054M5692
211B0911r745l6538J3627J6665m3342l2589L0361J9079k5738M089L7961o520l8521
$$ y = [84801, 56380, 15645, 80759, 132715, 68595, 17401, 55735, 57796, -6248, -6471, 55407, 55551, 16299, 32310, 47120, -4860, -40174, -14862, -14629, -44573, -19071, 23732, -7282, -47706, -25111, -22655, -86370, -100990, -37066, -23828, -68044, -48236, 5827, -26393, -91863, -74668, -40180, -72057, -87598, -29853, 2343, -28380, -31748, -3609, -24253, -62272, -40567, -8680, -21947, -15298, 34856, 41264, 1209, 3773, 32393, 7082, -21093, 21733, 62931, 39394, 30428, 72563, 70981, 15659, 11389, 52083, 43569, 15650, 50685, 89806, 60160, 28434, 48243, 47145, 3073, -153, 38616, 38668, 17829, 37883, 53251, 12343, -17276, 2132, -686, -36835, -24781, 20911, 11166, -25372, -11745, 4920, -38422, -71011, -40650, -21571, -47309, -43220, -5259, -11779, -50300]
224e0300K331J6054k3409j4713L5160K1411j8681K923K6681j3215l3808J0637
236c8929K4341j1930k713L7633J6513k5196k849K0876j2624k7398K1157L3818
248C2699q575p319K9973R580l4072j2453K1772k468j8807J8753L0229r558j5871
261C3883J3067k423l2355o660K4141j446j5708J8046K0583k3941k6485J0317Q53
274A1872k8813k970K9939K601k0939N701J2490k5608k6302J2477R522j7319J704
287c5645K8162K90k5502j069J0874j7938j6944J9134J7962q740J450K0508m505
300a1963k4216J671J4354q690n225K6470J8800j2593l899J5536m530k2211N894
313a0602K2063M91k528K0012J1541j7121r075J0357l929j4352J1946K2454k250
$$ y = [-50300, -47969, -31915, -55324, -70037, -34877, -13466, -32147, -29224, -2543, -15758, -49566, -38929, -14588, -26518, -29231, 8402, 24915, -281, -3130, 17746, 5122, -22276, -1119, 32699, 24124, 16805, 46778, 56358, 22286, 9833, 31605, 29137, 10330, 29083, 59312, 49754, 33883, 46950, 44527, 12172, 5512, 29653, 28207, 12499, 30545, 51128, 27187, 702, 11019, 11872, -16941, -19911, 10028, 12629, -8310, -2609, 9881, -15727, -42029, -29552, -20030, -37349, -35645, -7483, -7193, -32695, -33764, -22890, -40828, -57772, -38638, -20676, -29416, -27966, -7458, -11963, -36179, -34508, -20154, -28844, -34069, -7599, 11201, -1392, -5291, 10245, 5715, -16496, -10602, 11461, 11952, 9424, 29436, 40977, 23856, 14781, 25138, 21209, 6857, 18803, 41257, 39007]
326C9007q829J1025K720k2714j1519J1993K219r949R710J6006r023j6215K150
339A6581k350k0456n686J6758M089j1635M322J0567j4736k1696J616N060j1244
352b8810k134J7660N254j2309k243M653j2959j4635Q942J1763m365J414J6765
365a1004K335j5793m472P956l980o367J3315J6094j028n50R080j822j3059j69
379i464J1743O74j67J4940J2560p211p220N156j470j0645J868J4474M293j631
393B7900O310K917j1948r238K590r38o245N868J2502k194r165p42j677j3460q553
408f073N519M123k866J861N821o368j2325l015j870q333j948J0457N269m935j444
423a6127L401p301j2159j83O789M22J493R259M621n290l127L14l672l997P169
$$ y = [39007, 30178, 41203, 43923, 21209, 9690, 21683, 23902, 13953, 23663, 39669, 30646, 14431, 16581, 14231, -6225, -11911, 4847, 8936, -2699, 1623, 12190, -2546, -24242, -22626, -17566, -28810, -30944, -13284, -8030, -20339, -22582, -17929, -30888, -45523, -36581, -24818, -29183, -27769, -11004, -8669, -24462, -28934, -20978, -24958, -31325, -18010, -1916, -2944, -3494, 5586, 3764, -9295, -9464, 2279, 2953, 2786, 17726, 30286, 23075, 15855, 21011, 19541, 8896, 10764, 25238, 29531, 27900, 34210, 37127, 25179, 15941, 18531, 17593, 11348, 17216, 29718, 27524, 18359, 17617, 15940, 2480, -6073, -554, 3569, 703, 2564, 8385, 2017, -10308, -13323, -15193, -23526, -25474, -15017, -9748, -14683, -16127, -12726, -20027, -32186, -32369, -25580, -25158, -23665, -14406, -9785, -15075, -18202, -17888, -21560, -25557, -18388]
438a8388J0076K801K237O493Q36p530l693M008K640J433Q017Q842J488j683j99
453A7378l118n368Q2O222M045K013N288K639m627p012k762j630k460J463N869
468A8022K655r07j462m191q218n498o44K46k93L065L755j861o799m348l999n029
484a5506k299K274M248J685Q52q08m532n371k745q74K01L389N518M149j33k228
500a2180j844k341k279M04M760N686M516L099M82p95k595j830r5K742N250N281
516H261M141J537j114j492j845k416p06M146N796K868J19J202j072n252n274p3
532H826J733J065K655L041L28m070l484l881n037k139K942K550l89P4J438l998
548A654p370l912l82j029l24L846K618j311k592j607m778m308J041L274N13J630
$$ y = [-18388, -8312, -5511, -3274, 3219, 4055, -3475, -7168, -3160, -520, 913, 8930, 17772, 19260, 17577, 17378, 14260, 8892, 8974, 15196, 19241, 21254, 26542, 29181, 24554, 17542, 14780, 13150, 10690, 12153, 18022, 20677, 19770, 18308, 14117, 5899, 401, -243, 3, -290, 2775, 6530, 4669, -2130, -6478, -10477, -15506, -17805, -15531, -11283, -9598, -8746, -9554, -14086, -19457, -22202, -23076, -22875, -19486, -13968, -9819, -9952, -12180, -14024, -16365, -18644, -18240, -13480, -7794, -3278, -179, 303, -492, -3087, -4917, -5012, -2270, 2980, 8261, 12402, 13939, 12825, 11333, 9488, 7072, 6366, 10512, 16308, 19176, 19295, 20497, 19425, 14173, 8899, 8826, 10559, 11624, 14279, 17320, 17648, 13578, 10094, 6213, 1176, -963, 1979, 4529, 4140, 4214, 5652, 1654, -5716, -9628, -10010, -11039, -11363, -7517, -4899, -6210, -8802, -10409, -15187, -19495, -18454, -15180, -14667, -13037]
564a3037N203J188n047l608O19m51j273L728O791K045N89J946j127m275m48L647
580c510J369Q26O852N906j947l374J555q1m150M53O483M075q21L199K244n020
596A4059n316J538P13k895J816P210Q34n501p49O47o393n809K617L684k079MM178
613H558k431p616k048L30n180k670N465M031m264k037L077l362q669j126M779
628a3163n89j140M940L991m504l624K225j743m963L515P298O50j172N078K270
643i31n774l098M456J734j787M950P744l98k521L191L82o052q99P934K670k823
659H778M069P010m068o800J106K825m267j031P005K800m405J82K226n946o983
674B501K493L094m368r38O930K3q837k339K144m686o436L880N198m018j743M345
$$ y = [-13037, -7834, -6646, -11693, -15301, -14682, -15133, -16406, -12678, -5887, -3842, -3253, -1307, -2434, -6709, -7157, -3510, -2141, -1315, 5537, 11443, 9496, 6122, 7677, 7596, 3446, 3899, 10382, 14457, 13636, 16835, 19079, 14059, 8743, 10281, 10994, 8099, 9915, 17125, 17959, 12458, 11709, 12356, 5963, 154, 2771, 6455, 4376, 4380, 8558, 6127, -1489, -3537, -3207, -8387, -11057, -5592, -1561, -5825, -7862, -4785, -8147, -16816, -17942, -13163, -13752, -14892, -9952, -5961, -10465, -14089, -11864, -13607, -18570, -15055, -7757, -7107, -8279, -3201, -931, -6705, -9803, -5347, -3613, -5400, -450, 7294, 6896, 4375, 7566, 7948, 1896, 997, 8931, 11601, 8778, 12847, 19857, 15789, 8989, 10095, 12920, 8653, 7622, 14627, 17427, 13022, 13204, 15430, 9484, 2501, 4994, 8088, 3720, 2782, 9712, 9735, 898, -1441, 703, -3983, -10419, -6539, -1341, -5359, -7102, -2757]
690b757k377r124j599N033k627m261O367O488m992m701M104J15o929kP536J719
706h007k372M772M594m937l190M667M47l949M273R201J32l932M294L515o239l436
722a67O620L561k991K684P730j909o329J916K736o023k398P811L544n716j30N646
738A6585m032q964L76L823l061k669N241K006o455k188J983m837p147L312N108
753i19m231k782O034K44r380k817N030j965n440L804P250l467m204M320Q93p365
769a4995j382P279J197l751M812O468l355n133L641K792m547R39P819K010k754
784A040L246L989m710l799N049L094m274K429Q342k49o900J970M143n193m742
799C435N623N024m364j240O123k019q398K53L939m066m130N730L810n648l172
$$ y = [-2757, -5134, -14258, -15857, -10824, -13451, -17712, -11345, -4857, -9849, -14550, -10446, -10331, -17260, -17262, -9726, -8007, -10379, -5607, -1013, -5950, -9140, -4473, -4026, -7975, -3702, 5499, 5631, 1699, 5993, 9508, 3269, -167, 6453, 10014, 7023, 9707, 17437, 15528, 9199, 11115, 13851, 7828, 5430, 13241, 16785, 11069, 10939, 16585, 12553, 3589, 3965, 7788, 4727, 2058, 7299, 9305, 2850, 662, 2645, -2192, -9339, -6027, -919, -5150, -7932, -1898, -1654, -11034, -13851, -8821, -10786, -16226, -12422, -5172, -8639, -12843, -8523, -7630, -14995, -16377, -9098, -7901, -11652, -6840, -372, -3727, -8860, -5219, -2427, -6974, -6035, 1784, 3794, 1040, 4286, 8275, 3565, -234, 4815, 7909, 3635, 6064, 14406, 14157, 7257, 9227, 13370, 8177, 3435, 9058, 14082, 9718, 8478, 14601, 12582, 4184, 4437, 8376, 4310, 180, 5910, 9720, 4072, 900]
814I00L188k460p292J83M392k160k728M684J199o575k908L970k590o056L596O719
830c938k559m563M652K337p019l532N757J966m172L030O751j482m669K927K211
845b303m563j027P015K913l698K546N641k772n350K888L362k590J67O466J546
860A0241m256J499L443m345m935M783M552m309r24O569K65p641j343M152k181
875E570m624K987M691l330k366K996j536o556o21M044k443l068L922L426n257
890b165m074L043m06o344P44N561o65l369K989K113n548l508M492P13m442J836
906i030O793n64m997J906L554m099k763M537L693k231J244M934j138m407J871
921f97K960k981n76N867K806l399P4M364j827n206K463L974j512j313M653J619
$$ y = [900, 4088, 1628, -5664, -5481, -1089, -3249, -5977, -1293, -94, -6669, -9577, -5607, -8197, -14253, -10657, -3938, -6497, -11060, -6408, -4071, -11090, -14622, -8865, -6899, -11071, -8041, -1290, -2772, -7441, -4514, -2303, -6866, -7893, -878, 2035, -1663, 883, 6524, 3752, -1598, 1290, 4652, 2062, 2229, 8695, 10241, 5985, 7484, 10927, 6582, 1647, 6430, 10982, 6673, 5749, 12318, 12583, 4942, 3599, 7751, 5570, 946, 3933, 8624, 5294, 2928, 5924, 4388, -2168, -2789, 1255, -1188, -4256, -334, 3092, -2165, -6239, -3196, -3602, -9946, -9202, -3641, -4306, -7675, -4686, -2573, -8121, -11629, -7137, -6424, -10866, -9030, -2237, -2801, -7798, -5892, -2338, -6437, -9200, -4663, -970, -3201, -1957, 2977, 1839, -2568, -697, 2263, -718, -1294, 4573, 7379, 3980, 4054, 8418, 6591, 1385, 3848, 7822, 6310, 4997, 9650, 11269]
937A1269m588j209K707k047m434K600M543k615k386L358K92n725k303K596m71
952A587l391K112L193k973k520J086o28n537m05M392l25l738K408L334m064m308
968i777K181J271l499J26N011N16k941J196K400k932k791L208K668j937O57N224
984E81N33l961L95L062j492j895L831L478j459N67L291r90l747J398K443j025
1000E010j108M237K407l105j837K357m71l953O79L215m46j840K496L71m082k199
1016A731J576p27l276J360L302k032k894R76K99m282k109K316O50k284Q10K288
1032b296k263k964J192J42k981m80M115J135k679O36K814j853l210J438K599q96
1048e551R0L603J359j749L06J632j414j492L106K833r39L82L173R55l387n80K428
$$ y = [11269, 6681, 5472, 8179, 6132, 1698, 4298, 8841, 6226, 3840, 7198, 7490, 1765, -538, 2058, 1587, -1804, 308, 3501, 528, -1992, -906, -1534, -7071, -7476, -3084, -3409, -7147, -4739, -1405, -5469, -9777, -7596, -6325, -9824, -9698, -4687, -4171, -7112, -5916, -3516, -6448, -9239, -6031, -3363, -5300, -4643, 581, 1114, -2847, -2452, 610, -882, -2777, 1054, 4532, 3073, 3640, 6931, 5941, 2194, 3592, 6035, 5010, 3902, 8139, 10546, 7441, 5604, 7961, 7490, 3537, 4216, 7431, 6985, 5145, 7641, 8012, 3930, 1731, 3307, 2580, -696, 664, 3966, 1934, -960, 16, 315, -3967, -6076, -3760, -3110, -5394, -4584, -2296, -4559, -7523, -6331, -6189, -9170, -9650, -5535, -4400, -7079, -6443, -3629, -5482, -8692, -7254, -4655, -5551, -5461, -1858, -499, -2248, -1942, -310, -1724, -3216, -110, 2723, 1784, 2166, 5339, 6294, 2907, 2327, 4755]
1065D755j97q32K236K635p40j255J165o43l269N13K122j82j325J402J550k739
1081E196k625N94k60k310j16J641K03j585K23j25l063k110J288m6j828M74K444
1098b005p66k540K3L79k196j175J690J704n73j8J585o65k108O66J389j021OL578
1116b047J410j084k52J535n47j118L49K049R93J27K332M74j328l57O51m47p06
1133B034J899K228j97q47J120J5j958j078N84P20k00N73Q76o03j308o68p20j586
1151H84l05J393K26q74j95Q91j843k273n77J92l57l20J222L47j029l48l85j858
1169e209o50Q88Q87k75L06J394j82j668o08L66M08l42J253J194M00O08K4n62q06
1188b574N25J002J45P64J457J321l47j101J84K97j03k53J559J208M13K75j18j060
$$ y = [4755, 4558, 3726, 5962, 8597, 7857, 6602, 7767, 7124, 3855, 4368, 6490, 6308, 4983, 6385, 7935, 5196, 2571, 3165, 2905, 595, 479, 2120, 2323, 738, 961, 836, -2227, -4337, -3049, -3095, -4923, -4449, -2005, -2771, -5311, -5288, -4909, -7105, -8280, -6590, -4886, -5459, -5477, -3892, -4557, -6665, -5999, -4610, -5631, -5625, -2047, -637, -1721, -1973, -438, -985, -2103, -1754, 295, 1288, 1415, 3747, 4221, 2893, 2536, 3187, 2740, 2034, 3933, 6161, 5964, 5117, 6237, 6252, 4294, 3216, 3800, 4520, 4320, 4893, 5769, 5166, 3858, 3190, 2470, 884, 579, 1972, 2198, 1324, 1129, 2020, 177, -2096, -2673, -2481, -2838, -3158, -1936, -1589, -2618, -2966, -3351, -5209, -5859, -4971, -4084, -4359, -4053, -2659, -2841, -4509, -5117, -4751, -4343, -4685, -3432, -2238, -1838, -1230, -1206, -1768, -2574, -2049, -1047, -902, -138, 1319, 2640, 2293, 1192, 1376, 1673, 1570, 1317, 2876, 4084, 4497, 4772, 4654, 3594]
1206C594j71o39J22J75O08J226J77j025p72l06m82j205j77J227Q3K16o01m76j019
1225E55q87r73l11L20M05N07j86m10o11p20j465o46M63O61L80N5J09O2n19j216
1245d427n75M83O18Q19K57N82L60J4m66r10JJ162Q45N08J141M96K95n81n27R6
1265A91N2N57J111R29N75N92j27n93j337L26O51K39J67J110O16o60j130k81n16
1284B472q37M42R43K70n29K54l33j937p45P9j75n79R4J031p0j496o43j42j096
1303b997r71L27Q69k01M15M05j141q98rLp88M96J228J030m14k28N81l07q07j42
1323c549J112P90P22J208L68p65k1O45l48o60J591J612K34m97R68N38j511m08
1341B029J004o7q7J181R74r23l26M14q23j672K94J283j33r33O37P83j650j512
$$ y = [3594, 3423, 2784, 2906, 3081, 3689, 4915, 5092, 4067, 3295, 2989, 2507, 1302, 1125, 2352, 2435, 2651, 2050, 1574, 555, -332, -1305, -1616, -1296, -891, -384, -570, -980, -1591, -2311, -3776, -4422, -3959, -3298, -2918, -2863, -2754, -2692, -3211, -4427, -5002, -4519, -3901, -3082, -2825, -2243, -1883, -1869, -2335, -3245, -3244, -2082, -1237, -729, 412, 908, 1203, 622, 95, 191, 243, 800, 1911, 2840, 3415, 4007, 3880, 3287, 1950, 2276, 2927, 3166, 3333, 4443, 5059, 4399, 3269, 2988, 2472, 1635, 2077, 3020, 3290, 2761, 3015, 2682, 745, 0, 79, -96, -675, -581, 450, 380, -1116, -1759, -1901, -2997, -3968, -3641, -2772, -2973, -2558, -2153, -3294, -4192, -4201, -4198, -4986, -4490, -3262, -2232, -2646, -2874, -2293, -2600, -3407, -3549, -2437, -1647, -925, 283, 651, -114, -135, 510, 162, -498, 1093, 2705, 2939, 2442, 3410, 3948, 2437, 2029, 3033, 2966, 2879, 4060, 5034, 4111, 3785, 4199, 3376, 1704, 1998, 3281, 3148, 2215, 2852, 3635, 1985, 473]
1359D73l14K12j118J14Q68J88j314k96K32j906q83M35J101j246j27J464J2j758
1377c863l59Q16j064m28J208J254l11k74J200m91j468O19J474j13n13J857J655
1394A199r67q23J106L35q32J29J421N89o5J081P76j574k43Q72k43q15J073J738
1412D757p13r32K60M30j755q12J048K32o26N48J229j498j614L08N8j815m41J790
1430D54M61k002O9R88j249k032M83M55p41M5J386K89j203n12J017r10k006J832
1448c176J138l65n23J750K77j567o15J510J1n76J469J491o62k84J294j46j879
1465h53O42J866j99p92J327J878r71j543N99P42j201L0J427J80p11P79N05j966
1483A739q84J010K03j265K58J652k44k098L25M76j068j275J138Q10j162j81R94
$$ y = [473, 159, 371, -747, -633, 235, 423, -891, -1187, -955, -2861, -3744, -3309, -2208, -3454, -3581, -2117, -2105, -3863, -4222, -3406, -4470, -4898, -3690, -2436, -2747, -3021, -1821, -2312, -3780, -3161, -1687, -1800, -2313, -456, 1199, 232, -591, 515, 850, 18, 147, 1568, 2157, 2092, 3173, 3949, 2375, 2132, 3004, 2761, 1946, 3019, 4757, 4044, 3112, 3372, 3802, 2047, 1235, 2283, 2515, 1889, 2437, 3666, 2168, 554, 862, 920, -895, -1336, 454, 915, -1087, -1018, -30, -1279, -3311, -2828, -2373, -3114, -3069, -1683, -1394, -2597, -3109, -2092, -3002, -5008, -3176, -2038, -2403, -2926, -1176, -899, -2466, -3081, -1571, -1560, -2136, -667, 824, 162, -122, 1172, 1026, -853, -211, 1655, 1456, 664, 1991, 3869, 2898, 1355, 1954, 2696, 1495, 1525, 2952, 3132, 2421, 3200, 3705, 1739, 855, 1865, 2068, 803, 1061, 2713, 2469, 371, 696, 1172, 104, -1171, -33, 777, -385, -566, 428]
1500D28j089j522L15R83j427j094K046J272j877l43R16j05j830L30R93Q9m90J396
1518a009O94j611l28J338n53j226J268J891l44j204J447M58j189n32J342j15m62
1535a35P07J629j37j331R19K68j487k09J847O01j520M75J705j265j294M97O30
1552A900q92l65J438L1r46J1M93r72j567J371N51j097j43J458n61j477m81J260
1570A2j167j218J263Q14p97j07P85l12j891M10R25m96n50J009J161j154q62J192
1588i83j86j085J42J365j41m18J129Q55j259p93J246r8q09Q11J632l33r51N77
1606G01J129j339m68J303M69m84O2J314p40r02P05O2q16k81J269L96j038J9R80
1625B341n28j678M59O34p77j23J190m3j297k69R37j291j656J103R44q40q29J613
$$ y = [428, -661, -2183, -1868, -885, -2312, -3406, -1360, -88, -1965, -2308, -1392, -1497, -3327, -2997, -2004, -1915, -2405, -1009, -315, -1926, -2254, -916, -1469, -2695, -1427, 464, 120, -1084, 363, 821, -368, -900, 442, 327, -135, 572, 2201, 2064, 733, 1652, 1920, 433, 224, 2071, 2672, 1152, 1627, 3332, 2067, 773, 1270, 1900, 1008, 643, 2081, 2112, 1166, 1177, 1670, 698, -869, 502, 1053, -44, -187, 1271, 710, -767, -1248, 12, -1155, -2373, -1110, -296, -1093, -1200, -415, -727, -2618, -2208, -1283, -1779, -2329, -1320, -159, -1313, -2175, -983, -1169, -2254, -2112, -747, -888, -1306, -177, 678, -581, -1374, -128, -226, -1035, -224, 1408, 1075, 124, 701, 1830, 491, 23, 1326, 1795, 1311, 1373, 2687, 1947, 1045, 1750, 1812, 996, 715, 1984, 2380, 1342, 1361, 2341, 1813, 135, 594, 1228, 451, 328, 1518, 1475, 178, -91, 846, -445, -2101, -998, -54, -894, -1723, -110]
1643a10m43j375m69Q50m51o66J332L54p94k09P01j74j181J34J395k22p52J230
1661h50J233j177p31O67Q34r91K47J247L95o15N99Q35j126o67J356O12j004M13
1679A277J542P1j206j4P06r89k68O59K80k76j52Q68o57j361N49L72r17n44P92
1698G32N52j206k30L81n35j114J99N45m51m63O86M09j272n17J160o77q64P76Q93
1717i96o44o75J223L00j182j22O17P2RK53R88n27l57P11M13j116M31J322L9o84
1737G5O59J167p21j046J046K24l99L28P12K64o47K13N58r57p70J006M57o65l35
1756A169P73M3j089r3N53m64q96N67J38l98k02J89m42j119J62N21m71p46P72M73
1776e60n89p46O57l36o79L86O10j81k24O54q3o08K5L36L11q51Q94P19j43l83L41
$$ y = [-110, -553, -1928, -2397, -1547, -1998, -2664, -1332, -978, -1772, -1981, -1280, -1454, -2635, -2501, -1106, -1328, -2080, -850, 383, -794, -1525, -858, -24, -1015, -768, 479, 874, 259, 858, 1693, 567, -100, 1256, 1868, 864, 1277, 2819, 2890, 1684, 1670, 2376, 1387, 1119, 1778, 2058, 1782, 1630, 2498, 1841, 480, 1029, 1401, 484, -60, 732, 1284, 78, -152, 229, -306, -1420, -1221, -676, -1127, -1590, -904, -495, -1767, -2284, -1124, -1801, -2665, -1889, -996, -1640, -2315, -1092, -792, -1974, -2096, -1479, -1407, -1398, -1145, -157, -684, -1041, -330, 83, -1033, -602, 720, 759, 75, 734, 1901, 1180, 134, 1180, 1404, 1005, 1333, 2045, 2309, 1662, 1875, 2433, 1476, 706, 1712, 2169, 1504, 1169, 1942, 1985, 896, 803, 1356, 892, -4, 563, 701, 303, 101, 290, -152, -1271, -1109, -588, -1059, -1805, -1033, -560, -1149, -1895, -1238, -1574, -2253, -1867, -1257, -1438, -1662, -1008, -1091, -1699, -1674, -1338, -1027, -1878, -984, -265, -408, -791, -450]
1797d50L39n13k8M40P13m79P58O54p09n92Q23M64p75J22P73N42o52QK36k18m57
1818I99m8L46l3m12O17P2o54j33M91n18p46K68K99k40n21N77J76r75k30J70o6
1839e61k56K9J86j83m1k7J69r60J72N33k05l18N74j0Jo08J39N33m07K40N99m37
1861h38L0L72K63p2l37K46L30j04j06O43K33l55m6M20l35n1L44N87l98L46j58
1882A014N5n80M88K94k32o87R45M39p12k20J62N0m14j18K51K0k49K77m15o89L76
1903E5K21j32l17m42P28k18n32k9O30n18l05j89j02K76pk75kL11J31j62m68j85
1925a531L32N17l8j81J2L39n60L57J49K84l20M48J70j94L37L38j66j36K79j7J21
1946E40l6M50n4j48K16J90k20L25Q9l86J60k2K58k30m9k02L11l38k07K53J5N4
$$ y = [-450, -111, -624, -652, -212, 501, 22, 780, 1434, 725, 133, 956, 1420, 645, 767, 1540, 2082, 1430, 1438, 1674, 1456, 999, 951, 1297, 1264, 852, 1469, 1541, 887, 754, 1245, 727, -19, 249, 548, 308, -213, 364, 540, -435, -665, -495, -561, -817, -788, -602, -785, -826, -853, -684, -1644, -1472, -939, -1144, -1462, -888, -898, -897, -1505, -1366, -833, -1240, -1000, -401, -838, -808, -436, -173, -245, -582, -336, -6, -110, -216, 427, 660, 305, 259, 679, 344, 293, 637, 1224, 826, 1172, 1014, 1069, 489, 977, 1271, 1039, 352, 1297, 1736, 1024, 804, 966, 1016, 602, 484, 735, 755, 506, 783, 368, -321, 55, 276, 144, -173, -615, 113, -105, -637, -666, -36, -554, -859, -1048, -1150, -874, -881, -1156, -1158, -847, -716, -878, -1346, -1531, -1199, -682, -720, -901, -889, -550, -1110, -753, -604, -320, -640, -192, -22, -216, 121, 459, 293, 157, 436, 419, 540, 504, 954, 900, 752, 968, 1158, 938, 1263, 1352, 966, 1126, 1104, 1362, 1132, 1083, 881, 1192, 854, 647, 900, 915, 969]
1968I69m07j43j16j58kj1j16k15k01L59m34m23J6K04j51l00L13K3L4l64j77l6
1990a336m2j24J80K70J1q0j66L31j7O6J1k09L06L22K25N6O0K35j26K32J16J65
2012D86L66j10l4M0L89k17m3L27j38K47P7k44j72K98M8J1k52l20K45q1j71L6P6
2035H64r5k90l50J98k74k24J12j35l71L50j65o14J42Q2j34j49m4l2L73m09k73
2056a438P1l5J99NK48m86M34K9K08n7J33K09j15j28N87K09k05O4K00j2L4J84N58
2079H96l08K56K06q9r2L5K33k76j49M48K91m47J56K78m10J63k11l24M90n57K20
2100H09Q5o34l4K64k51j68j2J67n7n47J12l4k19j24n7n3k4Q4j2l87p9J38K67n79
2124a345J40N70Q2m37J21K66m6N4j29M05r8j41L02j22j70P31k31J33j94L81N88
$$ y = [969, 562, 419, 303, 145, 143, 132, 16, -199, -400, -41, -475, -898, -882, -678, -829, -1129, -816, -793, -759, -1123, -1300, -1336, -1378, -1502, -1322, -1052, -1041, -1121, -1287, -956, -973, -907, -896, -1105, -799, -477, -252, -196, -136, 99, -27, 205, 321, 486, 852, 742, 708, 748, 1137, 920, 877, 1204, 1066, 1313, 1390, 1146, 974, 1272, 1320, 1331, 1079, 759, 1004, 923, 752, 788, 864, 769, 479, 129, 327, 53, -171, -59, -194, -565, -215, -380, -994, -852, -770, -904, -1053, -1097, -1129, -756, -1165, -1438, -1367, -1402, -1203, -1198, -950, -1436, -1002, -973, -765, -822, -689, -480, -595, -723, -136, 73, -132, -68, 132, 120, 154, 338, 896, 588, 844, 1050, 961, 869, 904, 1137, 861, 712, 1160, 1451, 1004, 1160, 1438, 1028, 1191, 980, 656, 1146, 589, 809, 894, 260, 226, 490, 239, 71, 59, 226, 169, -378, -266, -300, -519, -643, -700, -753, -777, -693, -705, -1092, -1171, -1033, -766, -1345, -1205, -635, -553, -990, -869, -603, -649, -595, -724, -319, -417, -558, -256, -378, -548, 183, -48, 85, -109, 272, 860]
2145H60o72J15L44o5r5j46J13L54k47J41L62l29j31M96j73k98j0L00j38l83N9
2166D57J29m49K09j91J31k25M9K68o86J41J80o3k00m28Q51j96o24o0N07j55l69
2187g24q9N73l97j5j68o6L93j44L74k44m22R0K50j35J03K32J74l43l4M18J03l96
2209d67K73J38j11M99k92K89j60L6J96l08k17L54P03k58l42K82k2Q4k49N16j20
2230H24l4l98M99m66k71N87k8n20J16J13J22k03m59L16R5m81K24k16rn5N16o09
2252c37q5P7J15l83k10L94P1m13j80O87n08r4K44J15n33O04k41L29l33k34N18
2273c97k10l9J79M36j91M0K37L72m53k6L00J77j30J17K29j02P9m5J06k17j22M34
2295G74K43p66L65J80M6k92J83j7k60K4L30j3m23n3L09l96k95L80nn24JL13j34
$$ y = [860, 188, 303, 647, 582, 487, 341, 454, 808, 561, 702, 1064, 735, 604, 1100, 927, 629, 619, 919, 781, 398, 457, 586, 137, 346, 155, 286, 61, 110, 378, -308, -167, 13, -50, -250, -678, 173, -23, -647, -707, -200, -355, -724, -813, -240, -637, -652, -820, -886, -493, -637, -263, -507, -929, -839, -589, -724, -621, -389, -215, -558, -592, -174, -71, -467, -194, -56, -167, 332, 40, 329, 169, 205, 401, 93, -124, 230, 933, 675, 333, 615, 593, 677, 428, 944, 824, 790, 392, 891, 425, 154, 741, 713, 193, 309, 422, 544, 341, -118, 198, 293, -188, 36, -180, -189, -244, 272, -337, -422, -345, -230, -613, -823, -429, -358, -771, -951, -264, -772, -866, -622, -507, -1040, -436, -677, -348, -681, -915, -397, -607, -646, -467, -31, -222, -182, 55, 427, -26, -52, 248, 425, 295, 412, 641, 539, 618, 573, 679, 462, 340, 774, 1017, 251, 616, 796, 842, 550, 733, 716, 456, 480, 810, 797, 374, 321, 630, 234, -61, 319, 314, -210, -209, 104, -30]
2318c0n48p0K66K06n50J32m6j70q0J24K6k34R0K88k0n40N09L11n32j5M18J02j28
2341d91j10L66k56Q4N78O3k28L22J30j28k76M9P82k88k92J20K2j42L78J45K34
2362A062l40K78R7k68j36j52K79o28J29L00J45m24m4K83k78l36K40j02k95l09
2382d99L25J91m71J69K63m48l31L48j7l69m5M16j12j54K04j92J72l68K35L01n5
2403d37k5J90M6m71K71L84j91k40M68J65j43q8K83M6l44L89M07n8m81O64n68J23
2425C90M2K90L36m71J92j27j92k0M9L6k02m42M90k85M5K33o3J1o00L49J08l49
2447a80k7J31K41k37p0j89P6j35N7k71n2K00J08j45j12j30K74qk21M17j8J75k36
2470c52k38N29k53P2k04K08K21J04j8K01k32P3L08p3j08K88k06k49L47O1kj79
$$ y = [-30, -578, -648, -382, -176, -726, -594, -640, -810, -890, -766, -740, -974, -884, -596, -616, -1156, -647, -336, -868, -883, -465, -363, -491, -601, -235, -491, -407, 171, 234, 6, 328, 458, 330, 54, 103, 885, 597, 305, 425, 447, 305, 683, 828, 1062, 722, 1000, 1097, 829, 693, 541, 820, 192, 321, 621, 766, 342, 298, 581, 303, -33, 207, 105, -190, -499, -174, 17, -454, -285, -22, -470, -801, -453, -470, -839, -884, -468, -580, -734, -530, -722, -550, -918, -683, -382, -437, -462, -272, -226, -697, -426, -42, -233, -473, -5, 160, 17, -71, 212, 258, -86, 303, 710, 652, 171, 835, 267, 390, 432, 722, 1058, 587, 779, 652, 460, 440, 489, 525, 323, -119, 371, 86, 131, 364, 301, 312, -288, 61, 169, -180, -207, -76, 165, -72, -142, -331, -255, -390, -333, -604, -656, -456, -348, -493, -605, -735, -461, -469, -690, -273, -291, -116, -352, -590, -61, -314, -242, -446, -238, -17, 87, 69, 270, 38, 111, 419, 346, 238, 526, 320, 71, 418, 479, 477, 298]
2492B98k78M65j0k77M3K4n4j25K34j02l28L78j98r2K60K33k62l44K27j32j07J34
2514a3NP8j69j68J66J34l31M3J20l28K31j26J29m30L95j54J15l87M63J22j25j3
2536b43p1L15l88J89J36k24q6R9P9r1L70k66M3P3N0J99P7k69j68O01j16j90K92
2559D11N0m17K72J10J34l02p4K18J22l53n0n0K49k92O05n35K3K93l06J46l82J54
2581B6R8J94m74J59Lk31l64M43Q5m74N8N04j31j88J06j19rj44L44l09Q1J19o3
2604b86k7n4L7L0k16M27k93j2J27l26L14J95p4J99L44n92K60K58r0M8M1P2l2l6
2628C14P2j08K74o1P7j3l04l1Q6mj23M18N0qm58Q3P6m13J62m4J03J06N9l91J74
2653I6j2P4k98j30k3M8K62j83m23K65r7J09j76M9J17q5j96QN89l38o5m41K72L97
$$ y = [298, 20, 485, 475, 198, 241, 265, 211, 86, 320, 218, -110, 268, 70, -22, 238, 471, 209, -135, 92, -40, -147, -13, -8, 70, -99, -267, -101, 33, -298, -255, -135, -463, -232, -358, -229, -659, -264, -418, -303, -690, -227, -105, -230, -243, -314, 1, -387, -198, -62, -286, -372, -273, -194, -285, 85, -181, -138, -65, -15, 184, 261, -8, -176, 425, 309, 119, 411, 461, 44, 316, 426, 560, 258, 184, 402, 524, 171, 121, 71, 320, 28, 633, 98, 121, 414, 108, 254, -128, 26, 124, 318, -156, 3, 6, -225, -589, -146, -61, -535, -477, 27, -104, -292, -186, -305, -314, -458, -114, -423, -342, -223, -286, -313, -367, -330, -300, -516, -89, -382, -394, -267, -593, -279, -84, -158, 41, 385, -207, 53, 311, 221, 269, 310, 382, 350, 314, 386, 278, 552, 491, 568, 555, 251, 220, 306, 302, 179, 597, 647, 639, 181, 264, 340, -73, 89, 45, 148, 254, 313, -78, 96, 84, 158, -140, -270, -293, -245, 17, -166, -589, -324, -421, -312, -488, -439, -322, -407, -603, -595, -6, -344, -409, -850, -578, -181]
2677a81mo9N5N7L36j10k01j4L87P8k48J53k70L00j90J81P5Q9J38J85l13K5J30
2700E89l54K03j62p4M5J37O3p9R8j57j22Q6j18j79K09j55J01KK4j72l57J90j07
2723b89l81L51n6p0Km8j51K31k08K7r1P4J11K27n5J0r1J78k51J98j54K91K2j33
2747b56K53k79M81k74L77l09L58m64M58K12k77j2R1J51k90L26lk75K53l68N88
2768G41l32k38K60p7P9l39K74j44M4J23o67K74K86n50K26R9k26k8J22L4l15K35
2790a19q7J94l59m07M71O0n14K16J1n9J07j61O13r9k45J50N6j14L90n41J81K79
2812B3r3o4L26k77J52n02N18k29L96N8j06P5j81N00j80J6J8l58j6M63l51k10L30
2835C08K55k44j95O5R6mk90j07J92L74k09l53%K39K13j72J7k35K7l38M37k32k89
$$ y = [-181, -185, -254, -199, -142, 194, 84, -117, -131, 256, 334, 86, 239, -31, 269, 79, 260, 335, 424, 562, 747, 434, 459, 589, 235, 438, 276, 202, 247, 384, 447, 368, 466, 309, 187, 273, 155, -24, 185, 30, 131, 133, 157, -15, -372, -182, -289, -670, -319, -375, -445, -443, -491, -642, -411, -619, -592, -683, -609, -498, -271, -326, -316, -407, -229, -480, -282, -436, -145, -123, -256, -3, -282, 199, -75, 302, -7, 351, -113, 345, 557, 280, 268, 359, 510, 220, 546, 543, 268, 521, 153, 741, 409, 171, 431, 354, 433, 94, 368, 224, 268, 391, -276, -2, 284, -266, -40, 59, -167, -195, -73, -39, -354, -119, -206, -12, -371, -778, -307, -247, -761, -545, -534, -593, -486, -647, -34, -133, -378, -228, -172, -286, 104, -437, -256, 23, -70, -134, 192, -85, 67, -435, 83, -146, 250, 308, 202, 277, 96, 596, 416, 432, 450, 92, 76, 539, 188, -22, 308, 563, 319, 124, 189, 285, 281, -9, -116, 76, 450, 241, -112, -112, 127, 340, 168, 185, -50, -23, -361, 76, -156, -445]
2858d45K74m5j71J85k2j13L2j54N65l18J00j84m0R3J51k60k77M50j59K47l08M98
2880I9ll32Q4k7J2j8K46j42j69K16J96J3M4k56M18l34J24J86J00mj38P4J92l30
2904B51o9R0O0Q9j44n3K55j74j03k3o8j82J98k0j06o2M54k18m25J25P4j68J59
2927f0j08P6p8J00l17J28Rk3j01R8j1k81K77L22l24p8O9q3J65L0k10J96j4o5L32
2952D9q6k48K03m32O10o2rK19r7Q4j59L53j11m2k87M45Q7k84j94N53l01MO6j1
2976C50o9L31m56L32m48L4L27K16n07K04Q6m7n01J58m2M6m7m46M13m4j07J74k7
2999g0j07m1k77J54J37j2K61m27L1Q7J06m47K40O3J39N1j33K23j66r7r4k5L14
3022i0p2J31J54j87m8J74L90Jk99O5L2j25M09l1l88K52RM1l51M01m1r4RM87l19
$$ y = [-445, -171, -216, -387, -202, -224, -337, -305, -459, 106, -212, -112, -296, -336, -243, -92, -352, -629, -179, -338, -91, -399, 99, 96, -236, -152, -179, -167, -185, 61, -81, -250, -34, 162, 175, 219, -37, 381, 47, 171, 357, 457, 453, 315, 389, 581, 251, 182, 272, 332, 421, 277, 224, 479, 305, 202, 179, 111, -71, 127, 107, 1, -61, 393, 175, -250, -125, -51, -219, -60, -168, -92, -170, -70, -387, -259, -250, -273, -374, -276, -287, -568, -291, 31, -293, -371, -302, -385, -220, -190, -400, -204, -218, -283, 49, -37, -285, -82, -514, 96, 34, 25, 244, 147, 231, 72, 425, 314, 272, -15, 430, 517, 233, 39, 592, 291, 295, 361, 350, 281, 612, 156, 488, 40, 74, 401, 617, 110, 314, 400, 353, -148, 10, -32, 14, -33, -479, -66, -110, -217, -43, -70, -177, -218, -495, -341, -204, -216, 45, -382, -351, -264, -158, -605, -365, -302, -163, -112, -245, -22, -188, -285, -379, -404, -90, -162, -31, 123, -64, -112, 62, 452, 453, 154, 219, 251, 126, 535, 504, 116, 368, 377, 418, 67, 468, 427, 333, 342, 829, 510]
3047E10n18K1L91k77K25k63Mj64n0J91j28M5k49M07p50L22O1j10Q1j02L1L15o27
3070f34L67J37m87J93J16k23L62J9j19P2l64M95K64k74j63J56r4O4P5NJ49Lk00
3093h1N4M3M30J20m75J78n10N28j7R6J2j69M66l89K56k72k86L34O0j89J19Pk25
3116I0R8k16n1MN6J14j22K9j34O1k13j9J50r5k8r1J48J37l19k19L94j01Q7j6J05
3141a51l6L27l19O9r3R0j9j06L63l26R6K3j13M2K44L5q6K22l1k25PL82o6%l23
3166FK8n9M0K8L25k99o0K14o2K17l62M52j71l51J98K51k43P2n4J86k46o8j46k9
3190a33M68n56K00j7q7M1J76l92L47m1kR4o57M68J4k15j93N35l11J15M7j79K48
3213c0M9l34j83O38l1k61OJ23M9j51M7l16L36Q2K18k98l11J54Q5L17q6J42l26
$$ y = [510, -8, 13, 404, 127, 352, 89, 93, -71, -121, 70, -58, -13, -262, 145, -605, -283, -222, -332, -251, -353, -322, -7, -634, -267, -130, -617, -424, -308, -531, -169, -150, -269, -197, -561, -66, 198, -76, -239, -83, -177, -113, -38, -33, 116, 119, -81, -27, 16, 446, 566, 91, 269, -241, 287, 270, 366, 378, 209, 675, 286, 542, 270, -16, 318, 378, 189, 308, 315, 90, 188, -28, -79, -75, -19, 95, -27, 2, -132, -71, -284, -303, -153, -248, -276, -367, -219, -82, -401, -620, -226, -327, -240, -256, -151, -187, 140, -179, -110, -203, -113, -132, -238, 125, -201, -105, -82, -195, -153, 91, 126, 40, 262, 231, 6, 13, 395, 329, 329, 6, 34, -25, 15, 43, 368, 69, 9, 223, 161, 378, 16, 468, 297, -54, 144, 395, 152, 224, 170, 356, 110, 42, -104, -133, 335, -221, -21, -38, -125, -84, 92, -300, 47, 6, 4, 98, -559, -91, -77, -292, -485, 50, -261, -146, -99, -278, -30, 19, -315, -498, 140, 109, -152, -146, -23, 26, -125, -78, -394, -58, 24, 242, -56, -367, -213, -128, 189, 103, 245, -81]
3236h1J40M0J57k47K51j12o4K52j60o7OJ83j8j49kM06l87J8K62J6m64L88r8k68
3260BQ3j27J27j42K43j41N4N2j92O4k57qj61K18J30k71K35j78j19k2Q6L82l57
3283b99J66l80L10J71K6m62J11Q6K8J44Q4j43m1K96j52J86J91L3j19l13N15j67
3305B71l76M75l16K93J56n24P0R6K34n4l76K13J85l66K93m04Q4J52r0L8k3J69
3327B00k9R6l49j21K58KQ7k10j47K14j67q6o4J09J06p1m00J22L71n82M49mR4P3
3351d9j70k42K22J73j23k56M35k55L30k91L92k8j73K68K03m49J7J78J50k09J23
3372B46j5j97K97k90O5K05o3P2j27j94L02k88K37m6j53J23N8m04N28k7n33K82
3394G8l43K59J24j97n8P2l18M45l18J4R8N5k91J59r1QK65k85J6nO20l35l29M98
$$ y = [-81, 59, 99, 256, 9, 260, 148, 84, 336, 176, 109, 115, 298, 280, 131, 129, 535, 148, 166, 428, 444, -20, 368, 270, 2, 85, -42, 85, -57, 186, 45, 99, 151, -41, 23, -234, -242, -403, -185, -55, -326, -91, -269, -388, -410, -324, 58, -299, -133, -513, -203, -32, -6, -468, -357, -271, -243, -99, -15, -158, -199, 97, -55, 131, 322, 355, 236, -77, 438, 271, -105, 370, 54, 347, 503, -21, 49, 145, 379, 325, -51, 162, 347, -19, 274, -130, -46, 106, 16, 54, 31, 200, 171, 267, -82, -203, 55, 57, 144, -66, -213, 1, -166, -252, -316, -207, -101, -172, -572, -450, -79, -661, -212, -216, -122, -49, -219, -461, -239, -66, -189, -445, -10, -265, 65, -226, 166, 138, -35, 233, 436, -13, 4, 182, 332, 123, 246, 231, 34, 331, 41, 106, 311, 248, 320, 193, -1, 301, 13, 250, 204, 51, 174, 232, -172, 356, 329, -204, 78, -265, -6, 118, -79, -137, -65, -383, 62, -256, -242, -144, -89, -380, -221, -312, -304, -39, -324, -308, -313, 307, -28, -357, 141]
3418A41j25Q6l73J77O7n0J97k6j98L41l36Q3p0P5J35j49J82k65j0L98j33K18N1
3441D16l07J74j41J56m03K86J03k51M80n18J37l11J80J89k53M1m6p4K47m0m5l74
3463c54M68j42k3R9k42J27N9m1q7k53L62j2l71L77K10l32L01m44r7K32J19j63
3485b07K49j44J80M4o5J57n5o8m9j08K23o3N6j51K60J97n82j16K73K20j5m73L77
3508A40L81n69n6K75k55L89j58j34K98p3k37j71K98j22nJ3j58j0j94K56J76j49
3530f5J31l9o6o3K66l62Q7M0j44RM85m64J13R2k19J13n3J51l61J61p5P2r3J69
3554a15o8O05n37k42J15M74Jl52j18L01n4p1Q7j97K04k9K21k73N5K2P8Q7j2j47
3578C5P7R5l65L30q3j84L2J49j79K21l1p2l04N02k52R4p4n2L9k99N07q8M5j58
$$ y = [141, 16, 102, -271, -94, -27, -77, 120, 94, -104, 237, -99, -16, -86, -11, 124, -25, 157, -108, -118, 280, 147, 365, 416, 109, 283, 142, 298, -105, 181, 284, 33, 513, -5, 132, -179, 1, 190, -63, -22, -68, -142, 105, 65, 20, -354, 114, -28, -51, 48, -194, -67, -8, -49, -136, -389, -27, -39, -410, -33, 177, -155, 146, -298, -395, -163, -44, -207, 42, -102, 78, 122, 57, 214, 159, 91, 42, -66, 157, 94, 150, -1, 259, 456, -126, -242, 31, 251, 236, -237, 140, 521, -48, -104, 171, -84, 305, 147, 13, 311, 238, 1, -170, 128, 6, 1, 14, -144, -154, -348, -92, 84, -65, 66, 27, -39, -102, 164, -198, -111, -71, -215, -206, 279, -185, -72, 20, -199, -86, -139, 12, -349, -188, -263, -191, -284, -115, -183, 422, -115, -357, -242, 232, 233, -119, -237, 64, 10, -61, 26, -171, 33, 4, 225, -48, 7, 29, 107, 194, 182, 35, 112, 207, -158, 172, 89, -95, -63, 86, -93, 128, 97, 25, -279, 223, -29, 65, -9, -61, -22, -321, 186, 98, 143, -15]
3602a5m12K80J42j86L62k08jl74J49L90k30j15M17l66l4J31j47J46O3J07k09J69
3624E9R2l68k12K36L8R3j54r9K20j59J50R3L8k50J06L46J50q1j08n15L40J37M0
3647A92k78M87K0j22L7n1J76l30J0l0Q4j01r0J11l60L05n0K5J0J40k60l71R6K64
3671h6P4J3p7k64M89m58K59K02n28P9N5K43k70p9R3J20j43K29k38L2M37r2j87
3694i7P4l3L6j7N3J67P4j10J5k34J29J19k67K23L9R4k35J69P1l02M73k10Oj23
3718A14K42k55j7L5P9o59R01m34NK24l28j80R8L09j6j67j61O5n3K3N9q8J73K2
3742iO7r2k33K50j80K21j29j67M1K20j79R0J69j45j41J23l34M23j70J43J26R4
3764A88l26J36M7K55k87L5J28j40j1L7p6j26N02k41J45J1k46O7p4p1j48L55L1
$$ y = [-15, -427, -147, -5, -191, 171, -37, -38, -412, -263, 127, -103, -218, 199, -167, -201, -70, -217, -71, -8, 99, -110, 59, 151, -217, -429, -193, -155, -62, -216, -315, -95, -254, -104, -11, 27, -223, -117, 229, 379, 298, 190, -325, 15, 152, 192, -86, 401, 421, 299, 336, 285, 461, 131, 141, 111, 195, 94, 4, 115, -245, 60, 10, 35, 45, 185, -75, -446, -350, -86, -12, 1, -76, -340, 149, -309, -50, 152, -376, -297, -242, 1, -269, -348, -255, -135, -278, -49, -287, -255, 182, 90, -97, -23, -56, -20, -37, 16, 183, 257, 147, 162, -72, 57, 176, -91, 132, 171, 265, 30, 199, 270, -32, 441, 231, 237, 114, 356, 101, 84, 119, 198, -461, 440, 6, 11, 235, -93, -273, -175, 134, 118, -49, -210, -145, -198, -175, -116, -204, -31, -9, 58, -34, -267, -17, -197, 24, -105, -272, -231, -11, -190, -100, 69, -76, -217, -94, -428, -5, -175, -32, 94, 188, -138, -2, 45, 300, 13, 48, 176, 36, 25, 62, -14, -140, 362, 121, 266, 277, 31, 98, 24, -47, -195, 160, 191]
3787A91j9j1L14o19J57J19K1n1k46o9K75j71P5J25K39o06P8K89k14n8RJ59l76
3810c89K18o5J15MK01j84mJ15K43m67K68k23J74K3J82l69j16L55pl8N3j68K44
3833A65r4m06L55J07j34R5k04K58K76m19K66k33L7k30K40l43L20Q1K23m64jQ9
3855a6J51L06m70k72M21K8j63p6j4O9R4K1k00J12J70p3k08K21lm01K37N2P4j52
3879i2J08o9j58J63PJ61K66n14nl1L6Lj69L43k14O1K77J3j8m34L5J72j61K64j28
3904h4L93k82j07J70r6J99k56P9Kl1R0R6j00k1N3j5N4J26l42l08L95j00RK0J44
3929H8r8j43M13k3n3k08J44l03j3L30n9k27K7o9j1N9J54K15j97l14K23K74k57
3952d8j2J14M7m62L02q0j14PK9J14L7p0p2J14J79l24j04O53n16K73L8K23k03k94
$$ y = [191, 172, 161, 475, -144, 13, 132, 153, 102, -144, -213, 62, -109, -34, 91, 330, -276, -198, 91, -123, -181, -172, -13, -389, -171, -236, -121, -117, 84, -100, -104, 11, 254, -213, 55, -168, 6, 29, 211, -158, -274, 81, 74, 36, 89, -79, 165, 71, -335, 20, 127, -7, 88, -116, 142, 418, -1, 265, 32, 69, -161, 79, -264, 56, 137, 360, -104, -105, -16, 135, 441, -29, -301, 120, 148, -15, -91, -105, -36, 58, 79, -121, -9, 161, 88, -120, 101, 98, -303, -66, -14, 60, -92, 16, -53, -211, -48, -41, 120, 386, -128, -133, -164, -128, -125, -294, 49, -165, -104, 173, 186, 168, -266, -231, -59, -220, 44, -84, 309, 27, -80, 90, -6, 193, -63, 16, 18, -13, 77, 173, 73, 52, 105, 90, 144, 270, -72, -380, 15, -85, -76, -56, 88, -10, -153, 260, 237, 184, -24, 120, -183, -196, 134, 75, -152, -125, -194, -205, -146, 8, 223, 26, -288, -65, 209, -48, -60, 54, 101, -361, -59, -139, -253, -246, -217, -103, -66, -136, -208, -94, 85, -239, -343, 310, -206, 67, 105, 328, 125, -169]
3976a69J90P7n5j40L12l03R3M26r3j04j24p5L17m04J83k19n3L82k28M9J22m69
3998b85L26k23N8Ql9K28N3l24J91l15K58K7J81k1j86Q8j60j42L38l22K43Q5k03
4021a36k5L6L5L9J02M0o3k36J59r7J06j47M57l04k4M1o7q0J07J29L27n00J04J65
4045A68j48K11O7n35N82l47k3O5J46k06J11n3q9KJ79k43NK36O9j78k07O7K45J71
4069B95k70j8r5L18n13J24M2K45l86p8J31j53K28M8k42L23J76l27M6L35j83p4
4091b8K05n3k72j6qJ81R3k84J25k70O87k86K4J86l90K93J2l51L65l87J50K21j92
4114EJ32m7l34N5L08p3O0K40k3k32j35K38L09k89r4m7k41m1J25J84j61j06k8K05
4138A0L0P4m3j27m5n8J03l47O98k09j38P8j29PK09n5o7o9K00J90o43M11K02m68
$$ y = [-169, 21, 98, 43, -97, 215, -88, 5, 431, 338, 234, 110, 35, 352, -52, 131, -88, -141, 241, 13, 62, 184, -285, 41, -182, -124, -116, -155, 73, 126, -198, -7, -322, -64, -37, 144, 123, -63, 25, -135, -277, 61, -261, -18, 67, -136, -161, -125, -90, -51, 51, 91, 28, -208, -49, -146, -40, -187, 270, -34, -58, -17, -84, -164, -57, 72, 399, -101, 3, 168, 20, 231, 298, -237, 345, -2, -25, 40, 186, -20, 91, 38, -51, -49, 130, -113, -108, 128, 197, 19, -188, -121, 124, 295, 25, 7, -88, 230, -283, -159, -117, 128, -258, -336, -205, -358, -130, -82, -324, -1, 175, -152, -106, 229, 46, -28, 177, 124, -148, -164, -172, 9, 102, -182, -57, -327, 360, 74, 98, 284, -106, 187, 199, -152, 213, -174, -24, 197, 5, 137, 90, -244, -189, 119, 46, 106, 346, 323, 91, -44, 194, 503, 214, 120, 73, -168, -209, -84, 100, -61, -167, -195, 10, 40, 114, 71, -56, -101, -159, -56, -403, 295, 86, -52, 26, -103, -96, 113, 58, -9, -78, 122, 312, -331, 80, 282, -186]
4162a86j93M13J2L6J07l80J13K15l29P4K18j6j77J44q2K58q1P9J68k80r1%n2L83
4186C53j03j71NJ2k96K89j75K26K49n67M34m8k76K92j82J10l22J92L49n89L26
4207A08j01k10N5N9J85k1j28N3j47J22J83l95L85l7j55l6L5mJ55j07K4j12j45
4230b34Q9K66l66K50j64O6j8P4J90k91K9J71k21j01L10j58j08J39R2k39J34L30
4252B40l46j0J17K00k32J49O7j26K37j01k93J58j12q2J28O4j52l8J25K58k86j27
4274a62K71J5J21j80m32N08j28p2J92l6L3k32M8j76J00N9p5K31P2N2m63M51m38
4297b41J30J5P2j96K38p6p9l8l7M44k84K03k90J99J40l21L43j54%J0J73m0J4j97
4321B8j91L19j4k32L24k43J18Q9k63K12J99k96r6R6j84q8M69k14K4J61j05k25
$$ y = [-186, -379, 34, 46, 82, 189, -191, -78, 137, -192, -118, 100, 84, -93, 51, -31, 227, 146, 225, 393, 113, 22, 22, -30, 353, 250, 79, 84, 96, -200, 89, -86, 140, 389, -178, 256, 208, -68, 224, 42, 152, -170, 22, 371, -218, 108, 7, -203, -148, -89, 96, 75, -53, 0, -147, -25, 158, -237, 148, 111, -44, -80, -45, -49, 106, -1, 23, -89, -234, -145, 121, -245, 5, -159, -93, -111, -37, 153, -138, -109, 62, -159, -260, 50, -108, -216, -77, 15, -224, -90, 240, -106, -116, 1, 201, -31, 118, 185, 59, 296, 195, -98, 60, -52, -134, -6, 58, -94, -132, -7, 251, -35, -162, 109, 124, 245, 65, -367, 141, 13, -59, 133, 97, 130, -102, -54, -230, -130, -71, -146, 85, 157, 209, -254, 197, -241, -111, -96, -24, -220, 18, -58, -137, -175, -212, 232, -52, 151, -139, 60, 200, -121, 222, 68, 68, 78, 251, 211, 225, 28, -163, 156, 142, -90, 234, -9, 109, 198, -65, 147, 346, 50, -46, 50, -134, -222, 247, 33, 57, 218, 113, -112]
4343a12j35J6M98l64k0p8J11J32j79l1j20M76m90J46J1L17j87m8p8N65l51q5J00
4366I4k13k90M21j88K8J52o5R3J02k5o1J9O5j57j81K06L2j06j24K86j3j30K41
4389A86j06l7j82J48J83J1n12N88l48N63j10k88J25k07K98m26K07k97Q5J52j39
4410a06J12J35l98K45j99L70l01K09J62J10m05j14N9K01l4j43j45K43k42j89R
4431d21J26j5P08m71l39N79j65j26P1n1j8L21k51K86k38m0k7o9M19k22K24r7k16
4454c2J57N4k27R5K21l71j05R1J93j41R0J73n8j74K56p3m7j87J79j23M6L78n82
4477a87lR9J08l41L93J85m54l4K47j16M4n5K91k08j19K00Q5o0k92R1M47k00j78
4500e7Lj21J70L0J5k00J83Q9j39j88L16n15K54J52j27J16M42k02l31K08k56J27
$$ y = [-112, -247, -231, 267, -97, -117, -195, -84, 48, -131, -162, -282, 194, -296, -150, -139, 178, -9, -57, -135, 430, 79, -6, 94, -119, -409, 12, -176, -148, 4, -61, 32, 134, 109, 48, 67, 132, -25, -206, 0, 32, -74, -198, 88, 75, -55, 186, 80, 43, -139, 9, 192, 203, -309, 279, -69, 494, 384, 96, 221, 14, 312, -114, 93, -204, -119, 33, -106, 6, 141, -257, -12, -211, 159, -142, 67, 229, 339, -66, -180, -121, 80, 46, -97, -242, 1, -241, -430, -421, -295, -310, 398, -73, -412, 167, 2, -124, -53, -104, -122, 199, -52, 234, -4, -44, -71, -140, 279, 57, 281, 184, -32, 125, 179, -48, 47, 268, -103, -208, -117, 76, -65, 25, 198, 140, -34, 222, 149, 102, -85, 94, -29, 17, 395, -187, -190, -91, 17, -324, 69, 254, -200, -234, 13, -103, -59, -114, 177, -31, -150, 50, 135, 75, -217, -126, 321, 121, -57, -54, -175, -5, 25, 40, -160, 23, 112, -27, -215, 101, -414, -160, -8, -135, -19, 423, 221, -110, 98, -158, -31]
4522c1k75r2L82O9m4K7j43J95p0L4q8O4q1mJ34p8j32l3K07j64J72k28K38o7P7
4547F9r5M2K15n68q6K74R5M5m8R1R9k78J05j79j01L26k6k64L90k80L62o1j06j05
4571h4P0o6J20N7j86k67N98k76L02k57j29k9J91k03K37p7RP4j02P9j67J32J95
4594B21r0k66L33pJ6j97J55k12j36J34M0P7J83k36Q9j43j14K7J51j62J18L8L4
4617E3NP4m68Q8M79k18j35J92j11N4L3L49n91K29j26p1K06p9j62P2R0j40K6L0
4641a21K10m17L98j51j30L21n3k04L67m94M33p8j19J26k21J22J11j67J47l4J04
4662A50j66m1J20k08K68j44k2J3J05j19J16k5K0J43j91m3j14k54K81L50j38K24
4684C25n31O9Q4K2L3j30O4M1j40J8PK93j15k85K45L6j05k2J03k15K55l6J60J0
$$ y = [-31, -306, -398, -16, 53, 9, 36, -107, 88, 18, 52, -36, 28, -53, -57, 77, -1, -133, -166, 41, -123, 49, -179, 59, -8, 69, -26, 16, 231, -337, -423, -149, -54, -9, -57, 34, 133, -145, -40, -219, -320, 6, -20, -284, 106, -174, 188, 127, 21, -84, -14, -80, 40, 97, -89, -356, 242, -34, 268, 11, -118, -147, 44, -159, 78, 1, 10, 84, -18, 61, -106, 26, 221, 131, -135, 198, 191, 207, 10, 165, -47, -183, -49, -9, 68, 251, 15, 104, -39, -153, -126, 25, -137, -19, 19, 53, 58, 132, -336, -248, 231, 13, -122, 70, -41, 13, 46, 395, -196, 33, -93, -164, 42, -37, -199, -127, -37, -177, -151, -121, 89, -328, 70, -81, -211, 110, 57, -147, 220, -274, 159, 81, -38, 88, -133, -11, 100, -67, 80, 46, 150, -16, -57, 63, -145, 123, -21, -43, -30, 75, -44, 72, 47, 67, 210, 19, -24, -138, -392, -111, 239, 101, 325, -206, -137, -53, -31, 2, -128, -64, -23, -163, -145, -138, 155, 40, -245, 0, 36, -69, -91, 12, -203, 52, 16, 176, 186]
4708A86m09J27j71P68l55n7j50M8P5k09J77J52j06k02Q6R9m3K11j76k6N2k79K63
4731F1l8K03M9Jk97j51J38l3J86m2j30J76oJ27j21k99n9J86q9J36J12j92kj8q1
4756a83J7K36k87M5m9M21m09J76j31k8J56n8L9K4J97j03j65M5j28L75k29R9J82
4779B42j85r1K63j65J65j28j04K0M7j80O6K01L5j95J09l9k23M35j85k2n2K95l19
4802a0K27q0j84q8J99J81l78L0K18l20J94j59O6M39j3n68J16J91l76L63k42L91
4824A97l88J32QML9j28MJ70J16J21k42M3j13K43k22j72K18J91j73O6k02Q2J01
4847I5j0J4k59J87k25L91L8q8l98L06j87j10K66O3m6l5Q5o8k35J81L9k07N10k30
4871G7k26J18j29j39M09k23K42j36O5J30K0k97Q3n3M1R7j1o3j98PK08J63k08K4
$$ y = [186, -223, -96, -267, 501, 146, 89, -61, -13, 62, -147, 30, 182, 76, -126, -40, 59, 16, 227, 51, 25, 77, -202, 61, 23, 226, 275, 276, -21, -172, -34, -67, 119, 77, -53, 123, 117, 244, 123, -176, -235, -49, -138, -2, 110, -82, -84, -102, -183, -166, 70, -217, -172, -221, 200, -209, -33, -164, -192, -36, -94, -55, -31, 166, 63, -102, -57, -185, 190, -39, 60, 242, 57, -34, 229, 64, 229, 101, -3, 17, 64, -116, -50, 151, 186, -9, 100, 61, -162, 273, 88, 66, 14, 309, -10, 217, 137, -47, -135, 64, 245, -133, -103, 115, -205, -11, -170, -104, 335, 322, -246, -130, 61, -315, 48, -194, 197, -191, -59, -51, -47, -8, -136, -132, 38, 154, 275, 33, 76, -37, 206, -16, -188, 30, 221, 48, 114, -88, -6, 95, 85, 99, -160, 27, -198, 193, 231, 143, -255, 51, -136, -246, 20, 83, 37, 2, 87, 19, -216, -35, 4, -203, 307, 77, -149, -31, -160, -299, 110, -113, 129, -7, 58, 188, 208, -89, -6, -59, -18, 79, 68, 5, -193, -186, 22, 185, -23, 1]
4895AN8q1J22k69k14L29J90k32K28l09N7L9P3L41l85j31J10m2J23J03m2K57K7
4918C53m98R1p7L92k66r0J6n9K34rj42L53j76m4m5m5J25o2lq1J32j69L53j17j71
4943eP7K08m51j2K50J36k11K76k70j04K05j18J76j24o6j63L32j29M3M5j22J76
4965A49l24O3l3j3J10K28l30J62j9n9M2J27j28n8K11j57J12P7k88O9J23l09K37
4988hJ34j22K25j33l94O04j77j89M2K10k51P8J35N3k52n8N38n11J45P8r2NO2j42
5012b0J23j14j05l3L40j05L09p27M23k51O4pJ08K63j29j82j62K25n3ql4J4K85
5035B24L8l26J33k61K20k01K01l45J67RR4p3O2j90K52j3k06K28j64K20l3J03j11
5058B8l6l4n9Q7K7p5k03P2J77j87L83r6J76m7k82J91RP0j7j21m2K54j30k97J12
$$ y = [1, 59, -22, 100, -169, -383, -54, 136, -96, 132, -177, -120, -81, -8, 333, -52, -183, -73, -115, 8, 111, 69, 326, 353, -145, -54, -131, 261, -5, -95, -79, -138, 96, 87, -55, 298, 122, 78, 33, -12, 113, 51, 48, -33, 99, -70, 283, 166, -5, 72, 280, -171, -183, 67, 203, -8, 268, -2, -106, 99, -19, 157, 33, -33, -196, 136, 7, 50, 95, -27, 149, -175, -112, -145, -158, -48, 180, -150, 12, -7, -66, -24, 103, -25, -83, 128, -29, 83, 160, -128, -59, 64, -245, -8, 126, 4, 229, 96, -298, 306, 129, -60, -18, 192, -59, 19, 154, 207, -45, -103, 435, -76, 69, 147, 55, 60, 122, -20, 103, -11, -116, -149, 191, 86, 395, -332, 91, -160, -96, -103, 5, 268, 139, -43, -205, 20, -33, -41, -75, -61, 224, 262, -64, 69, -192, 28, -173, 28, -317, -150, -141, -47, -120, -58, -248, 4, -9, -215, 13, -151, 69, 36, 139, 28, -8, -42, -101, -14, 13, -62, -265, -193, -16, -203, 180, 84, 260, 213, -69, 122, 131, 201, 184, 63, 21, 275, 145, -152, -40]
5083d0r2O4j7Q1K2K7m05L64j14J37r3L88l62O0R0l2j93L04j63j91K29L5j25J5
5107a1j98J33J06O4j87J88Mj07P7M8J41k50j5j25K07p3jN0R4k6l47K19r7P3M46
5132D13o94M74j22k60L39j41n0p9K6J18l3K20k6j21l82L48r8j31K50m8q9J4j33
5155b05MJ78l3J46l38KK94o1k56k5J76Q0L5P0m3J65L4k57k54L68K68m67j50N48
5179B79K98m62n5j59M24m27K12j59n3r3L86r3k9OK37l34L4O4p7q7Q1J18l26N85
5203C70q6k67R3j42P3l5j43L85j70k6k7k19M69j86k14J46m6J35j08j35LJ33J33
5226A36j18k2k54J53J63j34l75L99N1j42M8K38J17k65L2j43M43m81Q2K4l1j3j41
5249b33L09l5n4R9K13n33M34k54J2j53o5K83J32l15J18j69M40j25m2m0ok40J38
$$ y = [-40, -132, -68, -85, -4, 18, 45, -360, 4, -110, 27, -66, 322, -40, 20, 110, 78, -115, 189, 26, -165, 64, 99, -26, -11, -209, -76, 30, 94, -93, 95, 99, -8, 69, 117, 258, 8, -7, -132, 75, 2, 1, 51, 145, 119, -228, -9, -106, -33, 413, -281, 193, 71, -189, 150, 9, -41, -120, -94, 24, -9, 211, 185, 64, -318, 30, -68, -199, 51, 3, -86, -72, -205, -201, -23, -56, 90, -248, -246, 48, -13, -269, -294, -118, -38, -3, 67, 24, 189, 223, -34, -288, 80, 348, -119, -269, 279, 577, 115, 60, -99, 325, -102, 110, -49, -102, -195, 191, 98, 69, 75, 312, -22, 12, 76, -1, -88, -7, 111, -215, 370, 284, 17, 110, -32, 41, 6, -137, 248, 78, 52, 25, -194, 275, 89, -125, 21, -25, 110, 2, -133, -130, 3, 136, 18, -4, -258, -105, 58, -76, -451, -52, -1, -143, -95, 143, 260, -5, 27, -116, 327, -154, -72, -48, -79, -92, -233, 76, 41, -13, 86, 299, -234, 200, -54, -42, -195, -260, 23, 155, -160, -42, -211, 229, 104, 62, 22, 16, -224, -86]
5272h6j65K90J52j83J44j66oN6k32M64k20J4N6r0l3J36j65J96j21P5k5%j3J8J89
5297B85l24Q3q4P1j26k9Q1O2n9j4o2M4q9m0K53R0l62J71mK03k10K52j84n3O5J2
5323C2Kk73M97m69J20Q5l14K92J2n1M85m4l34K1Jn6O5r7K17m51L33QL0J96p3j92
5349D2QJ3J8K15l89J9Q5k47J60J57n0J1k39K23j40N24n70J47Q6J5l9k84QK08m8
5374f7k11K50J50j43r3P2K4R4Rk46K20j08l2K60q1J51k63J74l22m1J9K92j5k58
5398a65J08J51l9j99J08j3Q7J76l02pk5R5l17L57KJ34N5j38K3L6K56j51k65K7
5422fJ02j42J04O4j22J27n9l59N18j11N0J6l20R5j23L2P7k3o1K93l9J13q5l05
5446a64q7j27L10P6K07j57l22M52j74j82L09j30M3J25k71J33j17q3K03Q8j05L2
$$ y = [-86, -251, 39, 191, 8, 152, -14, -20, 36, -196, 268, 48, 62, 118, 28, -5, 131, -34, 162, 41, 116, 91, 91, 78, 96, 285, -39, 44, -40, 31, -95, -124, -43, 19, -40, -54, -116, -72, -161, -201, 52, 142, -220, -49, -53, 150, -60, 192, 8, -45, 20, 32, 34, -239, 258, -211, -91, -6, -320, -28, -16, -67, 418, 374, 40, 61, 62, 6, 71, -26, 191, -260, 73, 81, 111, 307, 234, 42, 50, 63, 81, 296, -93, -74, 11, -236, -76, 81, 31, 42, -197, 26, -114, 410, -160, -13, 73, 88, 49, -235, -227, -19, -67, -278, -28, 122, -21, -114, -42, -18, 76, 85, -161, 59, -49, -81, 179, 98, 249, -14, 160, -162, -203, -184, 108, 93, -165, -57, 94, 55, -144, -36, -49, 38, 214, -88, -95, -120, -25, -342, 15, 17, 151, 206, 68, 91, 127, 383, 232, -33, -6, 96, -46, 58, 122, 0, 127, 68, -291, 227, 116, 166, 182, -138, -43, -166, -134, -57, -80, -141, 152, 113, 226, 141, -164, -251, -378, -68, 8, 215, 58, -264, 188, 14, -168, 141, 11, 54, 179, -92, 41, -76, -159, 44, 132, 27, 59]
5468E9r3r0P8N0N7j41R3j55J57m31L89R9L5l16K44Q9K35m40J60n64N20L41o44
5491b68J79l3l1O8K31m48K78J66k37p7K04j5j94K57j5J68l44K60j86k36M8M42
5513B17k04O3p2l9j1L66l69r5Q0M4M6k05m7K14M1K1j30L10j43k75K13K44k92K88
5537B65k04l9K15k63n0k35K30M6j44Q4j47K87k26j2K20K30l28L3K08j99R7j08
5559d0j84K14j37Q1J62l4N5L6n3o6J69j19j68J59k04L8Q1M2k9K06j97m7J44M5
5583A54O9m74K94J98Q0m04N6J45R2n55K78q8L16j52R5j38O2Nk8J18p7K5J22o3
5607A30j40j02J91m7p6J14J49l73L66j62P4j80q5p5K33m0J72k59L0P0n9L79n07
5630a97J44m2K17j24l0l2J90n7L02m17j68J18j30P5J91k29P9J50N1K1k55K53j86
$$ y = [59, -34, -124, -46, 4, 61, -80, 13, -142, 15, -416, -27, 72, 107, -209, 35, 124, 359, -81, 79, -485, 35, 376, -268, -89, -122, -153, -85, 146, -302, -24, 142, -95, -172, 32, 17, -177, 80, 65, 233, -111, 149, -37, -273, -225, 217, 13, 76, 4, -35, -46, 320, -49, -144, -64, -20, 26, -179, -226, -12, 29, 50, -80, 230, 87, -188, 25, 269, -23, 265, 61, 22, 237, -26, -76, -311, -81, -35, -179, -95, -242, 45, -181, -193, 27, 257, -71, -38, 170, -29, 68, -40, -224, -10, -147, -66, 96, 62, 117, 153, 100, 34, 203, 84, -84, 75, -129, -91, -10, 32, 3, 209, 12, -35, 109, 154, 223, -251, 43, 241, 321, -83, -27, 118, 210, -345, -67, -155, 161, 9, 104, -34, 28, 33, 5, 123, 46, 71, 193, 130, -10, -112, 79, 32, -44, 70, 219, -154, 212, 50, 124, -56, -141, -216, 17, -23, 149, -110, -80, -10, -69, 310, -197, -53, -95, 122, -2, -32, -64, 126, 69, 371, -46, -214, -96, -226, -151, 40, -189, -110, 40, 91, 112, -143, 110, -76]
5653g6K09k43J44n2J02K7j45J52m0J2J27l86O7J23J23n85O73l44O4lj30M21O1
5676C01m01K82J32J9j30j03r3K36m17L18njk59k05L81j97P3K76m21L44k64J15
5698a9J39j42j4j14J70k3K78k98L4L57m79j45M46j33l5j83L59m35P9R2J95l24
5720a95J91K45r3j81J30L0j50p7J13r8J24j1q8J41J08nj39o1K82l05m90N93p2
5743hJ50j34J26o1j34j7L6k4O2N6M1j02J42R0m7J75k63j57P2L61l70l0j1lK62
5768B12k35J77K3m1m15O2M23j76K10k92j7J67j20J62k31K78Q6k60j07K38k45k14
5790c15K36K82m02N10n04Q1j13J99k30M26l68K19n9J56J28l10J36j38L07j68j16
5811d3J99o5jj15J10k03nK05j72J45j24l8M5l28J84L94j81o4j4J9l3K02q7J25
$$ y = [-76, 133, -110, 34, -18, 84, 111, -34, 118, 78, 90, 217, -169, -102, 21, 144, -441, 232, -112, -48, -51, -181, 240, 301, -100, 182, 314, 333, 203, 100, 7, 243, -174, 144, 139, 138, -121, -326, 55, -142, -69, 207, -214, 130, -134, -19, 120, -22, -36, -150, 20, -3, 275, -23, 11, 368, -111, -256, 190, 57, 22, -161, 198, -237, -158, -66, 129, -195, -4, 241, 148, -33, 97, 127, -23, -100, 13, -85, 39, 28, -60, 81, 189, 184, 45, -16, 266, -39, -529, 64, -8, 142, 8, 134, 73, -61, -78, -42, -66, -4, 52, 93, -9, 133, 223, 176, 351, 88, -69, 3, 364, -6, -36, -47, -50, 212, -23, 154, 177, 136, -279, -217, 206, 30, 240, -52, -69, 98, -22, 140, -91, 187, 273, 13, -94, 144, -101, -315, -79, 203, -199, 311, -193, -112, -225, -26, -256, 170, -198, 21, -38, 118, 246, -64, 72, -66, 241, 73, -43, 156, 91, 90, -25, 85, -118, -123, 82, -90, 55, -69, -107, -62, -390, -206, 188, 7, -57, -71, -52, -85, 117, 30, 155]
5835A55N0k5q2O6J2R2k47k78L53p6M6l15P6K98q7j48j77K39o7L21r2o3P1k50K74
5860A46l27K46k27L12Mk54K03k51j20m1L87o6K12k55l20L75k86K46J62j89K04
5881A61k68r7K28k61M21o6m1j62o1k3R2J68k95N3K35j44p5R8J39j13j09J27o9
5904f2j82N75o09L45L0K12m49L28j02j21K70l58n3M12k89K33k66J44j58K17j02
5925A5j75K40k13J49O3p5M1k54L32M7l34K51k00O7k4J58P0m7j99J0K11M6k14J58
5949A23k0l83L71j90J87j39P6l84L23L17k48L6k29M38m91J04J44j07q9k1L90o6
5971A42j57j05m9L48J2k15J33k40L04j73N6j1l80J09K57k71K00k29J57L63l77
5992a26Q9J59j75K6j11p9L71k41K83k13k28j0L90l2l12L19j23p5k66O82l07j41
$$ y = [155, 205, 180, 98, 164, 176, 268, 21, -257, 96, 20, 66, -249, -173, 125, 38, -110, -287, -48, -115, 206, 114, 51, 122, -128, 146, -181, 65, -162, 150, 154, -100, 103, -148, -268, -309, 78, 12, 224, -31, -351, 24, -262, -16, 146, -43, 161, -107, -204, 24, -237, 184, 118, 77, -85, -146, -169, -77, 91, -204, -151, 84, -60, -135, -37, 102, -11, -120, 7, -62, -244, 331, -278, 67, 97, 309, -140, 188, 86, -35, 235, -123, -176, 236, -53, 180, -86, 58, -100, 117, 15, -160, 80, -133, 16, 79, 4, 45, -209, 123, 170, -164, 87, -113, -46, -70, 88, 158, 111, -88, -78, 133, 179, -35, 123, 103, -280, 91, -99, 88, -51, 25, -359, -36, 281, 33, 69, -160, 278, -213, -109, 35, -72, -161, -182, 208, 142, -15, -120, -169, 179, 191, -24, 109, -131, 173, 0, 56, 45, -335, -226, 31, -240, -40, -269, -112, 251, -126, -37, 122, -53, -27, -138, -217, 154, -87, 196, -17, -245, -255, 135, 103, -209, 110, -13, -88, -354, 328, 21, -120]
6014a20J65L3Q3j0m6l12K48J2k28P6r6J1K81J28k07j65O3K37n41M50j71J82j3
6037F0j33K37Q6J4m58J43J26j0j38j07J16J94j01J4j22kJ91K9m08M10l41J48L42
6060B90k91k1j90J39j09O0M05k10Q2r6l27R0R6N13j99l70J12N7k02K16j10R2j70
6083a43J83l53J23M18k58J87j74P0m6p6N7l3Q4Q3k02J09j69K62n1LqR9J47l08
6107Dk02Q3K78k06J91j36k94L9L46j10J07r8l9o4K03K1k83K64r3N4N3k36J62k03
6131a59M18j09k26J50q8j21J54n2k21M20j05j05J04j00j24K12k09pj37J22l6j06
6153c25J3J96J47K90m19M%o9lJ18J85o4J73j17l05J52l1J87M9k89j31M15j38j10
6177g2k32K3K18M69m42p6K66j32K02j93l1pJ27m8k38L2K57k12j24M5mL83k6j59
$$ y = [-120, 45, 78, 161, 151, 105, -207, 41, 53, -175, -99, -195, -184, 97, 225, 18, -147, -84, 153, -388, 62, -109, 73, 60, -73, 164, 250, 264, -194, -51, 75, 65, -73, -180, -64, 130, 29, 43, -79, -81, 110, 139, -269, 141, -200, -52, 290, -1, -22, -212, -73, -182, -122, 283, 73, 155, 59, -268, -178, -82, 431, 232, -138, -26, 31, -171, 45, -65, 27, -143, 40, -313, -190, 228, -30, 157, -17, 53, 7, -69, -12, -45, 39, 122, -80, 29, -140, 122, 71, 74, 66, 165, 312, 4, -198, -115, 163, -43, 148, 12, -282, -243, 103, -7, 100, 2, -37, -101, 102, 123, -160, 104, 11, 65, 118, -118, 44, -159, 259, 150, -76, 74, -14, -135, 19, -33, -254, 166, 61, -44, 60, -40, -164, 48, -161, -168, -305, -183, -219, -325, -312, -116, 31, 321, -98, -94, -94, -163, -166, -48, 137, 73, 246, 129, -176, -24, -55, 132, 181, -108, -239, 176, 38, -72, -304, -281, -63, 406, -36, -112, 154, 22, 224, 31, 0, -7, 120, 72, -166, -134, 123, -89, -213, -168, -172, 211, 185, 26]
6201B6j3J8k89N63l34K25J24k96l4K1P8j95J52l55J38J43L57Q4n07M9J26k81K00
6224@J87j58k83M21l34M34m29L75K0m26n7L27n5n8P0J58p5q4NK29k78j83Q4l0
6248a40K10N0l05J41lJ74j96m4J94J10l80N4L2K9o4K26k73K37J4J48k09j13J41
6271C3r7K29m40Q7L38l52K13J72m10K63K06m70M43k7M8j63o3l6J12l5k74J87l04
6294c40L31k71N74j65o1R3k16K29L9n3n6P9k54J43j80m6J02k51K96k15K76J53
6316B07l11J48N1k46j0J71m4Q8L66k35j81J30N8k08o5l37N42r3p1R0J39l96K23
6339A6r9K70n7o1j16J43k48K55k99M43j51K25m98J07K36j38R2j33m4M14m96M54
6361C15k21j38L21m13L09l88L27l8o5K45l4m02K44K91m36J38k68L08k56Q9mJ74
$$ y = [26, 13, 31, -258, 305, -29, 196, 320, 24, -10, 11, 89, -106, 46, -309, -171, -28, 329, 413, -94, -45, 81, -200, 0, 187, 29, -254, 167, -167, 267, -162, 213, 233, -193, -250, 77, 22, -36, 34, 192, 117, 33, 38, 267, -11, -194, -110, -140, 70, 120, -185, -44, -47, 127, -69, -113, 81, 191, -189, -135, -103, -74, -138, 88, -185, 52, 66, 214, 5, -108, 33, -64, 165, -275, -188, 150, -202, 11, 183, -227, 36, 242, -228, 215, 188, 236, 73, 10, -26, 86, 51, -223, -36, -340, -9, -280, 294, 129, 68, 161, -55, 174, 213, 160, 104, 183, -71, 72, -108, -154, -52, -303, -7, -222, 54, 207, -104, 44, 95, -151, -161, 10, -34, 54, 420, 185, 4, 134, 192, -16, -81, -418, 124, 31, -40, 50, 189, -207, 16, -83, 187, 130, 69, -47, 96, -152, 103, -196, 247, 96, 321, -177, -70, 166, 28, 120, -13, -57, 357, -139, 315, 94, -44, 277, -136, 173, -215, 112, 74, 9, 254, 220, -182, 62, 353, -83, 55, -213, 95, -161, -72, -76, 98]
6383I8j37K62k94R7J04l7j83J03q3K63j79J74l89J85R6L3k94M32l48okP4K97k9
6407B37l30J1M07j41L6l37J33M5L1P0k60Q1r6j31k3M02j22j34N56k54j61Jr7P9
6431Cj25K62J25j50k52L84K0j5l35l8M3K47mk46l5K73q5m24L78O8n4O6k01J17
6455B2l8l87M34pL4k7j03J01O3k03j49M04l16P7L26k75J63m63L68K76k99L98k68
6478A31k83J03P9j08L55l87K43j14j37J00k4J30l4O5k31l6N6J52j81J56J71O8
6500B74j92L1R8m94M57j24k92M55m20o1J45j76L95R5l73K99k37K18jk75Q3Q3J53
6523A41k94j39M58j56K21l04N2j71R1R2k65K12J19k25K37K21k49MJ6j56k73O5
6545c03M77k30j8J94j11k01K59r0J29j13O7o4Q4j31j28M42k45N5r1K40m23K47
$$ y = [98, -39, 223, -71, 26, 130, 93, -90, 13, -70, 193, 14, 188, -201, -16, 80, 113, -181, 251, -97, -103, -105, -31, 266, 237, -93, -82, 325, 184, 220, -117, 16, 61, 92, 162, -98, -17, -113, -244, -267, 135, 13, -121, 435, 181, 20, 21, -76, 3, -122, 140, 265, 115, -137, 247, 267, 252, -83, -121, -78, 169, 165, -81, -116, 157, 72, -352, 26, 94, 40, 106, -95, 22, -16, -403, 31, 24, 58, 31, -72, 29, 92, -111, -260, 144, -172, -95, 231, -44, 119, -344, 24, 300, 1, 399, 131, -152, -49, 30, -78, 277, -110, 133, 19, -118, -18, -42, 88, 54, 119, -112, -148, -92, 60, -121, 35, 206, 274, 82, 113, 211, -283, 174, 50, -242, 213, -207, -268, -123, -299, 96, 191, -182, 117, -120, 98, 97, -178, -95, -12, 141, -153, -292, 166, 10, 231, -73, -21, -192, -101, -9, -274, -62, 57, -168, 69, 290, 41, 45, 61, -95, -368, -303, 174, -56, -74, 120, 9, -192, 67, -23, 106, -7, 60, -4, 80, -51, -179, 263, 18, 73, -18, 222, -201, 46]
6567D6L3n5k38J97K97k56j2m8N5j0j88K73k78J07L08l56N7p4J23j73J05R4N3L0
6591I0k0o6R4k61M03k62Q2K58k82J0q8L2j41L01J22r8J00k96o2J09j08j05L86
6614A98j17r8J66k09r4K4j63J93L19N3j95M7l03L49qp1k06J00J83j26K08l31J39
6637E8j17j41K09m3J4j45J34mL9k19J08n0L74k98Q4J15l72K49K0J89p6m3j54l8
6661a07M7K60J69m76J91mm04J73J53m0rr9K19j52J4KOQ7j91K79qk55L51m11J91
6686a4L89m62J93q1j84Q7K87l00j14M46k14K96l83k5O0J16l2j60K68m59J54J09
6708b3n4K63o9j73j9QK07l49L5L29K4km52M10k49L6j23L13l9J69k89O2J17J2M
6733A48Q9k89pJ75m29Q8Q3k44M05j35K54j73J32r8j03J06J41j00l96L53J5j06
$$ y = [46, 79, 24, -214, -17, 280, 24, 12, -36, 19, 9, -179, 94, -184, -77, 231, -125, -68, -142, -19, -192, -87, 7, 60, 90, 70, 4, 98, -163, 240, -22, 60, 318, 36, 46, -42, -10, -151, 150, 272, 174, 274, -22, -84, 25, -83, -188, 198, 81, -17, 149, -60, -154, -130, -293, -100, 219, 272, 77, 124, -179, 170, 162, 91, -115, -15, 168, 42, 250, -81, 58, -59, -200, 9, -34, -20, -165, -31, -35, 4, -215, -107, -157, 217, -81, 3, 118, -254, -5, 15, 204, 128, 85, -69, -107, -60, 200, 369, -107, 84, 80, -324, -151, 2, -38, -47, -146, 73, -79, -65, -63, -57, 30, -161, 118, 110, -145, 206, -205, -14, 375, -87, 106, 25, -159, -72, 215, -85, -199, 247, 33, 329, -54, -79, -19, 97, 65, -95, 173, -286, -132, -23, -77, 186, 117, -56, -75, -67, 140, -209, -174, 155, 179, 177, -275, 135, -114, -78, -201, 112, 73, 242, -47, 15, 132, 144, 148, 237, -52, -59, 116, -313, -225, -142, -386, 19, -116, 138, -35, 97, -1, -104, 2, 143, 43, -353, 0, 15, -91]
6755i1K03j60K17k91Q1m3K18R4l73J76K26j33k22L32l64K74q7J30k17n7j87M53
6777A79l03M43j20j19j4k93N36j23r3j13K08j37j79J67n79M92k01K51o6M8J07
6798I1k53J52R2l41M23j91K19o38J62M26k86J85J2j23j24K23j20L7r1J7J26k7
6820b9p8J64rJ14j04K15k95l0J36p0J34k41J81n2K28k90o7L07Ok23K00k00j31
6843a34J87j00q5K25n1J5J13K13o82J27J34j10K4J09N5kn6K6r6K34k98n2K26q5
6867f3J61k92J30j26J81p3j23R0j46K07Q2K2M8j13J56j80j00j17J30k6M51m27
6889a28J21r4J0J92k23J21j52J17l8J69J7p9kR1L1j86Q9m9j12J86j2j73J85j68
6913h7J2j76L77K8J87n79K86M8l3J94j84l5l2l05K95n0Q9j11Q0k07K77Q6l24L32
$$ y = [-91, 112, -48, 169, -122, -41, -84, 134, 228, -145, 31, 257, 124, -98, 234, -130, 144, 57, 187, -30, -87, -274, 179, -124, 319, 199, 80, 66, -227, 309, 186, 93, -20, 188, 51, -128, 39, -540, -48, -249, 2, -64, -16, 91, -162, -10, 82, -259, 164, -27, 192, -446, -284, 142, -144, 41, 53, -70, -194, 29, -91, -54, -145, -128, -2, -29, -107, 57, 48, 162, 58, 273, -22, -52, 84, 14, 148, -93, 88, 36, 264, -26, -93, 214, 220, -3, 197, -3, -134, 53, -47, -132, 93, 42, 57, 170, 383, -299, -172, -38, -148, -124, -15, 40, 38, -18, 8, -88, 146, -152, -204, 22, -63, 98, -194, -64, -190, -9, -82, -205, -115, -261, -54, 28, 50, 98, -15, 141, -39, -139, -256, -126, -152, 299, -128, -7, -101, -91, 101, -122, -1, -153, -36, -74, 95, 112, 33, 31, 122, 153, -33, 56, 7, -105, 81, 69, -104, 81, -87, -75, -251, 126, 154, 341, -238, 48, 96, 63, 257, 73, 38, 6, -299, -4, -54, 35, -76, 4, -203, 74, 160, -164, 168]
6937A68j07k44K80j72O7l1j18J02K15k1k16o1j54M74j14J94l90K27l00J50k6N
6959g2K00j44m4K4O2oP8%k5j6j59J81P1k9J70k64P2Rk31J03o1M70l71k61L27Q5
6985A69j64J05r2R1k02P5k78L45JM6k82J91p1J04K5j26K61k96K12k48P3J46j51
7008f6l1L5j43K13J43j54K93j22j19l6N6k81J63J67l21M85j15j46j33j83N05m30
7030b20J58K6M60l50m9J92k07N4m8P7l87K42j14Q6q6M61j85m59L51L34l83n9K09
7053A03J10l29m9j66M27J57k5j7m78N25m02J68n9o1j35j17J81L27l09n4J43k3
7075h3J57j67%R7n7q8M38k53M7O3m30J93J25j50K71r9Mk27l2K79R3k33J23k55
7099a84L7L85l77L55j93J10%k47j41N1K82RK7p3k67L84J57k31j15Q1m09R6R6R
$$ y = [168, 61, -183, 97, -75, -8, -39, -157, -55, 160, 139, -77, -138, -292, 182, 68, 262, -128, 99, -201, -51, -77, -72, 128, -16, -60, -36, 26, 20, 98, 98, 73, 57, -102, 79, 150, 121, 291, 27, 99, 108, -123, -20, -81, 389, 18, -243, 84, 169, 5, 110, 18, 109, -93, -18, -296, 49, 50, 96, -186, 5, -66, 38, 63, -63, 198, -98, 114, -134, -61, 85, -66, -97, -62, -205, 8, 151, -3, 290, 168, 49, 13, 69, -212, -49, 118, -203, 282, 167, 21, -112, -295, 210, -220, -62, -36, 424, 74, 25, 217, 10, 64, 16, 93, -294, -52, -166, -80, -166, 295, 110, -349, 2, 336, -47, -106, 103, 213, -116, -165, -331, 96, 253, 228, 211, -267, 258, -144, 24, -35, -96, -231, -348, -167, 160, -149, -203, -60, -83, 74, -93, -93, 4, -53, -141, 297, 44, 91, 154, -276, -83, 42, -108, 163, 64, 68, -159, -191, 88, 181, -52, 71, -184, -147, 238, -139, 216, 23, 133, 133, -114, -255, -204, 78, 87, 114, 41, -226, 158, 315, 84, -31, 50, -359, -263, -167, -158]
7123a58J34l8K9R4k57R2K32J28k76R2J4nj24N2l7j70L52j63k4L0P2O2O8j84L46
7148C61l61J04j17k02N27m77J49k4l12N93k39Q9j89L6K18J3j34O8k5R4j29r7j13
7171a67J66q6qR8J84k61n3K05j26J21l35M77k26j96K55lj40K99l78q7K31k8L95
7194C37j88l8m31N21k86K38J56m08R4L6j66K41k26K91l7%j58p5M0L9R7Q6j58l4
7218b9J7J25m09J16M07j24n8J11q9K55m19J80j94j5L34l10K75j85Q6jk4n8J90
7241A81k46Q9K6Ko0j9J15j96l3J85K15j90M2L7j64p8J27J17lk65L34l72M01n19
7265b74L00k2M37k72j56J05m94M48jj65R8j21Q7j25J25J07K94m17N6j30J22J53
7287A55Q3l55J37KJ05J51j09j49J43j51k69J93j20J21J71qMl25L13k09N5O0q2
$$ y = [-158, -24, -62, -33, 61, -196, -104, 128, 256, -20, 72, 86, 81, -43, 9, -28, -198, 154, -9, -33, -3, 69, 131, 199, 15, 361, 0, 104, -13, -215, 312, -165, -16, -40, -352, 241, 2, 91, -98, -62, 156, 169, 35, 103, 78, 172, 43, -54, -167, -1, -87, -95, 3, 187, -74, -127, 78, -48, 73, -262, 215, -11, -207, 48, 45, -95, 204, -174, -261, -30, -58, 337, 149, 111, -320, 201, -85, 153, 309, -99, -5, 31, -135, 106, -120, 171, 134, 134, -24, -99, -59, -20, 77, 163, 5, -29, -12, 113, -296, -180, 227, 103, 45, 156, 67, 322, -97, 83, -111, -126, 208, -102, 173, -12, 74, 73, 49, -9, 181, -65, 24, 50, 52, -8, -27, 88, -108, -141, 44, 259, 69, 111, 148, -16, -94, 33, 150, 147, -118, 216, -156, 245, -274, 26, 4, 441, 169, 13, 118, -376, 72, 71, -94, 4, -117, -30, -155, -30, 77, 371, -46, 10, -120, 2, 155, 238, -117, 20, 22, 127, 278, 169, 20, 163, 12, -257, -64, -184, -63, 108, 100, 104, -221, 92, -117, -62, -2, -84]
7310h4N7m5L1j02L4K57Pl78K62M7j00K4J4M6K17n26J37j04Q9K58k05K77k83O2
7334hm8j06L89n2l74K66L3k03J41Lq9M4J53j8j25K32j71L6j66K87k20J10j19m07
7358d12L23p9j1K1n6K41K50j60k22K6P1K82q6o4j39l7K51j75J34k68K22j98K2
7381f4J20o4j09K71j22K40l66j9J35r4LK85l05J68l18M2J46p8K72M52n46m5j13
7404a09J22J21j87L52n50K89L9q2k6j62O6L35n2k50q4K66q4J83k80j54J57k20
7426c10M01l55J23J18j70Qn6L30Kj88K17J56m33J74k53K66j2J63j19L3j71K30
7448A54j35J86j29qq1K45l35p2K94o3l9k42J37p4K9J79K34l01J85k11J10k55K98
7471A06j14n8l23M14r1j46Q0L9J56k20J19j23R0k42J65O2p7M5J09N3k5j78K57
$$ y = [-84, -27, -72, -41, -143, -109, 148, 155, -223, 39, 86, -14, 10, 24, 70, 287, -239, -102, -206, -117, 141, -64, 213, -70, -8, -56, -162, 227, 175, -199, 67, 100, -103, 38, 41, -48, -4, 149, 131, 6, 238, 67, 103, -63, 224, 4, 114, -5, -412, -89, -168, -179, -158, -214, 27, 277, 117, -105, -79, -8, 274, 188, 124, -15, -52, 199, 24, 158, -110, 112, -86, -64, 56, -8, -117, 154, 32, 272, -94, -113, 22, -72, -69, 216, -89, 79, -239, -197, -51, -129, 143, 595, 49, 4, -109, 13, 134, -53, 299, -251, 38, 77, -5, -31, -193, -127, 208, 156, -94, -178, 88, 4, 187, -93, -247, -90, -310, 91, -264, -141, -23, -193, -185, -241, 89, 91, -97, 120, 276, -157, 17, -236, 30, 18, 181, 62, 95, -76, 154, 19, 205, 76, 68, -13, 232, -103, -175, 119, 56, 17, -225, -88, -162, -133, 46, 280, -21, 164, -47, 63, -192, 106, -8, -66, -389, 25, -66, -212, -132, -93, 63, -157, -38, -161, -71, -313, -148, -86, -163, -118, -9, 44, 19, -159, 98]
7494I8K09n64K06J54k18J19J16K03k96p3J65k06K26p2M3P8j0l4K97l29q5J12M4
7517A83K5j87j85K47O8l74N41l20l5L01j69k08O0j54J44p5K09l17R9O7p7J55J5
7540A3k9p1L53m62K07J21k21r6jL70r0k73o7R4K43p1J72Qj75j46K48k79L02j50
7564@lK00J8k33J33J18k07O2n79O20k14J81M39o48k6K94k13J54m1o2K7J44l8k6
7588A00K8kM6m5m1J97l73kkJ77K5p3J52l02J07L8k26P4J89n2l5k20O2L23j48l50
7614c53L66J11l3q8j06J43k24L7P5J04J31k29K21J1l01R2o2L38j92K96j10k12
7636A5l63M97n1m07K30j8j65J60J05j83L42l56K49lk82K94j66j87L10P0l09N3
7658a65J52j17K19k45K39K6J09r9K53j84k45j10L19j36P6n7o3J67j20j15J86K05
$$ y = [98, 307, -257, -51, 103, -115, 4, 120, 323, 27, -46, 119, -87, 139, 67, 110, 188, 178, 144, 441, 112, 27, 139, 183, 208, 21, -164, 83, 151, -223, 318, -2, -37, 264, 95, -113, -53, -207, -63, -138, 71, -246, -147, -80, -157, -2, 13, -16, -87, 266, -196, 11, 132, -89, -185, -186, 184, 94, -179, -246, -152, 91, 20, 192, 200, 25, -121, 127, -152, 150, 0, -3, 197, 215, -18, 115, 233, 26, 88, -491, 129, -85, 96, 535, -113, -139, 155, -58, 96, 55, -7, 20, 164, 126, 100, 128, 126, 172, 127, 86, 283, -90, -92, -94, 83, 108, 35, 187, -115, -8, 30, -196, -122, 67, 15, -20, -240, -178, 145, -3, -353, 13, 124, 91, 3, -103, 40, -184, -147, -72, 32, 163, -66, 155, 166, -135, -43, -105, 233, 41, 337, 227, 15, -348, 149, 98, -309, -79, -97, -262, -102, 3, -180, 162, -194, 55, 52, -230, 64, -102, -289, 21, 91, -218, -165, -13, -130, 89, -156, 83, 109, 218, 119, 372, 188, -57, -167, 152, 16, 92, 35, -28, 139, 19, -96, 90, 295]
7680B95q2p8j31q6%L54k66M9j86L08m97M40r0J41l28L1J86j40K94k50L93j76L10
7703D91n60N3K3k7n7Q0J35k05J78j54o9K10l69J84K29M2k29K72k40k0R8j53K34
7726A46j55j90J82l2K74K59o95L29k72M42m31Q2J81k68L07j24J11l13L44k61K10
7747A26k82L29m0k40L57m98K10j76J78OJ44J26k13MR8R4k24J35l29J74K34p9j94
7770f0l6J69j97J63j95J71o3K01k46j36K79j65J73J23k24K48j58L0j52l12K67
7791a20J95j73P1k07K73Rr3N7j2J29o3j45L41k86k40L94m5N9L8l78N21o5k23J62
7815A99j14k64J66P4J87k00ML27n48N66m23k38L86J2l00J40R7k52K72k48LJ95
7837D1O0j89M9N3O8p3Pk00K12j35K2j39M19j60j14j97K40j64N25k14J1m4J1r6
$$ y = [295, 213, 135, 4, -82, -82, 272, 6, 55, -131, 177, -320, 120, 30, 171, -157, -126, 60, -80, 214, -36, 357, 181, 491, -69, -16, 7, -20, -77, 3, 138, -67, 111, -43, -112, 98, -271, -87, 142, 184, -45, 227, -13, -33, 65, -88, 146, -9, -199, -17, -49, 225, 484, -211, 118, -154, 288, -143, -61, 120, -148, 159, 35, 146, -167, 177, -84, 126, -156, 173, 133, -107, 250, -248, -38, -214, -36, -30, 114, 240, 27, 31, 129, 223, -1, 134, -195, -21, 213, 134, -60, -96, 73, -124, 39, -156, 15, -48, 153, -93, -229, 50, -115, 58, 181, -43, 205, 47, 77, -75, -387, -120, 75, -98, -27, -234, 39, 48, -45, 12, 0, 129, 66, -79, 262, -24, -264, 130, 85, 144, 182, -196, 325, 260, 37, 199, 85, -179, -13, 61, 248, 48, 52, 379, -169, 397, -26, -264, 122, 134, -166, -26, 71, -181, 91, -157, -154, 41, 101, -88, -39, 14, 82, 9, 16, -184, 28, -107, -85, -224, 195, 35, -79, -276, -36, -200, 325, 111, 122, 78, 89, -7]
7861gr8L04l34j07K77P0j32j73L69k91M10k73k07J46J71k87q9J10L46l38l7K63
7883I3q9J68p8l09M68l8m91N98l87M28l83Q1m71N94J19l31j16Mj03L78r5m7j5
7906b2P9Rj6Q5k00J78q1J14k90k76L17m3J47k93j2L42j49j42K59o2J21Mk40K5
7930a46lK89m23L34j69J03j35J00o5L53N7j36O7l17j2M08k12P8j9l78L07o7j40
7953a26J77j35R6K18j03q3k30j9N04p80L31K96j26o1J51j08K79m00Q8M66n83K00
7975E2l23J93J74j00J38k29O2L7J13j28LN1%l47M23o5P4Qk14L1q4L78k21rj76
8000a59K01j17J94K8o7j10K5K29j6m41M31j61j85O9J01O3L05n34M25m6l20J21
8022C6J94r3P9l05P8J37l24K79k33L48l10J25L1j30P7k1J93l3l57J65L73j96K0
$$ y = [-7, -105, 199, -135, -242, 35, 105, -27, -200, 169, -122, 288, 15, -192, -46, 125, -162, -251, -141, 205, -133, -170, 93, 4, 172, 94, -215, 253, 215, -276, 322, -65, 363, -20, 61, -410, 184, 303, -28, -144, -140, -243, 135, 40, -7, -22, 57, 66, 50, 135, -65, 113, 32, 146, -144, -420, -103, -146, 1, -292, -304, 38, -111, -253, 6, -56, 65, 69, -171, -146, -149, 140, -283, 51, -118, -15, -150, -50, -115, 238, 295, 159, 226, -91, -103, 305, 93, 171, 152, -226, 81, 14, -126, 51, -84, 12, 230, 127, 44, -186, -205, 299, -481, -150, 146, 20, -41, 110, 2, 281, -119, -31, 435, -148, 52, -271, -78, 96, -4, 134, -95, -33, 4, 117, -11, -8, 43, 43, -304, 119, 54, 128, 136, -78, -47, -131, 247, 26, 17, -159, 42, -75, 119, 147, 80, -30, -5, 224, 208, -233, 198, 37, -148, -79, 22, 85, 390, -144, 281, 235, -85, 36, 230, 137, 216, -89, -11, 126, -198, 81, -152, 196, -114, 11, 42, -88, -11, -32, 161, 128, -229, -64, 309, 113, 133]
8045A33j43k17j1J01l9O2K77J35j68k13k49N49j96p7j1J9m6K8K71j68m7M0PL1
8069F8o7J44J64m49j22J78K45j80J58j53J0p0M7Q9J56k87j29M63k81k96L46j26
8091i2K05m05N04l55J93K2j70j29K97j67M3L7k49J44l6L39q5r0j69J97O8k06Q4
8114b0Q5J54l53M13k39L6j00%K2J57j8p0r4J1K73m01J95j59J43O9k05L8r6K67
8138A08j24P1J21j35q8R6J59k82J52k63K49p6J36o4J54l06J98k46K74k24j22K31
8160A9K24k59j09O2qm7K32J0k31M3N2Q2k7l84M33l99L84K2N7l61L22k73K19J05
8184A68j29J20k68J98L4K80j47
$$ y = [133, -10, -227, -238, -137, -176, -114, 163, 298, 130, -83, -332, 217, 21, -56, -67, -48, -94, -66, 205, 37, -10, 30, 37, 68, 1, 145, 309, -140, -262, -84, 161, -19, 139, -14, -4, -74, -27, 62, 218, -69, -198, 265, -16, -312, 34, -92, 113, -292, 212, -143, 50, 72, -98, -227, 70, -97, -54, -17, -266, -122, -158, 181, 96, 6, -163, 34, 102, -104, -20, 65, 219, -134, 279, 40, 76, -24, -24, -2, 155, 137, 67, -27, -16, 257, -144, 51, -108, 35, 104, -101, -63, -159, 108, -16, 55, 176, 41, -47, 49, 208, -74, 78, -185, 64, -12, 124, 60, 214, -92, 106, -140, 134, -90, -212, 19, 243, -16, -125, -63, -71, -118, 114, 124, -107, -64, -12, 70, 43, -341, 92, -307, 77, 99, 156, -205, 117, -156, 63, 168, 39, 159, -109, 89, 123, 403, 256]
8191B56
$$ Imaginary data points
##PAGE= N=2
##DATA TABLE= (X++(I..I)), XYDATA
0@%%%%%%%%qJ6j6J6j6J6k4L2l9M7n4O2p2Q7j01J15j31J49j72J95k19K50k81L15
32A67l55L96m43M94n49O11o77P51q29R15j015J125j248J386j539J713j913K147
50A137k421K750l153L658m316N213o513Q575j2359K1544q4137j17032J26900K6548
64c3606p6706J6665J21783j3508j02094j3722L9547m5868l9621M7442M8732o359
76e7315J9061K3322l7569l4436L3203M164m2537L2821R0357j0598o3717L7993
88e251N8452o6585o2592Q0848P5564n2454k1946Q7605K1633r2992k8067O3019
100E7234K381m5718L5859O7858r348l0537J1667j4783n1571j718K8476j5606k630
113C1564O0986J6611o8879k3702L9863l4208q1192K5424P9863k1661n4869M3129
$$ y = [0, 0, 0, 0, 0, 0, 0, 0, 0, -8, 8, -8, 8, -8, 8, -16, 16, -23, 24, -30, 32, -40, 47, -54, 61, -70, 79, -93, 102, -117, 133, -148, 167, -188, 208, -235, 259, -290, 321, -356, 395, -434, 481, -534, 591, -657, 729, -810, 903, -1010, 1137, -1284, 1466, -1687, 1971, -2345, 2868, -3645, 4930, -7429, 14115, -70022, -187054, -60154, -33606, -110312, -93647, 28136, 14628, -87466, -101188, -61641, -107509, -147130, -99688, -50956, -57315, -38254, -14932, -52501, -86937, -53734, -49570, -92107, -59286, 31071, 20473, -43244, -5251, 53201, -13384, -75976, 4872, 80436, 27982, 6036, 93641, 115274, 22282, -5785, 57234, 59615, 13897, 49756, 117614, 108266, 77729, 89396, 74613, 23042, 21324, 49800, 34194, 31564, 92550, 109161, 40282, 16580, 56443, 22235, -58957, -33533, 46330, 24669, -30200, 12929]
125A2929L8688p6786o2796M3411K2423n1495J501O6590o58n4482J753K0062l9791
138g8651k6781M2501K3844k1613J7725L8021l0086m5848K4360K2814l8894J45
150g2463P4333K3255m8263N499M8765k8198o0624K8169N7330j5029j5209N3669
162E1234K8441m4345k0211K6723r774l1146K6784M2090j1415r165L1762l351n1207
175B6420p555L1933j3735k6796L6927L6706l5245l0583K5660m335n5212m813M7001
188B6373j190l4350K0520K8792l9730m4065J7611J0470l3549p5M3866K572l1445
201c4200O004J2380l7415k6414K9638J5625k3612J2421M4209j0495m3195Q471
213d6583K4347k8479k1621M2914L3306k2253l101L3746o117l9493N063L0125q189
$$ y = [12929, 51617, -25169, -87965, -44554, -22131, -73626, -72125, -5535, -6193, -60675, -58922, -38860, -78651, -105432, -62931, -39087, -60700, -42975, -4954, -35040, -80888, -56528, -33714, -72608, -72463, 1870, 25125, -23138, -17639, 31126, 2928, -57696, -29527, 27803, 12774, -2435, 51234, 79675, 35330, 15119, 41842, 32068, 922, 27706, 69796, 58381, 49216, 80978, 77627, 26420, 18865, 50798, 37063, 10267, 47194, 83900, 48655, 18072, 43732, 39397, -15815, -20628, 26373, 25183, -9167, 11353, 40145, 415, -43650, -26039, -15569, -49118, -49193, -5327, -2755, -34200, -28196, -15816, -53231, -79645, -50007, -34382, -57994, -45573, -1364, -11859, -55054, -46583, -22236, -50715, -72336, -29422, 3884, -18369, -21470, 12276, 6159, -33334, -28271, 1854, -6335]
226f335q643L6954K4026k4644r085K1718r081k9570J4579L4020n947r600K7256
239E5648R460l4971j3496K1128n984k3409J9857L3189j4035k2838J5647K990l7917
252E269j5707K6289N061j9466J0659K3281j8065k9244M595J229k5975l572K8778
265f868L666j9674Q042J4267k6443k8449J4385J3021j8159R94L2299M287k5942
278c4574j138J4718j7675j8831K1551K2717r617J84K5318l52k7356j076J9359
291f772o062r044K4622K3460j1048o090J4595l733k2150M146K2492j192n293K1471
305C9402J3925k0408j3233J1527j911j8966O678K4842o48j2106P982L819k2979
318A7924j5034J0766J808j2362Q389J8820r252j9885J839Q75k1586r748J6727
$$ y = [-6335, -14978, 21976, 46002, 21358, 12273, 33991, 24910, -4660, 9919, 43939, 37992, 28392, 55648, 65108, 30137, 16641, 37769, 31785, 8376, 28233, 61422, 47387, 24549, 40196, 43186, 5269, -10438, 15851, 20912, 1446, 12105, 35386, 17321, -11923, -7328, -6099, -32074, -35646, -6868, -3202, -22876, -14834, -567, -27010, -55459, -41074, -28053, -46212, -45218, -12919, -8632, -34574, -35712, -20994, -38669, -57500, -35949, -13232, -22849, -22665, 2653, 2301, -25055, -26131, -6772, -12834, -21878, 2744, 26204, 15156, 9066, 23661, 19928, -2222, 1924, 24416, 23224, 17931, 39402, 53327, 32919, 19686, 31213, 29302, 10336, 17014, 41856, 41208, 29102, 37084, 40903, 17924, 2890, 13656, 15464, 3102, 11491, 30311, 21059, 1174, 3013, 3888, -17698, -27446, -10719]
331a0719P040j0359L033J0837j2974k0846K144M550j1838m9K0401P085j4180p42
345b6617R063j1442j7521R188J5846k662N19J7533M971j4492l841Q333m461o694
359b2277J5039J8182k023k345J1990N7j6577l065J3486L396l259J2400J3835n995
373C2844q822K659k114j1842J500J3790K390m666P293M873j4669j3489K632J132
387A3511q474K247J2744O15j0128k599k074j3794q780N467L406l942M043P954
401A96o470j4088k877J096q233l328J0729Q145l155j090L762o291j0976J396O272
416b4912M16K880J2462N891p134l060L900k690o412O531J2620M250J304O343K214
431A4603p525m175L535J054O55Q900R445j39l484J022k234q539k823O783M705
$$ y = [-10719, -3679, -14038, -11005, -168, -13142, -33988, -31844, -27294, -39132, -39181, -18780, -11695, -25875, -26617, -17554, -28996, -46517, -37329, -21483, -24145, -23626, -6093, -1122, -15614, -19455, -11122, -15583, -22277, -7238, 10944, 8921, 6576, 18566, 18623, 2046, -1019, 12467, 15863, 12604, 25004, 38839, 32844, 24022, 26681, 24567, 12725, 14225, 28015, 30405, 25739, 33032, 37905, 23236, 9747, 12379, 13511, 5037, 7284, 20028, 20643, 10515, 7916, 5842, -7952, -16732, -11265, -7859, -11801, -7758, 196, -6274, -20362, -23239, -22143, -30376, -33704, -22975, -14830, -17985, -19075, -15313, -21604, -32580, -31184, -24912, -24496, -21616, -9154, -3263, -10397, -13457, -9557, -12247, -18659, -12128, 492, 4742, 6046, 12389, 14603, 7078, 2903, 6438, 7492, 8147, 17047, 26492, 26353, 22869, 23891, 21657, 13118, 10295, 17078, 21783]
446B1783J6L722L292m754q567l760k753m164J162O332K313l056j290k388q444
461e56q312j590J699L44K001L779l83n240n151m606n358j228M071L989J624K155
477a2762J745l548p027k380J041J220K851O417N597J057j207j339k895j887J954
492a1163M810M841M717N023J539k563l722o70N79J331L803N731M884J509j444
507A9205l312k991j968n95K110L486L928J958r53l912m362l906k033j037O97L773
523A0088L286j566m374l359l382n729l514J893L842Q39K62k89l309n611m120j491
539a6534j380J721M973L086j799j737k74l698n221L98M594L305J628M289J793
554d856k778k203r36o88k87M988O702J908R08K826Kn385k403L532L425J084M413
$$ y = [21783, 21799, 25521, 28813, 24059, 15492, 11732, 8979, 4815, 5977, 12309, 14622, 11566, 10276, 7888, -556, -8868, -10458, -8759, -8415, -6414, -2635, -3018, -8258, -13409, -18015, -23373, -24601, -20530, -16541, -14917, -12762, -11017, -14565, -21592, -23972, -22931, -21711, -18860, -12443, -6846, -5789, -6996, -8335, -11230, -13117, -11163, -6353, -1512, 3205, 8228, 9767, 7204, 3482, 2812, 3391, 4722, 8525, 14256, 19140, 20649, 19205, 15893, 12902, 10934, 10339, 12449, 15935, 19863, 21821, 20868, 16956, 12594, 8688, 6655, 5618, 6315, 10088, 13374, 11808, 7434, 4075, 693, -5036, -8550, -6657, -2815, -1976, -1714, -2003, -5312, -10923, -15043, -16534, -17914, -16193, -11220, -8134, -9933, -11670, -11944, -15642, -20863, -20465, -15871, -12566, -10938, -6649, -4856, -7634, -9837, -10773, -11461, -11748, -6760, -58, 1850, 2758, 5584, 5586, 201, -2202, 1330, 4755, 5839, 10252]
571A0252N455o0l079m30j812l767J098N403K170n55L234K133n603o197J78O82
587I102l329P22N886J610m527j685j077o002n810K258L119k570N41M762k227p789
603g016l392J356l776l436M860N131k089k070J821k167o964p29M073p02j23O945
619h278M107m400l455L440q68n333K582Q504K251j318M312L215m977l233L669
634B18J516j226M003Q426J3l599K134J705n980k700N916L759j819K213N176l546
650A6209o066O64N66n428m88P323J947n959o7L119n561r041J293M003l136k258
666b880N776P78p128l236J427m710n531M182M921l004k187N244p63r025k270N338
682a3068j141l535N932O411k938l715M051k44o435J192Q067J339k726N911O228
$$ y = [10252, 15707, 15647, 12568, 12138, 10326, 6559, 7657, 13060, 15230, 14675, 17909, 20042, 14439, 8242, 8420, 9102, 5773, 6495, 12381, 13991, 9464, 7779, 6702, 700, -5110, -2852, 267, -2303, -1762, 3000, 773, -7016, -10408, -9052, -12828, -16264, -11404, -6273, -8362, -10432, -8611, -10778, -17742, -18471, -14398, -15100, -15223, -8278, -4171, -8571, -12026, -8586, -9454, -14787, -12205, -3701, -1450, -2768, 1544, 4759, -218, -3451, 218, 1734, 508, 4511, 12937, 12950, 9351, 11485, 13190, 7210, 4510, 10426, 14185, 12366, 14579, 19755, 16209, 10143, 10807, 11373, 5945, 5457, 12780, 14727, 8768, 8701, 11820, 6259, -2782, -1489, 2514, -622, -2880, 2896, 3674, -3454, -6690, -5263, -9973, -15504, -11322, -6401, -9405, -11592, -6348, -7111, -16136, -18406, -13068, -14209, -17744, -11812, -5401, -8339, -12054, -8003, -8247, -14682, -13490, -5423, -4084, -6810, -899, 5329]
697E329n006n191M482L449m418J476R088K608l790K040L185m915l500M725K959
712A2521l304L143P033k201p483J426K938o418l826O286M069m809j172M471l710
727H964r100O13L305m724l270O735K958p953l257L856l712q332J168O951k332
742h130l028M131K076p405l363M042j547m179N064P132l047l806N298J525p620
757a2857j409P779K216l941M559P643l037n171L933L094n398M47Q960K783m611
772D990K854N733m254o297L788M352l202r6P010O91n506K33K628n011m529N192
788H576L078m708k64O114k607r004o21M004m099m738N555M290n750l582L565j921
804b112q480M14N553j791m045M904L284n932n041M149L07o143J932P077j22l506
$$ y = [5329, 323, -4868, -386, 3063, -1355, 121, 9209, 11817, 8027, 10067, 13252, 8337, 4837, 9562, 12521, 9217, 12360, 19393, 17192, 9709, 11135, 14073, 7655, 3829, 10115, 14184, 9375, 8203, 12674, 8964, -136, 477, 3782, -942, -4212, 2523, 5481, -2472, -5729, -1873, -5585, -13917, -12749, -5798, -8130, -11158, -7027, -4951, -12356, -15719, -11677, -13224, -17403, -12339, -5207, -8254, -12060, -6762, -5237, -12857, -14266, -6487, -4271, -8212, -3653, 3990, 953, -4218, -285, 2809, -2589, -2142, 6818, 9601, 4990, 7844, 13577, 9323, 3026, 6814, 11166, 7964, 7868, 14878, 15569, 10063, 10296, 12924, 7913, 3384, 8576, 11654, 6946, 6682, 12796, 10189, 1185, 564, 4568, 469, -4269, 1286, 5576, -174, -3756, -191, -2112, -10592, -10178, -4625, -6416, -10461, -5557, -2273, -8205, -13246, -9097, -8790, -14933, -13001, -5924, -6046, -9552]
820i552L149K246n494k620N969P79l761M110Q199k517n380L872L766n419k548
835e201P832M309l990J030O290k105n923K314L742l291j141P027K369n096m34
850G732L854l072n735K205M436k336j771M831p5o334j392K717l151m610M116M655
866F070m623l126M386n62q020k145N132o28m315L012M124l633m032J884K86n273
882a1463J69N921q4l537L454L110m743m051M178K082l835J581O548O9l943K113
898b431K644l870k641N395L610l471J513O451j036n867J451M335k724k373N218
913F204M298l282j187L707j647m874J051M037k465j460N192J681n706j875L113
928F787k047m845J850M345j989k884K860K14n660k533L058n53m336K438M232k783
$$ y = [-9552, -6403, -4157, -9651, -12271, -6302, -5523, -9284, -5174, 3025, 508, -4872, -1000, 2766, -2653, -5201, 2631, 6940, 2950, 3980, 10270, 8165, 2242, 4556, 8298, 5007, 3866, 10893, 13262, 8166, 7732, 11586, 8514, 2779, 4984, 9420, 7084, 5313, 10144, 10069, 3735, 2343, 5060, 1909, -2701, 1415, 6070, 1447, -1679, 2707, 2145, -5875, -8020, -2888, -3516, -7831, -4819, -695, -4328, -8360, -6476, -6190, -11463, -11294, -5373, -5457, -8994, -5540, -2430, -7173, -11224, -7046, -4964, -8799, -7218, -670, -601, -4544, -2431, 213, -3657, -6298, -903, 2707, -764, 749, 7200, 6164, 297, 1748, 6083, 3359, 986, 6204, 10502, 7220, 6033, 9740, 8093, 3219, 4270, 8307, 5842, 4382, 9574, 11255, 5549, 3674, 6787, 4740, -105, 1745, 6090, 4101, 1217, 4077, 4291, -1369, -3902, -844, -1397, -5733, -3295, 937, -1846]
944a846m133K064M92n178j772M090J526k830J485K985k886l298J962J084l404
959i659O05N850N70l180J778L353k954l593L384L562j807L26N080J184m092M35
975H42K889j627k263M259L549j894p59M066k67m779qL356q29k056L334K886l290
992G409j754J914j566m053Q47L115j457k386L150J111n405k972K067R8l794N16
1008c160L446p84k678J16M42m029j644K553K88k285J702L055k025l586J239J421
1024e929k757p34L610K045j608M43K447j389k546J862K030j127O40M485J724l018
1040A78J49K957q60k600J847L843j73m04K292Q44k607q25J976j071j204K540K913
1057I795k249j693J688n32l788r98K524Q6k092J311J280k072k472k60l05k902
$$ y = [-1846, -5979, -3915, -3423, -8601, -10373, -6283, -4757, -7587, -6102, -3117, -6003, -9301, -7339, -6255, -9659, -9054, -3204, -2634, -5814, -4036, -683, -3637, -7230, -3846, -284, -2091, -1765, 3315, 4499, 407, 842, 3731, 2104, -159, 4100, 7649, 5755, 4996, 9062, 8795, 4016, 4008, 7364, 6535, 4479, 7813, 10699, 7409, 5655, 7569, 6003, 1950, 2797, 5912, 4455, 2069, 5219, 6330, 925, -2047, 20, 118, -3676, -3160, 286, -498, -3176, -3060, -2618, -6647, -8291, -5738, -5450, -7735, -6033, -2978, -5003, -8589, -7350, -5929, -8686, -9420, -5810, -3765, -5373, -4930, -2483, -3872, -6418, -4556, -2526, -3653, -3013, 1472, 3196, 178, 327, 3284, 2424, -176, 1671, 5514, 5341, 4937, 7229, 8073, 5466, 4641, 6617, 5546, 4342, 6882, 9795, 7546, 5853, 7541, 7009, 3221, 2223, 4747, 4833, 2741, 4052, 5332, 3260, 788, 528, 223, -2679]
1073b679K03K674o33k236O66N31k795k819R53J312j537OK270k08j710j50J00j666
1091g718o03K445J285o46P53K384o18k277K03J789L2m79K910K174p06j06J054
1108A876m73j725J546J747L14J72K236J068j815j272J487k38j334R04K092K18
1124F803p54J97k18k141r40O89m84n99J241J237j278k226k95j27j774j372J144
1141h97J100r78k66K09j408j765j69j4j241Q34J495M23j227k36J53j201j428N31
1159f085J369O75K94R61L42r52j81M0n58M98J903J799k7l40J480l12j228n46J278
1178D10J169N71Q76J430l04o50j03n75n04O43J451K57K9Q24K27j583j675K3N38
1197C054k76m4R98N60r87j005o82j132p40N75L1r1L97L31p80j951q93j2p96L4
$$ y = [-2679, -2476, 198, -435, -2671, -2005, -1474, -4269, -7088, -6135, -4823, -6360, -6354, -4084, -4292, -6002, -6152, -6052, -7718, -8321, -5876, -4591, -5237, -4484, -2100, -2718, -4995, -4792, -3003, -2971, -3450, -540, 1634, 928, 822, 1876, 1403, -322, 1224, 2971, 3285, 3457, 5693, 6761, 4946, 3674, 5161, 4923, 3589, 4493, 6585, 6803, 6049, 6246, 6028, 3887, 2947, 3636, 3152, 2553, 3794, 5031, 3753, 1527, 1232, 1105, -669, -2041, -897, 203, -775, -1041, -832, -2240, -4005, -4174, -4188, -5429, -4595, -3100, -2677, -3904, -4140, -3987, -5188, -6616, -6085, -4716, -4041, -3747, -2786, -2444, -3396, -3577, -3537, -4095, -3597, -1694, 105, 78, -262, 1218, 906, -322, -868, 410, 1579, 2150, 3026, 4456, 4152, 3502, 3399, 2824, 2320, 2963, 4414, 4671, 4700, 5524, 5751, 4168, 2493, 2516, 3054, 2778, 2734, 3732, 4292, 3305, 2300, 1618, 486, -254, 321, 352, 261, 658, 989, 209, -1742, -2635, -2647, -3443, -3409]
1217c409O08J004L54r67r55n39o08m47J21N09Q83R90j28L6p63l09j57K8K00J040
1237b509J534M54k61j53J63k86j25N5J709O68P57M92M06p51j73k69j86N87J281
1256C393P25L87l14K74q09p13n81K18P67P7M87J26m69n84q27j002n86M14P28j14
1276A597n74O9j55j429j451o5k50q3L08N91q1n67o03q10r77k36Q34N18l70N84
1296c150J021m70j102o33N55k36J39J628Q09J35M8L07n45q60N93J495j19K86J796
1315A697R44q91n73N95j11l05O70J366N21J17M33l71r33n09P31j01q30J195J457
1334E102r53j172n4J96j678r21P68M96m96M1K90j216j301r0l71j341J80J579P1
1353h70j606rM29j371j487L22J227l30N6J298n6j178j82O57r20o41J441J595m38
$$ y = [-3409, -2801, -1797, -1443, -2410, -3365, -3904, -4512, -4959, -4838, -4329, -3446, -2456, -2584, -2548, -3311, -3620, -3777, -3749, -3549, -2509, -975, -521, -782, -935, -772, -1058, -1183, -1128, 581, 1249, 2006, 2498, 2904, 2153, 1980, 1711, 1525, 2112, 3393, 4118, 4505, 4191, 4465, 3656, 2943, 2362, 2580, 3347, 3424, 3911, 4037, 3568, 2984, 2157, 1155, 569, 983, 1711, 1597, 1023, 1092, 937, -492, -1943, -2008, -2258, -2341, -2033, -1442, -1523, -2090, -2693, -3503, -4480, -4716, -3882, -3364, -3734, -3150, -2129, -2599, -3701, -4334, -3779, -4015, -3876, -2248, -1439, -1304, -1256, -949, -1494, -2354, -1761, -266, -385, -99, 1697, 2641, 1750, 1177, 1772, 1661, 1356, 2026, 3392, 3913, 4030, 4463, 4092, 3159, 2650, 3381, 3280, 2450, 3645, 5102, 4149, 2977, 2923, 3119, 1441, 520, 1288, 1784, 1288, 1329, 1619, 403, -898, -988, -1359, -2700, -2520, -941, -870, -2476, -2485, -2056, -3427, -4914, -4592, -3365, -3695, -3639, -2341, -2397, -3575, -3757, -3100, -4020, -4661, -3220, -1625, -2063]
1372b063K75J380rj656Q8J105P43k04J364J171m72r7L84j84j011Q64J600j8n22
1391B738J364R81j628j019M62O50j161L04J138K39j250J96r9j776n69J216k38
1408A548j037K73J303n94k171l77N13j654n80J152Q49j124l4O52j097j984O57
1425c705J075j496L47J854N39j604m53R35l42j238Q59J668k00l0J261M23j542
1442a649L5J476m32o84J601J939q06p17J146M05j439k56J681M20j061J200J264
1459D123j110q60M51L29j427k2J985o5j634M86J049j445j672K96P61q85p0J530
1477A820l89j793N9K88j428j001J785m2j008j04J419o64j678l90J302q11p22J487
1495a870J051j023o67J653j390j038L64K037p95o69J761R03j315r72J409K35j466
$$ y = [-2063, -1788, -408, -417, -2073, -1985, -880, -137, -341, 1023, 2194, 1722, 1625, 2009, 1825, 814, 1678, 3278, 3260, 2738, 4102, 5083, 3455, 2436, 2898, 3548, 2387, 2691, 3829, 4068, 2818, 3014, 2915, 1139, 570, 1786, 1548, 511, 784, 2087, 1493, -678, -1055, -542, -2196, -2776, -1624, -775, -1899, -1933, -1281, -2378, -4362, -3705, -2630, -4126, -3779, -1925, -1386, -2990, -3443, -2508, -2850, -4088, -3229, -1561, -1761, -1791, -530, -107, -1649, -1614, -138, -570, -1254, 347, 2286, 1480, 763, 1909, 2314, 875, 619, 2300, 2720, 1659, 2859, 4123, 3013, 2153, 2604, 2933, 1506, 1484, 3469, 3404, 1770, 2256, 3305, 1860, 188, 484, 1245, 360, 290, 1820, 1431, -362, -303, -15, -1443, -2444, -659, -701, -1709, -1813, -394, -1058, -2736, -3126, -1824, -2635, -3357, -1870, -819, -1842, -2509, -856, -2246, -3284, -2920, -883, -1678, -2347, -586, 317, -998, -1970, -561, -326, -1792]
1512a792J085J716l6p24R89L99j233o04J434L15j115J230J552n86j485P70P10
1529B625j838j35J336L47p37J04Q15q62j002N03N17j392l06J768L26j914j23J001
1547A033r27j374J94J003q69j27J162o9j423J43K51r34j061J553J280j470n73
1564b208J443k6j779l37J399q8o08P41J506r67m47P01O4j466M17J524L2r66J311
1583B46J137j415p13J136M11q39P08J249J15j043O73N81j093p03J205L52q00J81
1601A388J401j64j736L75R99j492m04Q71P22p18k51Q92j151j013J8Q19p08r13
1619a065J264P17j920k72R38o68j009K86Q72o89l41Q68m1j082l76J133l97j111
1637b893J141J043l39p65Q48J12j027k93J226K25k05Q82R12j088k92R82J41j108
$$ y = [-1792, -707, 1009, 973, 249, 1238, 1637, 404, -200, 1234, 1549, 434, 1664, 3216, 2630, 1145, 1915, 2625, 787, 652, 1988, 2335, 1598, 1702, 2517, 1655, 653, 1156, 1673, 281, -25, 1743, 2069, 155, 32, 1033, 106, -1268, -1074, -71, -940, -1067, 95, 26, -1397, -1254, -1003, -1937, -2998, -1445, -165, -1635, -2208, -765, -791, -2570, -2907, -1508, -1596, -2204, -1463, 43, -924, -1371, -670, -606, -2072, -1655, -131, -99, -1065, 246, 1383, -32, -745, 391, 802, -37, 671, 1920, 2035, 992, 1665, 2246, 1153, 450, 1655, 2007, 1207, 1388, 2789, 2625, 889, 1264, 2263, 771, 367, 1238, 1960, 1242, 991, 1883, 732, -281, -263, 556, -152, -1065, 199, 916, -1004, -1276, -338, -1006, -2015, -1729, -857, -1546, -1887, -1019, -1060, -2142, -2518, -1385, -1782, -2893, -1752, -709, -1048, -1813, -965, -853, -1880, -2173, -947, -722, -927, -45, 867, -221, -513, 469, 610, -498]
1655d98O36J576N1q61O64P07q03q13N39P21l17J20J258k09j300L04M49j017q10
1674C97J272L96r04m87J156l30j423j54M33k47p53L47Q87j128k77O10q13r93L60
1693a651K88l93l11R63M91j660l23J042m2q44K66R94j35k64L11M85q83K49P65
1712f52m4q83Q89J827p95q28Q98O46p23n10J598K48k62R5N39n05l13O13K24p92
1732A270o3J047K45p69J5O84j056r32P97L38m65n72J258p71j052L55J2n94n51
1751h04K69Q83j114l51P28k06j115p42J263m88k33M28N45p77l6K98p5q76L75Q48
1771a180j49n13Q52O07n68o39P08N30m36J53Q87j26L6K80O94j006l76J105N93
1790A452l46l48J008l26l19M4L46l10k89N04M54n68J31N04n35o50O5M75q61j09
$$ y = [-498, 138, 1714, 1765, 904, 1568, 2275, 1472, 659, 1198, 1919, 1602, 1722, 2980, 2771, 1471, 1775, 2224, 1207, 397, 1669, 2065, 1161, 674, 1830, 1500, 77, -77, 356, 109, -644, -297, 590, -538, -815, -205, -1018, -2011, -1651, -1363, -1756, -2067, -1104, -613, -2273, -2596, -1554, -1596, -2440, -2174, -1180, -1315, -1579, -1268, -783, -1666, -1417, -652, -696, -1579, -690, 1137, 342, -486, 412, 1058, 335, -175, 1423, 1671, 1409, 1504, 2043, 1538, 1225, 1838, 2062, 1270, 1207, 2254, 2499, 1730, 1745, 2429, 1373, 441, 1238, 1576, 1111, 539, 1797, 1026, -26, 329, 341, -253, -804, -535, 348, -766, -1117, -389, -595, -1710, -2452, -1189, -1677, -1910, -1482, -937, -1714, -1750, -1452, -1527, -2403, -2028, -1180, -1329, -1842, -990, -383, -951, -1590, -882, -352, -788, -635, 252, 126, 162, 442, 1136, 130, -246, 859, 1452, 1106, 758, 1766, 1440, 1121, 1165, 1511, 1201, 912, 1416, 1870, 1302, 1433, 1937, 1402, 752, 817, 1292, 431, 322]
1810C22P86K54j192j07M01k83q89n0O32k17j23r9L0l22l24K89k38p67P76M21l34
1831a034m19M71J12o35K15K78R9p6K9L89k81m23N41q8p4j19J094j10l54L29M40
1852C84l8n27K55L81k7L37J50J61r5j33J13k20l7M81M15n27K24K98l08p03L23
1873I07k59J47j29K12L65l79l19L61n23l45Q7L21l76l12K91K36m26n33M84l49
1893e39l89j41L87M6k07j41M21n56K9Q4M6j23k16L47J16k88J49J66m15J07J66
1914i51M26O6K21J32k27k64O17O3j58J61M64Q8j40N8J7j33L62j20J14K37k04L65
1936A194J35l71O1K21j90j08M8L11l46j18L32j17k55j44j31j81K16rj72m4p9K39
1958D92r17r5J93J48j86m41k8N5R9p82K07Q6R5O1m85L13l6LQ7j70q4R6J37M44
$$ y = [322, 1108, 1362, 170, 63, 464, 181, -708, -758, -126, -343, -466, -565, -535, -857, -1181, -892, -1130, -1897, -1121, -700, -1034, -1453, -982, -870, -1505, -1290, -1012, -913, -989, -960, -571, -852, -1275, -734, -822, -896, -1015, 79, -31, -385, -56, 384, 346, -181, 74, 455, 428, 765, 915, 1076, 981, 848, 961, 741, 704, 1185, 1600, 1073, 1297, 1595, 1287, 584, 907, 648, 795, 666, 878, 1243, 864, 545, 906, 383, 38, 125, 446, 70, -242, 49, 285, -141, -674, -190, -539, -928, -1069, -682, -636, -843, -984, -563, -1119, -1090, -1006, -960, -1083, -1299, -952, -836, -1124, -975, -809, -1224, -1117, -951, -525, -459, -238, -106, -333, -597, 20, 83, -75, 86, 550, 638, 498, 556, 573, 440, 802, 682, 796, 1033, 829, 1194, 1329, 958, 1019, 1240, 1050, 942, 990, 1301, 955, 837, 1169, 1052, 797, 653, 522, 341, 557, 548, 376, 332, 253, 492, -425, -520, -327, -179, -365, -806, -834, -779, -680, -1462, -1255, -1169, -1074, -1013, -1498, -1185, -1221, -1218, -1131, -1301, -1385, -1289, -1152, -708]
1982g08k70J23K53J27k05J72O92m26O7M29L6P9J04j47L39L06k70K27J30J24M85
2003A667j77k93J83Q5J82n26L7R0J94k61k09L3o1N1m11m6j45OJ43j75k50k05j49
2026b37p2k81o5J09j08o65L81O4l45R0j49Q3j11L93j36m49L59J25j53j14J41M33
2048g07p1j82j1O36j06L0K0L68j02L44j39R0M58j2j55K24K23j95K95k97QO69j07
2071A281n9k18L07m76L3L63j35o7r1K97m35m80M08l38J41k86PM5m60k28L72j49
2093a68n10R6p1K46l32m0K33o30J71L26j11n62M06K00j94m02L72L71l32J33L61
2114d37j46k33J62N43k77j72P84j53k95Q4L86J82m03J90M57m2m87N48L66n05K90
2135H42K13J3k69O0J83K0o54J16L59k31j57M39m6m12m01O85l1m54LK08o42r7N37
$$ y = [-708, -978, -855, -602, -475, -680, -508, 184, -242, -175, 254, 290, 369, 473, 326, 665, 971, 701, 928, 1058, 1182, 1667, 1490, 1197, 1380, 1465, 1647, 1121, 1158, 1248, 1442, 1181, 972, 1005, 944, 995, 584, 538, 393, 399, 542, 367, 117, -88, -237, -309, -590, -655, -546, -654, -1319, -938, -874, -1219, -1129, -1278, -1195, -1306, -913, -1049, -1498, -1139, -1014, -1167, -1281, -1140, -707, -778, -960, -971, -335, -441, -411, -391, -23, -125, 219, 80, 170, 628, 616, 461, 685, 908, 713, 1008, 711, 719, 1388, 1281, 1222, 1004, 1311, 835, 868, 1231, 1096, 1029, 938, 1235, 800, 320, 728, 390, 531, 245, 252, 297, -163, -391, -19, -168, -678, -582, -653, -407, -739, -779, -546, -1176, -1005, -679, -790, -1352, -946, -746, -940, -1342, -970, -599, -931, -798, -437, -583, -816, -654, -111, -388, -560, 224, 71, -224, -140, 246, 428, 25, 215, 672, 630, 143, 691, 1057, 552, 842, 1055, 1068, 799, 859, 1042, 1062, 408, 524, 883, 652, 495, 934, 888, 476, 75, 760, 729, 275, 278, 486, -156, -253, 284]
2158B84k60l69n9J29k26O1J15L17o20o2n2J31k61K44K05n21k9M83n4k34OK62J73
2181c37o95K55O05j18j82R2K42p8k7M90j37k79o7N48k55j90P08R8l02l7L60J26
2203H20m57m0K90kl80M44O4k24K21J9k6K9m61K93j27q2K53J45m76m60N62J01k42
2226B64j30Mm6n35O54k07j51l19L50k91J04j58J2L90o26J54L04m75o2L01L35n53
2248f81K04r0L4l98N48j01q8j11M35K47l90o7M89j98K5r5O56k67O2j61L25k24
2270A54O9K02J58l82M53K21k87j70J60M26k58k19K19K04l90J39L7l56P8r9R3k24
2292B28j94Q05j80l74n05O77l91m99O39k37l77n3J42M1n2k25rj34j68l7K95j92
2314h00j79K51J46o42O01J96j69l70N32J51m66L76J92Q7j07rK88K6m41N26M13
$$ y = [284, 24, -345, -404, -275, -501, -440, -325, -8, -628, -690, -742, -611, -872, -628, -423, -944, -973, -490, -544, -778, -772, -510, -337, -1032, -777, -172, -290, -472, -380, -138, -216, -243, 247, 110, -169, -236, 312, 57, -133, 575, 673, 371, 334, 694, 820, 363, 323, 613, 611, 231, 675, 739, 515, 736, 755, 729, 758, 297, 590, 463, 381, 634, 779, 303, -157, 405, 506, 264, 134, 138, 92, -443, 211, 4, -147, -466, -116, -407, -303, -461, -449, -59, -685, -531, -227, -702, -764, -463, -128, -681, -477, -567, -533, -931, -383, -484, -572, -683, -248, -1, -391, -458, 31, -167, -142, -237, 419, 152, 214, 53, 378, 154, 223, 425, 583, 201, 654, 875, 588, 418, 578, 1004, 746, 527, 746, 950, 560, 699, 736, 380, 458, 359, 452, 228, 34, 839, 659, 285, -220, 457, 66, -433, 206, -31, -408, -461, -319, -278, -330, -555, -564, -698, -866, -903, -608, -800, -979, -728, -582, -1224, -623, -427, -596, -966, -434, -283, -749, -373, -181, -94, -201, -210, 78, 104, -337, 189, 602]
2335F02p7k63J79OK64k58L16j10m5K50j47j62M7L15j23l23L82M6k75j1k95J57
2357D75J99m36J28l7j44j73J88l37p1L1j22m27J45K09J04j88m25K81J15k97o5
2378h47J93M8l13N44j0j34l05M40k14K64J09o5j34j9J55K92m55K52K07K6N2K13
2400B99K16k34j58O99l07m5M0M10k47ll9K19j60l06L95r8l21K01M11l77l13J29
2422D11l63o4J69o3J79l41j3K7J03m77L78j51n1k14R8Q6j73R4l7j08j45O1j2J75
2446d31j09J69k91L28k65L35l53K2L31M6L70l49J69Lk20K09J65o5j37K64mK09
2468C96N4m44L66J44M5j45J18l1O6j20l3j42J87o2l76N76l42J60j47J81k16k34
2490AO9l98K67L3J29p0K65o2j27n00L5K5J93P0l10J4J20J35l78RR4L2l8N3j8K1
$$ y = [602, 525, 262, 441, 447, 711, 453, 769, 659, 614, 864, 717, 555, 602, 917, 794, 471, 853, 899, 624, 613, 318, 475, 674, 238, 366, 329, 185, 12, 200, -137, -208, -177, -299, -726, -581, -372, -268, -456, -881, -600, -485, -782, -847, -654, -606, -919, -375, -385, -519, -824, -384, -598, -334, -225, -290, -424, -443, -288, 4, -451, -199, 8, 34, 86, 299, 515, 281, 123, 822, 515, 470, 510, 920, 673, 670, 631, 850, 690, 384, 779, 681, 360, 561, 972, 595, 282, 411, 48, -16, 153, 90, 269, -72, -85, -58, 45, -432, -54, -205, -256, -470, -372, -286, -459, -365, -402, -510, -655, -594, -606, -431, -540, -371, -662, -334, -599, -264, -617, -595, -264, -218, 152, -197, -28, -25, -245, -36, 129, 64, -73, 191, 187, 396, 450, 6, 372, 516, 561, 416, 534, 503, 569, 449, 416, 274, 461, 399, 23, 599, 257, 417, 270, 451, 235, 1, 70, -328, -61, -28, 101, 31, 296, 234, 107, -393, -358, -333, -140, -70, -380, -366, -246, -111, -489, -480, -386, -354, -392, -339, -357, -336]
2516c36N7j28j77o7K95J99k73R1N65j8m21M0L8K97j25J09J07m34L06R7k6r1l0
2539G5K90R8l78K93L67k67l77K03J50O8N0k48J50k44K21q0m9l87M43L9m39J60
2561A38L34J11n11o4K84j98j36Oj78n7K09J10k80j61n3L39k27m8n3M11j97n59
2583g80K23j1k67N23j28J07j29J50r1N9K7jK37oj46l8K78j02O9n7J65J4K73m34
2607f5J96K42J58k8l39L54k02j12L33M0R6n8k74KK72Q6l88o5K16l75L46j56n3
2630B26k6Pj59L3K19l01l5j69j1L94m43K64l48L8k39jK36j06m9M2j48oP1j1l5
2655e57p4J09L69l59J65K2J05J9j11L02k01K97O6K9Kj93J87j82nN84l42M88o04
2678A16L73O2L60o24O7K50J45j44k00Q6j61M3K7k27J57m5m8J11l05L07M4n13r0
$$ y = [-336, -279, -407, -584, -651, -356, -157, -430, -339, 226, 208, -213, -173, -135, 162, 37, 146, 253, -181, 125, 222, 196, 105, 75, 365, 463, 85, 378, 745, 478, 101, 304, 454, 522, 572, 324, 474, 230, 451, 371, 322, -65, 378, 417, -22, 138, 472, 583, 72, 8, 292, 94, -42, -36, -214, -271, -62, 48, -232, -393, -446, -107, -334, -382, -435, -24, -221, -780, -557, -568, -835, -312, -440, -333, -462, -312, -403, -344, -317, -318, -81, -87, -233, -271, 7, -95, -26, -83, 82, 96, 369, -65, 131, 373, 531, 503, 164, 518, 316, 204, 537, 577, 673, 615, 341, 343, 615, 701, 313, 248, 464, 89, 435, 279, 226, 200, 207, 48, 81, 300, -1, -36, -205, -216, 178, -265, -1, -349, -311, -550, -551, -315, -421, -470, -428, -576, -582, -511, -522, -557, -631, -522, -153, -512, -347, -325, -220, -201, -312, -10, -211, 86, 152, 181, 183, -10, 177, -5, -10, 574, 232, 720, 116, 489, 551, 911, 287, 354, 604, 749, 605, 405, 491, 330, 373, 400, 173, 330, 285, 237, 348, 43, 350, 394, -119, -209]
2701b09K73l13M5m6L76l18k55n6J38L0j58j30J79k15M27K2k53k50m9J49J75J79
2723b59j44O9J98j9k27k5K60m5J34Nk4M08j91O8j60J24PJ65O4M3j00J82j49K16
2747F00k70K06N9k8j92K05j42j09J85m07J31j68O9R1q5j20L7k68L13k33k22M5
2769c03q5M77j52l85p1J36R3n6O6J19k02o1O7K08j34k42L09j54J4q2KL97n76L01
2793c14K0J31k83J65L07J16k94N0K79J98l43O7K26k67J35Q4p9J71j1K58k37j18
2815B61R6J88k53L3j49K78o1k55l0k07N47k60J54n60N11j98J65l60J41j52O7l8
2837h2k35K33p3l48K39J34k96K43k47L29k47K63k98mL9J57k52L56l95M62k37K6
2859b33r7p3M98k06J9k7K5l5k01K71j52L92p3k02j4m2K39L33l38K10r3J43k07
$$ y = [-209, 64, -249, -204, -250, 126, -192, -447, -503, -365, -335, -493, -623, -444, -659, -232, -210, -463, -713, -762, -613, -438, -259, -403, -334, -136, -155, -382, -407, -147, -192, -58, -53, -77, 331, 140, 208, 48, 172, 179, 344, 408, 451, 351, 533, 384, 600, 330, 536, 595, 567, 375, 580, 438, 329, 514, 107, 238, 70, 139, 230, 145, 25, 62, -206, 107, -126, -348, -303, -388, 89, -63, -448, -519, -383, -290, -346, -280, -161, -363, -424, -357, -149, -283, -525, -216, -370, -356, -438, -436, -39, -615, -314, -294, -163, -446, -281, 26, 142, -152, -102, 177, 375, 32, 99, 325, 58, 193, 277, 198, 369, 358, 616, 379, 261, 357, 545, 292, 325, 176, 454, 393, 138, 108, -99, 448, 188, 342, -218, 293, 95, 260, -100, 41, -111, -44, -82, -317, -84, -157, -505, -266, -132, -428, -185, -432, -103, -350, -87, -385, -389, -350, -193, -445, -89, -484, -22, -259, -233, -330, -403, 95, -111, -92, -119, -94, -129, -330, -59, -211, 181, 108, -94, -108, -150, 89, 422, 84, 294, 201, 344, 137]
2882A37L30l39R5j58K40J03j87K39k28q3l6K44j42m1l7J80R0j51n7j27K14j39
2904A47O3k61P5Q8j9J17l42q3J88j53j83J79k5J77k90M6L3j71j94L93k70M00r6
$$ y = [137, 467, 128, 223, 65, 305, 408, 221, 460, 232, 149, 113, 357, 215, 174, 137, 317, 407, 256, 199, 72, 286, 147, 210, -51, 24, 112, 93, 210, -132, -215, -27, -180, -363, -184, -209, -32, -322, -276, -243, -414, -608, -215, -485, -85, -181]
$$ [...]
8191f9
##END NTUPLES=NMR FID
##END=
