##TITLE=1H_LR-681-K2-C2
 CDCl3, 8 sc, 
 23.7.2019
##JCAMPDX= 6.0         $$ Bruker NMR JCAMP-DX V2.0
##DATA TYPE= NMR FID
##DATA CLASS= NTUPLES
##ORIGIN= UXNMR, Bruker Analytische Messtechnik GmbH
##OWNER= root
$$ XWIN-NMR		Version 3.5
$$ Tue Jul 23 15:16:03 2019 Russian Standard Time (UT+4h)  she@DPX200
##.OBSERVE FREQUENCY= 200.13155
##.OBSERVE NUCLEUS= ^1H
##.DELAY= (6, 6)
##.ACQUISITION MODE= SIMULTANEOUS
##.ACQUISITION SCHEME= undefined
##.AVERAGES= 8
##.DIGITISER RES= 18
##SPECTROMETER/DATA SYSTEM= spect
##.PULSE SEQUENCE= zg30
##.SOLVENT NAME= CDCl3
##.SHIFT REFERENCE= (INTERNAL, CDCl3, 0, 15.7039)
##AUDIT TRAIL= $$ (NUMBER, WHEN, WHO, WHERE, WHAT)
$$ ##TITLE= Audit trail, XWIN-NMR		Version 3.5
$$ ##JCAMPDX= 5.01
$$ ##ORIGIN= Bruker BioSpin GmbH
$$ ##OWNER= she
$$ F:/spectra/data/she/nmr/H-F/1/audita.txt
$$ ##AUDIT TRAIL=  $$ (NUMBER, WHEN, WHO, WHERE, WHAT)
(   1,<2019-07-23 15:14:50.53 +0400>,<she>,<DPX200>,
      <created by zg, POWCHK disabled, PULCHK disabled
       configuration hash MD5:
       00 E9 B6 7A A2 85 ED C7 34 08 36 98 17 FE 4E 26
       data hash MD5: 16K
       25 92 E2 97 A8 47 77 83 99 C7 3B C6 7C 94 E2 6D>)
$$ ##END=
$$ 
$$ hash MD5
$$ 9D D3 AE 1E CB C2 EE FE C3 F1 15 8C 8D DD 25 53
##$RELAX= 
##$RELAX= 
##$RELAX= 
##$RELAX= 
##$RELAX= 
##$RELAX= 
$$ Bruker specific parameters
$$ --------------------------
##$DU= <F:/spectra>
##$EXPNO= 1
##$NAME= <H-F>
##$PROCNO= 1
##$TYPE= <nmr>
##$USER= <she>
##$AMP= (0..31)
100 100 100 100 100 100 100 100 100 100 100 100 100 100 100 100 100 100 
100 100 100 100 100 100 100 100 100 100 100 100 100 100 
##$AQSEQ= 0
##$AQ_mod= 1
##$AUNM= <au_zg>
##$AUTOPOS= <>
##$BF1= 200.13
##$BF2= 200.13
##$BF3= 200.13
##$BF4= 200.13
##$BF5= 200.13
##$BF6= 200.13
##$BF7= 200.13
##$BF8= 200.13
##$BYTORDA= 1
##$CFDGTYP= 0
##$CFRGTYP= 5
##$CHEMSTR= <none>
##$CNST= (0..31)
1 1 145 1 1 1 1 1 1 1 1 1 1 1 1 1 1 1 1 1 1 1 1 1 1 1 1 1 1 1 1 1 
##$CPDPRG= <>
##$CPDPRG1= <>
##$CPDPRG2= <>
##$CPDPRG3= <>
##$CPDPRG4= <mlev>
##$CPDPRG5= <mlev>
##$CPDPRG6= <mlev>
##$CPDPRG7= <mlev>
##$CPDPRG8= <mlev>
##$CPDPRGB= <>
##$CPDPRGT= <>
##$D= (0..31)
0 1.2 0 0 0 0 0 0 0 0 0 0.03 0 0 0 0 0 0 0 0 0 0 0 0 0 0 0 0 0 0 0 0 
##$DATE= 1563880489
##$DBL= (0..7)
120 120 120 120 120 120 120 120 
##$DBP= (0..7)
150 150 150 150 150 150 150 150 
##$DBP07= 0
##$DBPNAM0= <>
##$DBPNAM1= <>
##$DBPNAM2= <>
##$DBPNAM3= <>
##$DBPNAM4= <>
##$DBPNAM5= <>
##$DBPNAM6= <>
##$DBPNAM7= <>
##$DBPOAL= (0..7)
0.5 0.5 0.5 0.5 0.5 0.5 0.5 0.5 
##$DBPOFFS= (0..7)
0 0 0 0 0 0 0 0 
##$DE= 6
##$DECBNUC= <off>
##$DECIM= 24
##$DECNUC= <off>
##$DECSTAT= 4
##$DIGMOD= 1
##$DIGTYP= 9
##$DL= (0..7)
0 120 120 120 120 120 120 120 
##$DP= (0..7)
150 150 150 150 150 150 150 150 
##$DP07= 0
##$DPNAME0= <>
##$DPNAME1= <>
##$DPNAME2= <>
##$DPNAME3= <>
##$DPNAME4= <>
##$DPNAME5= <>
##$DPNAME6= <>
##$DPNAME7= <>
##$DPOAL= (0..7)
0.5 0.5 0.5 0.5 0.5 0.5 0.5 0.5 
##$DPOFFS= (0..7)
0 0 0 0 0 0 0 0 
##$DQDMODE= 0
##$DR= 18
##$DS= 0
##$DSLIST= <SSSSSSSSSSSSSSS>
##$DSPFIRM= 0
$$ [...]
##$SUBNAM2= <"">
##$SUBNAM3= <"">
##$SUBNAM4= <"">
##$SUBNAM5= <"">
##$SUBNAM6= <"">
##$SUBNAM7= <"">
##$SUBNAM8= <"">
##$SUBNAM9= <"">
##$SW= 24.9336996594482
##$SWIBOX= (0..15)
0 0 2 0 0 0 0 0 0 0 0 0 0 0 0 0 
##$SW_h= 4990.01996007984
##$TD= 16384
##$TD0= 1
##$TE= 0
##$TE2= 300
##$TE3= 300
##$TEG= 300
##$TL= (0..7)
0 120 120 120 120 120 120 120 
##$TP= (0..7)
150 150 150 150 150 150 150 150 
##$TP07= 0
##$TPNAME0= <>
##$TPNAME1= <>
##$TPNAME2= <>
##$TPNAME3= <>
##$TPNAME4= <>
##$TPNAME5= <>
##$TPNAME6= <>
##$TPNAME7= <>
##$TPOAL= (0..7)
0.5 0.5 0.5 0.5 0.5 0.5 0.5 0.5 
##$TPOFFS= (0..7)
0 0 0 0 0 0 0 0 
##$TUNHIN= 0
##$TUNHOUT= 0
##$TUNXOUT= 0
##$USERA1= <user>
##$USERA2= <user>
##$USERA3= <user>
##$USERA4= <user>
##$USERA5= <user>
##$V9= 5
##$VALIST= <valist>
##$VCLIST= <CCCCCCCCCCCCCCC>
##$VD= 0
##$VDLIST= <DDDDDDDDDDDDDDD>
##$VPLIST= <PPPPPPPPPPPPPPP>
##$VTLIST= <TTTTTTTTTTTTTTT>
##$WBST= 1024
##$WBSW= 4
##$XGAIN= (0..3)
0 0 0 0 
##$XL= 0
##$YL= 0
##$YMAX_a= 255234
##$YMIN_a= -354602
##$ZGOPTNS= <>
##$ZL1= 120
##$ZL2= 120
##$ZL3= 120
##$ZL4= 120
##$ABSF1= 10
##$ABSF2= 0
##$ABSG= 5
##$ABSL= 3
##$ALPHA= 0
##$AQORDER= 0
##$ASSFAC= 0
##$ASSFACI= 0
##$ASSFACX= 0
##$ASSWID= 0
##$AUNMP= <proc_1d>
##$AZFE= 0.1
##$AZFW= 0.1
##$BCFW= 1
##$BC_mod= 2
##$BYTORDP= 1
##$COROFFS= 0
##$CY= 11.3945322036743
##$DATMOD= 1
##$DC= 2
##$DFILT= <>
##$DTYPP= 0
##$F1P= 18.9103706918063
##$F2P= -1.10871071338519
##$FCOR= 0.5
##$FTSIZE= 0
##$FT_mod= 4
##$GAMMA= 1
##$GB= 0.15
##$INTBC= 1
##$INTSCL= 1
##$ISEN= 128
##$LB= 0.24
##$LEV0= 0
##$LPBIN= 0
##$MAXI= 10000
##$MC2= 0
##$MEAN= 0
##$ME_mod= 0
##$MI= 1.114404
##$NCOEF= 0
##$NC_proc= 0
##$NLEV= 6
##$NOISF1= 3.799351
##$NOISF2= 2.8
##$NSP= 1
##$NTH_PI= 0
##$NZP= 0
##$OFFSET= 15.70392
##$PC= 1
##$PHC0= -8864.601
##$PHC1= 21.80096
##$PH_mod= 1
##$PKNL= yes
##$PPARMOD= 0
##$PSCAL= 0
##$PSIGN= 0
##$REVERSE= no
##$SF= 200.130013532006
##$SI= 16384
##$SIGF1= 3
##$SIGF2= 2
##$SINO= 400
##$SIOLD= 16384
##$SREGLST= <1H.CDCl3>
##$SSB= 0
##$STSI= 0
##$STSR= 0
##$SW_p= 3612.71676300578
##$SYMM= 0
##$S_DEV= 0
##$TDeff= 0
##$TDoff= 0
##$TI= <>
##$TILT= no
##$TM1= 0
##$TM2= 0
##$TOPLEV= 0
##$USERP1= <user>
##$USERP2= <user>
##$USERP3= <user>
##$USERP4= <user>
##$USERP5= <user>
##$WDW= 1
##$XDIM= 8192
##$YMAX_p= 0
##$YMIN_p= 0
$$ End of Bruker specific parameters
$$ ---------------------------------
##NTUPLES= NMR FID
##VAR_NAME=  TIME,          FID/REAL,        FID/IMAG
##SYMBOL=    X,             R,               I
##VAR_TYPE=  INDEPENDENT,   DEPENDENT,       DEPENDENT
##VAR_FORM=  AFFN,          ASDF,            ASDF
##VAR_DIM=   8192,          8192,            8192
##UNITS=     SECONDS,       ARBITRARY UNITS, ARBITRARY UNITS
##FACTOR=    0.0002004,     1,               1
##FIRST=     0,             0,               0
##LAST=      1.6414764,     0,               0
##MIN=       0,             -354602,         0
##MAX=       1.6414764,     255234,          0
$$ Real data points
##PAGE= N=1
##DATA TABLE= (X++(R..R)), XYDATA
$$ [...]
2357E514J254Nj141r02j646j338K3J545Q23J330R71l95k231j720q53j384q3J307
2375A079J476L35j20p94j854k210j394KL83R11J022R75m78j571j573j191j739
2392f741O02K057Q63O09R90j93j615j783p71O07N66J589K059J239k15l49j280
2409a766j197o05J035J484J247J840J608l24j759o06o13o66Q68J533K464O88M26
2426E657r76j358j487o29M81M27J380J418P65j113j071j290j292j244K71J068
2442A007J174P62M36j014j830k041n40m74J15J573J375L00n31j249j105j867r51
2459d860O13J060R67J306M29o57j311j294o89n20J035J471J471Q18K60k46j447
2476a594j205k21M72P16J717J472R01o50l94j100j493J2Q70J202J515J161P14
$$ plain form
2357 5514 6768 6773 5632 4730 3084 1746 1769 3314 4137 5467 6438 6043 3812 2092 1239 -145 -228 1079
2375 1079 2555 2890 2770 1976 122 -2088 -3482 -3480 -3097 -2186 -1164 -189 -667 -2238 -3811 -5002 -6741
2392 -6741 -6139 -4082 -3219 -2610 -1620 -1813 -3428 -5211 -5982 -5375 -4809 -3220 -1161 78 -137 -486 -1766
2409 -1766 -2963 -3568 -2533 -1049 198 2038 3646 3322 1563 957 344 -322 546 2079 4543 5231 5657
2426 5657 4681 3323 1836 1207 1688 2115 3495 4913 5678 4565 3494 2204 912 -332 -61 1007
2442 1007 2181 2943 3379 2365 535 -1506 -2046 -2520 -2405 -832 543 843 312 -937 -2042 -3909 -4860
2459 -4860 -4247 -3187 -2220 -914 -485 -1142 -2453 -3747 -4436 -4956 -3921 -2450 -979 -161 99 -147 -1594
2476 -1594 -2799 -3020 -2548 -1832 -115 1357 2258 1608 1214 114 -1379 -1367 -497 705 2220 3381 4095
2493D095p77j616j309k39k30Q20J579J558M06p20r80j040j475m91O17R11Q98J348
2511C355O7j168j066j317r49n11N12J471Q60L18L28j042j766j431j82k64P58J391
2529f36J387%o55j114j221j315k23Q48J467P37J126K79j132j570p89n25r7R24
2547b509J637J427O2k0o46j119j194k15O98J177J678J257J1o44r26j205o76n8
2565a265J277J473J146P65o3j062j590l73n38K12O68K055O22K74p72q47j329j116
2583d63l25Q03R77J426M26q1j071j808r51o20l86J459R86P92K32m55j298j270
2601a627j269j36M48N09J839P56n58q46r36q33j057o5J157J223J124L22l3m57
2619d39j674p75k7K88J145J541Q99M09l86o41j180p84J43J056J269J473O44k12
$$ plain form
2493 4095 3318 1702 393 154 -76 744 2323 3881 4287 3567 2587 1547 72 -419 198 1109 2007 3355
2511 3355 3422 2254 1188 -129 -1078 -1589 -1077 394 1254 1572 1900 858 -908 -2339 -2521 -2785 -2027 -636
2529 -636 751 751 96 -1018 -2239 -3554 -3777 -2929 -1462 -725 401 680 -452 -2022 -2811 -3336 -3433 -2509
2547 -2509 -872 555 617 597 -49 -1168 -2362 -2577 -1879 -702 976 2233 2244 1600 674 -531 -1207 -1265
2565 -1265 12 1485 2631 3396 3333 2271 681 308 -230 -18 650 2705 3327 3601 2829 1982 653 -463
2583 -463 -788 15 992 2418 2844 2763 1692 -116 -1067 -1687 -2073 -614 372 1164 1396 941 -357 -1627
2601 -1627 -2896 -3032 -2584 -2075 -236 520 -38 -884 -1820 -2653 -3710 -3775 -2618 -1395 -271 51 18 -439
2619 -439 -2113 -2888 -2915 -2627 -1482 59 958 1367 981 340 -840 -1624 -1481 -425 844 2317 2961 2749
2637B749p72j312o14n35L63Q85J438J080J44k59j164j185q94o3K52Q75J175R13
2655C076l56n32j166j722l21o3Q07P84Q78L39l87j053j654r37o4K68Q78J320K13
2674C08J34n70j171r50q10Q0Q50P38J511M26j97p91j189o23k84L36J261P74Q49
2693F82L98l35o14j323m75J50M29J280J256P32O3q13j096j005k33M45Q28Q27J159
2712B355N26m07j035j065j014k2M04P14J125O02K97j129q47j143n28J97M51P45
2730B26J208L80l46m87j399r87k53P12L46Q91J062J9o37r41j019p78O7N42Q50
2749e44J247J63M21j243r19r61p2J10P72R48Q66K91l45j146j185m01m0O01Q29
2768f08Q64R80q7r74p98r58k52Q4O47J203R18N14m04r45r76q99Q1M55J075J107
$$ plain form
2637 2749 1977 665 51 -484 -121 764 2202 3282 3426 3167 2003 818 -76 -139 113 988 2163 3076
2655 3076 2720 2188 1022 -700 -1021 -1084 -277 507 1385 1724 1337 284 -1370 -2307 -2371 -2103 -1225 95 308
2674 308 442 -128 -1299 -2249 -3059 -2979 -2129 -1391 120 546 349 -442 -1631 -2254 -2538 -2202 -941 -167 682
2693 682 1080 745 131 -1192 -1667 -1517 -1088 192 1448 2180 2243 1430 334 -671 -904 -459 369 1196 2355
2712 2355 2881 2474 1439 374 -640 -662 -258 456 1581 2183 2480 1351 504 -639 -1167 -970 -519 226
2730 226 1434 1814 1468 981 -418 -1405 -1658 -946 -600 291 1353 1372 735 -206 -1225 -2003 -1936 -1394 -544
2749 -544 703 866 1287 44 -875 -1836 -1908 -1798 -1026 -78 788 1079 734 -412 -1597 -1998 -2038 -1437 -608
2768 -608 256 1236 1149 175 -623 -1581 -1833 -1749 -1102 101 1019 1533 1129 184 -792 -1691 -1610 -1155 -80 1027
2788A027O51K25p09o44r09k68k15P00Q96J090N41l80o11r51p56k09L70Q17J130
2807A795L67L47o43p93j382l33J58K82R55N63P95o12p23j003j198l13Q7N76J107
2826C2O00K73p25j016r11n49k27L32Q43J155K13j21n30q98o71n50J67O10R64J103
2846I4K59n43j80q17n99k21L15J218J050R83k99n06l67p67m77K94P34P39J248
2865B158M01k77m75p55n15l12j29J485P28N87l8l84r84o47r72j11N30N68J240
2884B098M8k76n30r77j103l35n1M66P08O71Rn66n96j309p84j63P23M57Q57M20
2904b33l29o36p12q01o66M68O26J017P35P38o70o10l03q12m62Q55P85J460M16
2923H66J01l09n62n90l31l9J060P51R83M80m12j95p79n71l71O00P44M45Q89N21
$$ plain form
2788 1027 1678 1903 1194 550 -359 -627 -842 -142 754 1844 2385 2005 1394 443 -313 -522 -152 665 1795
2807 1795 2162 2509 1866 1073 -309 -642 -484 -202 753 1316 2111 1499 776 -227 -1425 -1738 -1651 -1075 32
2826 32 632 905 180 -836 -1747 -2296 -2523 -2191 -1348 -193 20 -101 -631 -1529 -2200 -2750 -2583 -1973 -1009 94
2846 94 353 -190 -370 -1187 -1786 -2007 -1692 -474 576 1559 1260 754 387 -380 -857 -563 171 910 2158
2865 2158 2559 2282 1807 1052 537 225 96 1581 2309 2896 2858 2474 1490 843 -129 -240 290 858 2098
2884 2098 2146 1870 1340 363 -740 -1075 -1126 -660 48 719 728 162 -434 -1743 -2527 -2690 -1967 -1510 -653 -233
2904 -233 -562 -1198 -1910 -2711 -3377 -2909 -2283 -1266 -531 207 -463 -1073 -1376 -2188 -2650 -1795 -1010 450 866
2923 866 967 658 96 -494 -825 -864 196 947 1930 2410 1998 1803 1024 453 82 682 1426 1871 2760 3281
2943C281p51n87p95o59j81L99P25Q82kj26m41j244p34p72J66O19N93Q65R1n92
2963G37r58o11j016k77N32K15Q33K23L20o26q26r31k37k08O13P02O79L84j29j47
2983g28j315n79l2N24P75M74Q82K31Q3j016o61j54k37R45P72O07R87M0k24r56
3003D18p65J96K58O35R14J000j3l50p43m21p16L14K11J079M20M86j55n34o83q57
3023F94j40j45L23Q60M57k03l44l45j051o50n56L18P23J34L97j73o93j086j33
3042a613j002J75M41O59L82M5q5o18p95p05q9M42J39R42Q70n7k89p27l61n44L94
3063b396M59R44O01M49O59p70l38o21K5K64J063P49R29O4L79q60n37k42R2N14
3083A427P11Q88M47j04n83o04l66l9k35O01M56J29K36k97o97r54q90l50JO33O35
$$ plain form
2943 3281 2530 1943 1148 489 308 707 1432 2314 2312 2186 1745 501 -233 -1005 -839 -220 373 1238 1329 737
2963 737 -221 -832 -1848 -2125 -1593 -1378 -545 -322 -2 -628 -1454 -2385 -2622 -2830 -2217 -1515 -836 -452 -581 -728
2983 -728 -2043 -2622 -2654 -2130 -1355 -881 1 232 315 -701 -1362 -1516 -1753 -808 -36 571 1558 1598 1374 418
3003 418 -347 -151 107 742 1656 2656 2643 2293 1550 1129 413 727 938 2017 2437 2923 2768 2234 1551 694
3023 694 554 409 732 1592 2049 1846 1502 1157 106 -544 -1100 -782 -59 75 472 299 -394 -1480 -1613
3042 -1613 -2615 -2440 -1999 -1340 -958 -913 -998 -1616 -2411 -3116 -3205 -2763 -2624 -1682 -812 -869 -1158 -1885 -2246 -2790 -2396
3063 -2396 -1937 -993 -392 57 716 -54 -392 -1013 -988 -724 339 1088 2017 2081 2460 1600 1063 821 913 1427
3083 1427 2138 3026 3473 3369 2786 2182 1816 1777 1542 2143 2599 2728 2964 2667 1970 1016 126 -224 -223 410 1045
3104A045L05l62m57r86j139k98o4M33K1L70O36l24j117p42j96m38n04O55Q71N52
3124a739J21k01m83o59k71N2N29P22O30R83P5m39j67k85k27N22Q78Q33N69M62
3144A905K34o20m08k50J32J55J043Q30O29k56m28m35l24l93J4M93M96M18J33m67
3164B901q00m32o74n29J2N89M50j9k2m30p70j214o03q9k19M63N60R9n04l77l15
3185a923r58l69k4K17R23L56M02p65l11o21p8j31R1J275Q95K37M22o14N1o66j44
3206a735L28P21R52L25M49K11l61k63k16k51P85O61O70L71J69k29m26n05o13O84
3226A727R1O75N39J54k85n30l96j050K43l32L50P14j90j6n04o10q11o68L17n4
3246f36K00L09K58j27q72q67k77k33l00rO81N79N27p66o13k83o08r1M04O62O91
$$ plain form
3104 1045 1350 988 531 -455 -1594 -1892 -1956 -1523 -1502 -1132 -496 -820 -1937 -2679 -2875 -3313 -3817 -3162 -2291 -1739
3124 -1739 -1618 -1819 -2302 -2961 -3232 -3180 -2651 -1929 -1299 -316 -241 -680 -847 -1132 -1359 -837 41 874 1443 1905
3144 1905 2139 1519 1111 861 993 1148 2191 3021 3650 3394 2966 2531 2207 1814 1828 2321 2817 3235 3368 2901
3164 2901 2101 1669 995 466 478 1067 1517 1498 1476 1046 276 -938 -1541 -1630 -1849 -1386 -826 -727 -1231 -1608 -1923
3185 -1923 -2881 -3250 -3274 -3057 -2134 -1778 -1376 -2141 -2452 -3073 -3151 -3282 -3191 -1916 -1021 -784 -362 -976 -925 -1591 -1735
3206 -1735 -1407 -686 266 591 1040 1251 890 627 411 160 945 1606 2276 2647 2816 2587 2161 1656 1043 1727
3226 1727 1818 2493 3032 3186 2901 2371 1975 925 1168 836 1186 1900 1710 1694 1190 580 -231 -899 -582 -636
3246 -636 -436 -127 131 4 -868 -1735 -2012 -2245 -2545 -2554 -1873 -1294 -767 -1533 -2146 -2429 -3037 -3128 -2724 -2062 -1371
3267a371M43O3k10p31l35LL96L56R67N07K35k66J26n4n45Q5p7J082P08L89J91
3288A962K01n35m18k62j72R15L85O06M27j88m54l57j047Q8K2N51K65M60J09m91
3308B067n65o53m99k72j12O63J36J9M63q63r35q19k56r4K36P30K0l05J88r63m67
3329b281n71J08J78L98N50K60J51m74m72o24R2L76K21O42N90L43J8k64m31l02
3349a492K18M63N18O64O02J77J49n49q6j69K14M44M07M20N29K28m86l26l58J8
3369A585n3M84M87L28L2o14j36n74p24J48L46j76N03K69n61o38j98q32k80n20
3389a124j4N56k3J53l95m08o57q58K58j10K62L63M69k90ok86q96P6L2M01O33M87
3411a377L66j34o0j58n27N63P3L83Q45P71K04k15m10l20K63K75P6P27N42O10K37
$$ plain form
3267 -1371 -928 -865 -1075 -1806 -2141 -2138 -1742 -1386 -419 88 323 57 183 129 -416 -331 -408 674 1382 1771 1962
3288 1962 2163 1628 1210 948 776 1691 2076 2682 3109 2921 2467 2110 1063 1151 1173 1724 1989 2449 2558 2067
3308 2067 1502 849 350 78 -34 629 765 784 1247 384 -551 -1370 -1626 -1720 -1484 -754 -734 -1039 -851 -1814 -2281
3329 -2281 -2852 -2744 -2566 -2168 -1618 -1358 -1207 -1681 -2153 -2777 -2685 -2309 -2088 -1446 -856 -513 -495 -759 -1190 -1492
3349 -1492 -1274 -811 -293 371 973 1150 1299 750 664 495 709 1153 1560 1980 2509 2737 2251 1925 1567 1585
3369 1585 1532 2016 2503 2831 2863 2249 2113 1539 815 963 1309 1133 1636 1905 1344 706 508 -324 -604 -1124
3389 -1124 -1138 -582 -605 -452 -847 -1255 -1912 -2770 -2512 -2622 -2360 -1997 -1528 -1818 -1824 -2110 -3006 -2930 -2898 -2497 -1864 -1377
3411 -1377 -1011 -1145 -1205 -1363 -1890 -1327 -1254 -871 -26 745 949 734 324 4 267 542 618 1345 1887 2497 2734
3432B734m60o68j40k1L90j0N12N30r1jn83n87o05J16r2M95O28j32m81k63o08m54
3454B09o47l46O26N9L4j83k69m01o23l87k04J65L4M24K18N1j75o97j39l66p7K53
3476b441M77M36N32q5j91j39l94L73n1M45R21L72n9K54m55j84q4K21L64K76O74
3497A262O51J05o56m21M8j36N9M53K81P47J27k58o94k15m70j9K82J89J79O26m22
3518A718l29o98m82k3k6j02P02J29l04l93l44l79o70k92P1M20J46L48q7J16q35
3539a314k19p34j49O65N89K40M89n79j66j70l10p0j28O95N40J95J6J19k36p30
3559a257M18j15K01N50Q48o6M66k88l41p09L14J72O71M11J29K78M1l01m96Q3n62
3580D47N27K99N36J06j11L2o44n02j17l5R7L77J51K51k02j90q07n11o0r0L36N02
$$ plain form
3432 2734 2274 1606 1466 1445 1835 1825 2337 2867 2776 2775 2192 1605 1000 1116 1024 1519 2147 2015 1534 1271 663 209
3454 209 -438 -784 -158 -99 -65 -248 -517 -918 -1541 -1928 -2132 -1967 -1933 -1509 -1291 -1240 -1415 -2112 -2251 -2617 -2694 -2441
3476 -2441 -1964 -1528 -996 -1081 -1272 -1411 -1805 -1432 -1483 -1038 -117 255 196 450 -5 -189 -273 -52 312 588 1262
3497 1262 1913 2018 1362 941 989 853 912 1365 1646 2393 2520 2262 1568 1353 883 864 1146 1335 1514 2140 1718
3518 1718 1389 691 209 186 160 58 760 889 585 192 -152 -531 -1201 -1493 -1422 -1002 -856 -508 -595 -479 -1314
3539 -1314 -1533 -2267 -2416 -1751 -1162 -922 -433 -1012 -1178 -1348 -1658 -1728 -1856 -1161 -621 -426 -410 -291 -527 -1257
3559 -1257 -839 -954 -753 -203 645 579 1045 757 416 -293 21 193 864 1275 1404 1682 1723 1422 926 1009 447
3580 447 974 1273 1809 1915 1804 1836 1192 690 573 538 635 1012 1163 1414 1212 1022 215 -296 -356 -446 -110 392
3602C92k69j9J0o33j25p18n0J77L61M94p7m96J31o15k69j83J0L98L80L00R9o1
3624g63n10m05J58k31K50O78O11K22L31l40r2l36J77p1M62k2P76K67J29m17l85
3645D89K67j78L85N8M76L10K45l02k39o24k1L67k64K12L88J83q5o17k00n29j41
3666A80K97j49K48L17k69o4p23l42l46m70K03P22l22M55r1l45p64l81K46k61N21
3687a338M41j5J77k59j97j13n40n9L47N84L20L31J7Kj45j5l0j75M97L11L63M30
3709I34o4l46j69j0k13M94M82p6O18J78k69m00j75j81j37K89L00K40Q3k67j64
3730A147n13l54J08MM93K22Q8j42o77k51l87j58j76j22M71J36K11l15k46k26n32
3751a219o0K1K34J29K65J64k53j61m47q2J40M1M74L17K58l97L8j78lJ1j91O20
$$ plain form
3602 392 123 104 114 -519 -644 -1362 -1412 -1235 -874 -380 -457 -953 -822 -1437 -1706 -1889 -1879 -1481 -1101 -801 -702 -763
3624 -763 -1273 -1678 -1520 -1751 -1501 -823 -212 10 341 1 -91 -427 -250 -321 141 119 895 1162 1291 874 489
3645 489 756 578 963 1021 1497 1807 2052 1750 1511 887 866 1233 969 1181 1569 1752 1667 1050 850 321 180
3666 180 477 328 576 893 624 560 -163 -505 -851 -1321 -1118 -396 -718 -263 -354 -699 -1463 -1844 -1598 -1859 -1338
3687 -1338 -897 -912 -735 -994 -1191 -1304 -1844 -1903 -1556 -972 -652 -321 -304 -302 -447 -462 -492 -667 -170 141 504 934
3709 934 870 524 355 345 132 626 1108 1032 1650 1828 1559 1159 984 803 666 955 1255 1495 1578 1311 1147
3730 1147 634 280 388 392 885 1107 1195 1053 376 125 -262 -420 -596 -718 -247 -111 100 -215 -461 -687 -1219
3751 -1219 -1279 -1258 -1024 -895 -630 -466 -719 -880 -1327 -1409 -1269 -1228 -754 -437 -179 -576 -538 -716 -719 -708 -899 -279
3773b79Q1L85K38J23j09p57P0q6J32J5Q65M15l86K63n36j10l00L28j2N37J04K88
3795A269k25k75Ln31L0k2J90L03M19k18n5j55p34M1j07J32J33K85J1J27n7n74
3817a0m12J59l15J75M04j59M39k71l12m20l95K78k32J53O04L47l06J10l61j34
3837f58n50J9L24M05%J74M5k62q9pl27J49K83L56K63J05l63L46m00J73j18J16
3859a6K55L07K32j58j12p4j04k45J47J0O18K75k2r1k69j83k42R2K08k10O05j95
3881H28N03n97j10k92m39L1L23L42k36j8J11l82l59j78K26j56l85N95o8R9l39
3902e01k2l20K4k85r9O81K0P9j9l98mp3k16K09K9J33L32J8K33k58j87k44J03M27
3926c38M04N79kK45l42p0m04m0M68J47oK78J32n7J62m14k22O4l8J62O31L2J59
$$ plain form
3773 -279 -198 187 425 548 439 -318 -248 -334 -202 -187 678 1093 707 970 434 324 24 352 340 877 981 1269
3795 1269 1044 769 772 241 271 249 439 742 1161 943 888 733 -1 40 -67 65 198 483 494 621 564 -10
3817 -10 -422 -263 -578 -403 1 -158 281 10 -302 -722 -1117 -839 -1071 -918 -314 33 -273 -163 -524 -658
3837 -658 -1208 -1189 -865 -460 -460 -286 -241 -503 -592 -599 -926 -777 -494 -138 125 230 -133 213 -187 -14 -132 -16
3859 -16 239 546 778 620 508 434 330 85 232 242 860 1135 1113 1022 753 570 328 420 628 418 1023 828
3881 828 1331 734 624 332 -107 -76 247 589 353 335 446 64 -295 -473 -247 -403 -788 -193 -261 -162 -501
3902 -501 -523 -843 -819 -1104 -1203 -522 -502 -423 -442 -840 -844 -917 -1133 -924 -895 -762 -430 -412 -179 -437 -624 -868 -765 -338
3926 -338 66 645 643 888 546 476 72 32 500 647 641 919 1051 994 1156 742 520 584 546 708 1339 1371 1530
3949A530m71j67r80N13M3k21L70q0J34k03l96j0k59k70J14K4J82P2n0k41l39J32
3971e73m92O6%L34L41k64K46l82l2n78L6M01N4J14L95K16j58j34l46K33Oj09O34
3994Hk12O70L9k09k33q8k78L96p8N03L19O9k19j28Q1j83n5q6K19L48Q2M6O5m80
4018E96k70R9m2L5L1N44J0n13J39k73m89K06j84K10N02j21Rm15l19o5l28J8J66
4041d54j9K70o2N5o3k9j70l28M5L03J38l9L67m18L4l56j14j65N30K3K44J18Jj74
4065b63J00m67m2L9K04L44M73j82j85J98m66j74K70J23J19J88K98q8P8j90o9j62
4087A46J28K5L62K55m0j31J60p10Mk20L70J47J83K2J27l91Q5j35o58K69J2K83
4109B93k25O4J36k79J3m57j71J4Q4J80K25l02j70J11l63q2R3l54Q03p2J75j38
$$ plain form
3949 1530 1059 892 -88 425 468 247 617 537 671 468 72 62 -197 -467 -353 -329 -147 -75 -125 -366 -705 -573
3971 -573 -1065 -999 -999 -665 -324 -588 -342 -724 -756 -1334 -1298 -897 -843 -729 -334 -118 -276 -410 -756 -523 -517 -626 8
3994 8 -204 466 505 296 63 -25 -303 93 15 518 837 906 687 559 640 457 402 316 535 883 965 1011 1076 596
4018 596 326 425 383 418 449 993 1003 490 629 356 -133 73 -111 99 601 480 489 74 -245 -310 -638 -620 -454
4041 -454 -473 -203 -265 -210 -273 -302 -472 -800 -755 -452 -314 -353 14 -404 -370 -726 -840 -1005 -475 -452 -208 -90 -89 -263
4065 -263 -163 -630 -672 -633 -429 -85 388 206 21 219 -247 -421 -151 -28 91 279 577 489 567 377 308 146
4087 146 274 299 661 916 876 745 905 195 199 -21 349 496 679 701 828 437 522 387 -271 -2 10 293
4109 293 68 132 268 -11 2 -455 -626 -612 -528 -348 -123 -425 -595 -484 -847 -929 -836 -1190 -387 -459 -284 -422
4131d22j79j39j54L04n04J77N55J78oL7Q8k57j76RK48j4N05R1m3K02k6k97o4N6
4155A69L02L76j69J4N83Jn56k73J76j33J52O93k55j30l51NJ15m19k46K22p1N51
4177G56j55j88k52m28J04m44J82k55L76J6K24K18n20k65k07l44K81Nj5M92L01
4198a18m24m22j61l64O93k33L39J96K46p4r0r8R7j32K49K17k2K63M70l71Q1p2
4220B70l6Jp7N27ON10k25k29j25k6j02J93n7K98R7L5l17M5l43Pj42k18P8K75M3
4245D88R9Om3n01k81N7l53K38M34k61J02n0l48j53j57K19l78K42J03M44k76q0
4267d49k32k06J67l83M52N26k39K17l71r8j31J80J70K15k58M49L48n40K95j26
4287a4k30J32L60j53O38n17M89j82k83L07k61J23n1J31L46R5k33l41p6j19K37
$$ plain form
4131 -422 -601 -740 -894 -590 -1094 -917 -362 -184 -190 -153 -65 -322 -498 -489 -241 -255 250 341 298 500 474 177 113 169
4155 169 471 847 678 692 1275 1276 720 447 623 490 642 1335 1080 950 599 604 719 300 54 276 205 756
4177 756 601 413 161 -267 -163 -607 -425 -680 -304 -288 -64 154 -366 -631 -838 -1182 -901 -896 -911 -419 -118
4198 -118 -542 -964 -1125 -1489 -796 -1029 -690 -494 -248 -322 -412 -510 -413 -545 -296 -79 -101 162 632 261 342 270
4220 270 234 235 158 685 691 1201 976 747 622 596 494 687 630 928 1025 1060 743 788 445 452 310 92 170 445 488
4245 488 587 593 550 49 -232 -175 -528 -290 144 -117 -15 -65 -413 -566 -723 -504 -882 -640 -537 -93 -369 -449
4267 -449 -681 -887 -720 -1103 -651 -125 -364 -147 -518 -616 -747 -567 -397 -182 -440 9 357 -183 112 -14
4287 -14 -244 -112 248 95 733 216 705 523 240 547 286 409 358 489 835 930 697 356 280 161 398
4308C98J85j07l2K89n2j40M1k72o5m1j76J80n7N02l01k06l45j7R8m38K76J36L62
4331B18n72M0M7k58q0O2l47O37J94j36kk45j33O7j68j63N24m42L67L79k19l43
4353e73K52l51K3J70L42l4K16K81Ql62J46k49M37j87J45K82j2K22j41k74m19L14
4375B36KL84P1L52l18Kl71q6J01L66n04K86j16K13j14P8n89J4n1l0P5J0j69J76
4399A8L7k02l36k90L04n15N21J86m3J45o13Kk40K8M49k85M66J83o57L07J93m69
4421h11Q1j61R5o1P49k09K01J7n7r1k0k11O89P8P2rJ76J44l99j92N06j96K82O8
4445G41J42k9n0j80L6m91K06K44k36K81j2J52o3l56k36j41K8L57r1J54k07k55
4467fO9m23J92k22J8L3J44p6J8j18m10L06n51J24L35k2K02m3O1O7p18L82J17N0
$$ plain form
4308 398 583 476 444 733 681 541 582 310 245 204 28 208 151 653 352 146 -199 -216 -118 -556 -280 -144 218
4331 218 -354 -314 -267 -525 -605 -543 -890 -253 -59 -195 -197 -442 -575 -508 -676 -839 -315 -757 -390 -11 -230 -573
4353 -573 -321 -672 -649 -479 -137 -171 45 326 334 -28 118 -131 306 119 264 546 534 756 615 341 -78 236
4375 236 238 622 693 1045 727 729 358 272 373 739 235 521 405 618 504 582 -7 7 -44 -74 1 11 -158 18
4399 18 55 -147 -483 -773 -469 -984 -463 -277 -320 -175 -788 -786 -1026 -998 -549 -834 -368 -185 -842 -535 -342 -811
4421 -811 -730 -891 -796 -857 -108 -317 -116 -99 -156 -247 -267 -478 211 289 361 352 528 672 273 81 587 391 673 741
4445 741 883 854 804 624 660 169 375 619 383 664 652 804 741 385 149 8 36 393 302 456 249 -6
4467 -6 63 -360 -168 -390 -372 -339 -195 -271 -253 -371 -781 -475 -1026 -902 -567 -589 -387 -430 -369 -302 -1020 -638 -521 -471
4491d71M2J48o2L93k85m8K46m52K16K2L03J18L98l01j96K15j89l5j18K73M18q8
4513E47J68R1k87r4N3j87K09r9J81K81j64j81n3k85o2k26K4K45J59R0J04k49p2
4536A93l01j21r7O2N70k89J41k78N5k67j3k75l6L15n1M77j43j89k33l86O1K73
4558e32k82M51J80j56P3P3l71M16k63K03j49P73j9k24j77k41q7K7j95M13L92R4
4580C99jnj76o6kq9R0j21M28J69k14k49L60n8k00J5J00J03K02l11K02l03L45l80
4604B38l81L16j54M06K49j50j93k62j54j23O0Q1J46q2j65M16k29n83J01M3K4P7
4626c19j66K56j66K20j81J8m18l5L55l9J75K32j37K05n54J31K20k62J29L14J78
4647A56Nl66k29N27k88J39J5L09K17k28J15P8j43K76n62M53k23p5P16j53l32J75
$$ plain form
4491 -471 -429 -281 -343 50 -235 -283 -37 -489 -273 -251 52 170 568 267 71 286 97 62 -56 217 635 547
4513 547 715 806 519 425 478 291 500 401 582 863 699 518 465 180 118 -108 -84 161 320 410 514 265 193
4536 193 -108 -229 -326 -264 306 17 158 -120 -65 -332 -345 -620 -656 -341 -392 85 -58 -247 -480 -866 -805 -532
4558 -532 -814 -363 -183 -339 -266 -193 -564 -148 -411 -208 -357 416 397 173 -4 -245 -332 -305 -500 -87 305 399
4580 399 398 393 217 151 149 60 150 29 457 626 412 163 523 465 265 280 380 483 685 374 576 273 618 238
4604 238 -143 173 19 425 674 524 331 69 -85 -208 -148 -67 79 -3 -168 248 19 -564 -463 -420 -396 -319
4626 -319 -485 -229 -395 -175 -356 -338 -756 -791 -436 -475 -300 -68 -205 0 -554 -423 -203 -465 -336 -22 156
4647 156 161 -205 -434 93 -195 -56 -41 268 485 257 372 450 307 583 21 474 251 176 892 739 407 582
4669E82j14l53J91q8P9M27k31M0J49k80o03M29m54L64J21j94J74l51j94j16J13
4690c09N9j50k61M23r7J23l54K64l73M8j44J43q8L96K35j70j82Qn7q9K77p2J90
4713a80J18J22Lk43J16n5k35M55J3P0K39p0n1k85K78N1k07K5J24J22J06J31j90
4736D57O4l15J48m7q2J93J7L39l89O4k43j88k14L98j78R2q0r1L70n20k74o3L93
4759a49j43J4L83k42o1k16j2Qk67M26R1n89N82K7Q5j5l12k4K97k80L43PJ82l44
4783b09m1J53k31K44j52R5J14K16pJ43r9k32J07j60mL49J40K30m10K28k91J43
4805C26j73j68L18j52j5K26M1j42k04K59o9q3o8J01N6k34L43k44j6r2j22J03K6
4828A7L9J65l73J11j81J55k73J12P3L30l30L55k37k40L04k36l5j51M52Nl55J90
$$ plain form
4669 582 468 115 306 218 297 724 493 533 682 402 -201 228 -226 138 259 65 239 -112 -306 -422 -309
4690 -309 -250 -400 -661 -238 -335 -212 -566 -302 -675 -627 -771 -628 -716 -320 -85 -255 -437 -429 -486 -575 -298 -370 -180
4713 -180 -62 60 63 -180 -64 -119 -354 101 114 184 423 353 302 17 295 346 139 164 288 410 516 647 457
4736 457 521 206 354 307 225 418 435 774 385 449 206 18 -196 202 24 116 36 -55 315 -205 -479 -542 -149
4759 -149 -292 -278 105 -137 -198 -414 -426 -418 -685 -259 -168 -757 -175 -148 -63 -78 -390 -414 -117 -397 -54 -47 135 -209
4783 -209 -250 -97 -328 -84 -236 -141 -27 189 182 325 226 -6 101 -59 -63 286 426 656 246 474 183 326
4805 326 153 -15 303 151 136 362 403 261 57 316 247 164 96 197 253 19 362 118 102 10 -112 -9 17
4828 17 56 221 -152 -41 -222 -67 -340 -228 -155 175 -155 200 -37 -277 27 -209 -244 -395 57 62 -293 -103
4850a03m92M73o6k11j21J04J33L97j53J64j52n2l19J97j28M81q9r1JJ04k9QN4
4873A10j01J09j10L10j14M30l82l07q1L61j1q2o8K63K48%l48r7k06J62J79q6M67
4896F46j21k95j9k18J30j11j4R1l4L0K9N5n80j03K40k04K84n3L3L93k01m3k7j98
4920b90j57J37J25j23J61J67j68l99J12J96k00J27K19J81l70K17K90j00r1k56
4940b22qJ55J84n8K76k38J60L7j21r9Q2J44K03r4J76o4j71j03j5m91O09KK15m28
4964A31K53j62l06J33k41m2L95k78M4K93j03o9l33J5Q5j10l5J36MK22j89j35j67
4987d59K05Q0p6J4R8J53j10j56J41J31k18J68j83m1J15L67j44l46M1q1L42j46
5009a05m5K13K30J77n61L37Kl28L82l22O2L14j03j65Q8j74M0j45L82l5p7j68L5
$$ plain form
4850 -103 -595 -122 -188 -399 -520 -416 -283 114 -39 125 -27 -79 -398 -201 -329 152 63 -28 -27 77 48 56 110
4873 110 9 118 8 318 204 634 252 -55 -136 225 214 132 64 327 575 575 227 130 -76 86 265 179 646
4896 646 525 230 211 -7 123 12 -2 89 55 85 114 169 -411 -514 -274 -478 -194 -247 -214 179 -22 -65 -92 -290
4920 -290 -447 -310 -185 -308 -147 20 -148 -547 -435 -239 -439 -312 -93 88 -282 -65 225 125 34 -222
4940 -222 -230 -75 109 51 327 89 249 286 165 66 148 292 495 401 577 513 342 239 224 -267 342 344 559 131
4964 131 384 222 -84 49 -192 -234 161 -117 -73 220 117 48 -285 -270 -185 -295 -330 -194 -190 32 -157 -292 -459
4987 -459 -254 -174 -250 -236 -138 15 -95 -251 -110 21 -197 -29 -212 -253 -138 229 85 -261 -220 -301 41 -105
5009 -105 -150 63 293 470 -91 246 248 -80 302 -20 42 356 253 88 176 2 42 -103 279 244 167 -1 34
5032C4J59j44J41j09k80L01J24k52j14J92O2l84L0j8K90M4l76O30j72k92L2m42
5054e44L63l05N06K89l42l1Q8K26l93q1j96L45n7J0L03l08J49k07J16J5k20P4
5076b00L60R4k62o8J91j05j55p2K64r5K51n32L72j53L6k3n7J11K73j4O0o7J3j
5100B21j33J28o07M29J67N0l76O13m23R6j75K70j99j40L68m8j40J88j19j70K27
5121B27j07k24K31J66j31J1k4q3m30O13l07k57L38k97l5K18l9k58K49j40%j26
5143d05J82j97J10J84q2k02K30j19j04K79q9J41k3J67l4j38m3R0K31r7K79k07
5165A53Nj43J52j36L8N0J35j62K42J60m80O57k19j99K6o2j49N87n10L12j94J61
5187D24n22j33j7J89J48j41K63Ok76l3K92l66k88J65L36M4k45l7J92l11Rl26L17
$$ plain form
5032 34 193 49 190 81 -199 102 226 -26 -140 52 114 -270 -240 -258 32 76 -300 330 158 -134 -102 -544
5054 -544 -181 -486 20 309 -33 -64 24 250 -143 -224 -420 -75 -132 -122 181 -127 22 -185 -69 -54 -274 -200
5076 -200 160 254 -8 -76 115 10 -145 -217 47 -48 203 -329 43 -110 -74 -97 -154 -43 230 216 276 209 222 221
5100 221 88 216 -391 38 205 255 -121 492 69 165 -10 260 61 -79 289 241 101 289 170 0 227
5121 227 120 -104 127 293 162 173 149 66 -364 249 -58 -315 23 -274 -309 -91 -130 -388 -139 -279 -279 -405
5143 -405 -223 -420 -310 -126 -208 -410 -180 -299 -403 -124 -213 -72 -95 72 38 -100 -143 -53 178 81 360 153
5165 153 158 15 167 31 69 119 254 92 334 494 14 671 452 253 279 217 68 655 145 457 263 424
5187 424 -98 -231 -248 -59 89 -52 211 217 -59 -92 200 -166 -454 -289 47 91 -154 -191 1 -310 -301 -627 -310
5210c10K21L3Ql19K01J68l6r8q6j90K23J62j90K74M9j83j12L99m4m2J05j26M13
5233E20j99j86j17p4J04J50J0P3r7K58j32J5l94N4K2J76L11j94J6K9m48L34l96
5256a65L49k7J13k88K6M06k10j17k16q1L32j59K75l47K23k12k59l4j38M30j6j48
5278b63j19N9M97l98L82q5n73M26j39J13K12q9K10m2j41k11L98j47l62L51j45
5299f6L52j36J10k93P5K19l01M35k70J40J74l20j45J01j27O5J20o0J52j07K97
5320D15j43l41J19l06K02O0k04K00J30p3k02K17J49m75J25M4J33K55j96o6k4j8
5342Ap1J21k82K14L3k38L30k18q0K20k28o2J58j3J87j31L5J73l47p0j00M41p6
5365cj7m03L87k73p0N16k37K36K36m81r4L19K82m77L91l62m53L92R3J44J30l03
$$ plain form
5210 -310 -89 -56 -48 -367 -166 2 -34 -132 -218 -408 -185 -23 -213 61 110 -73 -185 214 170 128 233 107 520
5233 520 321 135 18 -56 48 198 208 281 184 442 310 325 -69 -15 7 183 494 300 316 345 -103 231 -165
5256 -165 184 157 270 -18 8 414 204 87 -129 -210 122 -37 238 -109 114 -98 -357 -391 -529 -99 -115 -263
5278 -263 -382 -323 174 -224 158 73 -500 -74 -213 -100 112 23 233 191 50 -161 237 90 -272 79 -66
5299 -66 286 150 260 -33 42 261 -40 395 125 265 439 119 -26 75 -52 13 133 73 225 118 415
5320 415 272 -69 50 -256 -54 6 -198 2 132 59 -143 74 223 -252 -127 -83 50 305 109 43 19 1
5342 1 -70 51 -231 -17 16 -222 108 -110 -190 30 -198 -260 -102 -115 72 -59 -24 149 -198 -268 -368 73 -3
5365 -3 -20 -423 -36 -309 -379 137 -100 136 372 -109 -203 116 398 -79 312 -50 -503 -111 -18 126 256 -47
5387d7J97O0k46J18j75Q6K51j56J7L2j99L25m69j9O49k65K60j38j03m6m03J70
5409a01J85l46L66L7J34m46J63k23k3J64rnk25K31o2K73l3l04K1jj48J18mL06
5433F8m17L99j22j30M6m9J14j03J69M8J99K9j5m63L25Ql8j42L37j74R8l0j93N6
5457B0o4J27L55k92Q0J08j02m0q0j02J26k1J83Nj64n6L31m27p0l12N89j44j68
5480a18K18k56J01r0m3l5J60j19M33q3j89p9j89J30L8j94J65l5K97k81j58J73
5502a54J04o1k85K46j22K51J24j16J11p8Q2j46j44J25N05l23l79N55k39m3J86
5523A99o6m03O26k13K33j40k1k02J23j69r5L75l54K46L0O6j11n4n9j76L63l66
5545a68K76m2p4R2pn0j57j03J31J32j98J9j31N8K9r6j58L12j7J15k33L85k0j47
$$ plain form
5387 -47 150 210 -36 82 -93 -7 244 88 105 137 -62 263 -206 -225 424 159 419 281 178 132 -271 -101
5409 -101 84 -262 104 141 275 -171 -8 -231 -254 -90 -99 -104 -329 -98 -160 113 80 -224 -203 -204 -352 -234 -238 68
5433 68 -349 50 -72 -202 -156 -205 -91 -194 -25 23 222 251 236 -227 98 106 68 -74 263 89 187 157 -36 20
5457 20 -44 83 438 146 226 334 232 192 112 10 136 115 298 303 139 83 414 -13 -83 -395 194 50 -118
5480 -118 100 -156 -55 -145 -188 -223 -63 -182 251 168 -21 -100 -289 -159 -121 -315 -150 -185 112 -169 -327 -154
5502 -154 -50 -111 -396 -150 -272 -21 103 -13 98 20 102 -44 -188 -63 442 119 -260 295 56 13 199
5523 199 133 -270 356 143 376 236 215 13 136 -33 -128 247 -107 139 169 235 124 70 11 -165 198 -168
5545 -168 108 66 -8 84 77 27 -130 -233 -102 30 -168 -149 -280 -222 -193 -289 -447 -135 -152 -37 -270 115 95 -52
5569e2j00Q9j67K42r2O4l14Q8Q6M42k26J94p8l13K93l83J24K07J16J43j8j29l02
5592h6K2q2N8M80k21pk53K61j66l22N07r1K9k76L13L49m28j78J64l64O05l26Q5
5615G3Lj9j95J20j46K11R1k0m8o6K35q6o0l36J36QL5P6j5R6k3m0j98J46o4o0j48
5642b94K33J92k56j69K20L1m30J40K40m0J0Ol1Q0J3m3j35J32J49r4L0Q0j44M4
5666c6l7j5J96j44J59o0J75n5p2K44l45J10O5j83P5K29j52J12p4j99J89J01j15
5689A68k79K25J94m9k59J64k76J69K04m71QJ82K8J01k80L75j64l77R1L68l29k28
5711d35L37m5J77m46J49K29m22M95J55l37j02J79K91o15K51L13k81J78k24K67
5731A14J9j14r1K40k09K08K69k33k47O5K68P1rl44P6K3K10k35M11k77J90j53k94
$$ plain form
5569 -52 -152 -63 -230 12 -80 -16 -330 -242 -156 286 60 254 176 -137 156 -227 -103 104 220 363 345 216 -86
5592 -86 -64 -146 -88 392 171 164 -89 172 6 -316 191 100 129 -147 166 515 87 -91 73 -291 314 -12 73
5615 73 76 57 -138 -18 -164 47 138 118 70 4 239 153 93 -243 -107 -99 -64 12 -3 93 70 30 -168 -22 -86 -146 -294
5642 -294 -61 131 -125 -294 -74 -43 -473 -333 -93 -133 -123 -117 -148 -68 -55 -98 -233 -101 48 -46 -16 64 -80 -36
5666 -36 -73 -88 108 -36 123 63 238 183 111 355 10 120 185 2 77 306 154 266 192 -7 182 283 168
5689 168 -111 114 308 259 0 164 -112 57 261 -210 -202 -20 8 109 -171 204 40 -337 -246 122 -207 -435
5711 -435 -98 -143 34 -412 -263 -34 -456 39 194 -143 -245 -66 225 -390 -139 174 -107 71 -153 114
5731 114 133 19 -72 168 -41 167 436 203 -44 21 289 360 351 7 83 106 316 81 492 215 405 252 -42
5754d2R9j57K23k0j2P4j88k08K17l98N21j91L38k38N8j36Rj49p3K1K7K27Q9k68
5778a77R0j63k2P6j94N82j83r1M03k90P5k10r8J79q3j90K89K41p5l03j88N84j03
5801A49j36O0K42n26N40k44J73k87L92k93k46K46j13J41j49R0JM24k67k64J18
5822E1l76L25J15j03N2K32l11j17K36k17r0K62k41K83q1J3j67r6J35k13J9L16
5844B7N6Pl1j48j11l26N15k99L99J21k57K6j26J35p4K31k16K27o4K9j98K22q2
5867F3p6J23j86N91l08k59Q9J69k30L33n28J46K20j96L86l07o9n8k56L94l79K79
5889e9O3p4K40J11j15j37n8l7K3L20J70m85L46J0k68J16P3j88l07K09K55J22m9
5912B81J02l37k77R7J88l16L51k15J7J97j79L20k70j27N9j18P3L94m41L01j86
$$ plain form
5754 -42 57 -100 123 103 91 165 -23 -231 -14 -412 109 -82 256 18 76 -60 -51 -200 -273 -252 -225 2 91 -177
5778 -177 -87 -250 -272 -196 -390 192 9 -82 321 31 106 -104 -202 -23 -106 -296 -7 234 159 -144 -332 252 149
5801 149 13 73 315 -211 329 85 258 -29 363 70 -176 70 -43 98 -51 39 40 464 197 -67 51
5822 51 -325 0 115 12 64 296 -15 -132 104 -113 -203 59 -182 101 20 33 -134 -230 -95 -308 -289 27
5844 27 83 90 59 -89 -200 -526 -11 -310 89 210 -47 -21 -147 -12 -86 145 -71 156 92 121 -77 145 63
5867 63 -13 110 -76 515 207 -52 37 206 -24 309 -219 -73 147 -49 337 30 -39 -97 -353 41 -338 -59
5889 -59 4 -70 170 281 166 29 -29 -66 -43 277 447 -38 308 318 50 166 239 51 -256 -47 208 330 281
5912 281 383 46 -231 -134 54 -262 89 -126 -109 88 -91 229 -41 -168 -109 -227 -154 240 -201 100 -86
5933h6R0J64m41J08j67K23R2J86j94k44K33n6J68k36k97M39k88L25J02K09j18
5954B12p3k86j48L65J27O0j02R5l21M94k91j91L20k35j78L21J05j60k53L86J07
5975C54m51Q6K33l35J30N8k73L6nP7j26M41J83m51n3j49K37q7j26J55R3j15J05
5998A7nk92M02m23J37K11m60L14P4P8j15k58M05l99J40J35mK2o2P6M70k91j16
6021E6r6K32J23l56o1M57j81K77m21q2L62l34J34j39J35J85o7k4l8Kk02L75m41
6044a04K62L5o53M73P2K17j17m04pj84O05q7j29J59k63N8j74J87k66N83n28R1
6066a74L99r1k02Rm4j07J54K13P6M3m12j72J07K1M07m33K70m15K98K36j19J00
6088A64j33r0JO2l0L7R8R4j08J56j60r7k6l3N21k94k9Q1j17j30q4Q8k81N43n9
$$ plain form
5933 -86 4 168 -273 -165 -332 -109 -17 169 -25 -269 -36 -92 76 -160 -457 -18 -306 19 121 330 212
5954 212 139 -147 -295 70 197 257 155 250 -71 423 132 -59 261 26 -152 169 274 114 -139 247 354
5975 354 -97 -11 222 -113 17 75 -198 -162 -167 -90 -216 225 408 -43 -96 -245 -8 -95 -221 -66 27 -88 17
5998 17 12 -280 122 -301 -164 47 -413 -99 -25 53 -62 -320 85 -314 -174 -39 -43 -21 -83 -7 463 172 56
6021 56 -40 192 315 -41 -102 355 174 451 30 -52 310 -24 110 -29 106 291 224 200 162 164 -38 337 -104
6044 -104 158 193 -460 13 85 302 185 -219 -226 -410 195 108 -21 138 -125 -67 -241 -54 -320 263 -265 -174
6066 -174 225 134 -68 -59 -103 -210 -56 157 233 276 -136 -308 -201 -180 227 -206 64 -351 -53 183 64 164
6088 164 31 -59 -58 4 -26 11 109 203 95 251 91 -6 -32 -65 456 162 133 214 97 -33 -117 -29 -310 233 174
6113A74K02m41N1K80k82K36o1J54J5K0l80L8J7R7n02J59kJ53K82j54L5kl09J32
6137h8J19j62L69j77j0j70K85Ln2j86k3K8m82L84K55p8J15l17J12k83O3M05j36
6160b6RJ27l2J54k64k5ok56Q4J83N9K00l0j93k18J42K04P9k25J32J21k26j09k52
6184c68M63j6j07N49O3n63J33pK4k0o2Rl34J11J73J9J36j88r5Q5k45J25j77J75
6208a17K71j83j96J76q8J64j93Q6j94J09pJ37l8k10K26j29K13m07M15l0j92k29
6230d16L92j57N1p9N3k85N76j44J3q5J18j99J41q4j8K91j47p5K57k89pRK20J17
6254B53r3kO0n6k00J43k4r7p0N9K85k81K66l63K07j83K57j19k9j6J61j13k07M16
6278B54q1k52k18J15k84L45J08M4j1k16L36j61l38L11k67J97R3j16O1p5n9J0j4
$$ plain form
6113 174 376 -65 -14 266 -16 220 159 313 328 348 -32 6 23 120 -382 -223 -225 -72 210 56 91 89 -220 -88
6137 -88 31 -131 238 61 51 -119 166 169 117 -69 -92 -64 -546 -162 93 15 130 -187 -75 -358 -295 110 -26
6160 -26 -17 110 78 232 -32 -57 -63 -319 -235 -52 7 207 177 -16 -234 -92 112 191 -34 98 219 -7 -116 -368
6184 -368 95 79 -28 521 584 21 154 147 171 151 89 98 -236 -125 48 67 203 15 -80 5 -240 -115 -292 -117
6208 -117 154 -29 -225 -49 -137 27 -166 -80 -274 -165 -172 -35 -73 -283 -57 -186 27 -380 35 5 -187 -416
6230 -416 -24 -181 -130 -209 -156 -441 135 -9 4 -81 37 -162 -21 -105 -123 168 21 -54 203 -86 -93 -84 136 253
6254 253 160 158 218 162 -38 105 81 -16 -86 -27 258 -23 243 -120 87 -96 161 42 13 -3 158 45 -162 254
6278 254 173 -79 -297 -182 -466 -121 -13 31 20 -196 140 -21 -359 -48 -315 -118 -25 -141 -80 -155 -214 -204 -218
6301b18L89k56K11j60n4l4OlK31j65j68J8K13m7J24R8q4j99J41j05K23L6r6j28
6325b7L9j26p9L33l05Q5J25k49L24L5j5K4j79k7R8K77m92P2K42l07K77j36L01
6348B90o78M27L04l50K39k44Q3kl34L29k71P8J40k47J79J19q8P2J75K26m91j07
6370a51N04p33L34j18J82k30j63L64j47J77K90l38j20J21k33L84n36L21Q9kj40
6391a45K58q2Oq2o0K18J43l87M01O1p1P2k08k24K3R2N5k33L42N9J5o1l3l6Lk17
6417i1J49K62m21M09j18k73m5J4L37Q9l40o9L6J26L8j17k33M27n04J43q3l0J55
6440a39L1K7j63L49q1l46J12J80k36J58j19J98p9r1L9l5r0J56P3K17k9k40j66
6463b74p2O40k81M0O5P3n9MJ98k58O7j90J41J36j06J26P0m89J81K70N6o8M2Rk21
$$ plain form
6301 -218 171 -85 126 -34 -88 -122 -116 -119 112 -53 -221 -203 10 -37 87 185 101 -98 43 -62 161 197 101 -27
6325 -27 12 -114 -193 140 -165 -80 45 -204 120 155 140 164 -15 -42 56 333 -159 -87 155 -152 125 -11 290
6348 290 -388 39 343 -7 232 -12 71 69 -265 64 -207 -129 11 -236 -57 62 -26 46 221 447 -44 -151
6370 -151 353 -380 -46 -164 18 -212 -375 -11 -158 19 309 -29 -149 -28 -261 123 -413 -92 -3 -5 -145
6391 -145 113 31 37 -45 -105 113 256 -131 270 331 260 332 124 -100 -77 15 70 -163 179 238 253 192 159 123 126 -91
6417 -91 58 320 -101 308 190 -83 -128 -114 223 312 -28 -97 -61 65 103 -14 -247 180 -324 -181 -264 -294 -139
6440 -139 -108 -81 -244 105 24 -322 -210 -30 -266 -108 -227 -29 -108 -199 -160 -195 -285 -129 -56 161 132 -108 -274
6463 -274 -346 294 13 53 118 191 132 136 334 76 143 -47 94 230 124 250 320 -169 12 282 338 270 312 321 100
6488A00R4q6q5p8j01L98j5k27j75L12k48K57r2j27j08K33J62L6j60m9k12Q3l00
6511c88oK94J11j70r4J24P7q0K46l09k9J3j31j55J71L53m53N88m15J74O7J53l5
6534A06L7M2k53J78nN8j06j36Q8J20j72R6j1L38k83q1M7R1J08k01J8k08M70k12
6558A29r7J38n75O16j64j22J58mn3j8j85R4J13J04j37J17J8m06N9j44K96j60R8
6581a25R4N9J09r8j46r1J06rl31N14m10J95J73l45M60k23Mo1j31M99o9k08m0r3
6605a67L44k72M1J29j09K26j92k79J13O1Q7QJ00j60K1J49k12P8jJ33MK73l94J81
6629A62J2K0P1j75j06P9L17k4k53q9Q0k4o2J89l77N13n06J39Mj75K74j50j15n2
6653b48k5K8J67Q5L7j92O0J63k54m0K12j56K74l35R3n1J06k5k97J60J42Rj67j21
$$ plain form
6488 100 194 108 23 -55 -156 242 227 0 -175 137 -111 146 54 -73 -181 52 214 250 90 41 -171 -88 -388
6511 -388 -394 -100 11 -159 -253 -129 -52 -132 114 -195 -224 -211 -342 -497 -326 27 -426 162 -253 -79 -12 141 106
6534 106 143 185 -68 110 105 163 57 -79 9 129 -43 53 42 380 97 16 63 154 262 61 79 -129 341 129
6558 129 32 170 -405 211 47 -75 83 79 26 8 -177 -83 30 134 -3 114 132 -274 -215 -359 -63 -223 -125
6581 -125 -31 28 137 39 -107 -198 -92 -101 -432 82 -328 -133 40 -305 155 -68 -64 -125 -256 243 174 -34 -74 -167
6605 -167 177 -95 -54 75 -34 192 0 -279 -166 -105 -18 -10 90 -70 -49 100 -112 -34 -35 98 102 375 -19 162
6629 162 174 194 265 90 -16 63 380 356 103 14 94 70 8 197 -180 333 -173 -34 -30 -205 69 -81 -196 -248
6653 -248 -273 -245 -78 7 44 -148 -88 75 -179 -219 -7 -163 111 -224 -131 -182 -76 -101 -398 -238 -96 -87 -254 -375
6677c75L41J67p7l83L88j11o0K63l20M12k38J08R8j26j5p4J72k11K33j22K69Q8
6699D27j80r3j06K38m74L78j61j41o0K2J91M77k76k91o1J54l0j98K03l8p6j09
6721b04j48J65J62j48K76m32Q1J04k69K77j18J95k03p8K62J01k82J1J23P7j05
6742a53j05J7M48J0j84k93J76j68L36l71L88P5j10k0k34L42n9q8p1J89k27L48
6764B46k06Q4k45K53P8k02L5j78L26j3m2n4Qj19j94K6K39k9K0m3l32N01l11Nk29
6789c76L94k9J30o7O9j94l71K35p7K43lj99J38l49N09J19k94J66j24j56L6N0k01
6812c51M05k3M15k98n60K60o3N7K00J46m09J74J6N3JJ66k56o7M1J63q1M56l38
6835A07Rk97L09l41L12Q1k17Nj04o3n7M18m40K49J13J33n7k9m82L48L26k19p7
$$ plain form
6677 -375 -34 133 56 -327 61 -50 -110 153 -167 245 7 115 213 87 72 -2 170 -41 192 70 339 427
6699 427 247 154 48 286 -188 190 29 -112 -172 -150 41 518 242 -49 -110 44 14 -184 19 -19 -95 -204
6721 -204 -352 -187 -25 -173 103 -329 -248 -144 -413 -136 -254 -59 -262 -340 -78 23 -259 -248 -125 -48 -153
6742 -153 -258 -241 207 217 33 -260 -84 -252 84 -287 101 176 66 46 -188 154 95 7 -64 125 -102 246
6764 246 40 124 -121 132 210 8 43 -135 191 178 136 82 90 -29 -223 -197 42 13 33 -10 -342 159 -152 -147 -376
6789 -376 18 -11 119 52 121 -73 -444 -209 -286 -43 -46 -245 -107 -456 53 172 -122 44 -80 -236 -200 -150 -351
6812 -351 54 31 446 148 -412 -152 -215 -158 42 188 -221 -47 -31 22 23 189 -67 -134 -93 70 -11 445 107
6835 107 116 -181 128 -213 99 180 -37 -32 -136 -199 -256 162 -278 -29 84 217 160 131 -351 -3 323 104 27
6858B7j53K57j66L22l90J18k7k65N23Jk80M2m6J10n1J51k50K6r0n1K98k53J34
6881a3m9K7r2J26r5K99l21m4J74J13j55k0J60k26K44j29j98J83jP2R6k16J87k70
6905a48K90j17J20j08j94j6n8Q1M3K46j11J17j63l8R1j40J98l07N12o5k16Q2P2
6928A71K86l06j55l61L23L47j72q6q8O1K8j93J52j43L7J22j59J20l7m7J54k48
6950a94j59L82j52k26K61j67J88l01l8L16K45k44p6M11k59r2R6o2K65l1K4m28
6972b41L60J32l83J42L08m45J63l0o1l9L13j59n0O0L28o13L8K25j19j6K32J26
6994B71m65O5Q7J37l71J15j17J7Q5L91l20J85l68J51K22l76K88J2k58M15k79o5
7016a78N3P7r9k40K65k02M19o2k10M48j39k27K25q6P0Q5j37N9k4l7j49K87l51
$$ plain form
6858 27 -126 131 -35 287 -103 15 -12 -277 246 247 -33 9 -37 73 22 173 -77 -51 -141 -192 106 -147 -13
6881 -13 -62 -35 -127 -1 -96 203 -118 -162 12 125 -30 -50 110 -116 128 -1 -199 -16 -17 55 151 -65 122 -148
6905 -148 142 25 145 37 -157 -173 -231 -150 -107 139 28 145 -18 -56 35 -105 93 -214 298 233 17 99 171
6928 171 457 151 -4 -365 -42 305 133 47 -41 20 48 -145 7 -136 -99 23 -136 -16 -53 -100 54 -194
6950 -194 -353 29 -123 -349 -88 -255 -67 -368 -406 -90 155 -89 -165 246 -13 -105 -9 -71 194 163 187 -241
6972 -241 119 251 -132 10 318 -127 36 6 -55 -94 219 60 10 70 398 -215 -177 48 -71 -87 145 271
6994 271 -194 -129 -42 95 -276 -161 -278 -261 -176 215 -105 80 -288 -137 85 -291 -3 9 -249 166 -113 -178
7016 -178 -125 -48 -147 -387 -122 -324 95 33 -177 271 132 -95 130 44 114 199 62 121 97 60 -89 198 -153
7039a53j03J09M65n48L17o4J6L54l74p1j55J39l0n9m2K59J52l87J17K67j69r7
7061e7k30M11J69N9m51M01j51m04M07n18L24K81k07M8k43oJ89j34J14j77k13N75
7083A87Q9o44M99m32J06K71l16K70K51l48OO0Q4n1L48q15O35l28Q7j31L49n3J35
7106B59j29k92L73m7m54K36pM2J5l45J73Q3K73j74k0K3j61K07m62M38R9j43J90
7129A77j1j20J85l14M9r6J31j13j49K78QJ63R8k01j22N8K43j26n23L68L6j16J50
7152E3k61J34L42l86j9L95j6l78n6N06k73k07K61J08J90m9l63J9J07k33l3j2R5
7175g6k27M50j32J2nJ87j24l2j80P2J30l25K79L6l12J31j42K09j56jN0j31K09
7198g8J36J06k98Q7J31k4rj96K2K95J9m15L38k12O5K75J13n55K74j02K01m66K45
$$ plain form
7039 -153 -256 -147 318 -230 87 23 39 393 19 -52 -207 -68 -98 -157 -199 60 212 -175 -58 209 40 -57
7061 -57 -287 124 293 352 -99 302 151 -253 154 -364 -40 241 34 82 -161 -167 22 -112 2 -175 -388 187
7083 187 276 -368 131 -301 -195 76 -240 30 281 -67 -61 -1 83 32 380 -435 200 -128 -41 -172 177 124 259
7106 259 130 -162 211 164 -290 -54 -61 -19 -4 -349 -176 -93 180 6 -14 9 -152 55 -407 31 130 -13 177
7129 177 166 46 231 -83 -34 -130 1 -112 -261 17 25 188 286 85 -37 21 264 138 -385 -17 19 -97 53
7152 53 -208 -74 268 -118 -137 258 242 -136 -192 314 41 -166 95 203 393 344 -19 0 107 -126 -159 -171 -76
7175 -76 -303 147 15 27 22 209 85 53 -127 -55 75 -250 29 65 -247 -116 -258 -49 -205 -206 -156 -287 -78
7198 -78 58 164 -134 -47 84 60 51 -145 -123 172 191 -224 114 -98 -33 242 355 -200 74 -28 173 -293 -48
7221d8j25L54o9j09K53o33L38k14M72k91j56K58l33j9L53j48J33R3J80l78j49
7242b38K12Jq7J2j42J79pK82k39n68M72J11K12k76J74Pk83L62j74r3J50J71k10
7265B8j46K77l15q6L39r4K94l42P8k74K50K3j02K46n05K64j27J66j23O5O5j5J41
7288A07j34J25k13Q1j73m2J57M6P4Mq1k14K27L0o3K45o9k20p9j01J69K73J6L7
7312B02l7J68k93k07L7M8J01p7K43J50k69M0J66j07O7m03L71k30N5K41k48J02
7334A20Ll4l40L86j83Q8J54j84k44j29L20J57l36J30j26jM96n24K66j39n1J75
7356Dk28J55n9J30k13M9N4M9K02J1m42M69k22K84l11R6j73J59J69k90o5L77K6
7379B31l94J95m71M48p8K25r9o5l8J98j97J11j4j87M90j2q5l97J67k02R5J78J38
$$ plain form
7221 -48 -173 181 112 3 256 -377 -39 -253 219 -72 -228 30 -303 -322 31 -117 16 109 289 -89 -238
7242 -238 -26 -25 -112 -100 -242 -63 -70 212 -27 -595 -123 -12 200 -76 98 105 -178 184 10 -83 67 238 28
7265 28 -118 159 -156 -242 97 3 297 -45 33 -241 9 32 -70 176 -329 -65 -192 -26 -149 -84 -19 -34 107
7288 107 -27 98 -115 -34 -207 -249 -92 -46 28 32 -49 -263 -36 -6 -69 176 107 -113 -192 -293 -124 149 165 202
7312 202 165 333 40 -167 -130 -82 19 -58 185 335 66 106 272 165 232 -171 200 -30 25 266 18 120
7334 120 123 89 -251 135 -48 40 194 10 -234 -363 -43 114 -222 -92 -218 -219 277 -247 19 -120 -171 4
7356 4 -224 -69 -128 2 -211 -162 -108 -59 143 154 -288 181 -41 243 -68 28 -145 14 183 -107 -172 205 231
7379 231 -163 32 -439 9 -69 156 57 -8 -46 152 -45 66 52 -135 355 343 258 -139 28 -174 -79 99 237
7402B37k87J19r4j4J76n3p1k68L67k34J74J00r8l29M09l8K80l98L1n6J99l64J39
7425g3L35k1q6l81L31q3j23J14k08J91O4J05k81J44J28j77J53M0j37K4J15j8l63
7448b07J64m4l9J48Q5q4l02j13N43M2k05j77K99k29Q1M1j4k2j61K30j56J67l40
7471b93J99N0K11jk3o2N8j42j67M07n03N09j70j08l2R5k53K04P1J3J59k28j51
7494a57K26p0J71r5j51P3J66j76P2L2k1q4L75l10k22N28k73K19m59J43k42J21
7516a34o2M08o27M30j51J29n8K65m80L15L7R3p1j36q1J65M1k17K22l73J48J69
7538C2k53K67l4K04j78P7q5L35n51K18q5K87K3m09M07k47M4p8J6p2K18M3k72L58
7562B65r7P5k43K0j1j00Ok35N55l05j18L07J0j34o1L19m51J72j3j85J87J91q4
$$ plain form
7402 237 -50 69 -25 -39 137 84 13 -255 112 -122 52 152 54 -275 134 96 376 -22 9 -47 152 -212 -73
7425 -73 262 241 155 -226 105 22 -101 13 -195 -4 60 165 -116 28 156 -21 132 172 35 59 174 156 -207
7448 -207 -43 -87 -126 22 107 23 -279 -392 151 193 -12 -189 110 -119 -38 3 -11 -33 -194 36 -120 47 -293
7471 -293 -94 -44 167 166 143 81 139 -3 -170 237 -266 243 73 -35 -67 28 -225 -21 50 63 222 -6 -157
7494 -157 69 -1 170 75 -76 -3 163 -13 59 91 70 -14 361 51 -171 357 84 303 -156 -13 -255 -134
7516 -134 -196 212 -415 15 -136 -7 -65 200 -280 35 72 165 94 -42 -123 42 83 -134 88 -285 -137 32
7538 32 -221 46 12 216 38 115 30 365 -186 32 -53 234 257 -152 255 8 52 -26 -10 -82 136 179 -93 265
7562 265 168 243 0 20 9 -91 -85 -320 235 -70 -188 119 129 -5 -66 253 -198 -26 -39 -224 -37 154 70
7585G0j46j33M35j82J01j48l2l44L78P2l73J60L25j41j44J93j97J37k89k3J03
7606a78K79r1rK26k7nk23m2J04k08p6L85L24n90M34k99n52N01J23k61L37J79l33
7629bm2O9l60M80L4MJ12j64q1J39j51m27N62k30J84j99L7K79q8j21Qr4k09L3J40
7654h7J26j6q1n6O2M5l68L40O7J3l8j20L43K2l02k88N88m21n2R0K89K45m90K3
7678f6p7J68j48L75l02N1J01j41J24k22J85k2J01l44L4p2J24J74j01M6j04J68
7700E2J88k83j77N46j63k73M37o16N09k7m09M20j35K50k61J2k24J74O0k14J30
7721dl05R1K2J64k16K85J19l82L50o6m93O47k56K82n47K54j44k94L72M8nMj3k15
7745c02K17J03n9k7q4K53j21Q9k21L04m2L37n71J94k3J21J24j51k34J38J52m28
$$ plain form
7585 70 -76 -209 226 44 145 -3 -35 -379 -1 71 -302 -142 183 42 -102 91 -106 31 -258 -281 -178
7606 -178 101 10 1 227 200 195 -28 -70 34 -174 -250 135 459 -131 303 4 -548 -47 76 -185 152 331 -2
7629 -2 -44 25 -335 145 179 183 295 131 50 189 38 -389 173 -57 127 -72 -35 244 156 35 43 -51 -260 -227 -87
7654 -87 39 23 -58 -114 -52 -7 -375 -35 32 45 7 -113 230 252 -50 -338 250 -171 -223 -133 156 401 -89 -66
7678 -66 -143 25 -123 252 -50 1 102 -39 85 -137 48 26 127 -217 -183 -255 -131 43 -58 -12 -116 52
7700 52 240 -43 -220 326 163 -110 327 -289 220 193 -216 204 69 319 58 70 -154 20 80 -134 -4
7721 -4 -309 -218 -196 -32 -248 37 156 -226 124 58 -435 212 -44 238 -309 -55 -199 -493 -121 -73 -78 -74 -87 -302
7745 -302 -85 18 -41 -68 -152 101 -20 69 -152 152 110 447 -124 70 47 168 292 141 -93 45 197 -231
7767b31J40K94M6j06o2J53k84j12K41J00j82j07l8M82k41pJ29j60O8l29K26M77
7789D97l74j23K55j84m55K22J27j14q8J87J00o8p5J89k07m1K61k25J59j70j00
7810b27l9R9q5K07l9J60p4l6J9r8j11J02K44l79J02M88k59j04N2J7J3k11K51n9
7834C3p4k74K10O7K61K3l76O3K68m1j63J74m31M1L19J08n05N19l92L24j45j58
7856a49M64n93L65K2K4j08o2o3L34k07q3N73n33r5J02J18N5k54J22OJ72k70M4
7879a6p1j54M0J80K66p9j98j34R4k79M58k08K45L2o0P0l07M84n10k2j25O4J52
7902g8M7J99j09K21m78J85Q9k55K76K23l62K96k51P0Q1K45o22N6n4M67k39j00
7924i3J62k20N5K8J2j28l7K23P2n6J46k18Om1K5N5k41K87J40N1j82j25J90j94
$$ plain form
7767 -231 -91 203 249 143 81 234 -50 -162 79 179 -3 -110 -148 334 93 86 215 55 123 -206 20 497
7789 497 123 0 255 71 -384 -162 -35 -149 -237 -50 50 -18 -93 96 -111 -152 109 -116 43 -127 -227
7810 -227 -266 -167 -252 -45 -84 76 2 -34 -15 -113 -224 -122 122 -257 -155 333 74 -30 22 39 52 -159 92 33
7834 33 -41 -315 -105 -38 223 246 -130 -67 201 160 -3 171 -260 -219 100 208 -297 222 -170 154 9 -149
7856 -149 315 -278 87 109 133 25 -37 -100 234 27 -56 517 -16 -111 -9 109 164 -90 32 38 210 -60 -16
7879 -16 -87 -241 -201 -21 245 166 -32 -166 -72 -351 107 -101 144 176 116 186 -121 363 -147 -169 -294 -230 -78
7902 -78 -31 168 59 280 -198 -13 76 -179 97 320 -42 254 3 73 154 399 -223 -167 -221 246 7 -93
7924 -93 69 -151 -96 -68 -56 -184 -221 2 74 18 164 -54 -48 -89 -64 -9 -250 37 177 228 46 -79 111 -83
7948h3N4K34l39P8J80j84j73L38j12J68j71j21J74P0j61J34m15m0L72J28R0j90
7970C1K4k24K40m62J90J32NN8N3K56m43J03L44J54k71J52l45m1R5j18J30K37k29
7993G1n21N93l74K21Lk81L25j82L61p6k2J17k49P2J94k88p0L4QL88j34m81L01
8016A0j07Q6k4j18J82j83j0J17k22L03k99j72J62L63l00J67o9R6j42L67j46k5
8038C6j84K11j6P7k60K58k58P1N7q4M43j74r2p0j0k8L87m64J57m49N05j72J68
8061A09J56n23M31k64PK0Q4R8p2J6J96m28J9M22N1j64k88K09Qj6J00k02J10l92
8085c13M09J8R6m42N12l00j46K48J15k85J29j37K15o5l22R5J31k90K77Nk97K28
8107a19l3L71k32J2l04L29j73L55k12J66j88J27J33k73K98n4j93K7L32k38O5l86
$$ plain form
7948 -83 -29 205 -134 -56 124 -60 -233 105 -7 161 -10 -131 43 113 -48 86 -329 -369 3 131 221 31
7970 31 55 -169 71 -391 -201 -69 -64 -6 47 303 -140 -37 307 461 190 342 -3 -44 51 -67 63 300 71
7993 71 -450 143 -231 -10 -7 -288 37 -145 216 140 118 235 -14 58 252 -36 -106 -72 -64 324 190 -291 10
8016 10 -97 -11 -35 -153 29 -154 -164 -47 -269 34 -265 -437 -275 88 -212 -45 -114 -18 -160 207 61 36
8038 36 -148 63 47 124 -136 122 -136 -65 -8 -92 351 177 85 15 5 -23 364 -100 57 -392 113 -59 109
8061 109 265 -258 173 -91 -84 -64 20 118 46 62 258 -170 -151 271 322 158 -130 79 87 71 171 -31 79 -313
8085 -313 96 114 210 -232 280 -20 -166 82 197 -88 41 -96 119 54 -268 -173 -42 -332 -55 -50 -347 -119
8107 -119 -152 219 -13 -1 -305 24 -149 206 -6 160 -28 99 232 -41 257 203 10 37 369 131 196 -190
8129a90J22j36L08mj49J22p5j95N43n11J36K05L9k66J66l52J61K48l7j03l43L04
8151gj63J36L4L9j6J1k66K34j84J42n8lo5J67j19M4K55l70j7P4K84njMo5R3j85
8178gJ68Q2m17K00j02M8k20K74Mp3qp1L72
$$ plain form
8129 -190 -68 -204 104 100 -49 73 -2 -197 346 -165 -29 176 215 -51 115 -237 -76 172 135 32 -311 -7
8151 -7 -170 -34 0 39 23 34 -232 2 -182 -40 -98 -101 -166 1 -118 -74 181 -189 -206 -132 152 147 146 150 85 178 -7
8178 -7 161 243 -174 26 -76 -28 -248 26 30 -43 -51 -122 250
8191B50
$$ Imaginary data points
##PAGE= N=2
##DATA TABLE= (X++(I..I)), XYDATA
0@%%%%%%qJ6j6J6j6K4l2L3m1N2o4P6q8J04j23J45j69J94k24K57k93L33l76M26
30B26m81N42o08O79p58Q46r42J046j160J287j425J576j744J930k138K372k635
47a387K936l279L676m143M703n390O252p372Q895j1097J4585k0985L6560j43473
61a19519k35083J38086N3808k9892N7734J55124l2343j50016o8045m316p4932
72c09394j2038J14080R6776k6K6089K0226q4207j00157K6267N1164P76O3154J34854
85B7564K4658p7093q176K5534p3414m9192J13058J19976r675J0219R6705j185
97A98979j27304m0808O8201N515l0515P7562J03604j1192m5372J0627k1268p9511
109A08518j6965M6732K921o506N6396K5564p1034m9142J5834m0550q4129J8158
$$ plain form
0 0 0 0 0 0 0 0 -8 8 -8 8 -8 16 -16 17 -24 28 -36 40 -48 56 -67 78 -91 103 -121 136 -157 176 -200 226
30 226 -255 287 -321 358 -400 446 -496 550 -610 677 -748 828 -916 1014 -1124 1248 -1387
47 -1387 1549 -1730 1946 -2197 2506 -2884 3368 -4004 4891 -6206 8379 -12606 23954 -119519
61 -119519 -354602 -216516 -162708 -192600 -134866 20258 -12085 -162101 -230146 -234462 -309394
72 -309394 -321432 -207352 -110576 -110602 -84513 -64287 -148494 -248651 -222384 -171220 -170444 -107290 27564
85 27564 52222 -24871 -33047 -7513 -80927 -130119 -17061 102915 93240 103459 200164 198979
97 198979 71675 30867 99068 104583 74068 151630 255234 244042 198670 209297 188029 108518
109 108518 91553 138285 141206 134700 191096 216660 145626 96484 112318 71768 -12361 5797
121E797P4227j9848n1311L7124J8815r9590p9957L0243P902n8897J1682Q2261
133d1552J884o4420r334K467o9224n2268L8790L7571m952L6961N9248k1618n9743
146a46190j955l78m8405M276R0909N1660j2200L0311M7658m6012p5631K0931N1909
159c3117p905J9659R7511N0487m3888k3325J9042l0939m6326M0707P6689K0282
171A38877J2080M4881n923p4499l7808J3088j2567p753O4927O2896j9712l2382
183A46105K590m1687q7840j7582N1247J1423j1095M3760L1975o3713p7311j1763
195b3891j5098m9501P199O7106K1126k8787k136o853o8127n8088J5126K0788p332
208a28468L1146N7581o574n3484j4732l151m4601j7160N8205N0570l39J7079L6684
$$ plain form
121 5797 80024 60176 8865 45989 64804 -34786 -114743 -84500 -76598 -135495 -123813 -41552
133 -41552 -39668 -104088 -113422 -110955 -180179 -232447 -193657 -156086 -161038 -124077 -64829 -86447 -146190
146 -146190 -148145 -148523 -196928 -192652 -101743 -50083 -62283 -31972 15686 -30326 -105957 -85026 -33117
159 -33117 -41022 -21363 76148 126635 82747 59422 78464 47525 1199 41906 118595 138877
171 138877 150957 195838 189915 115416 77608 90696 78129 70376 135303 198199 178487 146105
183 146105 148695 107008 19168 1586 52833 64256 53161 96921 128896 65183 -12128 -23891
195 -23891 -38989 -88490 -81291 -14185 6941 -21846 -23982 -30835 -98962 -157050 -141924 -121136 -128468
208 -128468 -97322 -39741 -46315 -99799 -114531 -117682 -162283 -179443 -121238 -70668 -71007 -53928 -17244
221a7244k3707o0058l889K8042m272J1406O7983M8339j5100j0764J3756k3127
233A1365m0630J7551M8387J6317J5885M7122J5672m1039k5670Q067j4729k0185
245C8113L6004N2703L295j0730J5463j3120n9039k8092J9922L681r343L1999L7187
258A18043k1949m2281j1346j9823m7455j3292L4550J7633p074J3848P758m2483
270a3871m9562q377n725k1828J3519M7435J3231k3529m424m139m2520l6452J8166
283a18076K6906L151K1165M0256p46l7896j4116K223j8863o266M3648M4457O904
296g253O652J8406j5232l9571n796K2145Q316J5692M7076L1320j3664j5463O45
309E3273j9910k8033J4630M0289J6825P773K5511L253l8810l0774j20n530j0100
$$ plain form
221 -17244 -40951 -101009 -104898 -76856 -81128 -69722 -1739 46600 31500 20736 34492 11365
233 11365 -29265 -11714 36673 52990 68875 115997 131669 90630 64960 73027 58298 38113
245 38113 74117 126820 130115 119385 134848 121728 62689 34597 54519 58200 48857 80856 118043
258 118043 96094 53813 42467 22644 -24811 -38103 -3553 14080 7006 20854 28612 -13871
270 -13871 -63433 -71810 -77535 -99363 -85844 -38409 -25178 -48707 -53131 -57270 -99790 -136242 -118076
283 -118076 -91170 -88019 -66854 -26598 -27344 -65240 -79356 -77133 -95996 -102262 -58614 -14157 -7253
296 -7253 -601 17805 2573 -36998 -42794 -20649 -12333 3359 50435 81755 68091 52628 53273
309 53273 33363 5330 19960 60249 77074 84847 110358 113611 74801 44027 43907 38377 28277
322B8277K5724L9396K902j8306n400j7531m3302k3743J4721J2559J534J9507J8826
335E5164k1146l7576j6423j5485k6694q35L3081J9765n523K225K36l2023l8001
348h3235m824R315k25J5162L5325J2508j9469j2804n447k2931j7665J8664L1475
361d4151J3571J3194K1048k223k7806j5704L404j527N784L2878L2938N782k223
374C4965J880j4219k7496l761J9609J4557J3517K6079J6758j5048k1266q665j2164
387B4746j4675J0349K8545J5679J830N389o383k9168k6376m568J108J975J7157
400B5608K2774R11j5928j3602j6935k6957j3800J2819J5879O215J0725Q292j4474
413A527k8183j6666p838p662N982K3802J8649M46k623o585k0264k2902k322J2283
$$ plain form
322 28277 54001 93397 96299 77993 72593 55062 11760 -11983 2738 15297 16831 36338 55164
335 55164 34018 -3558 -19981 -35466 -62160 -62995 -29914 -10149 -15672 -13447 -13211 -45234 -83235
348 -83235 -88059 -78744 -78969 -63807 -28482 -15974 -35443 -48247 -53694 -76625 -94290 -75626 -44151
361 -44151 -30580 -17386 3662 1439 -26367 -42071 -38667 -40194 -34410 -1532 31406 37188 34965
374 34965 36845 22626 -4870 -8631 10978 25535 39052 65131 81889 66841 45575 36910 24746
387 24746 10071 20420 48965 64644 66474 71863 65480 36312 9936 5368 6476 8451 25608
400 25608 48382 49293 33365 19763 2828 -24129 -37929 -25110 -9231 -3016 7709 16001 1527
413 1527 -26656 -43322 -51160 -58822 -52840 -29038 -10389 -9943 -12566 -19151 -39415 -62317 -64639 -52356
427e2356J0546J5255K1584R045j1628j4786r761j1288m481J4852K4241J5121R772
440A6116P272o980k0264j3835j33M835J0484K2142K0921M137p334q419j4621j6094
454a773k162J2637J5359J3066J2997M470j2896j8849j3448q638k415J0577J8728
467B7653J2119K332l402j2239k0889j7161l105N524Q814J3627J2506J88j2238
480A3729j5647j5689j2952k605J0506J4176J0603O577q51j2819j8379j3090l948
493d0389K519J0392J5920J2865K831o859j2043j4441j0081J65Q710J3796J5220
506a395J0378P37r377j2726j1209n437L408J2650J5733J3389O251l010j0479j3657
520d744q652j806P320J3774J5040J0430J656o503j2967j3977o927K616R307J3430
$$ plain form
427 -52356 -41810 -26555 -4971 4074 -7554 -22340 -32101 -43389 -47870 -33018 -8777 6344 16116
440 16116 23388 16408 -3856 -17691 -17824 -12989 -2505 19637 40558 44695 37361 28942 14321 -1773
454 -1773 -3935 8702 24061 37127 50124 54594 41698 22849 9401 763 -1652 8925 27653
467 27653 39772 42104 38702 26463 5574 -11587 -14692 -9168 -354 13273 25779 25967 13729
480 13729 -1918 -17607 -30559 -33164 -22658 -8482 2121 8698 7847 -4972 -23351 -36441 -40389
493 -40389 -37870 -27478 -11558 1307 4138 -2721 -14764 -29205 -39286 -39121 -30411 -16615 -1395
506 -1395 8983 9720 343 -12383 -23592 -29029 -25621 -12971 2762 16151 22402 19392 8913 -4744
520 -4744 -13396 -15202 -7882 5892 20932 31362 33018 26515 13548 -429 -7356 -4740 4567 17997
534A7997J2977O584l528j1520j3666j1615n290M789J1244J2362Q874K304p476
547B4036j4562j4070q006j851N449J1768J1960N807l301r805j4186j3211n860
560b5832L365P729J1456J1307L376p322j2039j1183r983l905O660J3081J0869
573b421O181K280p147j3721j1393l192J249O775J4575J3965L141m382o536r725
587a0351j1697k785Q913J1273J0257J0727N266p540j2993p498m932j894P228J6385
601A0359J1741K765l85m870j3391j2138r36N241O458J0521J3121K484q687r996
615A2287p678r932m273Q215J2318O967M958K393q486j5320q935k623j525M404
629g230J4099J0361j945n703n268j1024j3217k137P842O808P312R414J439j0336
$$ plain form
534 17997 30974 37558 34030 22510 8844 -2771 -8061 -3272 7972 20334 29208 31512 24036
547 24036 9474 -4596 -12602 -14453 -9004 2764 14724 20531 17230 7425 -6761 -19972 -25832
560 -25832 -22467 -14738 -3282 8025 11401 4079 -7960 -19143 -29126 -33031 -26371 -13290 -2421
573 -2421 3760 6040 -1107 -14828 -26221 -29413 -28164 -21389 -6814 7151 10292 5910 -626 -10351
587 -10351 -22048 -24833 -15920 -4647 5610 16337 21603 14063 1070 -6428 -11360 -13254 -6026 10359
601 10359 22100 24865 24480 19610 6219 -5919 -6855 -1614 4844 15365 28486 30970 22283 12287
615 12287 4609 -5323 -9596 -1381 10937 17904 22862 25255 16769 1449 -7486 -10109 -11634 -7230
629 -7230 6869 17230 15285 9582 4314 -6710 -19927 -22064 -14222 -7414 -102 9312 10751 415
643D15j1113o093p071l763Q561J4446O439M42J997n581j5129r497J655L895M424
658a5973J2464J2883j056q404m584o765j1034j005J2868J1006M624P217M778r303
672G716j2989m297K6j693P056J6280R410k271j420l082j2068j0801L340Q290M466
687G963Q383J1737M20j2106p501l240p962m562J1333J3731K375K3L187o813j6528
702D40p774K565P19K351J1548R591m500q734l989r492j2385j38J0604N359K141
717a694P718J900j2929j2918k678l304m375Q179J5261L724l578J45l123j4898
731b2570r636O306O874K787Q716J2842j050j0907m623j925p721o13J3400J2163
745D043K904M102M455p062j2930j954L970P16N746J5386Q663n111k931j74r903
$$ plain form
643 415 -10698 -16791 -23862 -27625 -19064 -4618 1821 2263 4260 -1321 -16450 -25947 -24292 -20397 -15973
658 -15973 -3509 9374 8318 -86 -4670 -11435 -22469 -23474 -10606 400 5024 12241 17019 7716
672 7716 -5273 -9570 -9544 -11237 -4181 12099 21509 19238 17818 14736 2668 -8133 -4793 3497 7963
687 7963 16346 28083 28503 16397 8896 5656 -2306 -6868 4465 18196 20571 20594 23781 16968 440
702 440 -7334 -4769 -4050 -1699 9849 19440 14940 6206 2217 -7275 -19660 -19798 -9194 -3835 -1694
717 -1694 6024 7924 -5005 -17923 -20601 -23905 -28280 -20101 -4840 -1116 -4694 -4549 -7672 -22570
731 -22570 -32206 -25900 -19026 -16239 -7523 5319 4269 -6638 -11261 -13186 -20907 -21520 -8120 4043
745 4043 6947 11049 15504 8442 -4488 -6442 -2472 -1756 3990 19376 28039 22928 19997 19823 9920
760I920j0998N219J1566L665K621R736J896j3621j0066o95l755m483P937J2597
774B1539J168m048k25n690j5499q419M150K318J64Q320P787o059j1008m268o720
789a6490j0770L21J0861N267k26M252K007j1781j2539p97J885k549N385J4955
803a0219N412n439k219p66q879p790O230J0125M453O244J0360K40r389m623N37
818e723l026J166J2182J1481K480J559L663n962j1515j195O195J807L433J1498
832B8043P464n440o816k066o023q371K242J0065L470N17M359l58j2565j0804j510
847B207k190k658M797R876L32n289l541o573j1974o488L976K579J140O345N967
862a494o686j0351l900l270p430Q97J1438O944k11K027J573r024j0012O27M660
$$ plain form
760 9920 -1078 4141 15707 19372 21993 31729 33625 20004 9938 9243 5488 1005 8942 21539
774 21539 22707 18659 18434 12744 -2755 -11174 -7024 -4706 -4542 3778 11565 5506 -5502 -9770 -16490
789 -16490 -27260 -26939 -16078 -10811 -11037 -6785 -4778 -16559 -29098 -29895 -28010 -30559 -25174 -10219
803 -10219 -4807 -10246 -12465 -13231 -22110 -29900 -23670 -13545 -9092 -2848 7512 7752 -1637 -6260 -5723
818 -5723 -8749 -7583 4599 16080 18560 20119 23782 17820 6305 5110 11305 13112 16545 28043
832 28043 35507 30067 23251 21185 15162 6791 9033 19098 22568 23085 27444 27086 14521 3717 2207
847 2207 17 -2641 2156 12032 12364 7075 3534 -3039 -15013 -21501 -17525 -14946 -13806 -7461 -1494
862 -1494 -8180 -18531 -22431 -25701 -33131 -32234 -20796 -13852 -14063 -12036 -10463 -19487 -29499 -28872 -24212
877b4212J025O274J2419N239m425k595q13o097m432P436J0130M984N489Q011j347
892A7086q948m051J792j442O60J1540J0627L34j395J236n705j0350k114N775K267
907A7312K653Q785M539o985q561l001n311p393J354R224L336r56J308k653j1696
922A955r363j322j722j516N872Q375j486o638k696n075j1179m804N645N016R16
937a8022N615M972n458r975l289p65m008J898J1622P535j17P00J529o756q258
952b2777J629O235K831N990J0984M696m988l068K15m398l346O985J0819M337L143
967A9287N522r44r033m584J844j08Q31R303Q911o50l708j241n066r662k867N706
983A3541L352J844M649K343p280q927l852n081n717K179Q031K407k629j86l364
$$ plain form
877 -24212 -23187 -16913 -4494 745 -3680 -6275 -7088 -13185 -17617 -10181 -51 4933 10422 18433 17086
892 17086 8138 4087 5879 4437 5097 16637 27264 27598 26203 27439 21734 11384 9270 15045 17312
907 17312 19965 28750 33289 26304 17743 14742 9431 2038 3392 12616 15952 14996 16304 13651 1955
922 1955 -7408 -8730 -10452 -11968 -6096 2279 793 -5845 -8541 -13616 -24795 -29599 -23954 -18938 -18022
937 -18022 -12407 -7435 -12893 -22868 -26157 -26922 -30930 -29032 -17410 -9875 -9992 -9292 -7763 -14519 -22777
952 -22777 -21148 -14913 -12082 -6092 4892 9588 4600 1532 1747 -2651 -5997 988 11807 16144 19287
967 19287 24809 23865 14832 10248 12092 11984 12815 22118 31029 30379 26671 25430 20364 10702 7835 13541
983 13541 16893 18737 23386 25729 18449 9522 5670 589 -5128 -2949 5082 7489 4860 4674 1310
998A310j0642r536p90J541l0M444P308j163o771m306l638p807l208O126P318K320
1014a7524K889M119l605q351l207J045r9L786J0091Q191N79n04N29m600o156J967
1030a0850P339N320N337Q432L815m083m370p82k269j587N995J0263L990J067K245
1045B9862k200q337n690N80J817J474O012O241j282n705l958o512p551k494M203
1060F460L662L74K592K40p378r826n421l107k950J688O597K794k190k168m369
1075a3002q562p062l4L260K253M487N891L36n387m814l027l549j29O443P926M471
1091a0499K755K802k639o208k382K148K966M797R096P291J135j279j411l324l853
1106A395J967O567N781M995M923K035m276n718k770j461k08M638O534L668k74
$$ plain form
998 1310 -9332 -18868 -19658 -18117 -18147 -13703 -6395 -7558 -14329 -18635 -22273 -30080 -33288 -27162 -19844 -17524
1014 -17524 -14635 -10516 -14121 -22472 -25679 -24634 -24733 -20947 -10856 -2665 -2086 -2590 -2061 -6661 -12817 -10850
1030 -10850 -3511 1809 7146 15578 19393 15310 10940 10158 7889 6302 12297 22560 26550 27617 29862
1045 29862 27662 19325 13635 14215 16032 17506 23518 29759 28477 22772 18814 12302 4751 2257 6460
1060 6460 10122 10496 13088 13328 5950 -3876 -9297 -12404 -15354 -13666 -7069 -4275 -6465 -8633 -13002
1075 -13002 -21564 -28626 -28660 -25400 -23147 -18660 -12769 -12433 -17820 -22634 -25661 -29210 -29339 -22896 -14970 -10499
1091 -10499 -7744 -4942 -7581 -13789 -16171 -14023 -11057 -6260 2836 10127 11262 9983 8572 5248 1395
1106 1395 3362 9929 15710 20705 25628 27663 23387 17669 14899 13438 13230 17868 24402 28070 27796
1121B7796j695m440p876n822j56J894J418L934L299k114o567o412n530n394j860
1136i525L191L689J729N94j854o438p994m670j212p0L057N777L588j317l658l649
1152a8762n349l939J318M497N070M800M614K28m262l946j597n82K177N910Q008
1167a815M579K069O62k711m654j950K766M070N151O363N088Q04l487l022l541
1182A0372j946J290M956N133L925J795j136n365n656l450j251J240L098M631K452
1197B0088j712m329n413o477l906p67K008L355L079P21l013o066o194n015k372
1212a6013J24L384M399K722n09l273n160n574l304j61L012M688M763L069r02l262
1228a1997m127l618j217K501M936O204M704K393o98k836l926j953J376L588N719
$$ plain form
1121 27796 26101 21661 13785 7963 7807 9701 11119 15053 18352 16238 9671 3259 -2271 -7665 -9525
1136 -9525 -6334 -2645 -916 -322 -2176 -8614 -16608 -21278 -22490 -22560 -19503 -13726 -10138 -11455 -15113 -18762
1152 -18762 -24111 -28050 -26732 -22235 -17165 -12365 -7751 -7523 -11785 -15731 -17328 -17910 -15733 -9823 -1815
1167 -1815 2764 4833 5495 2784 -1870 -3820 -1054 3016 8167 14530 19618 20422 16935 13913 10372
1182 10372 8426 9716 14672 19805 23730 25525 24389 19024 13368 9918 8667 9907 13005 17636 20088
1197 20088 18376 14047 8634 2157 -1749 -2516 -508 2847 5926 6647 3634 -2432 -8626 -13641 -16013
1212 -16013 -15889 -12505 -8106 -5384 -5893 -9166 -14326 -19900 -23204 -23365 -20353 -15665 -10902 -7833 -8735 -11997
1228 -11997 -16124 -19742 -20959 -18458 -13522 -7318 -2614 -221 -919 -3755 -7681 -9634 -8258 -4670 1049
1243A049O010M540J060k122l370k960j622J340M712N952M972J791p09l660m895
1258A2088l173q97J703L963M785L143q41l613m786n163m002j162K601M069K214
1273A0929P24j506n477o549m614k715l17L035M179K350j107l054m604o005m334
1288a9065o34K429L647L706L047m80m222m548l656j906J141M862N602L627J852
1303d598J37l000m471j953J172L205M927O100M676N63j717k564l010j882J846
1318e69N361N317M298L159J28l895m215k203n50J500M443N469K429n56j884l858
1334A4374n354m267K49K607K917L399J833k235n579m707m296l791k86L693L542
1349B099R22j42j970n379p137l007k25N87L050M840J865j964l039l701m789l139
$$ plain form
1243 1049 7059 11599 12659 10537 7167 4207 2585 3925 8637 14589 19561 21352 20643 16983 12088
1258 12088 8915 8018 9721 13684 18469 21612 20771 17158 12372 7209 3207 2045 4646 8715 10929
1273 10929 11653 10147 4670 -1879 -6493 -9208 -9525 -6490 -2311 39 -1068 -4122 -8726 -14731 -19065
1288 -19065 -19699 -17270 -13623 -9917 -6870 -7350 -11572 -16120 -19776 -21682 -20541 -15679 -10077 -6450 -4598
1303 -4598 -4461 -7461 -11932 -13885 -12713 -9508 -4581 1519 6195 6758 5041 2477 -533 -2415 -569
1318 -569 4792 10109 14407 17566 17694 13799 9584 7381 6831 8331 12774 18243 20672 20116 18232 14374
1334 14374 9020 4753 5002 7609 10526 13925 15758 13523 7944 3237 -1059 -4850 -5136 -1443 2099
1349 2099 3021 2879 909 -4470 -11607 -14614 -14839 -14252 -11202 -6362 -4497 -6461 -9500 -13201 -17990 -21129
1365b1129J734M757L633L187K949m70m436l967j034o9K055N691O043K796L73J92
1381B305k589m726j138L140L730M169N874L279j316l302j921k748k159K377O180
1396A1155L779J716J745r65n184n752j548Q04J010L467M710P79k357l154m317
1411E888n748k986J778L386J318K179J379k812o113m682k661j842O70M521L560
1426b165M19r20j716n211n872j152K182J938K512N004K421k614l673k224l095
1441a4166j519L140N464L203K565K314j145m429l075O8Q33K148N445N535J987
1456H368j554r45k814m357m76L487M047K804M126K560l122m731k048j771j028
1471B546K099N129L416K39m30j881n292n294r5J898J070K520M382L14l957m143
$$ plain form
1365 -21129 -19395 -14638 -11005 -7818 -4869 -5339 -9775 -13742 -14776 -14845 -12790 -7099 -1056 1740 2113 2305
1381 2305 -284 -5010 -6148 -3008 722 4891 10765 14044 12728 9426 7505 4757 2598 4975 11155
1396 11155 14934 16650 18395 17430 12246 6494 4946 5750 6760 10227 14937 15716 13359 10205 5888
1411 5888 140 -2846 -1068 2318 3636 5815 7194 4382 -1731 -6413 -9074 -10916 -10246 -5725 -2165
1426 -2165 -1746 -2666 -4382 -9593 -15465 -16617 -14435 -12497 -9985 -4981 -2560 -5174 -8847 -11071 -14166
1441 -14166 -15685 -12545 -7081 -3878 -1313 1001 -144 -4573 -7648 -7580 -6747 -4599 846 6381 8368
1456 8368 6814 5869 3055 -1302 -1778 1709 5756 8560 12686 15246 12124 7393 5345 3574 2546
1471 2546 4645 9774 13190 13429 12999 11118 5826 532 437 2335 3405 5925 10307 10621 6664 2521
1487B521k883m176j762K493L860J686Q14R41l142o275l414m22n42J199M659L702
1503g41l46k247j952l701m139p50L419K632K709L727R91k920m070j886j301o58
1519a1233L313O071L090J353R9j396m928k623J044K298K362M352M921J8k624j656
1535D461k599k916r7M319M048K401K527O96l378n152j680l73l09K134N442K597
1551A2121o68j552k526m743m232O65K513J206K964L297j311m467l851k088l585
1566f257q41L328M000J003J54K7l742n569k728M86J90K108M246L284j385k698
1582d394j990l099l499K45M511L243J890L108M33l890l838j074L7O4L881N765
1598A393K902o92k50j420m359k491J873L044K216M254M135l35m168j996j550k171
$$ plain form
1487 2521 -362 -4538 -6300 -3807 53 1739 2553 3494 352 -5923 -9337 -9759 -10301 -9102 -4443 -741
1503 -741 -1087 -3334 -5286 -8987 -13126 -13876 -10457 -7825 -5116 -1389 -398 -3318 -7388 -9274 -10575 -11233
1519 -11233 -7920 -1849 1241 2594 2693 1297 -3631 -6254 -5210 -2912 -550 3802 8723 8741 6117 4461
1535 4461 1862 -1054 -1151 3168 7216 9617 12144 12840 9462 4310 2630 2257 1948 4082 9524 12121
1551 12121 11453 9901 7375 2632 -1600 -935 1578 2784 5748 9045 7734 3267 -584 -2672 -6257
1566 -6257 -7098 -3770 230 1233 1387 1414 -2328 -7897 -10625 -10139 -9949 -7841 -3595 -311 -1696 -4394
1582 -4394 -6384 -9483 -12982 -12737 -8226 -4983 -3093 15 448 -3442 -7280 -8354 -8317 -8253 -4372 1393
1598 1393 4295 3603 3353 1933 -2426 -4917 -3044 0 2216 6470 10605 10270 6102 4106 2556 385
1614C85j94M504M601J407R19o5l525n110j752L88L79K292M461K297k448k473k142
1631C924m164l936R15L311K209J345J743j060m568m175j711j814m50L708M524
1646a99Q22j347l90k949m938k551J428K135K079L344L327k098l263j838k123k268
1662a0829J187M660L459J540J781L54l827m030o50J136R39L560M946K201j231
1677E196j661j725l427j752K197L558K616K695K045p50m089k658j089j100N77
1692F33L954M136M67l78r06k940m753j567J349J510K000L165J873k357l004k940
1708B42k521k385J092L881K188N99J019j174m562l924j007Q8N48K769L588Q27
1724A268j325j922k613l661k006K287K968J395L257J669j875l882k397j070j189
$$ plain form
1614 385 191 4695 9296 10703 11622 11557 8032 2922 1170 1558 1937 4229 8690 10987 8539 6066 3924
1631 3924 -240 -4176 -3261 50 2259 3604 5347 4287 -281 -4456 -6167 -7981 -8431 -4723 -199
1646 -199 623 -724 -1114 -4063 -9001 -11552 -10124 -7989 -5910 -2566 761 -1337 -4600 -6438 -8561 -10829
1662 -10829 -9642 -4982 -1523 17 1798 2152 -1675 -5705 -6355 -5219 -4280 -720 4226 6427 5196
1677 5196 3535 1810 -1617 -3369 -1172 2386 5002 7697 9742 8992 4903 2245 1156 56 633
1692 633 4587 8723 9190 8812 7906 4966 213 -1354 -5 1505 3505 6670 8543 6186 3182 242
1708 242 -2279 -4664 -3572 309 2497 3096 4115 2941 -1621 -5545 -6552 -6464 -5916 -3147 441 1268
1724 1268 -57 -1979 -4592 -8253 -10259 -7972 -5004 -3609 -352 1317 -558 -4440 -6837 -7907 -9096
1739i096J837M357L016R88K91n76l361l453k51J842J963K927L760J507j018k744
1755A989j664k518q06K414L818K551J186J758j130l673k677q63L01J679L339L301
1771I005P37j363j657l068l285o04J725J468K039K584O15k627l524k423j952r33
1787c263J195K771K300L10m29j987m311l356n05O31J255K601K507Q7j852k677
1803d723k412k910l85K151K406K557J466N32j964l303j786l76K88K470L812K829
1819F52Q53p63j154k647j958K35K340K660K910L169Q59j785k535j407j043Q7K505
1836B978L744J933J434n3k110l106k141r6P09J725K838K400j29k031k656k868
1852B571k307p25J847K140J401J333q93l154l365k491j400k42K115K235J460j60
$$ plain form
1739 -9096 -7259 -2902 114 1102 1393 817 -2544 -5997 -6248 -4406 -2443 484 4244 5751 4733 1989
1755 1989 325 -2193 -2999 -585 3233 5784 6970 8728 7598 3925 1248 385 686 2365 5704 9005
1771 9005 9742 8379 6722 3654 369 -235 1490 2958 4997 7581 8196 5569 2045 -378 -2330 -3263
1787 -3263 -2068 703 3003 3313 2884 897 -3414 -6770 -7275 -6644 -5389 -2788 -281 -194 -2046 -4723
1803 -4723 -7135 -10045 -10430 -8279 -5873 -3316 -1850 -1318 -3282 -6585 -8371 -8747 -8459 -5989 -2177 652
1819 652 1505 742 -412 -3059 -5017 -4782 -2442 218 3128 6297 7156 5371 2836 1429 386 473 2978
1836 2978 6722 8655 10089 10036 7926 4820 2679 2583 3292 5017 7855 10255 10126 8095 5439 2571
1852 2571 264 -461 1386 3526 4927 6260 5367 2213 -1152 -3643 -5043 -5285 -3170 -935 525 365
1868C65j616k578l232k420k07J269J990K484J770j78k435k618j837j405O07K409
1884g632L348K238J137k22j891k580j477L62J702K718L493K383N93j323j889j838
1900h78p89O57K585L086K549J693k37j923k542j286p68O03K696K826J949k10r70
1917I041k454k660k082R9J238J876J972P91r27k144l085k214k355M53J528J894
1933I71J794M0j606k771k888k334p72P09K090K229J215l20k170k263k692j613
1949a0381Q08K152K242J948J300p86j825k450j567J42J048K534L263J894O47r11
1965E8j734j840r10M23K108L244L041J130j96j333j752j696l05Q97K757K952K304
1982I148j3p28j622k337j616l98J496K271K228Q94p2k211k439k663j493O42J126
$$ plain form
1868 365 -1251 -3829 -7061 -9481 -9688 -8419 -6429 -3945 -2175 -2353 -4788 -7406 -9243 -10648 -10041 -7632
1884 -7632 -4284 -2046 -909 -1131 -3022 -5602 -7079 -6717 -5015 -2297 1196 3579 4172 2849 960 -878
1900 -878 -1667 -1010 1575 4661 7210 8903 8666 6743 4201 2915 2147 2750 5446 8272 10221 10011 9041
1917 9041 6587 3927 1845 1944 3182 5058 7030 7821 6894 4750 1665 -549 -2904 -2451 -923 971
1933 971 2765 2805 1199 -1572 -4460 -6794 -7566 -6857 -4767 -2538 -1323 -1643 -3813 -6076 -8768 -10381
1949 -10381 -9573 -7421 -5179 -3231 -1931 -2717 -4542 -6992 -8559 -8417 -7369 -4835 -1572 322 969 58
1965 58 -1676 -3516 -4426 -4003 -1895 1349 4390 5520 5324 3991 2239 543 238 1135 3892 6844 9148
1982 9148 9135 8407 6785 4448 2832 2434 3930 6201 8429 9323 9251 7040 4601 1938 445 1087 2213
1999B213K381J116K71j460k642k871k447p12N91J872J986M26l56j769l216j983
2015f600k119J90J755J806J672P72r37k071k735j599n2Q07K284K666J861N57j260
2032c003j677j799r90N37K272K744K573J649O2j082j933j151l94J535K499L036
2048D878K108N76J52j752k315j053J46J667K369K360J307k74j411k587k146j056
2064B969J1J766J928J179L66j187k390l055j868r53N65J351J515P89o27j767k864
2081b272k863j494k52J585J080J411J011j167k293k274k034q67P87K491J808J451
2097c892m1o41j504k193j064J013K026K028K373J937L3j112j081j403n42J198
2113b865L005K530J951J189p2j622j644o25N73Q07K158K640J727l03j090j985
$$ plain form
1999 2213 4594 5710 5981 4521 1879 -992 -3439 -4151 -3560 -1688 298 724 368 -1401 -4617 -6600
2015 -6600 -8719 -8529 -6774 -4968 -3296 -2524 -3461 -5532 -8267 -9866 -9918 -9111 -6827 -4161 -2300 -1743 -3003
2032 -3003 -4680 -6479 -7469 -6932 -4660 -1916 657 2306 2368 1286 -647 -1798 -2192 -657 1842 4878
2048 4878 6986 7562 7714 5962 3647 2594 2740 4407 6776 9136 10443 10169 8758 6171 4025 2969
2064 2969 2980 4746 6674 7853 8219 7032 4642 1587 -281 -1234 -669 682 2197 2986 2359 592 -2272
2081 -2272 -5135 -6629 -6881 -5296 -4216 -2805 -1794 -2961 -5254 -7528 -9562 -10429 -9642 -7151 -5343 -3892
2097 -3892 -3933 -4574 -6078 -8271 -9335 -8322 -6296 -4268 -1895 42 75 -1037 -2118 -3521 -4063 -2865
2113 -2865 140 2670 4621 5810 5738 4116 2472 1847 2420 3227 5385 8025 9752 9449 8359 6374
2129F374k125q17P92J317J184J875O84j097k791k130j563j035L2J741J665L40
2145D446l60j540k571l319j014k28N70J347J630O46j630j931j927j880j131Q14
2161h078J859J180J271R50j018k342k064n28J22J441K286K502J229n80p2j555
2177c397j970nJ601J649K132K493J430p45j663q09n85n72J786K557J827J331K59
2194G319n72k346j770M2J53J466J726K241M97j485j580j768j395j369R45J807
2210C911P54J243j44j629k820j766j060o13M14K132J232J32j380j635k108k042
2226e379j080N68J588J258J626N9j501k117j596j207k23J240K187J646R19J12
2242a900j031j769j755J66R35R90K693K538J87l72r26j557j107K37J560K214J542
$$ plain form
2129 6374 4249 3432 4224 5541 6725 8600 9284 8187 5396 3266 1703 668 700 2441 4106 4446
2145 4446 4086 2546 -25 -3344 -4358 -4586 -4016 -2669 -1039 -393 -2023 -3954 -5881 -7761 -8892 -8078
2161 -8078 -6219 -5039 -3768 -2818 -3836 -6178 -8242 -8770 -8648 -7207 -4921 -2419 -1190 -1770 -1842 -3397
2177 -3397 -5367 -5372 -3771 -2122 10 2503 3933 3188 1525 716 131 -441 1345 3902 5729 7060 7319
2194 7319 6747 4401 2631 2673 2826 4292 6018 8259 8756 7271 5691 3923 2528 1159 2104 3911
2210 3911 4665 5908 5764 4135 1315 -451 -1511 -2124 -1710 422 1654 1786 406 -1229 -3337 -5379
2226 -5379 -6459 -5891 -4303 -3045 -1419 -1360 -2861 -4978 -6574 -7781 -8004 -6764 -4577 -2931 -2012 -1900
2242 -1900 -2931 -4700 -6455 -6289 -5354 -4364 -1671 867 1054 682 -244 -1801 -2908 -2671 -1111 1103 2645
2259B645K138J75r28j627o32r53m9J789K699J301K00K4q90k353j687J61R72O93
2277C678J969J196J38j761j807j481k051m92J387J497J189J31n76j429k666j628
2293b706r18k60R18K158J182q81r99j309j866j981j78J135J491R35J518J47j838
2310c452k007r44n14K66J427K160J617K63K11p22j880j390R97J212J154K213K103
2327B714J08p44q07j325n72J95K262J974J147J085Q6j150k018q20Q6N25J070K010
2345E826J062k17q47j512j553j433m06J559P61Q21Q84o52j675k250j342j150q2
2362b206J250J404K20Lq89j312k615j266K63K37R98J687R28n10j538j234j196
2379e776j143J17J842J603J551M85K4j377k093L24j17N72J976K499J078J63l43
$$ plain form
2259 2645 4783 4958 4030 2403 1771 818 769 2558 5257 6558 6758 6782 5892 3539 1852 2013 2985 3678
2277 3678 5647 6843 6981 5220 3413 1932 -119 -611 776 2273 3462 3593 3017 1588 -1078 -2706
2293 -2706 -3624 -3884 -2966 -808 374 -507 -1506 -2815 -4681 -6662 -6840 -5705 -4214 -3279 -1761 -1614 -3452
2310 -3452 -5459 -6403 -6917 -6651 -5224 -3064 -1447 -1184 -973 -1695 -3575 -4965 -3968 -2756 -1602 611 2714
2327 2714 2822 2078 1271 -54 -626 -431 1831 3805 4952 6037 6123 4973 2955 2135 2221 2746 3816 5826
2345 5826 6888 6671 5824 4312 2759 1326 920 2479 3240 4061 4945 4293 2618 368 -974 -2124 -2206
2362 -2206 -956 448 668 671 -218 -1530 -4145 -5411 -5148 -4911 -3913 -2226 -1298 -1808 -3346 -4580 -5776
2379 -5776 -6919 -6802 -4960 -3357 -1806 -1321 -1297 -2674 -4767 -4443 -4560 -3988 -2012 487 1565 1728 1385
2396A385j094j315r16R47J724J247J887J229j43j076j404r60n36Q65J698J516
2412E054N94M34l43j760k158p39L56M74J272Q24P64o55j334j466j986r73L11R56
2430c75J268N15M53p58k121k026q37l50O18J219J211O45l87q76j523j537m48N56
2448d753Q07J626J100J101q41j075j512o54k15R37J779J383J215M03p06r46j531
2465a882k33O78P17J739J398J312o31n90j369j471K79Q60R40J315J170P32p66
2482D198k101j066p64J78N88J529J078M08k89j108j515j633n00N79N04R28J463
2499B477j34p32j344j228j160p46O32J138J118J57O96j106j620j387k78j21Q76
2516b762J387J334L42r92l73j781o99l45J112J086R85J524J46j066j207j083j82
$$ plain form
2396 1385 291 -1024 -1940 -993 731 1978 3865 5094 4951 3875 2471 1511 975 1840 3538 5054
2412 5054 5648 6082 5739 3979 1821 1082 1438 1912 3184 4008 4772 4117 2783 1317 -669 -1642 -1331 -375
2430 -375 893 1408 1861 1103 -1018 -3044 -3881 -4231 -3613 -2394 -1183 -538 -925 -1801 -3324 -4861 -5309 -4753
2448 -4753 -3946 -2320 -1220 -119 -960 -2035 -3547 -4201 -4416 -3479 -1700 -317 898 1301 595 -351 -1882
2465 -1882 -2115 -1437 -720 1019 2417 3729 3098 2508 1139 -332 -53 807 1747 3062 4232 4964 4198
2482 4198 2097 1031 267 445 1033 2562 3640 4048 3759 2651 1136 -497 -997 -418 86 1014 2477
2499 2477 2343 1611 267 -961 -2121 -2867 -2235 -1097 21 178 874 -232 -1852 -3239 -3517 -3638 -2762
2516 -2762 -1375 -41 301 -691 -1064 -2845 -3544 -3889 -2777 -1691 -706 818 964 -102 -1309 -2392 -2574
2533b574j59J092J670J318L36k7q80j391q33p6M99J344J394J463J82r55j099r35
2551C69j233M33Q14J667Q03N15L63j219j314j332l02K97Q12J468Q13J51n62j384
2569A159q17j433m53N90J228J125N68q3j514j259q96q83r6R25J526N56L76m86
2587A33q18k020l49l21M47J169J129P89j17o09q45j079q14q3J013J399J149P80
2605I53k73o13j230j058m6M76J229J251J131P09q33o66j000j049L80R22J376J024
2623B683Q23k38j007j034r60j05k5J062J062R85k7k76j066j202j411k45M62J081
2641E62J043O42M8j040j022j364q03j29J161N84J072L22o46p34j363j113l50L31
2659b799P94J237J053R2o33j114j143o97L14O71R45J268Q40j96o14r30j024o70
$$ plain form
2533 -2574 -2733 -1641 29 1347 1683 1656 776 -615 -1448 -1524 -1025 319 1713 3176 3358 2403 1304 369
2551 369 -864 -431 383 2050 2853 3368 3731 2512 1198 -134 -436 -139 673 2141 2954 3105 2543 1159
2569 1159 342 -1091 -1544 -954 274 1399 1967 1884 370 -889 -1785 -2668 -2764 -1839 -313 243 619 133
2587 133 -685 -2705 -3054 -3375 -2928 -1759 -630 159 42 -567 -1412 -2491 -3305 -3388 -2375 -976 173 953
2605 953 680 67 -1163 -2221 -2267 -1791 -562 689 1820 2529 1696 1030 30 -1019 -639 283 1659 2683
2623 2683 3506 3268 2261 1227 267 162 137 1199 2261 3246 3219 2943 1877 675 -736 -981 -519 562
2641 562 1605 2247 2295 1255 233 -1131 -1934 -2063 -902 -318 754 1076 430 -304 -1667 -2780 -3130 -2799
2659 -2799 -2005 -768 285 377 -256 -1370 -2513 -3210 -2896 -2225 -1280 -12 828 632 18 -912 -1936 -2606
2677b606Q70Q24J242J045J92j04j078j007n19o4O82J351J088Q64n27o04o68q90
2695I1p72k07J397J097M53N81m22o63j125p82n67N71J177R50N13m6o66j075j633
2714a128k06K9N89R41P73N34l33j001j063j149l8J52Q76R04R31K55m54j112j042
2733a542p90J81P06R80J025J61K11r03j043n82m81K11J018Q46Q48M59n26q02j005
2752a028m25k3K02J129R77Q64n6p82j263j050L6M7J016P28J081J83qq03r97q44
2772a016q1L03J098Q11N52P87r47r31r24l64n4R56R68P12L78j22j219m84j308
2791h85J06K16O45J166M75J91n14q79j030o25k85P92N85J020M02k05p16j148r36
2810a625p44N95L46J339K17K52l9j014j271q99K34K68J070P52O48r0j13j079o43
$$ plain form
2677 -2606 -1736 -912 330 1375 1567 1463 385 -622 -1141 -1205 -523 828 1916 2780 2253 1649 981 91
2695 91 -681 -888 509 1606 2059 2640 2218 1555 430 -352 -919 -348 829 1779 2292 2246 1580 505 -1128
2714 -1128 -1334 -1305 -716 225 998 1532 1199 198 -865 -2014 -2052 -1900 -1024 -120 811 1066 612 -500 -1542
2733 -1542 -2332 -2151 -1445 -465 560 721 932 29 -1014 -1596 -2077 -1866 -848 -2 846 1305 779 -23 -1028
2752 -1028 -1453 -1476 -1274 -145 832 1696 1640 858 -405 -1455 -1419 -1372 -356 372 1453 1636 1628 825 -172 -1016
2772 -1016 -1097 -794 304 1115 1667 2454 1507 576 -348 -712 -766 190 1158 1870 2248 2126 907 423 -885
2791 -885 -779 -563 82 1248 1723 1914 1400 521 -509 -1134 -1419 -627 -42 978 1380 1175 459 -689 -1625
2810 -1625 -2369 -1774 -1428 -89 128 380 341 -673 -1944 -2843 -2609 -2341 -1271 -519 129 39 -74 -1153 -1796
2829a796n70J18J082P74Q60M37j68m78r79q60L20N01J070Q55Q47J88o25m24j063
2848H9o51O36M59R19P45O49M2j075p19p95l67L81Q04N22Q10J40m63o96j249q68
2868f87O8L65M78J110n5p6j033p00j014l72j04O76P35K68K83k72p49j136m78m94
2888c187Q85L21J223M51k70p62n30q51j43J1R69Q72J223K89lq09p05l81j09M85
2908a021P73J310M02L67j67r44o24M2j10L32J352O75O64j64r33n30n55o38J48
2927C79Q90P61L35L44k82p77p70p67n88M83Q31N05J64j66l64j048j223l41o5M57
2947a242Q37O72K69q45l22j002q35l70L01O00P69O76J72o45p85m37p01K01L45
2966b342J187Q65L02n08k20o46n77k00L21J054O46R84K70k52q10n76%l30O96J102
$$ plain form
2829 -1796 -2366 -2248 -1166 -392 468 905 737 259 -720 -1580 -1260 -759 311 1166 2013 2201 1576 1152 89
2848 89 -562 74 533 1452 2197 2846 2888 1813 1094 299 -68 313 1117 1639 2449 2589 2126 1430 181 -687
2868 -687 -619 -254 224 1334 1279 1203 170 -530 -1544 -1916 -2020 -1344 -609 -341 -58 -330 -1079 -2215 -2693 -3187
2888 -3187 -2302 -1981 -758 -307 -577 -1339 -1869 -2720 -2863 -2852 -1883 -1011 212 501 498 -311 -1016 -1397 -1506 -1021
2908 -1021 -248 1062 1464 1831 1664 720 96 138 28 360 1712 2387 3051 2887 1954 1424 869 231 379
2927 379 1269 2030 2365 2709 2427 1650 880 113 -475 8 839 1344 1508 1342 978 -70 -1293 -1634 -1699 -1242
2947 -1242 -405 267 536 -309 -631 -1633 -2468 -2838 -2537 -1937 -1168 -492 -320 -965 -1750 -2187 -2888 -2687 -2342
2966 -2342 -1155 -290 12 -496 -716 -1362 -1939 -2139 -1818 -764 -118 866 1136 884 74 -502 -502 -832 -136 966
2986I66N40O91J46k86n96p72m25N31J94J179R38l65O3o64j021o21j65N40M86Q64
3006B223J22L11r24p43j127l57k8L09R95N3M39o21k76j072r47l33M33L06N08J84
3026e45O32n59j060o68o43o6M51P60L58O09j44p27k79q99k81N46M89J050Q10j4
3046a80K8m76o32j32j87R18Q03Q00O03J05m27o11k23k13O9J112Q11P34J75k45
3066B832n54n94o25JM22Q88M40L72j25o68l59q83o21J26J50N23P02L78p60n89
3086A056j020j243M2j83N17N33M97k23p99n83q32q13k48N48O59J19O26n03j74
3105b024r47n22P5m05J011P38N10L37K4l15p94k27N87N32M90J200K54L38j62N1
3125G51q58j65N00O40Q62Q28L77K81p67k12m65m70N42P11P26K99K03p38n23o35
$$ plain form
2986 966 1506 2197 2343 2057 1461 689 264 795 989 2168 3106 2741 2804 2140 1119 498 333 873 1359 2223
3006 2223 2345 2656 1732 989 -138 -495 -523 -214 781 834 1273 652 376 -696 -1643 -1976 -1543 -1237 -729 -545
3026 -545 87 -472 -1532 -2200 -2843 -2909 -2458 -1698 -1340 -731 -875 -1602 -1881 -2780 -3061 -2515 -2026 -976 -166 -180
3046 -180 -152 -628 -1260 -1392 -1579 -661 142 942 1545 1650 1223 612 389 176 245 1357 2168 2902 3077 2832
3066 2832 2278 1684 1059 1060 1482 2370 2810 3182 3057 2389 2030 1147 526 652 802 1325 2027 2405 1645 1056
3086 1056 36 -1207 -1165 -1348 -831 -298 199 -24 -823 -1406 -2238 -3051 -3299 -2751 -2092 -1973 -1347 -1850 -2024
3105 -2024 -2971 -3493 -3418 -3823 -2812 -2074 -1564 -1227 -1203 -1518 -2312 -2539 -1952 -1420 -930 270 524 862 700 751
3125 751 -107 -272 228 868 1730 2558 2935 3216 2449 2237 1772 1302 1844 2555 3281 3580 3783 3045 2522 1887
3145A887o64N9J79L44P07j70J57j233o24n77p29N0O0N60J1p8m41p88p05m75l48
3166b818J45L26P75J69p6p78n74k23n09L04O53K83L42M02j66j42l87k82o0P07
3186a909O15R60J026j16k76m21j28l54K46J009O34P02M66L64j061Q3n11J93lP64
3206B283N31M48l1Rr18m02m09j52K38P36N86j67l87p62m96q01l27k95M61M75K38
3227H58o7l06j047q26m33j93mO01N63j84o4o48r4r73l49J97L59N68N87L42l84
3248a497j54p15l35m2J76J109M87O27J54k4r80J20k75M01P97M22P69O27j13m8
3268A506m01p00j2L78J057K25O99K1M8n77r44k10M41lL37O23N13n05o05l51o53
3289H87m29L48O7K78M57J49q13n28p79o71l02L17O41K14J03j62o48l41q00m45
$$ plain form
3145 1887 1223 1282 1461 1805 2512 2342 2499 1266 642 65 -664 -614 -554 6 17 -61 -502 -1290 -1995 -2470 -2818
3166 -2818 -2673 -2347 -1572 -1403 -1479 -2257 -2831 -3054 -3563 -3259 -2606 -2323 -1981 -1579 -1745 -1887 -2274 -2556 -2616 -1909
3186 -1909 -1294 -334 692 576 300 -121 -249 -603 -357 652 1286 1988 2454 2818 1757 1840 1329 1522 1519 2283
3206 2283 2814 3262 3231 3240 2322 1920 1511 1359 1597 2333 2919 2752 2365 1603 1107 306 -21 -316 145 620 858
3227 858 791 485 -562 -1388 -1821 -2014 -2018 -1417 -854 -1038 -1102 -1750 -1844 -2817 -3166 -2969 -2610 -2042 -1455 -1113 -1497
3248 -1497 -1651 -2366 -2701 -2743 -2567 -1458 -971 -344 -190 -214 -1194 -1074 -1349 -948 -151 271 1040 1667 1554 1506
3268 1506 1105 405 393 771 1828 2053 2752 2773 2821 2244 1300 1090 1531 1528 1865 2488 3001 2496 1891 1540 887
3289 887 458 806 873 1151 1608 1757 944 416 -363 -1034 -1336 -1019 -378 -164 -61 -223 -871 -1212 -2012 -2457
3309b457J89J10L46N06L26n31n12l57o05J63J79P00M21L98K89n01J84p10K28l33
3329a967R24L41P36N97k16Qk65m04J55M35M93N22O51K48K7n79k20k46n4J21Q88
3350B195M74K72j43q4r40j08n28L09M17L73k4J63n08o87l61q42q9j80M02L19j82
3371B48j20l05q59k85q34O44l19M88K67k84n39mm73p67K7J4P66M62J92K25k26
3392a682l45n33K01j40R40L51M23N23j80K09l46j04R1n9J099L74N34L43K63l03
3412A659n14k37K92J52O08Q03J09R4l25m63m46O7l62M33P93j29q2l41k57p99o90
3433C65o4j96M38J98J34k38o91m92l21o33j74J15M60K52K11o83j24n97m56k24
3453b720%N25K02Q17l54j66K15p45l92J17Q58K58N09M32jll80o0p2K54P17N46
$$ plain form
3309 -2457 -2268 -2158 -1812 -1306 -980 -1511 -2023 -2380 -2985 -2822 -2643 -1943 -1522 -1124 -835 -1336 -1152 -1862 -1634 -1967
3329 -1967 -1043 -702 34 631 415 423 158 -246 -91 344 837 1359 2010 2258 2285 1706 1486 1240 1186 1307 2195
3350 2195 2669 2941 2798 2714 1774 1666 1138 1447 1864 2237 2213 2376 1868 1181 820 -22 -111 -291 111 430 248
3371 248 128 -177 -1036 -1321 -2155 -1511 -1830 -1342 -1075 -1359 -1898 -1902 -2375 -3142 -3115 -3101 -2335 -1873 -1681 -1456 -1682
3392 -1682 -2027 -2560 -2359 -2499 -1559 -1208 -785 -262 -442 -233 -579 -683 -592 -651 448 822 1356 1699 1962 1659
3412 1659 1145 908 1200 1352 1960 2763 2872 2966 2641 2178 1732 1799 1437 1870 2663 2534 2452 2111 1854 1055 365
3433 365 301 105 543 741 875 637 -54 -546 -867 -1500 -1674 -1559 -1099 -847 -636 -1319 -1443 -2040 -2496 -2720
3453 -2720 -2720 -2195 -1993 -1176 -1530 -1696 -1481 -2226 -2618 -2501 -1643 -1385 -876 -444 -445 -448 -828 -888 -960 -706 11 557
3475E57M99M00m26k34o1k14J87J72N58O47K94J79o10J03p31m26J51N30N31O4K89
3496B459j25q41p54j79k82K32L76K52L1k05m90n73m06l45o7J28M70K93j3j56o46
3517h41o85p7n95K32O53L28J47q3k87j09p67k06K88R3N20O28J56J55j65k22q34
3538a671M55Q2M57O46L15K4J21j87k10k70J56J04P58N85K30J12j62p04q6M4k11
3559E88N12P54m0K29j15o65j47l74k92K36J75O32K46k05j54m60m78m35K53l59
3579i9J89M78k35J79m07m23l44n50J62J51O1O63j77k57l19o05n88M06J64J68N64
3600h19l7K32n38l23k46k07K74N21L48M63K13L7j59n55l23j54Q92K78M34L50J74
3621H55k61k42O5k94K44L32J28Q67qJ21k2p29J6n52M07M95L42N9J58l58m13l38
$$ plain form
3475 557 1056 1456 1030 796 735 521 708 880 1438 2085 2379 2558 1948 2051 1320 894 1045 1575 2106 2170 2459
3496 2459 2334 1493 739 560 278 510 886 1138 1169 964 474 -99 -505 -850 -917 -789 -319 -26 -39 -195 -841
3517 -841 -1526 -1603 -2198 -1966 -1313 -985 -838 -921 -1208 -1317 -2084 -2290 -2002 -1909 -1389 -761 -605 -450 -615 -837 -1671
3538 -1671 -1216 -1134 -677 -31 284 308 429 242 32 -238 -82 22 780 1365 1595 1707 1545 841 755 799 588
3559 588 1100 1854 1814 2043 1928 1263 1116 742 450 686 861 1493 1739 1534 1380 920 442 7 260 -99
3579 -99 90 568 333 512 105 -318 -662 -1212 -1050 -899 -838 -175 -352 -609 -928 -1533 -2121 -1715 -1551 -1383 -819
3600 -819 -856 -624 -1162 -1485 -1731 -1938 -1664 -1143 -795 -332 -119 -82 -241 -796 -1119 -1273 -381 -103 331 681 855
3621 855 594 352 417 123 367 699 827 1694 1686 1807 1785 1056 1072 520 927 1422 1764 1823 1981 1623 1210 872
3643H72m26L25l9K2M94j93k60k95l64m80J88o77O51o1L50j05l66m10l33l46j60
3664a613O4J07Q63m53J35l07l54m20Q7L7K58J6O36L39m1o15j64J96l4K53O40J2
3686c58L25K45L08m52p1k51j6L91R39K4L39J73k80l64l38K92K42J05K95J09K59
3707A916k20n65k52n4k18M1N69k26M3K42k08p39k30m01M9K30o2L19J37m03k33
3728b65m94l48j93J24K69O29j52k50M7m00l72J64l49L01M12N22Q9k61j31j28l60
3749a146k37L07M78L80P9N45m50k68j11N4k41P97K26K40K57L1K78r63j49J16R4
3770C17L26M67p3R4k7j64k68m3m33L58L05L25k17K51m29m64l22J57j94K32M33
3791F31K7K95n91qp60M8j06M02k2m2N81m21N9p57k95m4Q0J62M36L10j60J27l31
$$ plain form
3643 872 446 771 732 754 1248 1055 795 500 136 -344 -156 -833 -182 -243 107 2 -364 -774 -1107 -1453 -1613
3664 -1613 -1549 -1442 -579 -1032 -897 -1204 -1558 -1978 -1891 -1854 -1596 -1580 -944 -605 -646 -1261 -1425 -1229 -1263 -1010 -370 -358
3686 -358 -33 212 520 68 -3 -254 -270 121 1060 1084 1423 1596 1316 952 614 906 1148 1253 1548 1657 1916
3707 1916 1696 1131 879 825 607 648 1217 991 1034 1276 1068 329 99 -302 -253 -23 -85 234 371 -32 -265
3728 -265 -759 -1107 -1300 -1176 -907 -278 -430 -680 -633 -1033 -1405 -1241 -1590 -1289 -877 -355 -266 -527 -658 -786 -1146
3749 -1146 -1383 -1076 -598 -218 -139 406 -44 -312 -423 -369 -610 187 413 653 910 941 1219 256 107 223 317
3770 317 643 1110 1037 1131 1104 940 672 629 196 554 859 1184 967 1218 789 325 3 160 -34 198 631
3791 631 658 953 362 354 -406 -358 -464 -62 -84 -126 455 34 93 -664 -959 -1003 -923 -761 -325 -15 -175 -48 -379
3814c79m47l79%Q0L65K00L06K31k85l20l19J58K74k65O79N6MJ58j17m64K9K81
3836a54m00N47K08M18l1Q1l85j97p6Q7J94M51K64k6o0J10k82m95O0O1KN49L19
3859A245j39L95r62k4l22j68K42L52J13PK6j37l48n46p1o4k07L02J19M97k66m43
3881c99l20l79r5Q7J40K49M35j64j02n19j66j33K22J74K94K85L1j9j73m14K4J05
3903h37N1M92K79J25K67N5m14k72JN28k45M11L95J91p0k21j56O8n0O8J7K45N61
3926A489m0k16j03l00k31m00J88J65J28L25k23K79m16m51o98L93Q9K03P4p5r1
3947H9k48n55K22k09k44L43L54m0k61K70m09l84k01R5k9K51L91K03q8m2j99l18
3969a009p5J70J44N22M90p7k95M44q81p7L13K92J76J13J78J36j7k17n1l56K82
$$ plain form
3814 -379 -826 -1205 -1205 -1125 -760 -560 -254 -23 -308 -628 -947 -789 -515 -780 -101 -45 -41 117 0 -464 -435 -154
3836 -154 -554 -7 201 619 588 669 284 87 11 98 292 743 1007 981 921 1031 749 254 314 375 377 926 1245
3859 1245 1106 1501 539 515 193 25 267 619 732 739 765 628 280 -266 -337 -401 -608 -306 -187 310 44 -399
3881 -399 -719 -1098 -1193 -1106 -966 -717 -282 -446 -548 -1067 -1233 -1366 -1144 -970 -676 -391 -360 -379 -552 -966 -942 -837
3903 -837 -786 -294 -15 110 377 432 18 -254 -253 275 30 441 836 1027 957 736 580 648 598 666 683 928 1489
3926 1489 1449 1233 1130 830 599 199 387 552 680 1005 782 1061 645 194 -504 -111 -22 181 255 180 89
3947 89 -159 -714 -492 -701 -945 -602 -248 -288 -549 -279 -688 -1072 -1273 -1178 -1207 -956 -565 -362 -450 -492 -691 -1009
3969 -1009 -1084 -914 -770 -248 242 165 -130 314 -567 -644 -331 -39 137 250 428 564 547 330 279 -77 205
3990B05K10N53N9O4j08k60k25k66o4N10J70K41k00O7J89m86l96k08m32M45N2M69
4012E89J18m51j48k20j74n1K41j12J45j35J20j55l78r2k73J1J21j14N41K50j50
4033c17o3l18pl53J39M46j18L72L09l93j21j60l2r8K03K14K90L24k19N3k0m76
4055c45O9J08K50j17N17J71k1k01k56l39J85L11J5L09K66j66J31k73l29J31l12
4076A04O8M49M50K2k27j58m30J82n01k10N01O8J48J1j96m02j10m8J5j68K30M3
4098a59J74j06m6k61r7o78Q2M00QM01j08j01k7r0l32p2L14nl0N39P9K6n34j65
4122g88lL8O01R9l4K26P0j56J25j94j91M32j70N75K4N8J65k24j56j09M5K61K7
4145G21M80j77j3k14j79L8l56L7nK43K08K12o03L26n10l96J35j02o5J68K62o6
$$ plain form
3990 205 415 968 1027 1091 983 723 498 232 168 678 848 1089 889 956 1145 659 263 55 -377 68 120 589
4012 589 707 256 108 -112 -286 -337 -96 -208 -63 -198 -78 -233 -611 -703 -976 -965 -844 -958 -417 -167 -317
4033 -317 -380 -698 -705 -1058 -919 -473 -591 -219 90 -303 -424 -584 -616 -714 -511 -297 -7 317 98 151 131 -345
4055 -345 -276 -168 82 -35 482 653 632 431 175 -164 21 332 347 656 922 756 887 614 285 416 104
4076 104 172 621 1071 1093 866 708 278 460 -41 -251 250 318 466 477 281 -121 -231 -279 -264 -432 -202 -159
4098 -159 15 -91 -137 -398 -495 -1173 -1091 -691 -683 -282 -390 -491 -518 -608 -940 -1012 -698 -703 -733 -194 -115 -89 -623 -788
4122 -788 -791 -753 -152 -53 -87 139 209 53 178 -16 -207 225 55 630 654 712 877 653 497 388 433 694 721
4145 721 1201 1024 1011 797 618 656 300 337 332 575 783 995 392 718 208 -188 -53 -155 -220 -52 210 144
4167A44j37k31j64l95l91M44K44k90M13j30P2n13j11K4Q4o7J39L18L4J6O0l63
4189h00k00J3K86K09L15K31J65l43K01k06M2L03p9J73M92k37K05r6M6l19J85k92
4211B94N18K26J93R2j54l74j01k37N9L69J78m99K84J64m11m15m24J96kJ71J50
4232B77j30r4J49l65k73k43K22m19K43K29j05Q5k86j6l16m5o4M13K9N1K9J79l37
4255g87j23m64L11M03k1M21K41J02M2o43L75l90J65J96L89J47K23Q9j23k90O1
4276C24M8L5j61K73L95o6J44m97P7j07j60L42P0j1N3P4j09m96j9j10l0K80j58
4299A91K96L0k66j71k39j20J52q8K39j62J52J3l99j82m6k29N3J36K04N6J94r5
4321b81k73L9m69K83O8M3K39o5Q4J51j43k82j64M27r7L11Q1K4K6K89o69Q5m0L37
$$ plain form
4167 144 7 -224 -388 -783 -1174 -730 -486 -776 -363 -493 -421 -934 -1045 -1021 -937 -1004 -865 -547 -513 -497 -437 -800
4189 -800 -1000 -987 -701 -492 -177 54 219 -124 77 -129 -87 216 137 310 802 565 770 674 720 401 586 294
4211 294 812 1038 1231 1323 1169 795 694 457 516 885 1063 564 848 1012 601 186 -238 -42 -44 127 277
4232 277 147 53 202 -163 -436 -679 -457 -876 -633 -404 -509 -424 -710 -726 -1042 -1087 -1151 -738 -709 -658 -629 -450 -787
4255 -787 -910 -1374 -1063 -660 -681 -260 -19 83 125 -518 -143 -533 -368 -172 217 364 587 676 553 263 324
4276 324 372 407 246 519 914 848 992 495 572 465 305 647 717 706 759 833 724 228 209 99 69 349 191
4299 191 487 517 251 80 -159 -279 -127 -215 24 -138 14 27 -372 -554 -600 -829 -776 -640 -436 -380 -186 -281
4321 -281 -554 -515 -984 -701 -633 -590 -351 -416 -332 -181 -324 -606 -770 -343 -440 -129 -48 -24 2 291 -378 -293 -333 4
4345DK08K08K34k12k40K65j54j56k16N63M0ML65P9k92j56k90Q7l3L26j14K60q7
4368F93M7k01j37k07m3LK58L1L18k52l38l08n23J3M9M86k38M00j26k55P7j07r2
4391d52k66M5m6J70lJ69k50J08j03k65M03k02L4L07J45j05m9p1n08K40P93l08
4413b14L30J41J09m76K95l03L81P0Q9n2L81K10k28Nm6j90k24M35K02J7j25K75
4435A082K2q6o39M36m04J62Np3K21k98Q9k86l68k8L5j2K8p8K47k42k25M5j51j23
4459f41j97J11L70L2q9k08R7k20k21K65j44K29J66K41k05mM3m74L10J08J05K99
4481b7rM76m02J7M4j29Nk0O47J14k69J50O3k70k81P9K54j08L03J22k91L75l01
4504E42J11J1o65O03J38j15J7m37J65K98p20j25k2K86J8L20l17J11o4m37m9k58
$$ plain form
4345 4 212 420 654 442 202 467 313 157 -59 504 544 548 913 992 700 544 254 341 308 634 520 780 693
4368 693 740 539 402 195 152 155 413 444 762 510 172 -136 -659 -646 -597 -111 -349 51 -75 -330 -253 -360 -452
4391 -452 -718 -673 -719 -549 -552 -383 -633 -525 -628 -893 -490 -692 -658 -351 -206 -311 -360 -431 -939 -699 94 -214
4413 -214 116 257 366 -110 185 -118 263 333 422 370 751 961 733 738 692 502 278 713 915 932 807 1082
4435 1082 1104 1018 379 815 411 573 578 505 726 428 517 231 -137 -165 -130 -142 -114 -192 55 -187 -412 -367 -518 -641
4459 -641 -838 -727 -357 -325 -414 -622 -525 -745 -966 -701 -845 -616 -450 -209 -414 -418 -375 -849 -539 -431 -326 -27
4481 -27 -36 440 38 55 99 -30 -25 -45 602 716 447 597 660 390 109 188 442 334 637 759 468 843 542
4504 542 653 664 -1 602 740 625 642 205 370 668 -52 -177 -199 87 105 425 108 219 155 -282 -331 -589
4526e89K50p0mK08K01j95k56j29r7LQ6R9J93K1O5l06J65p2m29L77q6J47K55L27
4550A64m61o3L81m48M32j54J75J02J91k25j51K19l23J09O8J39L1n1N62n0j13k09
4572C25J76k21k37K51K07J25N5j21k04j48k59Q6K69J34j95J6n1r7j34k39N4N9
4594a49k35N37J58k00j4j31l17O3L7k08J13Q5m9J91j1l48J8l20K41J11o6J23K24
4617a47p0N5k30k17J31n2K09J10j01J17oL9n40L94J39k3K98N9k57K39k0K56n56
4640a73K04J43L0K66r3K11l37K14l09K91k28J49L71l5R9q2j16m17m26M94l20K53
4662A89N8k33M17j18m27J43mn34J87N4K87j92L02m75k04J1j89P3J07MK6K36p2
4685c54J23k31l93K54j42J21K99J64J6j05n7l1pj26J06K58J06K19j06q7K78k60
$$ plain form
4526 -589 -339 -409 -413 -205 -4 -199 -455 -584 -681 -678 -592 -493 -300 -279 -214 -520 -355 -427 -856 -479 -565 -418 -163 164
4550 164 -297 -360 21 -427 5 -149 26 128 319 94 -57 162 -161 -52 16 155 186 135 697 647 534 325
4572 325 501 280 43 294 501 626 681 560 356 208 -51 35 304 438 243 259 208 111 -23 -262 -208 -149
4594 -149 -384 153 311 111 97 -34 -351 -288 -251 -459 -346 -261 -310 -119 -130 -478 -460 -780 -539 -428 -494 -371 -147
4617 -147 -217 -162 -392 -609 -478 -530 -321 -211 -312 -195 -201 -162 -702 -308 -169 -192 106 165 -92 147 127 383 -173
4640 -173 31 174 204 470 377 588 251 465 156 447 219 368 739 704 803 721 605 188 -238 256 -64 189
4662 189 247 14 431 313 -114 29 25 -509 -322 -268 19 -173 129 -346 -550 -539 -728 -655 -548 -544 -518 -282 -354
4685 -354 -231 -462 -855 -601 -743 -622 -323 -159 -143 -248 -305 -336 -343 -469 -363 -105 1 220 114 27 305 45
4707D5n9j50N56J54k35J77k02mNN8K4M36l37M53k61k14j05k53J03q4J47o0K81
4730D75k46j83j06L4k51j61L0K15r1M64m64L09k49k09j03J8J37J04mP1r4r9o4
4753d67K3k0J07k10L17q2J93j41l9k52M74n93N27j16K79J32j77L18m61J28j93
4774b53R1jN18O0j94L75j74n33M54j27o5L51l7l88M74n8jMl14j33k8q2O42l47
4798B34k3K81k51r6k49J91p0n6K22J43k99R0m57M1J13NK23K19k86L11l26n5n5
4821a50j10rq5L5M17O5m03rK5j97P9Q5J74k59L87M9q4j01k88L41l64J78M33j91
4845A8j9P6J55p6j42l04K8M2R7L53j00K57J2k76j52j19K36k49K83J06J52J77k60
4868B95j01K31m58K58m3k07M60K2k45J1l37j19K29nJ88k46L69k38J3k23P8j05
$$ plain form
4707 45 -14 -164 392 546 311 488 286 282 287 345 369 805 468 921 660 446 341 88 191 107 254 194 475
4730 475 229 46 -60 -26 -277 -438 -408 -193 -284 180 -284 25 -224 -433 -536 -518 -381 -277 -281 -210 -304 -403 -467
4753 -467 -444 -464 -357 -567 -250 -332 -139 -280 -319 -571 -97 -690 -163 -279 0 132 -45 273 -188 -60 -253
4774 -253 -162 -163 355 415 221 596 422 -111 343 216 151 502 465 77 551 493 492 496 182 49 21 -61 581 234
4798 234 211 492 241 145 -104 87 17 -39 183 326 27 117 -340 -299 -186 -181 42 261 -25 286 -40 -95 -150
4821 -150 -260 -269 -354 -319 98 163 -240 -249 -224 -421 -342 -257 -83 -342 45 94 10 -91 -379 -38 -402 -224 209 18
4845 18 -1 75 230 154 12 -292 -264 -222 -125 228 128 385 397 121 -31 -150 86 -163 120 226 378 555 295
4868 295 194 425 -33 225 182 -25 435 457 212 223 -114 -233 -4 -9 179 -67 302 64 77 -146 -68 -173
$$ [...]
8191b70
##END NTUPLES=NMR FID
##END=
