##TITLE=1H_LR-679-MC3-2
 CDCl3, 8 sc, 
 2.7.2019
##JCAMPDX= 6.0         $$ Bruker NMR JCAMP-DX V2.0
##DATA TYPE= NMR FID
##DATA CLASS= NTUPLES
##ORIGIN= UXNMR, Bruker Analytische Messtechnik GmbH
##OWNER= root
$$ XWIN-NMR		Version 3.5
$$ Tue Jul  2 15:18:46 2019 Russian Standard Time (UT+4h)  she@DPX200
##.OBSERVE FREQUENCY= 200.13155
##.OBSERVE NUCLEUS= ^1H
##.DELAY= (6, 6)
##.ACQUISITION MODE= SIMULTANEOUS
##.ACQUISITION SCHEME= undefined
##.AVERAGES= 8
##.DIGITISER RES= 18
##SPECTROMETER/DATA SYSTEM= spect
##.PULSE SEQUENCE= zg30
##.SOLVENT NAME= CDCl3
##.SHIFT REFERENCE= (INTERNAL, CDCl3, 0, 15.7039)
##AUDIT TRAIL= $$ (NUMBER, WHEN, WHO, WHERE, WHAT)
$$ ##TITLE= Audit trail, XWIN-NMR		Version 3.5
$$ ##JCAMPDX= 5.01
$$ ##ORIGIN= Bruker BioSpin GmbH
$$ ##OWNER= she
$$ F:/spectra/data/she/nmr/H-F/1/audita.txt
$$ ##AUDIT TRAIL=  $$ (NUMBER, WHEN, WHO, WHERE, WHAT)
(   1,<2019-07-02 15:17:44.43 +0400>,<she>,<DPX200>,
      <created by zg, POWCHK disabled, PULCHK disabled
       configuration hash MD5:
       00 E9 B6 7A A2 85 ED C7 34 08 36 98 17 FE 4E 26
       data hash MD5: 16K
       52 D2 9D CE BE A3 BC 27 6D 76 CF 23 FE 5B 25 32>)
$$ ##END=
$$ 
$$ hash MD5
$$ ED 4D FD 3C D3 78 00 37 7B 6B 3E FF CF E7 E9 3E
##$RELAX= 
##$RELAX= 
##$RELAX= 
##$RELAX= 
##$RELAX= 
##$RELAX= 
$$ Bruker specific parameters
$$ --------------------------
##$DU= <F:/spectra>
##$EXPNO= 1
##$NAME= <H-F>
##$PROCNO= 1
##$TYPE= <nmr>
##$USER= <she>
##$AMP= (0..31)
100 100 100 100 100 100 100 100 100 100 100 100 100 100 100 100 100 100 
100 100 100 100 100 100 100 100 100 100 100 100 100 100 
##$AQSEQ= 0
##$AQ_mod= 1
##$AUNM= <au_zg>
##$AUTOPOS= <>
##$BF1= 200.13
##$BF2= 200.13
##$BF3= 200.13
##$BF4= 200.13
##$BF5= 200.13
##$BF6= 200.13
##$BF7= 200.13
##$BF8= 200.13
##$BYTORDA= 1
##$CFDGTYP= 0
##$CFRGTYP= 5
##$CHEMSTR= <none>
##$CNST= (0..31)
1 1 145 1 1 1 1 1 1 1 1 1 1 1 1 1 1 1 1 1 1 1 1 1 1 1 1 1 1 1 1 1 
##$CPDPRG= <>
##$CPDPRG1= <>
##$CPDPRG2= <>
##$CPDPRG3= <>
##$CPDPRG4= <mlev>
##$CPDPRG5= <mlev>
##$CPDPRG6= <mlev>
##$CPDPRG7= <mlev>
##$CPDPRG8= <mlev>
##$CPDPRGB= <>
##$CPDPRGT= <>
##$D= (0..31)
0 1.2 0 0 0 0 0 0 0 0 0 0.03 0 0 0 0 0 0 0 0 0 0 0 0 0 0 0 0 0 0 0 0 
##$DATE= 1562066263
##$DBL= (0..7)
120 120 120 120 120 120 120 120 
##$DBP= (0..7)
150 150 150 150 150 150 150 150 
##$DBP07= 0
##$DBPNAM0= <>
##$DBPNAM1= <>
##$DBPNAM2= <>
##$DBPNAM3= <>
##$DBPNAM4= <>
##$DBPNAM5= <>
##$DBPNAM6= <>
##$DBPNAM7= <>
##$DBPOAL= (0..7)
0.5 0.5 0.5 0.5 0.5 0.5 0.5 0.5 
##$DBPOFFS= (0..7)
0 0 0 0 0 0 0 0 
##$DE= 6
##$DECBNUC= <off>
##$DECIM= 24
##$DECNUC= <off>
##$DECSTAT= 4
##$DIGMOD= 1
##$DIGTYP= 9
##$DL= (0..7)
0 120 120 120 120 120 120 120 
##$DP= (0..7)
150 150 150 150 150 150 150 150 
##$DP07= 0
##$DPNAME0= <>
##$DPNAME1= <>
##$DPNAME2= <>
##$DPNAME3= <>
##$DPNAME4= <>
##$DPNAME5= <>
##$DPNAME6= <>
##$DPNAME7= <>
##$DPOAL= (0..7)
0.5 0.5 0.5 0.5 0.5 0.5 0.5 0.5 
##$DPOFFS= (0..7)
0 0 0 0 0 0 0 0 
##$DQDMODE= 0
##$DR= 18
##$DS= 0
##$DSLIST= <SSSSSSSSSSSSSSS>
##$DSPFIRM= 0
$$ [...]
##$SUBNAM2= <"">
##$SUBNAM3= <"">
##$SUBNAM4= <"">
##$SUBNAM5= <"">
##$SUBNAM6= <"">
##$SUBNAM7= <"">
##$SUBNAM8= <"">
##$SUBNAM9= <"">
##$SW= 24.9336996594482
##$SWIBOX= (0..15)
0 0 2 0 0 0 0 0 0 0 0 0 0 0 0 0 
##$SW_h= 4990.01996007984
##$TD= 16384
##$TD0= 1
##$TE= 0
##$TE2= 300
##$TE3= 300
##$TEG= 300
##$TL= (0..7)
0 120 120 120 120 120 120 120 
##$TP= (0..7)
150 150 150 150 150 150 150 150 
##$TP07= 0
##$TPNAME0= <>
##$TPNAME1= <>
##$TPNAME2= <>
##$TPNAME3= <>
##$TPNAME4= <>
##$TPNAME5= <>
##$TPNAME6= <>
##$TPNAME7= <>
##$TPOAL= (0..7)
0.5 0.5 0.5 0.5 0.5 0.5 0.5 0.5 
##$TPOFFS= (0..7)
0 0 0 0 0 0 0 0 
##$TUNHIN= 0
##$TUNHOUT= 0
##$TUNXOUT= 0
##$USERA1= <user>
##$USERA2= <user>
##$USERA3= <user>
##$USERA4= <user>
##$USERA5= <user>
##$V9= 5
##$VALIST= <valist>
##$VCLIST= <CCCCCCCCCCCCCCC>
##$VD= 0
##$VDLIST= <DDDDDDDDDDDDDDD>
##$VPLIST= <PPPPPPPPPPPPPPP>
##$VTLIST= <TTTTTTTTTTTTTTT>
##$WBST= 1024
##$WBSW= 4
##$XGAIN= (0..3)
0 0 0 0 
##$XL= 0
##$YL= 0
##$YMAX_a= 140464
##$YMIN_a= -186593
##$ZGOPTNS= <>
##$ZL1= 120
##$ZL2= 120
##$ZL3= 120
##$ZL4= 120
##$ABSF1= 10
##$ABSF2= 0
##$ABSG= 5
##$ABSL= 3
##$ALPHA= 0
##$AQORDER= 0
##$ASSFAC= 0
##$ASSFACI= 0
##$ASSFACX= 0
##$ASSWID= 0
##$AUNMP= <proc_1d>
##$AZFE= 0.1
##$AZFW= 0.1
##$BCFW= 1
##$BC_mod= 2
##$BYTORDP= 1
##$COROFFS= 0
##$CY= 11.3945322036743
##$DATMOD= 1
##$DC= 2
##$DFILT= <>
##$DTYPP= 0
##$F1P= 18.9103706918063
##$F2P= -1.10871071338519
##$FCOR= 0.5
##$FTSIZE= 0
##$FT_mod= 4
##$GAMMA= 1
##$GB= 0.15
##$INTBC= 1
##$INTSCL= 1
##$ISEN= 128
##$LB= 0.24
##$LEV0= 0
##$LPBIN= 0
##$MAXI= 10000
##$MC2= 0
##$MEAN= 0
##$ME_mod= 0
##$MI= 1.114404
##$NCOEF= 0
##$NC_proc= 0
##$NLEV= 6
##$NOISF1= 3.799351
##$NOISF2= 2.8
##$NSP= 1
##$NTH_PI= 0
##$NZP= 0
##$OFFSET= 15.70392
##$PC= 1
##$PHC0= -8503.725
##$PHC1= 19.00097
##$PH_mod= 1
##$PKNL= yes
##$PPARMOD= 0
##$PSCAL= 0
##$PSIGN= 0
##$REVERSE= no
##$SF= 200.130013532006
##$SI= 16384
##$SIGF1= 3
##$SIGF2= 2
##$SINO= 400
##$SIOLD= 16384
##$SREGLST= <1H.CDCl3>
##$SSB= 0
##$STSI= 0
##$STSR= 0
##$SW_p= 3612.71676300578
##$SYMM= 0
##$S_DEV= 0
##$TDeff= 0
##$TDoff= 0
##$TI= <>
##$TILT= no
##$TM1= 0
##$TM2= 0
##$TOPLEV= 0
##$USERP1= <user>
##$USERP2= <user>
##$USERP3= <user>
##$USERP4= <user>
##$USERP5= <user>
##$WDW= 1
##$XDIM= 8192
##$YMAX_p= 0
##$YMIN_p= 0
$$ End of Bruker specific parameters
$$ ---------------------------------
##NTUPLES= NMR FID
##VAR_NAME=  TIME,          FID/REAL,        FID/IMAG
##SYMBOL=    X,             R,               I
##VAR_TYPE=  INDEPENDENT,   DEPENDENT,       DEPENDENT
##VAR_FORM=  AFFN,          ASDF,            ASDF
##VAR_DIM=   8192,          8192,            8192
##UNITS=     SECONDS,       ARBITRARY UNITS, ARBITRARY UNITS
##FACTOR=    0.0002004,     1,               1
##FIRST=     0,             0,               0
##LAST=      1.6414764,     0,               0
##MIN=       0,             -186593,         0
##MAX=       1.6414764,     140464,          0
$$ Real data points
##PAGE= N=1
##DATA TABLE= (X++(R..R)), XYDATA
0 0 0 0 0 0 0 0 0 0 8 -8 8 -8 16 -16 24 -24 32 -40 48 -56 64 -72 88 -98 113 -133 149 -169 193 -219 245
31 245 -277 310 -349 389 -431 482 -534 592 -656 728 -806 892 -987 1096 -1215 1349 -1501
48 -1501 1677 -1883 2120 -2406 2757 -3195 3763 -4536 5648 -7399 10576 -18194 75777 9864
62 9864 -115209 81306 133901 -41816 -119296 74441 140464 -33410 -108507 66520 123272
73 123272 -46490 -111116 55663 102444 -68299 -125724 38247 83692 -75810 -117015 45529
84 45529 76878 -91906 -131798 30125 63645 -93650 -117751 49377 76279 -89834 -119662
95 -119662 42047 66276 -95845 -119412 44180 68776 -89441 -108202 56717 84245 -67564
106 -67564 -84569 69752 84163 -71749 -87909 64878 81901 -61538 -66782 83110 90000
117 90000 -56249 -59008 87048 89468 -52443 -47659 95617 88541 -56152 -49116 93651 83554
129 83554 -59517 -48870 91804 76338 -66723 -51480 91082 77419 -61846 -46195 89265
140 89265 67607 -73066 -57751 74128 52970 -79244 -58102 70358 46470 -79489 -53486
151 -53486 70614 42660 -79781 -51738 64606 29473 -89454 -54626 62127 26069 -87964
162 -87964 -49444 63548 23043 -89107 -46614 66885 26180 -83770 -40837 68224 23409
173 23409 -85046 -40105 67294 23250 -80904 -34233 69649 24448 -75368 -25669 75118
184 75118 27615 -69185 -19233 74853 22265 -71075 -17292 74854 20786 -67855 -10420 78363
196 78363 21138 -64910 -4621 81147 20053 -64553 -2974 79283 15371 -66813 -2782 77913
208 77913 12845 -66846 -1605 76339 10340 -65682 1090 76063 8920 -65348 954 70881
220 70881 1898 -68002 120 66821 -2942 -68302 1170 64309 -6447 -67928 3979 63703
232 63703 -9260 -68855 2977 59376 -15048 -71645 2472 58197 -16484 -70669 3823 57087
244 57087 -16897 -69035 5065 56113 -17778 -67328 5681 53794 -19101 -65177 8068 53241
256 53241 -19274 -62025 11827 53794 -18902 -57793 16600 54953 -19188 -56043 19172 55337
268 55337 -19956 -54248 22576 57155 -19169 -51995 25277 58713 -17695 -49662 27633 59052
280 59052 -17871 -48817 27394 57052 -18586 -47012 28539 55908 -19430 -45471 28708 53199
292 53199 -21016 -44223 29424 50515 -23750 -44074 28876 46726 -27200 -44650 28856 44225
304 44225 -29862 -44826 29160 42455 -31915 -44924 28857 40419 -33829 -45305 27762 38689
316 38689 -34575 -44934 27636 37184 -34313 -43187 27215 35843 -33165 -40907 27560 33964 -32974
329 -32974 -38263 28343 32820 -32501 -35064 30185 31688 -32727 -32379 32087 31483 -32563 -30236 34209
343 34209 31400 -32909 -28994 35473 31357 -32809 -27828 36455 31430 -32545 -27029 36512 30867
356 30867 -31937 -26102 35970 29513 -31409 -24678 34961 27467 -31293 -23150 34282 25201 -31607
369 -31607 -21360 34160 22889 -32474 -20219 34416 20704 -33632 -18937 34588 18994 -34647
381 -34647 -18526 34604 17572 -35254 -18125 34513 16602 -35488 -17765 33814 15354 -35348
393 -35348 -17074 33047 14600 -34726 -16047 31616 12630 -33906 -14733 30769 11204 -33226
405 -33226 -12823 30366 9428 -32865 -11229 30349 7908 -32605 -8961 30958 6551 -32551
417 -32551 -7176 31726 5983 -32415 -5685 32378 5596 -31853 -4542 33052 5682 -31439
429 -31439 -3677 32933 5275 -30123 -2038 32808 5189 -28731 -668 32193 3706 -27962
441 -27962 680 31131 2252 -27400 2241 30963 543 -27358 3524 30318 -1169 -27893
453 -27893 4022 29602 -3068 -28334 4102 28836 -4551 -29249 3798 28000 -5573 -29146
465 -29146 3746 26879 -6444 -28966 3788 25584 -7676 -28867 3928 24103 -8362 -27983
477 -27983 4607 23599 -9068 -26971 6077 23089 -9522 -26097 7069 23162 -10138 -25243
489 -25243 8599 23299 -10248 -24245 9988 24161 -9757 -23007 11591 24676 -9595 -22185
501 -22185 12250 24550 -9612 -21716 12718 24090 -9756 -20853 13158 24055 -9665 -19817
513 -19817 13849 23170 -10766 -19894 13758 21762 -12244 -19953 13837 20697 -13389 -19970 14263
526 14263 20260 -14352 -20142 14100 19316 -15335 -20473 13473 18030 -16174 -20959 13202 17039
539 17039 -16318 -20009 13442 16739 -15942 -18949 13718 16090 -16375 -18251 13766 15074 -16573
552 -16573 -17176 14472 15097 -16200 -15875 15593 15149 -15807 -14864 16426 15083 -16087 -14498 16249
566 16249 14624 -15978 -14035 16130 14338 -15534 -13383 16541 14242 -14945 -12468 16425 13153
579 13153 -15480 -12705 15602 11659 -16252 -11901 15533 11122 -15867 -10789 15909 10676 -16369
592 -16369 -10363 16185 9649 -17107 -10417 15781 8835 -17540 -10426 16225 8864 -17163 -9389
605 -9389 16692 9191 -16240 -8879 16582 8911 -16296 -8979 15670 8201 -15655 -7850 15712
618 15712 8045 -14594 -6537 15738 7507 -14016 -5693 15392 6456 -14618 -5344 14935 5288
631 5288 -14921 -5198 15173 5088 -14889 -4819 15246 4740 -14910 -4880 14488 4137
643 4137 -15415 -5471 13464 3522 -15089 -5331 12951 3531 -14101 -4468 12622 3503 -13511
656 -13511 -4097 12236 2288 -13405 -3321 11984 1708 -12927 -2099 12590 1925 -12009
668 -12009 -825 13219 1930 -11736 -375 13549 1764 -11934 -174 13519 1789 -11674
680 -11674 518 13934 2135 -10626 1065 13830 2066 -10430 944 12698 1387 -10386
692 -10386 874 11888 565 -9874 1275 11199 -308 -9784 1580 10546 -1433 -10119 1507
705 1507 9524 -2532 -10840 1042 9162 -3385 -11080 1459 9048 -3388 -11048 1553 9090 -3780
719 -3780 -11425 1201 8225 -3883 -10985 959 8040 -3708 -10177 1810 8081 -3233 -8974 2744
733 2744 7968 -3771 -8490 3333 7831 -4086 -8132 4047 7826 -3796 -7358 4857 8594 -3763
747 -3763 -7059 5326 8750 -3667 -7091 5450 8409 -4078 -7030 5389 8356 -3782 -6430 5590
761 5590 8389 -3551 -6104 5422 7645 -4073 -6049 5181 6887 -4525 -6133 5079 6293 -4881
775 -4881 -5792 5255 6155 -5026 -5742 5269 5495 -5645 -6055 5061 5088 -5823 -6305 4734 4940 -5893
791 -5893 -5946 4871 4752 -5900 -5763 4562 4431 -5661 -5671 4417 4383 -5603 -5394 4511 4176 -5441 -4692
808 -4692 4997 3954 -5506 -4028 5198 3728 -5541 -4207 5397 3759 -5649 -3805 5679 4360 -5212
823 -5212 -3437 6078 4349 -4880 -3195 5935 4257 -4969 -3076 5828 4195 -4438 -2815 5901 3890
838 3890 -4445 -2176 5770 3538 -4414 -1896 5521 3115 -4596 -2173 5297 2496 -4970 -2223 5441
853 5441 2682 -5318 -2296 5130 2290 -5413 -2494 4669 1738 -5346 -2681 4241 1405 -5221 -2675
868 -2675 3954 1329 -5363 -2553 3645 1097 -5240 -2449 3623 439 -5030 -1844 3610 302 -4562
883 -4562 -1438 3807 332 -4583 -694 4066 758 -4240 -540 4738 941 -3931 -222 4836 1261
898 1261 -3574 30 4700 1324 -3192 72 4687 1233 -2824 401 4366 1207 -2810 464 3995
913 3995 936 -2801 712 3615 414 -2819 895 3490 -274 -3200 728 3156 -726 -3455 470
928 470 3211 -1031 -3593 141 2958 -1174 -3848 -2 2671 -1324 -3767 -140 2299 -1147 -3523
943 -3523 -129 1912 -1227 -3209 206 1938 -1218 -2808 666 2022 -1424 -2584 1019 2040 -1474
958 -1474 -2305 1518 2435 -1484 -2060 1991 2582 -1110 -2077 2114 2653 -1096 -1789 2090 2872 -1164 -1723
975 -1723 1832 2704 -1085 -1936 2024 2419 -1226 -1582 1869 1918 -1344 -1560 1759 1761 -1781 -1563 1970 1391
993 1391 -1950 -1351 2039 1356 -2328 -1458 2100 1356 -2469 -1834 1951 1291 -2684 -1786 2057 1385 -2469
1010 -2469 -1682 1928 1281 -2254 -1670 1779 1083 -2116 -1473 1861 1094 -2201 -1074 1860 1003 -1784 -879
1027 -879 2034 731 -2079 -637 2234 736 -2148 -554 2105 776 -2467 -791 2445 985 -2215
1042 -2215 -842 2442 775 -2165 -642 2334 1028 -1977 -868 2290 1011 -1963 -792 2161 936
1057 936 -1843 -464 1877 886 -1713 -401 2108 567 -1572 -386 2131 455 -1813 -371 1914
1072 1914 572 -2070 -265 2249 302 -2191 -256 2061 312 -2080 -567 2046 337 -2126 -520
1087 -520 1568 333 -2030 -560 1569 149 -1944 -667 1368 49 -1918 -504 1394 -105 -1679
1102 -1679 -304 1205 -278 -1859 -21 1205 -11 -1721 -1 1625 179 -1703 17 1726 224
1117 224 -1349 21 1874 312 -1324 -47 1744 337 -1038 235 1430 604 -604 322 1368 304
1133 304 -611 393 1532 296 -573 528 1442 -78 -660 306 1279 -6 -945 298 1212 -506 -1079
1150 -1079 213 677 -280 -1049 15 588 -408 -1046 -319 355 -606 -1321 -252 241 -510 -997 -173 40 -694
1169 -694 -737 12 306 -707 -528 46 80 -572 -603 417 211 -545 -348 661 667 -478 -174 514 711 -130
1189 -130 -57 620 662 -16 21 581 680 96 124 715 636 164 189 877 113 -99 254 586 72 -428 433 484 -44
1212 -44 -409 -44 534 -426 -645 -124 574 -415 -849 -187 348 -288 -780 -230 362 -325 -698 -137 155 -307
1232 -307 -725 196 296 -464 -619 128 325 -421 -520 253 413 -639 -465 557 695 -471 -450 650 722 -461
1252 -461 -690 517 687 -489 -542 562 799 -258 -447 582 896 -318 -360 478 678 -305 -430 430 492
1271 492 -295 -331 664 474 -360 -365 528 430 -739 -343 640 362 -886 -518 512 366 -926 -628 741 455
1291 455 -726 -800 586 554 -609 -537 759 620 -537 -427 655 465 -612 -355 482 258 -616 -229 705
1310 705 253 -506 -319 556 284 -902 -223 599 -67 -930 -410 673 276 -890 -437 706 232 -912
1328 -912 -355 856 131 -853 -70 620 129 -910 -387 605 120 -719 -203 507 113 -691 82 591 134
1347 134 -662 -115 637 -153 -455 237 836 67 -714 180 898 14 -646 166 895 86 -765 -47 913 285
1367 285 -624 211 806 -63 -597 -31 644 -250 -561 54 577 -256 -528 100 546 -379 -665 94 596 -371
1387 -371 -883 314 550 -376 -801 21 538 -479 -748 130 528 -517 -840 252 657 -593 -829 342
1405 342 816 -496 -705 409 625 -413 -661 386 597 -303 -546 578 945 -276 -242 743 601 -503
1423 -503 -473 842 749 -518 -415 841 883 -364 -445 725 771 -560 -447 763 663 -677 -717 548 496
1442 496 -784 -645 682 665 -685 -820 621 394 -925 -586 419 406 -876 -714 732 274 -1071 -921
1460 -921 649 217 -925 -607 860 431 -1000 -683 1035 516 -981 -559 955 624 -1027 -491 1095
1477 1095 619 -774 -666 1000 692 -671 -421 1249 592 -645 -299 1144 643 -685 -383 789 436
1494 436 -880 -498 778 436 -956 -478 1090 422 -977 -641 905 628 -979 -439 945 467 -1029
1511 -1029 -502 831 261 -892 -498 826 351 -1085 -441 972 533 -1113 -455 956 280 -909 -172
1528 -172 722 305 -925 -187 993 227 -1074 -231 1034 367 -1115 -230 1221 392 -863 -343 1126
1545 1126 321 -868 -135 913 315 -809 -294 1027 243 -827 -155 960 132 -967 -113 728 207
1562 207 -893 -22 695 132 -974 -122 878 -66 -983 -112 873 -196 -998 -160 952 -59 -778 -223
1580 -223 938 -40 -924 65 967 30 -753 -178 884 -69 -708 -97 732 132 -721 459 721 100 -814
1599 -814 127 683 -61 -665 26 773 56 -845 170 1032 -141 -728 324 825 -340 -1043 161 773
1617 773 -348 -740 159 766 -482 -885 273 690 -190 -860 243 651 -337 -878 132 449 -576 -652
1635 -652 405 439 -563 -751 237 538 -495 -617 213 561 -185 -526 446 464 -673 -796 543 750 -470
1654 -470 -598 645 747 -481 -584 417 685 -411 -467 426 710 -383 -692 417 449 -561 -630 479
1672 479 446 -866 -635 289 470 -742 -564 569 592 -616 -599 611 484 -862 -527 435 402 -602 -529
1691 -529 706 416 -583 -534 658 593 -595 -404 569 604 -446 -358 741 431 -497 -245 882 507 -746
1710 -746 -158 781 399 -685 -272 833 540 -754 -481 773 340 -880 -392 742 483 -893 -421 745
1728 745 176 -898 -352 620 365 -749 -422 767 400 -954 -302 938 86 -860 -452 758 180 -893
1746 -893 -214 826 117 -745 -416 978 378 -848 -273 792 227 -846 -245 989 26 -789 -395 1018
1764 1018 428 -905 -117 996 275 -690 34 942 260 -779 -331 758 237 -806 41 874 280 -651
1782 -651 10 946 82 -877 35 905 279 -954 -133 771 15 -946 -98 792 33 -931 -2 627 -133 -1018
1802 -1018 -266 674 -24 -803 26 616 124 -920 49 765 -156 -762 -25 860 37 -802 -102 700 68
1821 68 -704 19 926 -10 -589 82 985 155 -597 155 1007 -90 -733 154 649 134 -829 180 725 -129
1841 -129 -771 47 699 150 -765 -42 655 -280 -879 113 505 -332 -838 67 571 -250 -807 174 703 -269
1861 -269 -758 309 688 -303 -718 311 713 -392 -788 251 528 -222 -965 299 755 -289 -650 389
1879 389 691 -176 -731 175 574 -337 -568 423 672 -298 -602 457 678 -224 -555 423 514 -509 -682 505
1899 505 765 -322 -605 365 540 -375 -569 447 617 -520 -535 613 628 -529 -683 369 570 -367 -438
1918 -438 545 386 -603 -409 631 598 -366 -355 551 486 -378 -495 241 391 -341 -526 436 458 -440 -501 791
1939 791 410 -510 -565 593 593 -502 -563 561 537 -454 -590 651 485 -569 -451 667 366 -557 -606 517
1959 517 300 -539 -342 603 415 -661 -334 584 342 -570 -459 708 273 -645 -137 773 292 -508 -478 610
1979 610 218 -650 -248 670 531 -604 -145 885 514 -545 -439 486 342 -638 -245 697 295 -431 -356
1998 -356 724 438 -506 -238 716 404 -629 -348 697 196 -764 -475 646 304 -795 -215 550 396
2016 396 -641 -514 766 346 -831 -276 798 284 -717 -129 641 92 -824 -287 580 127 -641 -123
2034 -123 575 187 -495 -98 695 137 -606 -112 522 267 -560 -184 716 50 -656 -54 643 262 -660 -190
2054 -190 846 236 -543 -56 916 187 -651 -135 602 258 -664 -177 664 205 -714 18 702 -52 -631 -336
2074 -336 675 122 -494 -227 510 -77 -616 -274 506 -178 -686 41 512 84 -661 -34 571 51 -707 54
2094 54 560 -46 -815 -30 580 98 -462 85 436 -48 -567 65 679 -96 -633 -75 447 103 -440 174
2114 174 354 -35 -709 125 674 -128 -613 162 557 6 -475 46 550 149 -771 130 433 -159 -489 63
2134 63 391 -171 -596 80 470 -61 -465 201 398 -312 -701 7 327 -305 -522 192 484 -154 -443 134
2154 134 276 -370 -658 141 622 -482 -419 144 498 -277 -407 443 578 -387 -392 360 367 -192 -436 24 478
2175 478 -251 -297 308 250 -200 -309 205 399 -302 -266 364 300 -267 -355 136 341 -396 -313 330 284 -295 -341 353
2198 353 360 -424 -355 349 450 -329 -357 483 182 -218 -393 201 180 -261 -388 365 219 -423 -462 298 423 -162
2220 -162 -359 352 278 -185 -227 336 180 -480 -318 413 24 -510 -235 432 46 -489 -385 563 362 -338 -274
2241 -274 386 224 -439 -456 579 388 -378 -271 523 342 -396 -361 206 100 -526 -150 467 279 -418 -219
2261 -219 386 324 -450 97 420 158 -541 -41 329 117 -408 -177 548 288 -526 -50 567 65 -508 -63
2281 -63 602 296 -448 -264 492 241 -288 -213 327 245 -134 33 338 14 -466 -17 559 -33 -528 -95 378
2302 378 -7 -393 -297 429 -5 -400 -93 376 231 -425 -239 395 119 -335 -68 334 187 -393 -160 232
2322 232 115 -293 72 649 126 -530 4 391 -82 -527 37 395 -21 -473 -80 575 -96 -507 123 374
2342 374 -150 -602 135 470 -31 -415 1 527 -149 -419 183 224 103 -469 38 360 106 -291 -172 144
2362 144 -188 -268 39 243 -208 -365 292 237 -276 -326 195 197 -187 -285 12 296 -105 -353 -48 456 -75 -243
2384 -243 58 388 -67 -454 299 281 80 -276 243 207 -147 -156 87 538 -96 -342 120 315 -70 -422 343
2405 343 241 -76 -230 224 287 -170 -532 176 453 -146 -217 -5 144 3 -185 118 329 -193 -392 262 111
2426 111 -169 -266 335 449 -448 -570 169 222 -198 -215 165 299 -235 -339 316 361 -224 -353 273 402 -227
2447 -227 -503 37 168 -131 -205 174 271 -210 -366 153 176 -122 -105 149 241 -157 -383 158 312 -193 -18 417
2469 417 244 -290 -204 137 156 -136 -433 129 102 -162 -301 204 260 -209 -137 204 82 -365 -176 322 185 -362
2491 -362 -168 236 338 -205 -152 419 129 -303 -19 245 186 -262 -354 121 44 -260 -365 71 257 -369 -89
2512 -89 196 176 -182 -40 328 16 -232 -24 253 -13 -270 -26 124 236 -218 -180 310 -96 -211 16 249
2533 249 70 -265 -69 344 125 -291 -60 204 243 -295 -119 327 91 -392 -117 334 21 -171 -63 62
2553 62 28 -170 -104 169 -166 -29 38 283 55 -316 151 335 87 -240 -203 366 180 -353 -109 351 154 -241
2575 -241 -38 312 131 -243 11 183 86 -254 -164 253 31 -326 -96 427 165 -312 199 473 162 -178 -59
2596 -59 213 -40 -351 -82 225 75 14 4 56 192 -323 -44 192 196 -47 68 247 -152 -127 -36 314 252 -22
2619 -22 -52 328 205 -393 202 237 -30 -9 57 232 10 -1 -94 303 29 -196 3 320 116 -132 -249 308
2641 308 135 -169 -72 28 -98 -168 61 57 63 -238 189 155 35 -142 34 221 14 -41 184 152 -73 -92 118
2664 118 123 67 -202 -2 158 -100 -195 172 181 -234 -245 -120 40 -27 -83 105 148 -114 -193 146 185 21 -64 64
2688 64 83 -82 -153 74 76 16 -164 -36 145 -47 -389 221 256 138 -72 131 262 -78 -149 -10 172 -189 -236
2711 -236 -81 209 -115 -220 97 477 -26 -189 80 111 -170 -285 161 211 -184 -126 103 48 -24 -102 314 71
2733 71 -71 -180 104 319 7 -109 87 180 -115 -36 134 82 -65 -220 138 235 -124 -5 61 -7 -113 -161 1
2756 1 276 -134 -213 280 -1 -111 -101 195 239 25 -178 -22 95 -152 -31 73 40 -49 -161 143 85 -249 -140
2779 -140 205 82 -176 -180 302 39 -148 10 207 171 57 -57 194 -20 -6 -31 274 -18 -50 14 127 10
2801 10 -179 -65 134 39 -126 231 129 186 -195 -97 211 41 -367 -60 147 37 -192 177 28 105 -188 -81
2823 -81 99 -2 -114 -213 206 -156 -163 89 255 100 -323 -122 232 27 -158 -142 194 70 -117 31 70 -31
2845 -31 -129 -7 77 17 -200 24 162 -77 -176 145 140 137 -211 -146 101 -14 -137 -38 307 -2 -169 17 97 66
2869 66 -134 -219 154 -15 -113 -5 135 -79 -116 23 258 -8 -145 -15 6 90 -153 45 78 -159 53 -99
2891 -99 172 55 -265 -28 279 -30 -73 61 217 4 -125 -143 202 46 16 45 101 5 -168 31 64 114 -155
2914 -155 27 60 -75 -9 92 170 -212 -116 -168 10 120 -171 49 205 37 -111 -45 156 136 -100 -83 16 14 -38
2938 -38 60 -149 -129 -177 -74 -4 -44 -174 -65 105 -129 -61 33 12 108 -28 108 80 -42 -100 -63 40 -131 -125 -37
2963 -37 107 -114 -109 -17 68 84 103 77 9 -191 -39 -37 56 55 -138 240 45 -79 -214 74 183 67 142 161 177 -64
2989 -64 102 -11 80 -52 -128 105 125 -67 -27 -10 43 27 48 27 -38 -158 -67 122 20 -49 -70 25 4 -39 -148 -81
3015 -81 136 38 -132 -152 32 -144 -100 24 158 -43 -104 101 -74 158 -103 186 63 -80 139 -61 38 -47
3037 -47 -169 61 -18 86 -65 99 296 13 17 1 93 -124 -123 106 -46 -72 -131 29 -43 -110 -50 30 -35 -59 36 -30
3063 -30 132 -85 -178 -24 90 -105 107 156 65 -73 -7 47 24 122 -169 -18 -4 -92 -104 45 77 -206 105 -30
3087 -30 -4 5 40 -59 62 -7 -82 98 -5 -179 -27 79 85 90 -61 -18 -117 -84 -8 184 102 11 -48 69 5 -141 -1
3114 -1 149 105 -101 69 86 -15 -216 -92 -10 147 -28 115 147 233 -163 -196 -65 91 -119 -5 12 153 105
3137 105 -102 14 -68 -81 -67 53 29 -202 -113 14 50 92 155 -130 -84 -66 -58 47 47 51 -73 254 -71 185 -57
3162 -57 -170 28 -99 24 64 33 -192 -189 143 80 -27 10 -87 173 -105 -33 -2 -6 53 -120 245 -12 197 44
3186 44 131 25 -135 87 -12 -1 81 10 -118 -77 -13 -93 -109 -228 -146 38 40 24 -238 -101 42 231 118 56 -16
3211 -16 -45 -14 111 21 -198 -70 -204 191 -74 13 6 12 -49 48 28 -49 70 41 24 140 15 -121 -17 189 -105
3236 -105 -138 -24 34 79 78 109 -59 39 8 92 -178 0 139 -92 50 -50 -130 67 -90 86 20 72 60 64 94
3261 94 100 17 -26 -16 -18 64 111 6 80 24 -39 -152 17 -56 68 -8 85 15 25 16 100 15 -29 -17 164 39 -39 89
3289 89 -104 1 -73 -207 -97 -90 84 44 185 162 0 -70 216 -29 117 9 61 -2 -59 -16 -85 34 126 -266
3313 -266 238 39 40 44 0 123 8 -72 -62 -67 -153 -100 -2 141 103 -322 -107 -115 -86 -137 -40 -18 40 2 -90 25 3 21
3341 21 -138 -125 21 -226 -75 -15 33 -218 -78 18 77 110 44 24 94 -46 -139 -57 -110 -185 -142 109 -273 -34 161
3366 161 99 -47 -181 -148 70 27 -169 13 -99 -20 -67 -43 50 -14 86 -202 119 -17 -52 -95 -147 78 16 152
3390 152 45 111 -50 -129 -103 -51 46 73 -129 165 27 99 30 114 -21 -53 -94 -116 -15 45 -92 23 -41 52 -71
3415 -71 -44 -80 -94 -1 -9 -27 -98 -49 6 43 -9 -154 -158 -12 1 66 94 35 -95 135 -116 72 0 50 59 -158 -154 129
3443 129 24 -8 3 -202 98 106 13 -87 -70 -24 -93 224 -59 55 -4 -39 -12 164 181 130 -89 -224 264 58
3467 58 151 73 -51 52 63 75 160 -62 -56 44 122 -13 -142 -13 57 -34 -79 121 -52 -85 3 52 -46 -72 11 141
3493 141 -56 -111 22 53 -34 -146 78 -131 95 140 154 157 62 -167 100 90 -60 -34 3 96 -106 83 45 -143
3517 -143 31 117 160 -15 -59 88 -120 -153 -213 235 -121 1 108 104 53 -23 -148 12 137 73 -48 -257 -19
3540 -19 70 -112 224 142 -154 -139 -26 -125 -10 133 49 154 73 -152 -128 -6 -94 -36 80 -11 -161 111 13 -26
3564 -26 -50 173 -90 -14 -29 -79 -117 -35 -51 -123 -19 -163 129 -33 -21 -181 -68 98 -97 125 -102 -56 -17 96
3588 96 18 72 5 66 58 28 -124 115 29 105 -134 -2 -186 101 -81 29 72 105 -39 95 88 -156 -51 -72 -28
3613 -28 13 -186 -156 -65 16 174 145 7 -146 -80 -61 -45 135 -175 -35 121 145 -25 -56 44 81 152 -127 129
3637 129 86 -71 44 -30 84 60 -135 42 57 282 27 -177 152 -37 30 229 -92 -99 -80 72 -102 -34 212
3660 212 -97 -76 99 -52 -11 65 -28 13 50 174 117 -52 -15 217 217 174 36 161 78 -139 -110 -92 11 17 35 -8
3686 -8 0 216 -46 -47 -163 -45 -45 -116 0 -117 12 78 35 99 83 -6 24 -86 110 -134 -55 -146 37 -143 -95 38
3712 38 67 -58 -138 -177 -34 -1 50 59 2 -191 -114 -197 -73 17 4 170 -23 -14 -191 209 -12 35 40 25 -5 85 -172
3739 -172 -58 34 -45 3 44 -125 96 -53 97 -186 -79 2 4 239 -92 11 50 171 102 -52 60 -115 3
3762 3 -300 29 205 -185 -65 -100 64 75 70 -109 14 22 -33 -58 -28 -2 -14 -65 0 113 74 -210 19 -67 -41 204
3788 204 26 90 20 28 19 104 -170 24 22 -108 -81 -83 284 36 -34 99 -56 -17 -269 -101 22 55 -284 -20 68
3813 68 -87 133 10 26 -128 120 205 92 24 -189 247 -24 32 84 70 69 -76 -3 2 -73 -11 44 196 -87 89
3838 89 -56 -54 16 70 100 -122 -61 232 -57 -109 -74 31 -24 5 27 27 -78 70 -102 13 21 -68 67 60 -44 -71 21
3865 21 99 2 66 -104 -64 47 29 -91 -28 -48 -55 77 -29 -9 265 -162 -182 228 -31 -182 72 43 73 -157 -36
3890 -36 19 2 67 -25 55 -75 72 100 -140 119 23 144 109 58 253 -92 27 -8 -67 -99 157 -188 89 -28
3914 -28 -39 38 -112 -147 86 -153 -89 -88 -128 124 -48 78 32 -74 42 226 303 16 -96 37 -122 56 -90
3937 -90 196 118 65 -228 49 46 -83 35 -236 -104 38 45 57 51 32 -85 -70 -1 38 -26 -194 38 72 -119 56
3962 56 183 -64 64 -46 73 135 126 16 8 142 -53 -228 93 -117 157 8 -18 -25 -25 8 -64 124 37 -26 55
3987 55 165 -140 -133 234 147 89 36 151 113 7 -13 -112 0 -63 -188 73 7 -25 193 -101 -12 -141 -84 167 36
4012 36 -15 -178 72 99 -31 -103 -180 39 -31 -98 163 96 -148 202 7 -293 -132 -195 119 -65 -140 27 101 85
4036 85 -220 -85 -147 150 -93 235 182 28 117 -86 -168 104 -271 -33 121 19 174 39 42 75 -61 -56 -94 -10
4060 -10 64 -13 -54 -161 -119 119 17 6 109 -80 49 -50 -63 -1 142 4 -64 -141 -44 -58 -19 90 -12 205 -101
4085 -101 13 59 72 193 180 44 -69 -35 54 4 83 67 29 -30 294 60 -86 -121 -151 86 -7 128 116 -187 -190
4110 -190 -91 66 -97 95 -52 25 233 19 56 24 25 246 106 40 10 44 129 -177 -47 90 -97 -33 -125 -100
4134 -100 -41 29 -108 -97 69 0 -115 -83 -131 76 -160 59 -153 10 40 82 16 -44 5 75 -7 -59 -76 -27 129
4159 129 -202 -28 136 -175 -179 -44 -54 -45 -19 -86 7 81 18 126 126 -7 -102 29 158 89 77 -8 -94 133 -78 9
4185 9 -40 -54 -43 -85 -80 28 -1 -38 83 59 -55 -73 87 8 97 48 95 -59 -106 -97 -6 -29 -10 -91 119 -69 64 -22
4213 -22 -75 -97 15 38 -45 78 -72 -49 152 -84 22 24 5 -49 35 -40 -92 52 -199 -112 103 133 -65 -16 107
4238 107 143 52 -93 -66 -146 -91 88 -42 148 17 -109 -117 -54 21 154 33 -98 -58 35 158 -15 -57 -27 80
4262 80 7 87 -35 218 61 -141 -26 54 128 -134 68 29 3 -92 -193 -46 134 66 -56 198 81 -14 63 26
4286 26 -109 -60 -203 -79 -79 95 125 28 18 140 -106 -41 -95 -225 56 -54 42 -129 27 74 -215 137 140 -63
4310 -63 132 -182 -39 31 269 -174 -20 95 -43 -114 -252 -143 -48 -62 -39 175 -107 105 -92 152 62 96 24
4333 24 49 10 -117 96 -103 -138 11 155 -70 -48 -98 -232 -53 74 81 28 167 45 10 37 -9 -150 -145 -156 126
4358 126 -40 -104 34 -70 -57 -84 111 114 -167 -144 55 165 -60 -2 -147 9 53 -79 109 208 86 30 182
4381 182 61 -129 -52 -92 -44 -23 -144 71 50 22 86 -124 59 -113 -4 -9 156 -50 -30 -102 7 85 43 46 72
4406 72 -119 -151 -56 0 118 -144 48 26 -179 -128 127 -26 12 -98 92 83 38 -24 155 -17 -98 9 78 -13 210
4431 210 119 -95 22 -179 -63 25 -36 78 30 -120 102 -51 64 -18 -8 -156 -74 -31 23 -172 -3 40 102 -114
4455 -114 -38 94 -46 -47 -53 48 63 -35 -145 263 94 172 -174 180 -7 -13 -40 -142 -205 2 -62 120 151 -71 -182
4480 -182 13 -37 -104 13 21 17 -97 -55 126 39 62 -14 -23 -193 79 -96 -100 -119 -187 121 -16 -109 63 -52 63 -48
4506 -48 -101 -212 31 141 9 -69 -32 205 -180 103 8 -63 -62 84 -36 52 19 12 -21 -279 38 -61 123 72 -50
4531 -50 -154 -43 109 -14 -98 75 58 132 85 73 51 -16 61 104 -85 74 -9 -21 -175 -62 70 -94 -81 -79 -44
4556 -44 220 94 -18 35 88 -107 51 -36 25 60 -93 144 -19 66 -56 42 -89 -3 65 -40 153 61 -21 -28 14
4581 14 9 -123 -116 -34 -27 -41 78 25 84 -105 104 167 158 -123 137 51 -187 82 320 188 98 -126 23 0 -113 -89
4607 -89 -65 -22 -68 -2 -36 -27 -139 132 -118 275 -84 -478 -90 34 224 65 -168 129 -145 93 135 -72 -33
4630 -33 75 4 31 -74 35 -73 162 -2 70 41 117 -81 -67 92 65 65 190 192 65 -63 -111 58 251 -103
4654 -103 22 -92 108 -321 1 -70 169 -71 -68 41 20 19 -13 -33 -167 226 -185 246 -24 -31 -115 33 269 263
4678 263 -210 210 12 -110 -129 -193 -77 89 -208 -31 -63 26 4 -34 118 -66 -9 -205 60 -1 80 -14 96
4701 96 -129 -84 67 55 -17 143 110 171 9 69 100 95 31 13 127 143 147 -8 27 196 19 -1 182 -59 -46 -103
4727 -103 105 145 123 99 -141 -35 -6 2 170 247 -212 -8 -9 -79 -88 -29 225 95 -101 31 162 -2 -113 -103 5
4752 5 133 33 -41 133 103 -27 -44 186 -24 -75 11 149 25 -244 -103 77 103 130 -141 75 152 -34 -100 258
4776 258 299 129 151 104 55 -63 -52 -107 10 62 -18 -62 30 -200 -74 103 -66 51 -39 106 -122 67 135 162
4800 162 -72 38 -223 251 141 -125 81 -6 7 79 -58 -3 12 65 9 49 -75 96 -56 123 125 12 9 172
4824 172 88 -10 27 20 50 14 -158 -24 -161 -144 -44 9 -23 -22 -106 43 17 -15 -202 17 -79 -67 257 -20 69 182
4850 182 104 -11 -120 -179 4 246 -98 -31 -57 -8 78 73 48 0 265 -71 -204 -48 118 -98 78 -22 -62 4
4874 4 -48 -7 121 -94 -98 12 71 94 -62 211 28 83 66 128 50 -15 -44 -162 -75 5 106 -19 10 49 93 206
4900 206 -6 19 170 5 -3 -76 -118 113 -125 43 -57 48 -149 -157 42 132 -52 -174 98 -100 64 149 -16
4923 -16 78 -148 -182 -23 -21 64 -132 -289 13 171 115 -77 61 56 -255 -70 34 63 33 173 90 -75 -120 186
4947 186 59 165 -102 94 -113 -239 -143 52 232 -60 -69 126 -52 -36 -24 128 29 12 -54 -49 37 -9 -61 -188
4971 -188 185 120 -16 -42 70 -31 -295 35 141 -98 -9 200 121 -36 67 -30 219 46 -91 -21 -90 12
4993 12 -18 153 193 -108 26 123 -20 -92 55 -36 219 -93 146 -42 44 103 -127 -2 -140 -53 -69 -19 62 100
5017 100 -89 -39 18 81 -173 -147 81 -90 73 175 53 247 -10 -41 -111 -84 31 -50 64 13 -69 -22 20 -77
5041 -77 1 -6 14 13 -90 265 130 -140 -84 -85 18 -129 14 107 37 79 -49 -86 -29 -107 -90 142 135 -18 -265 281
5067 281 55 -16 -28 -72 4 -319 -50 -61 259 -99 -115 -124 -45 -71 -76 117 141 -82 -73 160 -14 4 -30 147 -83 -122
5093 -122 -16 212 -111 -171 -33 -127 127 -28 76 -14 63 5 -124 18 38 -217 82 195 -40 -40 -6 -6 72 -154
5117 -154 82 -58 -22 16 34 36 141 -34 12 57 -73 41 195 66 -148 15 84 53 72 -82 15 34 -24 -130
5141 -130 123 109 -95 -43 -71 -39 -19 167 -140 -55 23 -56 6 -95 58 62 130 30 -38 89 -100 -68 -30 -111 -53 65
5167 65 69 181 218 73 -69 120 113 -123 138 -71 -82 122 2 -198 3 -51 81 -41 89 20 185 -110 8
5190 8 -130 9 3 -41 23 -243 -21 51 146 -48 -9 -67 66 52 -21 -199 -19 -140 -37 28 -96 -84 -38 -63 -102 -6
5216 -6 91 168 188 241 189 152 -75 117 -89 -43 75 96 77 -220 -135 -131 170 2 -4 90 -148 123 89 88 -175 96 -49
5243 -49 -14 -191 -97 166 -16 -189 102 34 -58 23 -55 86 92 -39 70 -69 35 -155 124 -175 140 115 11
5266 11 -9 90 51 -30 8 -101 188 -56 259 195 114 -70 136 53 42 160 49 -45 220 -80 -52 -72 37 9 111
5291 111 -149 -78 185 -110 -51 11 17 123 43 -156 33 90 30 -200 -14 259 105 -48 45 -3 -34 -96 -99 58 -130
5316 -130 54 131 31 -19 -21 -50 -82 65 -102 -76 45 -44 63 176 -49 114 -135 143 -103 55 -26 -168 6
5339 6 63 -25 -100 158 -148 -122 -91 2 183 4 -79 -80 -143 -126 -148 -92 -27 -131 168 -6 -70 79 61 -154 -5 29
5365 29 -33 27 -2 -135 73 -65 236 51 -81 -21 -57 -109 8 0 -121 10 122 -181 2 13 196 168 -34 24
5389 24 209 -33 22 40 -55 -64 -48 -79 3 91 -73 46 30 86 -96 25 33 95 -75 -2 -40 12 -15 64 4 -56 -32 98
5417 98 -18 -92 83 84 88 -19 -103 -24 88 58 -224 149 123 202 -147 121 -15 148 -16 -25 210 7 42 67 33
5442 33 24 -96 212 56 193 -40 -258 0 -87 119 -92 70 -30 28 -113 86 -72 -55 -24 -65 -49 -221 -48
5465 -48 -46 45 -98 34 -14 -151 -64 44 -2 -14 -47 110 -104 -104 -112 21 94 15 129 -125 36 -73 16 83 -30 -19
5491 -19 -253 27 146 -120 -83 116 33 -48 -70 -62 172 115 128 67 178 -3 -181 159 13 120 -51 1 171 89
5515 89 -47 -18 99 38 -89 -12 37 99 -23 -9 -93 -216 92 -36 -55 198 178 71 104 -17 67 78 -113 46
5539 46 -77 74 -130 68 40 -141 16 34 -77 128 137 -18 -162 109 -69 37 -109 165 85 27 -13 -96 154
5562 154 -12 18 -120 -56 -6 37 -98 -97 -46 -6 183 36 -16 -126 -24 -18 85 50 18 37 -63 46 -112 210 42
5587 42 63 -160 -73 -4 -183 4 -17 -140 -63 155 244 35 27 -6 -65 -87 46 23 -131 49 153 -70 182 -176
5611 -176 -83 -115 123 45 45 99 -156 -97 20 -9 172 -40 48 -158 66 -26 -302 70 -100 -140 100 42 -31 22 -128
5636 -128 87 53 57 -131 77 -144 11 76 2 -175 36 -3 -51 67 -2 -29 -84 -30 101 37 87 153 134 11 253
5661 253 -35 49 -128 47 74 -24 67 68 1 125 30 -64 228 122 111 -4 98 -123 17 -60 43 89 7 -84 -130
5686 -130 -9 -150 189 -49 -1 39 91 18 119 44 138 211 -80 -47 -113 -134 149 84 41 29 -25 -74 39 256 130
5711 130 -80 -10 -78 28 -131 152 -58 23 -53 63 32 30 -63 2 -90 -12 53 52 -69 92 -92 -68 -109 -106 30 -220
5737 -220 -56 -87 37 -76 -2 -115 161 -43 66 -14 -55 100 69 -30 -295 80 -98 -246 25 37 -29 36 28 -128
5761 -128 109 1 -30 136 30 -26 68 -23 -5 -230 54 -193 200 -11 96 29 -8 -28 -168 165 -74 -109 113
5784 113 241 -58 -212 -34 -24 105 131 4 -46 24 -18 0 -47 74 -57 -67 74 106 11 -52 -16 2 16 -14 -28
5809 -28 13 58 -20 0 -40 -161 -178 80 -147 -34 -55 85 21 -115 -75 -21 34 5 49 20 8 -222 -113 -64 76 0
5835 0 32 -112 -64 -178 -59 157 37 -1 20 37 69 -40 -14 66 -141 -175 -83 3 22 145 23 -108 -63 -170 74
5860 74 199 166 25 -22 -43 -6 56 70 -10 121 0 -16 -12 -69 149 -86 84 126 -59 -133 -35 -6 -46 -9 134 185
5886 185 -24 41 -63 -83 79 -83 38 58 41 79 36 86 36 -29 -68 112 -154 57 155 4 241 -105 -5 168
5910 168 61 -7 65 27 -6 -145 -45 55 -262 49 25 36 78 159 40 11 0 15 64 -83 -121 -3 -16 15 15 -201
5936 -201 16 98 159 -103 22 67 54 -123 -40 39 78 -27 -28 208 -24 -146 -167 40 -135 -75 -124 -28 -61 -126 62
5961 62 -54 -96 -42 -12 -112 28 -263 -11 -72 95 12 11 -186 89 111 137 -69 -45 266 33 198 -120 -26 156
5985 156 69 -187 -68 73 151 -217 119 119 101 2 12 -65 37 -69 119 -110 -16 -173 10 -177 -83 81 -57
6008 -57 71 55 0 -3 58 199 -147 -100 147 -227 119 8 -35 -10 133 -4 76 -111 -172 64 -89 -69 -108 67
6032 67 -30 100 -59 84 -16 6 -56 -70 -124 -235 -149 -11 86 -29 5 -82 -57 211 -28 42 -47 69 -25 61 26
6057 26 -27 271 -137 -35 -180 -140 227 134 189 -18 -117 46 -9 13 92 -55 -183 8 87 -31 -168 -89 -25 -84
6081 -84 -15 26 76 39 31 -35 42 119 -203 -22 -84 61 -48 -371 91 -66 55 46 125 -117 -79 191 40 87 12 33
6107 33 -157 -42 -209 138 -137 -3 -209 -150 13 -5 -106 38 -84 45 112 169 -57 146 130 15 118 -35
6129 -35 56 -99 193 10 138 85 85 74 182 -87 -151 31 -93 -162 81 -130 73 25 -154 -88 21 3 106 72
6153 72 49 173 -9 177 85 148 81 -173 -33 -59 76 81 -111 99 15 -160 -107 91 -32 -174 28 -87 56
6176 56 -106 -107 24 0 -88 54 266 114 157 -61 112 60 35 70 49 92 82 36 -223 -78 119 63 -58 75 38
6201 38 157 77 169 80 22 90 2 138 154 -1 -37 -314 -93 -5 84 -86 -106 42 193 -71 55 62 -78 -94 57
6226 57 -119 12 -33 12 -14 -54 48 -8 -232 181 11 -25 131 -48 378 -132 97 -101 -39 111 57 89 -136
6249 -136 -32 175 18 -45 44 17 14 78 -74 -173 1 110 29 -54 -65 -5 -85 52 -29 -126 -19 53 -162 16 -66
6274 -66 -28 136 56 -98 -49 140 107 -84 -115 94 72 126 -143 -128 9 -78 190 -103 -82 -79 -31 171 -26 -68 115
6299 115 -39 -1 -9 -9 -35 115 60 -241 148 -24 46 328 272 -251 -98 37 -10 -57 -64 59 161 54 48 -42 101
6324 101 177 -158 -16 -6 -18 -107 89 -29 45 90 -17 176 33 -35 -14 170 184 72 69 85 162 13 79 32 -8
6349 -8 115 -80 -8 167 -87 -91 15 58 -232 107 -10 180 32 148 183 -44 -44 -45 18 -96 3 16 -110 -35 -136
6374 -136 -64 152 -148 51 18 -199 17 32 153 -28 116 -50 -59 7 16 -59 37 -77 50 16 -169 147 148 36
6398 36 161 79 140 -69 -15 -23 -72 45 60 43 40 1 -1 17 -53 -62 -64 -108 -152 133 -28 136 89 45 151 224 -118 -90 218
6427 218 269 98 39 -31 -58 66 -169 -113 18 -12 -56 -46 70 -61 -93 -32 1 -169 13 -5 -92 40 24 116 16
6452 16 17 57 -22 41 -11 91 -25 -103 39 -108 -161 -60 -126 -85 -23 26 38 1 37 52 -11 -56 12 -89 -111 65 -21
6479 -21 -140 55 -72 -13 46 -149 82 92 78 141 33 -29 129 51 46 -30 -26 16 -33 158 51 -48 141 119 -99 -54
6505 -54 -36 158 80 84 131 -95 12 62 63 226 -9 -8 79 62 116 -201 105 272 -24 -26 105 30 20 -17 117 -117
6531 -117 -156 76 90 290 35 -139 28 34 24 116 -119 8 -130 86 -39 17 50 -104 -20 62 -39 -49 127 175
6555 175 -99 120 131 -331 35 -35 62 93 -97 -69 -11 33 -56 98 29 65 48 -63 126 78 65 -24 -71 -6 114
6580 114 16 -137 -42 17 -155 26 -41 -21 67 19 35 56 52 13 163 -8 81 -249 -10 -172 39 156 202 84 139
6605 139 -94 121 -34 -45 68 12 84 -75 -95 87 -169 -56 180 112 239 4 115 149 107 152 -96 -141 179
6628 179 -44 247 -235 -54 -88 189 15 90 26 -69 -219 -131 23 155 -46 -30 256 -99 99 -26 113 32
6650 32 96 -159 -99 56 -21 -4 44 30 95 -135 59 6 -33 -102 -79 192 -69 29 -66 106 -31 4 -102 109 -40
6675 -40 -290 92 194 97 -2 12 146 196 57 -157 -64 -82 111 -42 38 76 -170 -53 41 -38 78 78 -222 -26
6699 -26 -57 248 -95 -44 74 -66 58 188 41 -33 107 93 -83 -60 -7 -196 -135 -1 105 -99 -126 151 124
6722 124 -220 -27 -46 142 -45 -2 -126 -107 108 62 3 -122 127 140 11 -68 -159 -127 -176 -191 -154 -189 16 -93
6746 -93 25 -31 23 -30 -74 28 72 142 -87 -52 1 165 -89 -93 -24 -13 180 0 -66 -220 115 11 77 29 -175
6771 -175 -63 -69 -13 105 -62 63 -26 -26 87 63 71 -110 39 159 -59 -48 -132 30 -42 16 -10 -41 -1 -44 -64 39
6797 39 112 112 -40 122 -41 -73 -44 -43 5 -159 -145 112 -75 -8 40 -72 92 -90 103 -54 131 -27 -34 94 119
6822 119 -52 -13 -106 77 -98 8 126 62 -81 59 134 54 -183 -13 -102 -51 186 -126 2 90 -106 -132 130
6845 130 119 -24 -55 -133 18 12 41 39 51 95 37 -17 -90 7 -163 -33 97 -93 41 76 -75 -127 69 26 27 24 -82
6872 -82 -147 57 -168 1 86 -52 142 63 16 -40 -124 71 -18 -33 -137 -60 -9 -238 26 -135 -134 -1 -134 48
6896 48 -32 -30 -96 -34 -214 38 13 148 94 2 -12 -1 -87 -51 20 17 -45 -169 -63 -321 -31 17 92 -65 -39 -129 33
6923 33 -91 -246 -95 107 -20 -18 -5 -71 103 20 85 58 114 -59 59 -126 -18 77 96 -15 -119 -75 -19 -206
6947 -206 119 85 42 33 -212 44 -84 54 -91 -15 96 -68 -194 -25 91 -167 -42 153 33 57 -21 -52 103
6970 103 23 -115 112 55 31 1 133 100 177 7 -244 -112 -27 19 -39 170 -33 -15 50 67 121 -122 -144 -13 -84
6995 -84 -21 -207 194 105 -74 -53 143 -81 93 -49 29 40 21 99 143 70 -81 35 148 -60 -96 133 70 46
7019 46 32 -45 1 -24 189 82 62 -12 -103 -41 11 30 -38 17 66 -4 9 -74 62 33 205 31 -19 113 33 161 -52
7046 -52 -118 -8 66 -117 -101 147 -4 -96 95 -14 6 115 95 61 10 224 -3 -11 173 44 170 -84 53 -62
7070 -62 -19 7 -126 8 -1 -8 62 -52 -70 106 54 -27 49 -152 91 -141 23 -1 -64 34 -47 142 44 -70 -10 152
7096 152 10 -18 6 -23 -135 37 58 75 134 39 -71 292 13 152 36 -26 76 -45 13 -176 -43 -58 168
7119 168 38 76 -31 57 81 142 128 22 36 82 69 -277 -62 -47 45 127 -103 -166 -72 -70 86 -100 -11 -138 -93 -79
7145 -79 -138 -1 141 82 -185 5 176 0 -45 -93 -67 -81 55 50 210 -33 43 -41 -107 116 119 187 -36 87 57
7170 57 -45 34 160 120 13 1 76 1 -155 41 -14 74 -56 -96 0 30 60 235 -68 -51 68 -4 -87 52 43 -60
7196 -60 2 97 -29 -21 91 -213 -29 -376 137 -38 18 115 7 -116 9 -24 28 -17 91 64 -90 83 144 -18
7220 -18 42 -126 -4 -211 30 18 -122 -9 184 -13 -97 -75 9 19 84 -29 81 -52 51 -111 -176 102 -61
7243 -61 279 3 17 31 -17 39 -64 -34 -65 -10 174 -98 245 -188 -25 -116 111 -6 -101 -113 26 -74 -105 57
7267 57 87 33 -48 136 215 14 39 33 -93 1 -43 33 55 -10 -34 -98 199 -64 -52 -75 -77 132 -80 -1 58 -66 93
7294 93 -120 46 46 110 103 46 117 27 -33 7 -43 1 -108 13 39 -101 -55 11 108 -148 4 291 -8 1 -103 -81 -25
7321 -25 -119 6 -79 -48 -176 -72 31 187 -65 52 116 -62 -88 -23 -23 -56 36 39 174 189 -2 -60 106 78 45 -46
7347 -46 -67 20 97 -103 78 61 -142 -23 -45 47 -81 -56 82 -17 -137 -10 -67 36 119 -2 97 1 -14 -17 -7 -22
7373 -22 40 9 29 77 -59 15 52 175 -17 -89 -15 199 -194 -114 29 -6 -67 51 16 56 18 172 287 -95 100
7398 100 -130 46 1 -64 -78 -7 105 -11 20 -44 118 -113 -141 -20 16 49 -21 32 29 -15 -14 -143 10 64 88 2
7424 2 -184 12 -186 -162 60 52 41 -15 -131 -236 -4 95 8 27 -188 -78 -9 4 -40 19 172 -118 201 77 -229
7449 -229 132 58 81 58 143 -73 169 -138 -25 80 -139 -113 -24 84 -118 -172 -158 -29 61 59 112 90 -134 -29
7473 -29 79 -150 5 -59 114 17 -125 -96 -40 -13 -164 -127 131 75 -42 209 1 30 -47 -46 -46 243 225 294 49
7498 49 64 -17 34 142 26 -156 5 13 27 -42 8 22 86 -134 77 43 32 41 -33 -165 210 179 -59 19 104 -5
7524 -5 83 112 -101 31 54 -53 17 -148 -110 -10 55 -118 -290 -180 80 -139 -117 -188 -121 -60 -77 -105 -112 51 -65
7549 -65 69 -52 85 -154 7 236 118 69 -66 9 -75 -64 -105 -98 -133 -193 -169 6 43 110 115 42 -69 -101 0 99
7575 99 58 24 65 -185 -121 141 3 -215 -117 -4 134 54 27 142 -121 189 98 55 -85 -69 -209 -19 57 50 149
7600 149 -35 -63 192 17 109 179 109 -58 -34 35 48 102 61 109 237 -30 52 38 -98 114 16 -35 -32 38 -38 -14
7626 -14 73 -19 60 -43 36 -68 -117 10 -253 -42 76 -212 95 54 -73 -186 -98 -179 -16 72 -131 -90 27 42
7650 42 -117 132 -221 -43 -153 -7 156 -230 -46 -18 -17 16 60 -47 151 -75 7 35 90 50 45 76 47 65 -14
7675 -14 26 -128 -91 193 147 -143 -25 137 -117 10 -132 20 95 41 105 40 -35 -139 -81 127 -148 -22 -32 66
7699 66 142 -184 -38 -85 37 8 70 -63 35 191 -163 140 158 65 9 -49 -48 -69 41 -33 86 66 -37 5 -176
7724 -176 6 -81 -134 25 -210 -37 30 168 27 -102 -195 -197 114 41 -41 -33 -12 -116 72 68 33 -14 -25 61 26 -27
7750 -27 28 -21 113 259 -80 32 -116 -76 -94 -206 106 -91 -131 67 -75 109 -177 -24 119 -39 37 -95
7772 -95 -10 -68 7 22 -275 -32 -51 109 -70 83 160 3 99 -65 -70 -82 4 24 -27 10 17 -15 -70 89 -26 174
7798 174 64 -140 39 -208 8 105 -52 -63 -236 -73 151 -34 28 72 -235 -43 -64 -50 1 71 237 -109 -20
7821 -20 84 71 -165 -72 111 8 245 93 -21 219 138 21 -115 -49 82 -23 117 -3 -22 -143 -27 -48
7843 -48 -45 11 -28 32 -46 6 -51 74 -168 -16 -45 133 9 -43 35 -62 -8 -58 309 -39 55 -33 -38 110 108 -56 208
7870 208 -21 -293 86 -66 8 -58 22 -160 -87 70 -37 -18 -119 33 -36 -13 -30 21 -69 47 -48 -19 -112 -59 -14
7895 -14 -66 26 -65 245 47 33 53 -72 -101 24 87 -32 10 37 -153 -109 29 -24 -184 115 123 -150 57 232 -97
7920 -97 22 -68 12 26 68 -78 57 -92 -28 152 -43 -37 -131 179 -134 -173 -74 12 12 230 -234 109 172 -11 -70
7945 -70 151 -123 171 -28 -126 -98 -24 99 31 -106 48 -143 -81 53 -29 197 141 -77 -11 -125 104 50 -100
7968 -100 118 -40 18 -140 1 58 325 21 -91 52 -180 -73 86 -143 33 116 15 -16 -161 -194 75 9
7990 9 104 163 -79 13 -12 -114 93 -84 -78 -16 63 112 -33 -80 232 -49 98 -31 81 -56 -35 99 134 -112 -54
8015 -54 -165 -112 33 104 139 27 -35 -49 45 -7 176 96 23 76 176 160 -160 180 -105 -57 97 -35 -1 -164 13
8040 13 65 8 15 -48 -93 11 -117 -206 38 -204 1 126 74 -18 83 -115 120 99 94 0 -37 -70 -64 -72 -3 17 78 62
8068 62 -31 -70 -55 -28 62 -176 -169 170 -76 -41 37 22 4 61 -71 18 -22 -115 64 171 112 -177 -34 -88 -38 74
8094 74 33 4 -102 -99 -72 85 46 -22 29 -128 128 -116 104 -38 172 -32 -162 72 154 -47 -3 33 -232 83
8118 83 -173 -80 24 -55 -123 13 16 -299 204 -152 -95 148 26 -174 113 -124 29 11 -210 -12 49 105 89 220
8142 220 7 -11 4 35 -25 -112 -20 -44 -75 -53 73 -20 -223 224 -8 -187 -93 -87 110 -126 53 14 156 61 207
8167 207 69 -143 -128 -11 80 -61 243 -88 -178 -156 99 -83 -228 -176 55 134 8 67 88 -76 -195 -177 24
8190 24 39
8191C9
$$ Imaginary data points
##PAGE= N=2
##DATA TABLE= (X++(I..I)), XYDATA
0 0 0 0 0 0 0 0 0 0 -5 0 -8 8 -8 8 -15 16 -16 24 -24 32 -35 40 -48 56 -64 71 -81 94 -105 118 -131 151 -167
33 -167 185 -207 231 -257 283 -314 351 -386 427 -473 526 -583 646 -718 801 -898 1010 -1144
51 -1144 1308 -1509 1766 -2109 2592 -3319 4528 -6915 13389 -66201 -186593 13482 85066
64 85066 -88210 -157521 34868 102960 -78076 -153333 21880 84501 -86757 -150480 19008
75 19008 73173 -93681 -145453 25070 78751 -79431 -121718 40771 76824 -86871 -120318
86 -120318 49108 89598 -65793 -91601 72420 98081 -68478 -96604 68806 97667 -61475
97 -61475 -82814 82749 109564 -48829 -67973 95492 119457 -38872 -62307 89113 102918
108 102918 -53337 -68281 87117 105173 -42326 -53145 92602 97045 -52413 -58700 86138
119 86138 87606 -57890 -58701 81874 73841 -72568 -67018 75344 65747 -78597 -69024 71363
131 71363 57296 -84854 -69927 72580 57622 -84547 -71631 63675 43194 -95984 -77920
142 -77920 58538 41041 -89796 -67538 63744 42053 -84367 -58816 66264 39016 -84662
153 -84662 -56981 62671 31673 -84729 -48417 70971 36938 -77248 -38999 75402 36726
164 36726 -75233 -32603 81304 40017 -71379 -29141 80322 36526 -71688 -26606 82325
175 82325 38439 -66792 -21034 83479 37880 -63076 -15291 84335 35307 -64264 -16448
186 -16448 77899 26337 -67725 -14471 78694 24982 -65057 -9512 78769 20650 -67280 -9065
198 -9065 75947 14070 -71878 -11336 71666 8460 -74131 -10292 70915 5835 -74702 -9805
210 -9805 69022 3435 -73925 -7962 66943 -891 -76047 -9878 61589 -6122 -76106 -7541
222 -7541 60974 -7621 -73423 -3537 60869 -9125 -71477 -176 60221 -12359 -71974 551
234 551 58578 -14207 -70148 4761 61347 -12558 -66795 7946 62131 -11635 -64136 10666
246 10666 62219 -11525 -61632 12056 61404 -11430 -57892 16116 62234 -10394 -53679 19729
258 19729 62193 -10545 -51075 22315 61267 -13222 -50917 23759 60314 -14661 -49874 25998
270 25998 60127 -16220 -50325 26505 59237 -17844 -50572 25725 56527 -20912 -52587 23863
282 23863 53676 -22563 -51817 23466 51029 -24512 -51763 22546 47771 -27156 -51210 22332
294 22332 44050 -30120 -51252 22262 41401 -32221 -49679 23937 40288 -33377 -48298 25498
306 25498 39668 -34063 -47236 26998 39418 -34285 -45734 28407 39841 -33071 -43296 29706
318 29706 39821 -31424 -40637 30827 39800 -29904 -37666 31283 38734 -28845 -34567 32348 37771
331 37771 -28177 -31658 33735 35967 -28672 -29443 35150 34548 -29808 -28174 36107 33338 -31286 -27904
345 -27904 36690 32278 -32436 -27664 36497 31124 -33228 -27829 35721 29838 -33402 -27892 34231
358 34231 27842 -33491 -27319 32927 25996 -33474 -25981 32381 23611 -33886 -24438 31883 20894
371 20894 -34745 -22588 32067 18892 -35435 -21236 32861 17742 -36205 -20134 33319 16825
383 16825 -36371 -19191 33794 16263 -35985 -18214 33614 15622 -35583 -17157 33361 15132
395 15132 -34202 -15718 32894 14166 -33061 -13878 32360 12941 -31661 -11693 31934 11664
407 11664 -30925 -9271 32348 10093 -30403 -7349 32797 8888 -30457 -5484 33455 7926
419 7926 -30409 -4362 33932 7144 -30727 -3699 34008 6438 -30651 -3093 33467 5750
431 5750 -30276 -2702 32173 4289 -29845 -2463 30734 2412 -29756 -1412 29467 422
443 422 -29921 -776 28262 -1887 -29940 459 27570 -3590 -30651 965 26791 -5397
455 -5397 -30991 1637 26817 -6131 -30682 2409 26932 -6440 -30206 3052 26196 -6494
467 -6494 -29336 3632 26070 -6496 -27844 4862 26089 -6463 -26166 6767 26235 -6385
479 -6385 -24557 8269 25977 -6760 -23437 9612 25857 -7249 -22559 10853 26084 -7588
491 -7588 -21819 12034 26050 -8216 -21528 12382 25645 -8888 -22112 12148 24525 -9763
503 -9763 -22313 11878 23795 -10572 -22007 11701 22493 -11562 -22112 11443 21109 -13027
515 -13027 -22382 11358 19530 -14424 -22225 11882 19013 -14983 -21569 12469 18892 -15572 -21483
528 -21483 12837 18160 -16051 -21233 13142 18174 -15804 -20333 13961 18528 -15028 -18746 14559
541 14559 18334 -14752 -17803 14835 17781 -14599 -16835 15270 17093 -14590 -15465 16346 17052 -14511
555 -14511 -14294 16971 16433 -14871 -14170 16786 15664 -15854 -14488 16652 14900 -15540 -13973 16547
569 16547 14785 -15591 -13563 16389 13651 -15789 -13624 15369 12359 -16371 -13531 14960 11625
582 11625 -16419 -12281 15382 11165 -15993 -11327 15716 10615 -16358 -10779 15692 9627 -17065
595 -17065 -10476 16091 9312 -16884 -9417 17022 9889 -16284 -8660 17174 9661 -16370 -9014
608 -9014 16585 8962 -16238 -8837 15924 8710 -15562 -7949 15694 8315 -14781 -7262 15351
621 15351 7164 -15127 -6835 14266 5426 -15603 -6444 14129 4809 -15410 -5465 14683 4580
634 4580 -15553 -5371 14441 4019 -15789 -5502 14094 3798 -15683 -5576 14075 4234
646 4234 -14506 -4604 14209 4569 -13408 -3745 13656 4179 -12810 -3387 13137 3492 -12230
659 -12230 -2260 13330 3263 -11396 -944 14015 3252 -10868 -210 13669 2242 -11673
671 -11673 -270 13265 1475 -11950 -253 13445 1668 -11866 116 13186 1350 -11965
683 -11965 -474 12086 230 -12408 -1102 11022 -648 -12219 -1027 10154 -1094 -11500
695 -11500 -557 9737 -1323 -11419 -133 9051 -2691 -11699 233 8574 -3160 -11359 965
708 965 9284 -3028 -10834 1969 9734 -2852 -10641 2228 9761 -2740 -10167 2334 9802 -2489
722 -2489 -9362 3057 10278 -1678 -7965 3705 10030 -1491 -7496 4064 9389 -2117 -7231 4550
736 4550 9147 -2451 -6790 5199 9281 -2595 -6393 5651 9237 -3191 -6851 5430 8597 -3922
750 -3922 -7204 5048 8236 -4108 -7344 4892 7845 -4368 -7202 4651 7621 -4560 -7234 4449
764 4449 6543 -5169 -7428 3923 6007 -5468 -6912 4456 5743 -5472 -6523 4595 5409 -5703
778 -5703 -6463 4724 4998 -6262 -6476 4760 5072 -6070 -6166 5093 5140 -5650 -5736 5158 5096 -5534
794 -5534 -5617 5231 5155 -5447 -5356 5123 4964 -4902 -4547 5470 5127 -4634 -3985 5644 4706 -4797 -3893
811 -3893 5653 4565 -5099 -3382 5909 4552 -4942 -3219 6274 4432 -4840 -3142 6194 4468 -5165
826 -5165 -3440 5868 3848 -5224 -3460 5395 3602 -4936 -3334 5261 3133 -5245 -3352 4827 2728
841 2728 -5319 -3310 4405 1963 -5774 -3237 4403 1810 -5759 -3072 4453 1796 -5905 -3182 4424
856 4424 1382 -5979 -2907 4480 1585 -5897 -2857 4170 1549 -5245 -2484 4329 1549 -4813 -1863
871 -1863 4350 1392 -4445 -1636 4415 1530 -4013 -933 4723 1595 -3532 -408 4858 1604 -3549
886 -3549 70 4922 1409 -3539 -68 4928 1497 -3614 59 4942 1176 -3536 -228 4672 1043
901 1043 -3617 -251 4045 732 -3812 -722 3596 270 -3695 -588 3200 -31 -3579 -421 2696
916 2696 -672 -3839 -213 2583 -1193 -3865 -357 2503 -1248 -4256 -90 2748 -1335 -4011 104
931 104 2665 -1108 -3627 150 2876 -993 -3434 283 3076 -634 -2867 528 2910 -336 -2395
946 -2395 1146 2843 -522 -2048 1331 2754 -444 -1761 1830 2907 -522 -1734 2213 2877 -820
961 -820 -1816 2029 2714 -1115 -1840 2176 2613 -1219 -2051 1990 2473 -1318 -2157 1613 2165 -1425 -2359 1286
979 1286 1951 -1740 -2299 1319 1634 -1807 -2063 1453 1332 -1953 -1939 1157 1031 -2299 -1645 1686 915 -2331
997 -2331 -1598 1818 1293 -2554 -1594 1982 1354 -2473 -1581 2331 1473 -2315 -1514 2260 1686 -1952 -1333
1014 -1333 2202 1477 -1916 -1110 2029 1478 -1713 -1006 1987 1255 -2023 -762 2261 958 -1750 -611
1030 -611 2228 771 -1928 -476 2400 972 -2196 -651 2509 945 -2019 -747 2380 884 -2129
1045 -2129 -809 2211 878 -2163 -850 2094 1006 -1911 -881 2027 954 -1761 -946 1855 652
1060 652 -2109 -627 2016 440 -1942 -370 1845 138 -2140 -246 2014 125 -2268 -652 2147
1075 2147 262 -2429 -584 1971 -19 -2212 -594 1984 199 -1965 -625 1581 278 -1941 -632
1090 -632 1634 432 -1895 -548 1406 345 -1646 -275 1591 304 -1235 31 1821 111 -1372
1105 -1372 224 1926 92 -1246 201 1769 331 -1189 265 1822 511 -1002 291 1958 486
1120 486 -1077 222 1606 345 -1042 143 1593 271 -920 128 1107 58 -1203 -130 989
1135 989 -78 -1174 -178 739 -598 -1219 -230 652 -670 -1386 -137 443 -661 -1309 -140 593 -502
1152 -502 -1133 -59 557 -452 -1347 -24 504 -302 -961 82 616 -298 -640 232 537 -218 -422 389 542
1171 542 81 -210 693 909 -199 -88 844 585 9 90 692 598 -147 -88 815 732 -320 -97 707 624 -213
1192 -213 -281 566 426 -409 -191 186 130 -316 -77 192 -157 -764 -235 180 -428 -914 -145 161 -514 -975 -186
1213 -186 286 -527 -843 -195 476 -614 -1060 -169 407 -342 -731 -187 418 -110 -730 10 425 78 -447 74
1233 74 617 -29 -418 267 551 -269 -233 593 618 -468 -436 735 963 -499 -334 635 708 -422 -637 715
1253 715 715 -299 -691 573 905 -423 -482 496 714 -401 -607 314 659 -465 -597 252 507 -366 -541
1272 -541 497 170 -518 -615 334 374 -717 -315 466 225 -1005 -603 790 347 -891 -485 805 555 -842
1291 -842 -439 678 514 -561 -694 722 307 -471 -506 676 349 -648 -408 484 326 -521 -287 393 339
1310 339 -406 -90 503 225 -852 -434 603 123 -791 -231 862 173 -656 -125 832 232 -694 -190 625
1329 625 391 -591 -98 686 389 -444 -130 623 264 -206 -200 686 183 -581 48 763 262 -364 150 878 169
1350 169 -556 312 867 171 -695 -19 638 214 -701 -44 729 -363 -825 17 636 -372 -1125 -224 752
1369 752 -224 -773 -128 496 -89 -952 -346 334 -265 -752 -27 440 -567 -655 232 510 -311 -589 212 503
1389 503 -388 -761 286 799 -367 -594 688 751 -237 -675 641 786 -243 -524 489 880 -71 -440
1407 -440 604 934 -164 -405 482 858 -259 -399 677 687 -355 -253 524 715 -409 -734 708 536
1425 536 -668 -715 437 498 -755 -769 554 773 -793 -652 494 635 -972 -893 557 454 -785 -793 416
1444 416 481 -816 -471 786 386 -725 -720 804 519 -766 -542 836 531 -708 -441 1017 703 -639
1462 -639 -289 1123 605 -794 -264 1090 681 -557 -307 1076 849 -779 -481 1046 713 -769 -405
1479 -405 943 583 -676 -541 833 509 -737 -528 997 387 -992 -531 900 456 -998 -351 914
1496 914 346 -1101 -514 829 255 -1183 -445 979 417 -991 -553 861 379 -1236 -388 986 505
1513 505 -984 -515 1003 484 -829 -241 878 645 -690 -401 974 405 -818 -225 1055 193 -939
1530 -939 -274 1006 102 -895 -378 1010 195 -959 -198 1094 125 -1153 -308 860 348 -1032 -201 1106
1548 1106 181 -972 -354 758 291 -1023 -390 921 33 -1015 -337 752 352 -822 -242 828 -24
1565 -24 -1067 97 882 118 -902 -29 704 119 -788 -82 1029 45 -732 124 1145 10 -836 226
1583 226 1062 145 -631 -27 994 4 -894 214 791 -94 -841 -120 655 12 -741 106 683 -86 -788
1602 -788 75 601 -231 -794 126 711 -387 -768 240 631 -365 -920 295 654 -188 -928 137 803 -298
1621 -298 -860 171 828 -130 -897 372 730 -230 -928 84 560 -297 -592 376 632 -205 -519 364 880
1640 880 -488 -610 612 485 -412 -535 570 664 -469 -665 606 351 -365 -653 295 584 -358 -512 451
1659 451 426 -377 -824 341 507 -500 -833 281 514 -562 -608 271 440 -621 -601 648 500 -552 -424
1678 -424 537 478 -707 -227 664 450 -727 -373 799 469 -516 -583 757 497 -526 -553 925 714 -642
1697 -642 -237 789 518 -560 -216 847 677 -668 -455 830 355 -556 -195 707 406 -858 -329 695
1715 695 236 -933 -331 816 313 -680 -462 735 326 -932 -506 717 266 -796 -405 883 299 -1144
1733 -1144 -471 742 131 -665 -358 817 389 -894 -360 812 379 -1023 -300 938 456 -730 -180
1750 -180 984 367 -738 9 1055 426 -753 -222 910 474 -662 -145 994 281 -862 -124 689
1767 689 326 -832 -210 668 -41 -774 -124 772 31 -818 -302 671 89 -962 -367 668 -14 -906 -157
1786 -157 698 -25 -1136 -17 877 68 -917 -292 906 -17 -921 -3 931 11 -830 -128 899 -69 -754
1805 -754 -34 716 185 -687 -44 789 -37 -665 183 679 181 -753 205 860 -21 -518 135 643 4 -525
1825 -525 29 721 36 -893 -119 755 66 -774 69 625 -98 -823 -115 769 -14 -869 -45 539 -112 -686
1845 -686 -204 659 -257 -835 -30 757 -257 -864 -13 718 -227 -660 -101 609 -192 -831 126 822 -233
1864 -233 -948 330 656 -252 -514 357 791 -293 -498 172 724 -76 -770 440 700 -320 -710 486
1882 486 625 -138 -642 182 772 -298 -571 474 759 -559 -446 137 403 -233 -740 226 542 -441 -642
1901 -642 470 567 -465 -497 339 507 -550 -603 404 456 -581 -842 231 742 -280 -503 304 606 -377
1920 -377 -564 356 536 -466 -480 439 351 -569 -416 504 499 -463 -521 462 422 -551 -389 441 552 -618 -568 720
1942 720 613 -622 -810 583 422 -492 -557 517 440 -420 -355 587 533 -436 -669 559 467 -634 -534 477
1962 477 370 -857 -402 579 306 -582 -350 651 366 -638 -453 633 421 -724 -174 650 490 -623
1980 -623 -558 750 404 -665 -270 566 363 -602 -378 628 320 -627 -441 475 310 -704 -404 595 149
1999 149 -633 -407 604 329 -569 -313 568 203 -870 -401 430 445 -685 -289 721 146 -640 -283 691
2018 691 443 -914 -95 732 282 -615 -261 755 237 -596 -175 570 291 -638 -226 636 281 -671 -115
2037 -115 748 487 -514 -102 731 362 -630 -361 748 95 -542 -87 693 226 -552 -250 713 6 -709
2056 -709 -363 790 109 -721 -250 669 -110 -704 -198 530 138 -754 -154 537 -17 -731 -146 421 -29 -562
2076 -562 -204 447 -114 -640 -2 795 98 -642 4 615 70 -712 -41 614 -174 -518 -332 550 37 -431
2096 -431 237 517 53 -515 198 501 -9 -403 98 557 -64 -599 196 514 67 -564 104 595 -23 -423
2116 -423 77 569 -22 -576 170 610 10 -519 141 441 -87 -705 68 479 -131 -584 146 412 -115 -606
2136 -606 202 514 16 -302 51 312 -141 -331 348 453 -106 -489 261 495 -139 -479 337 311 -114 -308
2156 -308 194 359 -185 -465 227 475 -270 -405 299 555 -272 -489 261 526 -265 -440 49 591 -327 -550
2176 -550 163 452 -350 -496 308 377 -201 -221 342 286 -300 -350 397 282 -515 -369 310 361 -225 -211 382 180
2198 180 -322 -389 355 275 -219 -448 332 368 -281 -308 267 227 -415 -341 488 388 -223 -152 451 145 -375 -317 296
2221 296 365 -485 -240 465 357 -417 -330 350 192 -394 -160 447 181 -490 -71 106 331 -367 -191 257 352
2242 352 -397 -512 436 197 -601 -172 441 88 -283 -188 505 46 -352 2 404 279 -325 -141 442 138
2262 138 -262 70 571 193 -387 -249 408 304 -516 -220 334 246 -218 10 565 82 -670 -231 516 219
2282 219 -208 -167 385 24 -373 -131 390 170 -244 -85 347 86 -366 -313 434 -61 -481 -256 302 6 -304
2303 -304 22 422 249 -340 -215 436 -29 -386 -339 457 168 -458 -93 524 68 -536 40 325 -43 -365
2323 -365 -57 487 -115 -487 -29 423 268 -487 37 315 -48 -399 219 351 10 -328 103 259 -92 -356
2343 -356 -86 331 -178 -595 123 537 -91 -340 32 484 -7 -400 39 305 -24 -325 56 415 -223 -228 -31
2364 -31 379 -107 -486 215 293 -44 -354 31 401 -134 -427 91 383 -98 -399 369 460 -155 -445 52 374
2385 374 -27 -334 169 249 -99 -276 205 358 -140 -184 199 365 -133 -239 83 217 -193 -313 163 210 -301
2406 -301 -255 331 303 -131 -469 212 222 -299 -412 142 149 -239 -472 96 304 -125 -334 171 219 7 -246 75
2428 75 280 -166 -184 323 292 -150 -144 277 337 -238 -122 235 209 -145 -204 159 337 -283 -172 191 51 -223 -430
2451 -430 109 447 -226 -157 96 80 -208 -279 228 247 -274 -140 150 -40 -436 -204 44 221 -238 -152 363 299
2473 299 -350 -15 49 267 -120 -131 185 68 -128 -89 321 3 -144 -73 269 282 -246 -372 275 165 -107 -170
2495 -170 277 81 -267 -203 278 183 -202 -45 242 139 -294 -226 260 241 -149 -174 379 263 -182 -195 190 34
2517 34 -355 -124 277 117 -353 -317 292 -43 -210 -27 166 116 -255 -220 130 229 -189 -18 409 163 -438 -181
2539 -181 333 191 -156 -215 272 119 -354 -102 318 64 -187 110 293 54 -260 -98 232 116 -300 31
2559 31 228 63 -388 -117 262 44 -332 -111 224 322 -317 56 419 -151 -119 -214 273 -16 -238 -73 125
2580 125 -38 -398 -61 312 253 -127 -92 140 -13 -435 39 225 -98 -489 -66 407 320 -244 -46 390 -15
2601 -15 -80 -123 317 24 -308 -20 289 136 -100 40 156 -9 -273 -91 199 -72 -213 -18 193 79 -198
2622 -198 -85 115 -104 -280 9 254 -50 -208 -40 152 53 -233 218 134 65 -8 -132 143 -54 -285 -43
2643 -43 361 -163 -372 -77 264 -1 -107 -30 354 -78 -66 17 45 43 -281 32 93 46 -260 -113 231 -24 -244
2666 -244 8 102 68 -138 80 275 48 -212 156 275 -63 -181 79 234 10 -142 323 221 -178 -185 60
2687 60 289 24 -9 -27 106 -80 -140 -96 156 -113 -231 211 236 -80 -231 -40 310 62 87 -85 188 67
2709 67 -249 235 241 -109 -2 64 182 87 -201 100 259 7 -146 54 5 -104 45 211 147 -281 -24 48 -8
2732 -8 13 -49 -51 46 -100 -110 63 0 -92 -249 282 128 -75 -137 202 190 -41 -281 272 280 -16 -137 51 265 -87
2757 -87 -143 120 6 -150 -107 124 90 68 -149 25 186 -232 -32 99 137 -57 -92 193 -71 -260 -160 77
2779 77 17 -28 87 110 -30 -39 -118 266 103 -365 -93 199 55 -77 7 61 252 -74 -181 96 16 -172 -90 49
2803 49 -242 -288 -41 -34 36 -56 162 130 105 -134 -43 348 142 -120 -47 18 65 -107 -230 122 89 -127 -142 86 48
2828 48 -140 -331 71 184 -33 106 176 -66 -120 -40 184 47 -150 11 187 188 29 -60 105 -123 -182 22 160
2851 160 132 -362 -61 283 22 -220 -99 183 84 -106 -50 176 91 -149 -75 49 21 13 -139 212 -14 -95 -51
2874 -51 159 -40 4 102 89 223 -82 -57 200 51 -190 -41 33 124 -238 44 82 222 -76 -58 76 127 29 -59
2898 -59 267 133 -371 -187 137 -62 -237 -9 255 -39 -179 -317 132 19 -6 -130 44 107 -83 71 73 14
2920 14 -179 86 3 -27 -113 4 269 -103 -134 84 159 44 -228 -90 110 67 -88 83 203 39 -215 -53
2942 -53 168 14 -156 -18 223 111 -66 -215 189 -93 71 -7 -27 -63 -9 -27 177 24 -30 41 91 -84 48
2965 48 124 19 156 -156 49 83 -82 -116 50 5 84 117 55 153 35 -64 164 171 69 106 129 106 -14 5 96 96
2991 96 -117 23 75 136 -138 39 72 70 -119 25 114 91 32 -105 235 102 196 -95 -120 44 -101 -23 43 104 51
3016 51 16 25 -41 -148 -153 184 138 22 -264 -141 65 29 28 83 -16 -53 -213 179 322 11 -196 43 65 -240 -154
3041 -154 50 -26 49 56 39 -4 -29 8 36 193 5 98 -40 87 -4 -127 168 81 -30 -284 14 37 18 -6 -56
3066 -56 61 -149 -3 175 80 98 -89 229 25 -26 -170 118 -16 143 -180 0 131 37 -21 99 158 -159
3088 -159 -211 -24 -106 -120 48 6 26 -180 -150 81 95 -105 -103 -56 90 -138 -259 77 44 26 90 117 31 70 -274
3113 -274 122 146 -2 -7 -215 -84 -66 -176 -165 -98 -153 84 86 55 -74 65 -53 28 27 -101 82 92 -38 -180 45
3138 45 5 82 29 -45 140 91 -22 -38 69 -61 27 -159 16 -55 40 186 10 -73 -141 18 -55 -31 -112 -8 130
3163 130 52 37 -194 -37 -10 10 -7 -146 -12 21 -105 -57 77 -221 321 29 -51 -73 -70 31 -71 -10 -174 201
3187 201 32 -80 29 342 113 -163 167 -115 -104 -183 228 285 -98 36 -98 5 80 11 99 6 -83 121 85
3210 85 81 -39 -158 91 -48 65 -105 1 -51 -9 -99 -53 -8 -181 -116 88 -98 -20 99 -218 6 -84 -117 -25
3234 -25 -131 39 40 111 -220 54 164 37 77 144 -35 146 242 26 104 -16 109 -115 -141 27 14 -15 -141 -20
3258 -20 100 -55 21 83 33 13 -146 -42 -65 -21 69 -26 72 -72 32 -138 64 28 -76 -186 -129 -93 -15 -69 79
3283 79 -48 -231 59 -121 17 -76 -13 -71 8 -81 28 83 -67 -3 69 -51 49 -22 -68 20 -55 153 -138 -122 -2
3308 -2 112 68 -27 -50 -73 57 -138 -165 -95 -51 -2 -55 -22 51 -60 -13 -14 -167 -130 91 94 66 66 -119 -96 -78 9 -40 92
3337 92 -33 146 -199 -118 73 -18 -41 242 134 91 94 -97 -129 -63 -190 30 46 -29 -109 -17 -79 -79 -136 40 11 -151
3363 -151 -129 66 -106 -92 53 11 -92 -26 117 -160 -17 -219 -108 20 98 53 47 61 19 -219 -173 -46 15 126
3387 126 30 71 -35 -286 -75 -40 53 -119 86 -127 -111 -9 -11 -99 80 -215 65 -97 95 19 18 101 49 -84
3411 -84 -47 -43 -149 80 -34 103 95 -67 -66 -20 -11 -46 -66 -46 -5 -43 4 -65 -9 -21 146 205 -52 -81 -69 113 -34 101
3439 101 59 39 -94 88 198 87 -122 187 41 49 -40 -5 40 -9 102 92 -72 -48 -78 -98 -114 -117 13 -131 11
3464 11 -111 7 17 -26 -80 47 -29 -104 71 -53 -117 212 -10 -57 -164 -98 114 91 83 133 76 10 -8 -68 -41 -45 -57
3491 -57 -164 30 -42 86 8 136 168 33 -15 38 56 -23 -176 -4 26 12 -44 -34 82 187 -147 -17 -4 -114
3515 -114 44 114 33 42 -58 -130 124 94 -213 -54 0 142 42 9 -5 118 -51 -109 -90 -21 -61 -49 49 164 133
3540 133 93 122 -135 76 140 182 7 -193 -121 141 8 -23 5 13 -36 24 -7 21 -67 20 122 13 -13 -129 -159 28
3566 28 -1 -108 5 -62 -133 84 73 -44 -104 -57 51 126 -46 -78 29 64 19 59 -109 26 -25 -114 15 35 -142
3591 -142 186 -82 61 14 -119 25 -85 80 -41 16 -82 -60 -1 142 150 -14 -19 153 28 -132 30 5 -17 166
3615 166 83 -86 -56 173 147 123 -57 3 -69 223 9 -73 -104 24 -51 -26 -40 11 98 -1 -117 174 -92 123 72
3640 72 67 -1 -134 102 107 143 -40 -51 -39 112 -61 65 -220 -71 84 -135 -114 66 62 -13 -112 -31 -119 187 -171
3665 -171 57 83 -75 53 -64 -137 164 -54 -48 147 139 168 -186 -66 -54 100 56 -44 -117 73 -75 -101 -151 -50
3689 -50 -239 -51 -192 -157 -14 -12 -99 76 69 -51 23 147 145 -96 78 -123 -183 -118 -100 -103 -38 25 32 -56 161 74 161
3716 161 -37 -113 -145 -48 -124 73 84 71 72 11 46 107 -40 -9 -17 88 -142 -165 -40 203 175 87 108 -58 -91 -38 61
3743 61 -137 -171 -42 -10 -170 12 57 121 -67 -39 78 183 -40 21 70 -104 52 64 -92 -47 -53 -58 -116 -20 -36 -82
3769 -82 68 -25 115 8 99 -8 -10 -96 -61 13 -45 -71 -10 -218 90 -87 12 181 50 20 100 59 9 55 -85 86
3795 86 28 -66 13 -131 17 -97 53 23 -49 75 -78 25 -42 68 -113 55 53 14 -41 35 -58 11 -55 47 -25
3820 -25 55 -90 48 16 -28 48 105 77 94 -150 -121 185 -172 -13 105 91 -22 -72 -126 -96 202 -104 -20 -65 -89
3845 -89 64 -225 57 86 -58 -27 -10 -191 37 102 8 -50 -77 42 172 -25 77 -59 -102 74 -39 29 -95
3868 -95 27 124 -43 123 103 -25 85 -16 -20 140 20 -65 21 149 -40 108 142 90 22 50 1 -11 156 26
3892 26 96 70 22 -30 -11 -143 -69 22 167 110 -2 51 -47 93 79 -7 33 119 267 171 -114 -42 27 109 -50 -25 -66
3919 -66 -39 -13 128 -6 127 -156 27 -66 25 53 147 223 -77 -134 46 158 -34 -215 51 -26 73 2 150 182
3943 182 -73 90 38 63 -71 149 36 19 68 -65 -38 160 -59 237 43 136 -102 -56 92 -23 -56 -155 -9
3966 -9 -90 150 -111 -77 87 -76 -69 48 82 141 -104 90 -5 73 -66 52 -113 19 51 18 173 17 85 21 54
3991 54 -73 -12 -98 37 146 5 -79 90 -41 -64 129 104 -29 72 192 20 -7 74 262 52 -100 33 85
4014 85 200 -139 -175 5 73 70 183 164 -36 -92 -210 -8 75 -108 10 47 -70 -130 78 -125 4 -5 65 85 -25
4039 -25 -76 -11 -7 -20 -60 5 12 -120 56 -51 -79 80 -85 -71 60 4 87 -187 -16 -20 42 -75 -65 78 63 -73
4065 -73 199 116 23 -128 -4 -75 -147 -2 160 3 8 43 -214 28 -159 155 76 -217 6 -78 -72 -14 -76 -197 -75
4090 -75 95 77 59 59 -252 -76 -87 -6 -18 -25 98 133 -146 -103 -39 73 50 -3 -4 3 160 -25 90 -72 31 -21 -24
4117 -24 118 -42 162 103 -43 88 -101 -271 -16 -25 63 -165 52 30 98 5 11 -28 -132 72 92 -65 33 -118
4141 -118 -139 58 -9 85 60 57 -253 -90 64 40 30 -8 32 -28 -83 -1 5 -8 -166 -46 -51 -16 88 -14 -112 -243 39
4168 39 -26 39 139 -20 84 77 86 -20 108 149 48 -61 155 40 -53 12 46 168 126 -66 19 -57 -45 43 19 106
4194 106 41 28 256 -5 53 -117 -27 -34 57 -151 169 48 -102 -37 44 -19 -10 -42 22 -29 3 25 -193 24 76 31
4220 31 7 14 63 -45 12 -34 -126 -55 -59 -7 36 -43 144 -47 48 -122 -8 72 90 123 220 19 106 -153 30 38 37 -169
4248 -169 4 -44 23 99 -9 -8 -137 122 61 148 -128 -43 68 72 -150 28 -14 -21 -84 -11 -191 -1 -313 7 -17
4273 -17 -43 12 163 90 -135 -115 -78 -40 -17 -76 -263 41 -140 -233 -7 -53 -26 -21 -36 92 -156 130 -36 -198 15
4298 15 -62 -140 27 -75 -61 48 119 233 39 -173 86 -43 -223 61 97 -18 -290 -45 55 25 20 -41 -1 -8
4322 -8 -180 -95 78 -126 -45 -111 245 -154 -66 176 176 4 21 -27 6 -56 46 136 -51 49 -138 -200 -22 154 34
4347 34 -119 186 -14 -100 -12 116 168 -109 -47 149 -63 11 -135 259 -98 37 -6 -151 25 -90 75 229
4369 229 -155 -151 158 134 -56 -137 51 -8 19 -174 -71 20 -28 -73 -71 -33 -31 2 -35 73 -72 -195 71 -183 -49
4394 -49 8 -135 108 45 -122 75 -42 -54 -221 -131 -126 -149 115 116 129 -115 -13 -28 -67 -63 87 -33 -182 74 120
4419 120 8 79 -224 99 -29 94 -156 66 -106 46 -18 -16 3 -121 -113 -104 376 -66 -81 53 132 -19 -205 -39
4443 -39 -26 127 -56 53 122 180 32 10 66 261 -7 -87 34 131 5 -137 -53 -126 3 -6 67 8 -101 -74 94
4468 94 164 -55 -272 94 86 -95 -57 -23 123 -106 137 175 45 -221 -13 232 107 -56 -129 66 -2 -117 -12
4491 -12 -64 -4 103 -66 -96 -15 -6 152 -142 52 -112 15 130 148 149 120 103 31 182 10 153 132 -100 -46 41
4516 41 -45 36 -42 -12 85 62 -18 13 -111 -285 -36 1 -68 37 -247 34 42 -167 -65 -63 -30 -22 86 6 101 -8 11
4543 11 102 96 129 82 129 18 15 -91 -145 -74 97 141 251 86 142 0 55 2 -128 51 52 -20 -110 -11 12 149 -99
4570 -99 -38 147 27 -42 203 -57 -65 -102 -81 5 -70 -47 22 -129 -29 -71 32 -1 -53 -261 -128 185 -117 -53 14
4595 14 -45 17 119 169 71 122 -89 -145 43 19 -79 -3 118 -18 -89 23 132 83 -22 38 3 169 -186 -52 73
4620 73 43 -162 129 59 -66 -209 -138 229 -17 28 -77 43 -5 -79 60 57 -153 93 78 260 -158 -137 -114 -19
4644 -19 -85 -26 16 34 58 10 136 41 -75 -41 37 138 29 89 -69 -114 -8 32 69 -22 75 25 121 79 -24 -79 -12
4671 -12 110 32 61 -16 93 26 -14 -36 18 117 105 118 243 -108 -214 -35 68 206 -45 66 85 41 -56 -88 75
4696 75 -21 -66 81 -5 47 -173 -44 25 -216 -138 -97 -36 -107 -147 -188 101 -186 -268 -59 -219 -117 -98 22 -51 -92
4721 -92 -172 44 -79 -363 -216 -12 59 -85 -95 -35 -46 106 64 34 165 -83 -110 248 241 -100 -62 152 138 10
4745 10 57 -33 -208 32 28 16 -53 -48 -97 71 95 104 -120 29 7 163 -158 -31 185 -15 -18 180 -19 -155 103
4770 103 -110 33 -56 -185 -6 -61 -200 -200 111 37 -130 -118 78 -125 9 -80 86 133 -241 25 -21 -32 -242
4793 -242 -108 121 37 154 -64 145 168 5 66 287 -18 -29 44 -42 -92 -14 -37 102 100 83 -6 3 8 -170 -30 277
4819 277 -57 -78 -93 45 53 122 -56 224 45 205 -117 -109 28 47 -265 74 -12 62 -194 124 -61 -33 79 90
4843 90 37 -163 131 -148 -84 -153 17 -29 -37 -30 31 -2 34 -25 0 -37 4 -30 124 202 74 125 81 137 56 -268 134
4870 134 106 -29 4 15 130 153 -214 54 148 122 28 4 114 66 -41 12 82 -175 66 -146 -31 16 -86 60
4894 60 90 97 -151 -44 -68 -86 87 -82 -40 -2 -96 -46 -22 -85 3 129 200 44 78 -61 54 18 -79 -20 112 68
4920 68 -53 12 -25 130 38 -83 213 -76 20 -11 -98 31 -35 -72 26 29 -122 -142 82 41 -140 -253 136 -120 -104
4945 -104 -10 196 -26 -132 206 82 -104 140 60 45 64 -142 74 92 -15 46 -25 -55 -58 -184 153 -28 12 -30
4969 -30 100 49 -78 -24 -15 -71 22 48 -75 12 -38 -240 -25 20 -264 5 1 299 -1 -103 -60 270 107 -168 20
4994 20 0 -127 -256 -19 124 -132 8 121 89 79 -157 43 47 -38 -16 29 -37 7 -38 72 16 -221 64 25 -20
5019 -20 -184 -65 85 13 -189 -96 -31 -11 12 7 41 140 77 -6 13 172 -83 5 32 134 -35 -168 69 63 38 -77
5045 -77 31 41 -154 -38 115 -164 87 -94 -13 0 -123 -37 -54 -71 36 -35 -294 125 52 -10 48 -96 -131 43
5069 43 -271 9 -16 -13 188 61 -67 -6 -25 -187 7 -178 -1 84 -239 -69 26 -114 -30 -177 235 79 -41
5092 -41 70 5 55 -147 -183 113 77 47 61 112 125 -110 -57 102 65 -155 -41 36 126 -138 -100 -80 41 100 -169
5117 -169 163 245 -94 -25 -14 21 -29 -92 218 -41 -299 -105 -67 85 -66 63 175 -48 64 20 90 -3 37 -142
5141 -142 93 -112 88 -91 104 77 43 22 -54 -101 -30 21 31 39 -29 48 98 95 110 88 -77 -146 -138 -38 -96 23 -20
5168 -20 -30 -41 -5 -91 107 143 83 -188 72 242 245 -79 4 122 -73 15 -37 -24 52 -38 -126 101 -27 27 -36 -61
5194 -61 -115 -98 -38 124 -6 -89 51 -93 -113 5 119 146 -113 56 122 51 -111 76 115 9 70 -23 -24 -29 -175
5219 -175 -150 50 -62 -60 -51 112 62 -41 -6 174 -62 81 96 144 68 52 11 176 8 183 -13 -35 5 -136 75
5244 75 -135 22 22 -173 19 249 111 -56 -107 87 -119 127 -45 88 -143 10 87 108 -108 187 -199 36
5266 36 6 -82 153 -40 -86 -69 60 -30 3 -18 -31 62 -11 -113 -55 4 -54 45 103 22 -235 -19 -157 213 42 -12
5292 -12 15 -120 -26 -15 -174 17 -43 106 133 78 102 145 168 49 124 -43 51 128 -39 -7 24 32 54 -33 119 148 -91
5319 -91 -98 54 313 116 -58 -35 3 38 -178 2 -8 -59 34 163 -39 177 -69 -24 140 107 -29 -39 173 -102
5343 -102 -105 -94 89 -50 -134 -66 111 34 -181 -132 34 -23 -40 117 209 -94 148 214 192 68 -4 -54 -51 57 -194
5368 -194 58 32 -72 107 -220 164 -168 -40 70 -89 -9 -55 -18 76 -137 65 202 -11 31 -122 -216 5
5390 5 -35 62 -60 13 -112 45 -114 -94 -190 -114 -8 -123 -159 44 -19 -135 -165 -45 128 105 -141 124 52 -37 -86
5415 -86 -88 138 -10 -99 -8 55 203 -92 26 -52 94 6 47 -50 -79 38 75 77 -62 -98 -109 68 39 118 14 109
5441 109 -107 -90 -154 -7 111 31 -122 5 -78 -242 71 -13 -50 16 -51 -62 133 -166 36 -106 62 50 -132
5464 -132 -100 -133 -62 107 203 -184 -106 -75 75 -45 -62 21 26 10 97 -45 46 5 -215 -92 -60 -86 -216 85 15 -107
5490 -107 34 25 113 -180 -69 -118 75 22 -163 127 -43 54 -26 -117 108 66 -65 -99 88 -70 -19 132 -104 195
5514 195 191 81 91 -14 123 -10 180 -188 -62 -38 111 83 -157 -20 -15 -119 -98 -34 -36 -82 -64 -58 28 -212 134
5539 134 -16 126 -232 -40 -41 35 -119 45 -3 45 -39 -16 -147 -114 28 -135 56 -55 -136 -179 -24 127 -67
5562 -67 -70 -26 173 1 -34 39 6 123 -46 141 108 -62 -24 -135 145 -22 -128 96 -137 -18 51 27 -20 60
5586 60 -3 122 12 -63 -141 82 -117 164 53 9 309 100 -86 62 33 -80 68 -34 183 37 -95 69
5608 69 67 69 -176 -79 54 -267 118 102 161 -42 -72 -68 71 35 6 61 -39 -79 94 152 24 121 -11 -129 -18 13
5634 13 -13 120 -39 184 63 51 53 193 23 -38 0 -29 259 187 -14 -2 -190 -21 122 -171 -45 -87 -97 -62
5658 -62 -114 -32 -92 78 -99 -2 127 -161 59 -65 84 62 92 104 -95 -41 56 18 -49 95 -202 -114 -130 -91 -169
5683 -169 35 -142 -112 130 -43 276 -21 -102 -154 -55 -69 -130 35 48 -75 33 75 116 -254 -44 104 -25 127
5706 127 130 -27 -4 23 -3 49 -22 -68 -128 -128 -149 -224 -54 -121 -4 -152 34 -6 -66 128 -58 89 11 141 -67 -3
5732 -3 -51 6 211 16 118 -66 -145 85 238 68 -23 -80 143 63 126 74 -64 -91 226 106 130 -81 -27 158
5756 158 21 61 -61 -99 97 80 -34 64 -50 -128 24 43 47 40 -32 -32 -10 -28 102 107 28 24 14 -229 -24 72 -101
5783 -101 39 101 -37 -67 -54 -32 -135 -18 106 -28 -28 -119 -14 146 -111 85 162 -133 -56 -14 77 -164 -111 56
5807 56 83 -39 21 64 187 -159 -22 146 -129 17 -30 -134 7 -38 62 2 -77 1 -44 -19 -14 113 -85 -75 -18
5832 -18 -53 -88 167 -27 152 -134 -142 36 20 -14 41 14 26 109 -12 31 60 -12 38 23 -146 100 198 -268 -66 -62
5858 -62 82 -34 74 -134 -16 54 -46 8 10 2 19 -37 -126 162 -99 127 33 112 55 51 -48 71 -52 59 185
5883 185 -100 -149 9 110 -79 131 -82 -9 116 151 -115 74 100 -8 -130 -92 67 -120 -54 124 110 223
5905 223 30 -29 97 -32 81 -196 -94 85 227 -60 -90 -93 -1 -64 112 62 -86 37 16 117 -89 84 52
5928 52 -31 112 79 52 32 -97 -38 -74 96 -151 -102 217 -51 -14 -127 -41 65 198 -97 108 -90 -9 -162 126
5952 126 138 68 123 -80 126 -3 153 121 -58 36 56 -33 72 -70 -138 -122 -90 -131 -158 -215 29 100 71 98 -54
5977 -54 119 194 -61 101 116 -177 -107 40 -8 203 103 34 184 264 184 38 -123 -133 -30 -86 122 71 -4 10
6001 10 -285 -41 -42 62 -23 -256 -172 111 61 -47 79 -91 26 -6 122 -101 -218 132 186 104 -91 -97 -21 -181
6025 -181 79 24 45 109 62 45 165 -35 -65 -1 -51 -17 106 104 -67 32 -71 -5 88 -35 73 -32 116 23 -202
6050 -202 -22 -50 44 -32 -75 35 39 78 97 45 -20 -235 -23 -69 -18 61 10 94 -37 56 23 -63 110 0 81 136 -192
6077 -192 -16 111 -52 71 -15 7 -21 -23 68 -47 -41 -89 -111 -259 -36 115 -61 -160 5 133 -19 -8 -32 -89 50
6102 50 -187 -50 -80 83 164 37 -288 69 -44 159 -53 -29 158 33 54 -48 225 31 -103 31 -32 70
6124 70 -61 18 48 15 0 95 25 52 -54 171 -95 24 7 -57 32 83 -49 215 -14 -37 -167 -15 86 -90
6148 -90 -76 -216 -6 117 -2 71 176 -179 51 11 -50 -96 -151 31 -81 -19 46 9 14 104 -69 7 -80 162 11
6173 11 72 156 -22 62 60 52 31 35 -11 -102 35 -46 -32 92 16 -8 186 19 8 37 104 52 -18 87 -55 72 93 -66
6201 -66 -10 -15 -41 -55 -76 82 51 76 -27 -16 -28 -237 -169 -57 -215 116 55 -142 -131 104 -140 -199 -47 3 -48 30
6227 30 274 -68 17 160 77 -200 -201 -41 112 41 73 -26 42 -20 166 45 84 -53 20 -31 -129 -85 -67 -231 -45
6252 -45 192 -227 -9 -29 -160 -161 -83 -26 114 50 170 -95 -62 -242 -184 54 -167 -135 49 -155 -194 -29 162 -131
6276 -131 85 -125 10 -265 99 -16 118 10 233 -103 -7 110 -185 0 7 143 -4 170 -32 56 51 141
6298 141 87 155 -30 -118 99 163 -137 -85 -15 155 96 182 -96 -56 24 65 11 -33 168 9 -108 -88 82 34 74
6323 74 165 -114 -174 -228 18 -33 -29 -189 -21 -8 18 201 -22 -81 27 -99 -1 -139 -59 120 -99 -130 178 202 73
6348 73 10 59 -103 96 153 38 174 -84 118 71 47 9 68 -214 -2 -161 52 67 -73 -49 -176 174 -37
6371 -37 -60 136 -62 -125 23 40 29 -28 28 68 118 -56 -12 9 -50 -215 -27 111 -130 203 -36 -187 162 173
6395 173 -31 -85 -65 74 80 -43 128 -3 87 -27 -110 127 -98 -57 -56 8 -35 59 -64 73 48 33 -97 49 106
6420 106 -55 -118 -82 -278 108 -191 62 -6 -5 -63 231 123 2 88 31 -71 -120 168 -38 -121 179 63 161 85
6444 85 -5 111 57 30 -167 63 16 -123 -75 36 119 173 -1 -47 -30 99 -18 -11 42 -3 142 -11 -31 10 182
6469 182 -75 -80 41 -41 62 16 -24 -27 -107 -22 123 -229 -137 -211 36 -53 -47 179 84 88 115 201 -159 71 197 192 -89
6496 -89 -15 52 -122 -240 22 264 -98 -127 81 -44 -28 168 -80 42 117 66 -166 171 154 -82 -191 -16 248
6519 248 152 -9 158 73 2 -106 42 37 56 -181 -15 -35 52 -18 21 -10 -123 -72 -57 93 -31 284 -135 -5
6543 -5 -81 -79 171 -9 -104 -47 -203 130 -24 -107 -153 16 -31 8 34 27 -47 -141 -38 -104 -86 156 14 -90 -43 -75 -113
6570 -113 -151 -27 -11 130 -43 -127 -110 -91 156 64 -40 -45 -59 -39 -103 -131 2 -19 45 138 -76 -199 103 180 72
6595 72 -110 77 -73 -57 119 16 52 215 -97 31 -56 19 -59 82 -37 31 -57 -167 35 34 -65 81 -102 -86
6619 -86 37 -16 96 -68 -23 146 78 -95 -107 2 23 41 -122 -42 -59 21 -65 -32 175 -63 -84 19 33 -64 -65 7
6645 7 91 37 91 -137 235 -33 -139 -102 138 211 -142 73 -72 -45 130 108 -4 15 44 -231 127 125 80 194 -6
6670 -6 -122 62 -68 385 8 27 63 -55 107 30 26 -4 -2 -89 169 71 10 -70 -110 -88 -112 80 50 -48 21 -108 22
6697 22 19 96 -45 -24 -16 -106 -134 -75 -12 253 -58 -196 7 -17 16 -290 13 -170 17 -120 113 22 176 116 -125
6722 -125 3 141 130 205 38 0 -102 -12 0 -74 61 -115 -61 -163 115 138 25 32 153 33 -85 29 -82
6745 -82 107 -40 -70 -61 145 129 6 -13 -260 13 -142 56 22 181 -170 -187 66 101 -83 -66 -58 -207 -84 -162
6769 -162 -144 -46 -49 -102 51 -84 157 -38 -73 -49 20 -49 55 -215 -19 -51 166 114 170 16 -228 170 86 165 -118
6794 -118 -60 135 69 -114 189 -11 74 61 -91 136 66 4 89 -46 11 93 -127 34 -42 -169 0 83 30 34 39
6819 39 -60 44 -13 16 183 47 188 33 35 11 -42 29 -116 -74 -69 -26 -71 106 9 -26 20 175 -33 7 42 39 226
6846 226 36 -59 170 225 -53 -266 2 34 23 69 260 136 -69 150 -76 -90 11 56 79 -95 296 25 -37
6869 -37 45 56 35 69 46 -65 26 -28 16 56 -47 101 59 -101 47 -67 -130 -1 59 -47 124 104 44 -34 -45 -266
6895 -266 -107 -75 -26 -51 -125 76 -74 -48 75 96 -149 -199 59 -99 159 96 32 170 -145 -54 -121 137 86 -2
6919 -2 29 33 -149 -36 210 15 -130 77 75 102 73 -192 64 81 6 32 -27 87 -124 172 26 100 -33 63 111
6944 111 123 -110 -42 67 228 8 58 41 82 -10 -24 57 -29 -14 -6 -292 123 -22 -117 -16 -227 107 6 -49 9
6969 9 155 -38 26 14 30 3 25 54 -27 -27 -45 38 -34 -77 -146 -7 -27 40 -18 -286 11 119 -101 137 -221 -60
6995 -60 147 92 214 -151 28 -87 -43 20 60 -18 -15 149 -43 41 -182 -84 -79 -345 -38 -28 174 -221 0 13 -18
7020 -18 141 -4 36 -172 112 73 -70 128 19 -170 -139 5 139 76 46 81 -52 95 66 110 274 56 53 132
7044 132 195 82 -77 191 -15 109 -101 153 -161 -44 -212 15 97 75 -25 -89 -53 51 -52 -215 27 24
7066 24 125 -1 -29 11 149 -28 -48 -153 10 53 59 -133 -87 1 -48 -13 193 114 -101 -12 -72 -28 163 8 -20
7091 -20 -159 48 -46 135 -4 116 -87 87 24 35 123 -20 84 -41 24 35 -84 88 -51 74 -3 94 56
7114 56 6 -74 -42 133 -221 118 44 149 60 242 -25 -16 -102 -5 51 -36 111 91 91 -155 84 7 20 0 -70 8 -58
7141 -58 28 -26 -5 -12 -104 -3 25 15 131 100 -112 1 -71 -107 -118 -157 -18 -18 -119 -93 133 85 89 -58 -78 53 9
7168 9 88 2 144 48 55 -74 -47 35 -143 -108 116 27 -49 5 54 27 247 42 2 -62 69 -61 -49 167 97 -123
7194 -123 96 91 -8 12 -46 -35 42 -80 68 144 136 82 -98 -57 -240 -85 72 -142 -99 38 131 7 -33 -18 165
7219 165 9 -125 79 63 130 -11 42 -43 -10 -81 -33 -97 1 156 -98 -47 -185 67 15 13 75 -31 32 -103 71
7244 71 44 -244 53 -56 -159 -183 -69 -57 -77 -159 -49 171 -140 -158 86 -82 -149 56 62 83 -164 154 193 -76
7268 -76 50 -99 69 -67 -65 -20 54 199 12 68 -28 104 -60 59 95 27 -40 -50 -67 44 85 -37 13 108 48
7293 48 88 22 37 86 149 -196 139 150 62 85 -50 222 237 -7 6 -83 200 103 46 15 4 140 91 -87 37 -25
7319 -25 41 -138 -85 22 148 191 114 -94 -102 -52 54 199 213 9 -98 -82 -138 188 -32 -89 118 9 -18 -87 85
7344 85 -140 85 33 164 33 -9 69 -22 -36 96 200 -73 -174 -78 93 -44 13 70 117 86 -148 8 97 55
7368 55 -4 124 150 -61 8 -6 13 -177 -313 -91 102 -2 -120 22 21 17 -7 -7 -46 -64 -68 -89 100 38 -23 100 51
7395 51 -138 183 111 52 31 67 55 -41 -83 -12 14 -11 41 21 -46 66 42 133 92 55 132 22 -27 82 -70 -91 95
7422 95 -18 -46 120 162 122 202 79 35 -18 -54 12 37 37 -74 -159 -11 -100 7 5 131 -60 -43 -37 66 -96 86
7448 86 -32 1 -76 -58 43 -48 -222 74 -164 80 -22 -227 187 -20 -142 19 -70 -32 -100 -32 28 -3 -47 38
7472 38 -40 -85 -25 -114 -85 -41 125 17 45 2 120 -166 67 -26 191 -104 -180 -271 0 211 146 -48 71 -129
7496 -129 -8 64 44 -164 83 -36 -113 122 -92 -103 -67 -77 33 -23 -4 -86 -87 -26 -15 -30 3 94 -132 -102 -71 70
7522 70 -3 9 -26 63 -72 61 49 -38 -63 91 -1 125 -30 33 -60 220 -92 -193 65 176 -280 -91 82 -21
7546 -21 2 -255 6 86 -152 20 -32 219 -135 -279 -208 -148 -96 42 -238 -182 -42 -203 10 54 2 28 92 -114
7570 -114 58 -1 7 -137 -134 -129 79 106 -67 -105 -66 -147 -143 -31 -50 -55 -190 -34 -33 42 56 79 -175 4 -100 -79 116
7597 116 -42 -136 15 -52 73 -116 11 69 133 -247 -217 -126 24 88 36 -53 -10 25 -96 29 -8 137 102 35 80
7622 80 53 -17 42 76 -35 46 -82 -23 219 119 45 -161 87 -52 49 70 196 -114 -12 29 -284 11 95 78
7646 78 -21 135 49 74 45 -115 -204 -92 -192 58 65 -86 72 -85 142 -88 -191 -160 143 -16 22 110 52 20
7670 20 97 -31 24 137 18 -105 76 -54 132 102 -44 82 -1 55 -114 -69 -162 19 120 -44 -128 84 41
7693 41 27 89 -47 88 35 -107 -46 11 -20 -48 -74 119 -24 -27 -200 -107 -95 -106 -29 -46 51 37 -148 57 -65 264
7719 264 -112 -5 86 -77 79 2 7 -72 -7 -25 -140 -98 10 147 44 91 -29 15 162 -73 -201 -164 47 -38
7743 -38 71 34 -155 -192 -131 -8 -64 -16 -105 104 -108 -11 -1 -88 205 -71 25 167 45 0 -15 3 -54 -195 -66
7768 -66 63 286 54 -125 50 -48 -10 -217 -178 6 -176 -123 42 -115 -13 -32 201 195 151 -93 -12 -132 11
7791 11 -15 -84 92 -67 -173 -137 -82 -30 -86 -114 -17 -144 -6 50 40 52 -233 -49 37 -79 -74 14 -29 -189 -167 -245
7817 -245 -130 -37 -254 85 -64 -4 -81 32 123 -38 -169 -2 4 49 -66 -117 114 20 55 94 41 -144 60 46
7841 46 11 -61 130 60 190 131 45 -66 -71 50 -42 -96 -121 41 65 21 116 -93 -72 222 163 99 -106 -127 43 67
7867 67 -51 -130 121 123 -127 137 -34 132 134 -32 -138 -9 38 7 -84 -123 0 -221 91 8 93 94 -28 -169 14
7892 14 -120 -209 -240 -140 123 156 -4 -66 20 210 51 -65 79 -1 43 -76 40 -19 211 3 -58 55 -39 -110
7916 -110 -103 -240 26 197 116 -224 -62 89 35 20 121 21 -88 -87 -85 120 155 -59 -101 88 -90 -81 50 11 -151
7941 -151 -53 188 164 50 26 -88 22 -11 59 -147 -102 -49 30 -231 17 65 -133 -7 -2 68 -43 7 -97 51
7965 51 -67 -77 45 -199 33 -44 103 176 -148 0 127 -9 10 -130 -58 209 31 -81 -94 73 -47 -77 124
7988 124 -89 -182 11 94 -97 -8 -26 -40 44 65 6 -83 20 -20 -32 -91 8 -121 135 13 -142 -27 -76 -64 87
8013 87 -81 2 -24 -136 -119 -162 -135 104 -191 -264 -52 45 -216 -56 173 18 101 21 -108 -2 49 -168 45 1
8037 1 60 57 -6 -60 -20 -65 135 88 17 49 -108 15 -130 68 104 96 -6 -48 48 -33 119 157 1 -182 -46 95
8063 95 -119 2 162 8 -7 -17 24 -129 23 -60 -60 -11 90 80 135 118 -46 36 62 -18 110 -96 -89 -147 -115 -31
8089 -31 -52 3 -71 -28 -50 -50 -5 30 99 -147 173 -76 11 -137 -156 44 34 81 -60 -115 114 -79 -24 -55 -107 -73 -140
8116 -140 33 -149 -62 -131 -45 172 -18 -163 -61 159 -55 -89 -207 24 182 -80 -60 -15 -58 133 119 31 -52
8139 -52 16 38 40 -162 14 186 36 -237 -9 36 -168 87 108 -113 -138 20 222 81 205 -38 -59 60 66 93
8163 93 76 -41 236 96 -119 53 35 -131 142 -47 -31 9 -63 -134 102 14 -127 65 -35 37 23 88 54 -65
8187 -65 210 31 169 -5
8191e
##END NTUPLES=NMR FID
##END=
