##TITLE=1H_LR-679-MC2
 CDCl3, 8 sc, 
 28.6.2019
##JCAMPDX= 6.0         $$ Bruker NMR JCAMP-DX V2.0
##DATA TYPE= NMR FID
##DATA CLASS= NTUPLES
##ORIGIN= UXNMR, Bruker Analytische Messtechnik GmbH
##OWNER= root
$$ XWIN-NMR		Version 3.5
$$ Fri Jun 28 13:50:29 2019 Russian Standard Time (UT+4h)  she@DPX200
##.OBSERVE FREQUENCY= 200.13155
##.OBSERVE NUCLEUS= ^1H
##.DELAY= (6, 6)
##.ACQUISITION MODE= SIMULTANEOUS
##.ACQUISITION SCHEME= undefined
##.AVERAGES= 8
##.DIGITISER RES= 18
##SPECTROMETER/DATA SYSTEM= spect
##.PULSE SEQUENCE= zg30
##.SOLVENT NAME= CDCl3
##.SHIFT REFERENCE= (INTERNAL, CDCl3, 0, 15.7039)
##AUDIT TRAIL= $$ (NUMBER, WHEN, WHO, WHERE, WHAT)
$$ ##TITLE= Audit trail, XWIN-NMR		Version 3.5
$$ ##JCAMPDX= 5.01
$$ ##ORIGIN= Bruker BioSpin GmbH
$$ ##OWNER= she
$$ F:/spectra/data/she/nmr/H-F/1/audita.txt
$$ ##AUDIT TRAIL=  $$ (NUMBER, WHEN, WHO, WHERE, WHAT)
(   1,<2019-06-28 13:49:15.67 +0400>,<she>,<DPX200>,
      <created by zg, POWCHK disabled, PULCHK disabled
       configuration hash MD5:
       00 E9 B6 7A A2 85 ED C7 34 08 36 98 17 FE 4E 26
       data hash MD5: 16K
       51 C8 58 C7 49 98 8E E1 ED 23 E0 51 F3 22 9A CF>)
$$ ##END=
$$ 
$$ hash MD5
$$ 80 22 E5 F2 A2 A2 C7 70 83 38 AF 75 6C 84 DB C7
##$RELAX= 
##$RELAX= 
##$RELAX= 
##$RELAX= 
##$RELAX= 
##$RELAX= 
$$ Bruker specific parameters
$$ --------------------------
##$DU= <F:/spectra>
##$EXPNO= 1
##$NAME= <H-F>
##$PROCNO= 1
##$TYPE= <nmr>
##$USER= <she>
##$AMP= (0..31)
100 100 100 100 100 100 100 100 100 100 100 100 100 100 100 100 100 100 
100 100 100 100 100 100 100 100 100 100 100 100 100 100 
##$AQSEQ= 0
##$AQ_mod= 1
##$AUNM= <au_zg>
##$AUTOPOS= <>
##$BF1= 200.13
##$BF2= 200.13
##$BF3= 200.13
##$BF4= 200.13
##$BF5= 200.13
##$BF6= 200.13
##$BF7= 200.13
##$BF8= 200.13
##$BYTORDA= 1
##$CFDGTYP= 0
##$CFRGTYP= 5
##$CHEMSTR= <none>
##$CNST= (0..31)
1 1 145 1 1 1 1 1 1 1 1 1 1 1 1 1 1 1 1 1 1 1 1 1 1 1 1 1 1 1 1 1 
##$CPDPRG= <>
##$CPDPRG1= <>
##$CPDPRG2= <>
##$CPDPRG3= <>
##$CPDPRG4= <mlev>
##$CPDPRG5= <mlev>
##$CPDPRG6= <mlev>
##$CPDPRG7= <mlev>
##$CPDPRG8= <mlev>
##$CPDPRGB= <>
##$CPDPRGT= <>
##$D= (0..31)
0 1.2 0 0 0 0 0 0 0 0 0 0.03 0 0 0 0 0 0 0 0 0 0 0 0 0 0 0 0 0 0 0 0 
##$DATE= 1561715355
##$DBL= (0..7)
120 120 120 120 120 120 120 120 
##$DBP= (0..7)
150 150 150 150 150 150 150 150 
##$DBP07= 0
##$DBPNAM0= <>
##$DBPNAM1= <>
##$DBPNAM2= <>
##$DBPNAM3= <>
##$DBPNAM4= <>
##$DBPNAM5= <>
##$DBPNAM6= <>
##$DBPNAM7= <>
##$DBPOAL= (0..7)
0.5 0.5 0.5 0.5 0.5 0.5 0.5 0.5 
##$DBPOFFS= (0..7)
0 0 0 0 0 0 0 0 
##$DE= 6
##$DECBNUC= <off>
##$DECIM= 24
##$DECNUC= <off>
##$DECSTAT= 4
##$DIGMOD= 1
##$DIGTYP= 9
##$DL= (0..7)
0 120 120 120 120 120 120 120 
##$DP= (0..7)
150 150 150 150 150 150 150 150 
##$DP07= 0
##$DPNAME0= <>
##$DPNAME1= <>
##$DPNAME2= <>
##$DPNAME3= <>
##$DPNAME4= <>
##$DPNAME5= <>
##$DPNAME6= <>
##$DPNAME7= <>
##$DPOAL= (0..7)
0.5 0.5 0.5 0.5 0.5 0.5 0.5 0.5 
##$DPOFFS= (0..7)
0 0 0 0 0 0 0 0 
##$DQDMODE= 0
##$DR= 18
##$DS= 0
##$DSLIST= <SSSSSSSSSSSSSSS>
##$DSPFIRM= 0
$$ [...]
##$SUBNAM2= <"">
##$SUBNAM3= <"">
##$SUBNAM4= <"">
##$SUBNAM5= <"">
##$SUBNAM6= <"">
##$SUBNAM7= <"">
##$SUBNAM8= <"">
##$SUBNAM9= <"">
##$SW= 24.9336996594482
##$SWIBOX= (0..15)
0 0 2 0 0 0 0 0 0 0 0 0 0 0 0 0 
##$SW_h= 4990.01996007984
##$TD= 16384
##$TD0= 1
##$TE= 0
##$TE2= 300
##$TE3= 300
##$TEG= 300
##$TL= (0..7)
0 120 120 120 120 120 120 120 
##$TP= (0..7)
150 150 150 150 150 150 150 150 
##$TP07= 0
##$TPNAME0= <>
##$TPNAME1= <>
##$TPNAME2= <>
##$TPNAME3= <>
##$TPNAME4= <>
##$TPNAME5= <>
##$TPNAME6= <>
##$TPNAME7= <>
##$TPOAL= (0..7)
0.5 0.5 0.5 0.5 0.5 0.5 0.5 0.5 
##$TPOFFS= (0..7)
0 0 0 0 0 0 0 0 
##$TUNHIN= 0
##$TUNHOUT= 0
##$TUNXOUT= 0
##$USERA1= <user>
##$USERA2= <user>
##$USERA3= <user>
##$USERA4= <user>
##$USERA5= <user>
##$V9= 5
##$VALIST= <valist>
##$VCLIST= <CCCCCCCCCCCCCCC>
##$VD= 0
##$VDLIST= <DDDDDDDDDDDDDDD>
##$VPLIST= <PPPPPPPPPPPPPPP>
##$VTLIST= <TTTTTTTTTTTTTTT>
##$WBST= 1024
##$WBSW= 4
##$XGAIN= (0..3)
0 0 0 0 
##$XL= 0
##$YL= 0
##$YMAX_a= 160069
##$YMIN_a= -216161
##$ZGOPTNS= <>
##$ZL1= 120
##$ZL2= 120
##$ZL3= 120
##$ZL4= 120
##$ABSF1= 10
##$ABSF2= 0
##$ABSG= 5
##$ABSL= 3
##$ALPHA= 0
##$AQORDER= 0
##$ASSFAC= 0
##$ASSFACI= 0
##$ASSFACX= 0
##$ASSWID= 0
##$AUNMP= <proc_1d>
##$AZFE= 0.1
##$AZFW= 0.1
##$BCFW= 1
##$BC_mod= 2
##$BYTORDP= 1
##$COROFFS= 0
##$CY= 11.3945322036743
##$DATMOD= 1
##$DC= 2
##$DFILT= <>
##$DTYPP= 0
##$F1P= 18.9103706918063
##$F2P= -1.10871071338519
##$FCOR= 0.5
##$FTSIZE= 0
##$FT_mod= 4
##$GAMMA= 1
##$GB= 0.15
##$INTBC= 1
##$INTSCL= 1
##$ISEN= 128
##$LB= 0.24
##$LEV0= 0
##$LPBIN= 0
##$MAXI= 10000
##$MC2= 0
##$MEAN= 0
##$ME_mod= 0
##$MI= 1.114404
##$NCOEF= 0
##$NC_proc= 0
##$NLEV= 6
##$NOISF1= 3.799351
##$NOISF2= 2.8
##$NSP= 1
##$NTH_PI= 0
##$NZP= 0
##$OFFSET= 15.70392
##$PC= 1
##$PHC0= -8494.747
##$PHC1= 8.40098
##$PH_mod= 1
##$PKNL= yes
##$PPARMOD= 0
##$PSCAL= 0
##$PSIGN= 0
##$REVERSE= no
##$SF= 200.130013532006
##$SI= 16384
##$SIGF1= 3
##$SIGF2= 2
##$SINO= 400
##$SIOLD= 16384
##$SREGLST= <1H.CDCl3>
##$SSB= 0
##$STSI= 0
##$STSR= 0
##$SW_p= 3612.71676300578
##$SYMM= 0
##$S_DEV= 0
##$TDeff= 0
##$TDoff= 0
##$TI= <>
##$TILT= no
##$TM1= 0
##$TM2= 0
##$TOPLEV= 0
##$USERP1= <user>
##$USERP2= <user>
##$USERP3= <user>
##$USERP4= <user>
##$USERP5= <user>
##$WDW= 1
##$XDIM= 8192
##$YMAX_p= 0
##$YMIN_p= 0
$$ End of Bruker specific parameters
$$ ---------------------------------
##NTUPLES= NMR FID
##VAR_NAME=  TIME,          FID/REAL,        FID/IMAG
##SYMBOL=    X,             R,               I
##VAR_TYPE=  INDEPENDENT,   DEPENDENT,       DEPENDENT
##VAR_FORM=  AFFN,          ASDF,            ASDF
##VAR_DIM=   8192,          8192,            8192
##UNITS=     SECONDS,       ARBITRARY UNITS, ARBITRARY UNITS
##FACTOR=    0.0002004,     1,               1
##FIRST=     0,             0,               0
##LAST=      1.6414764,     0,               0
##MIN=       0,             -216161,         0
##MAX=       1.6414764,     160069,          0
$$ Real data points
##PAGE= N=1
##DATA TABLE= (X++(R..R)), XYDATA
$$ plain form
0 0 0 0 0 0 0 0 0 -8 8 -8 8 -16 16 -24 25 -32 40 -48 56 -65 79 -90 105 -121 139 -160 183 -207 236 -266
30 -266 298 -337 378 -425 473 -527 586 -651 722 -800 887 -982 1087 -1203 1334 -1480 1643
47 1643 -1829 2044 -2291 2580 -2931 3357 -3892 4584 -5525 6884 -9023 12914 -22295 95238
61 95238 21467 -130802 94806 158608 -45657 -144925 76943 160069 -36965 -124078 82133
72 82133 149967 -53842 -138125 55448 112270 -85862 -150751 46987 98889 -95035 -146645
83 -146645 45678 80665 -122196 -165132 34439 72389 -120685 -146818 59490 88026 -116422
94 -116422 -147466 52516 73495 -132476 -155858 51977 79708 -115905 -128252 82062 107028
105 107028 -90612 -107517 90583 104068 -94849 -106897 91608 107633 -81134 -84120 110568
$$ packed form
0@%%%%%%%qJ6j6J6k4L2m0M9n7P2q8J04j21J44j69J95k26K60k99L43l90M43n02
30b66N64o35P15q03Q98j000J113j237J373j522J687j869K069k290K537k814L123
47A643l472L873m335M871n511O288p249Q476j0109J2409j5907K1937l5209J17533
61I5238p3771j52269K25608O3802k04265r9268K21868Q3126j97034q7113K06211
72H2133O7834k03809q4283J93573N6822j98132o4889J97738N1902j93924n1610
83a46645J92323L4987k02861m2936J99571L7950j93074k6133K06308K8536k04448
94a16422l1044J99982K0979k05971k3382K07835K7731j95613j2347K10314K4966
105A07028j97640j6905J98100J3485j98917j2048J98505J6025j88767k986J94688
$$ plain form
116 110568 116276 -71437 -70157 120482 118860 -65639 -56987 129683 118917 -67453 -54312 128943
128 128943 107773 -79813 -60902 122398 98343 -84907 -56237 130022 102826 -81214 -54921
139 -54921 122225 84320 -101301 -72426 103142 65562 -111460 -74117 99748 60434 -110499
150 -110499 -68313 99172 51579 -116548 -70491 91533 38362 -125234 -71902 88182 31065
161 31065 -128980 -70162 87633 28546 -125909 -61452 95456 33268 -119186 -54088 96021
172 96021 29103 -120584 -53503 92801 24890 -117911 -45041 99602 30286 -105910 -28697
183 -28697 109431 33176 -101208 -23411 108245 27354 -102938 -19042 110274 26092 -99362
194 -99362 -10941 115587 28043 -93969 -2237 120581 27916 -92906 217 118232 21916
$$ packed form
116A10568N708j87713J280J90639j622j84499Q652J86670j0766j86370J3141J83255
128A28943k1170j87586J8911J83300k4055j83250K8670J86259k7196j84040K6293
139e4921J77146l7905j85621K8875J75568l7580j77022L7343J73865l9314j70933
150a10499M2186J67485m7593j68127M6057J62024n3171j63596N3332J60084n7117
161C1065j60045N8818J57795n9087j54455O4457J56908o2188j52454O5098J50109
172I6021o6918j49687O7081J46304o7911j42801P2870J44643o9316j36196P7213
183b8697J38128p6255j34384P7797J31656q0891j30292Q3896J29316q4182j25454
194i9362Q8421J26528q7544j22012R1732J22818r2665j20822R3123J18015r6316
$$ plain form
205 21916 -96237 -529 114202 17200 -96662 2141 115151 16365 -92216 7388 113923
216 113923 11945 -93606 5643 105338 2035 -98194 3977 99242 -5533 -98921 6807
227 6807 97310 -9595 -97248 9315 93742 -16755 -101249 8093 87963 -24620 -105166
238 -105166 6793 84196 -28744 -104836 8543 83942 -28927 -101692 10794 81519 -30783
249 -30783 -99851 11291 77514 -33819 -97105 14920 76112 -34107 -90607 22405 78486
260 78486 -32581 -84408 29979 79810 -33711 -81102 34606 80455 -35027 -77774 40000
271 40000 83029 -33137 -73055 45847 85964 -31717 -69044 49124 85301 -32726 -66991
282 -66991 49815 82253 -34429 -64951 50931 79339 -36332 -62541 52448 75956 -39523
$$ packed form
205B1916j18153R5708J14731r7002j13862R8803J13010r8786j08581R9604J06535
216A13923j01978j05551R9249R9695j03303j00229J02171R5265j04775r3388J05728
227F807R0503j06905q7653J06563Q4427j10497q4494J09342P9870j12583q0546
238a05166J11959P7403j12940p6092J13379P5399j12869p2765J12486P0725j12302
249c0783o9068J11142O6223j11333o3286J12025O1192j10219n6500J13012N6081
260G8486j11067n1827J14387M9831j13521m7391J15708M5849j15482m2747J17774
271D0000M3029j16166l9918J18902M0117j17681l7327J18168L6177j18027l4265
282f6991J16806L2438j16682l0522J15882K8408j15671k6209J14989K3508j15479
$$ plain form
293 -39523 -61494 52601 70639 -44875 -61823 51664 64653 -50403 -62184 50803 59829
304 59829 -54191 -62002 51379 56404 -57793 -62321 50932 52630 -61235 -62403 49947 49718
316 49718 -62793 -61437 50085 47701 -62438 -58688 50764 46087 -61361 -54844 51516 43389
328 43389 -60665 -50070 52961 41226 -60047 -45467 56510 39909 -60311 -40319 60070
339 60070 39268 -60260 -36436 63213 38329 -61121 -34835 65502 38180 -60836 -32493 66894
351 66894 37723 -60785 -30668 66988 36086 -60026 -28464 66579 33369 -59734 -26082 65811
363 65811 30526 -59861 -23192 65345 26570 -60782 -20600 65705 23012 -62418 -18394 65922
375 65922 20037 -64284 -16525 66027 17167 -65062 -15753 65841 14869 -65898 -14996 64802
$$ packed form
293c9523k1971J14095J8038j15514j6948J13487J2989j15056j1781J12987R026
304E9829j14020p811J13381N025j14197m528J13253J698j13865j168J12350k29
316D9718j12511J356J11522k384j10139L750J09452m677j07448O517J06360q127
328D3389j04054J0595J03031j1735j01273J4580J01977j6601j00220J9992J00389
339F0070k0802r9528K3824R9649k4884r9450K6286J00337k7322r9016K8343R9387
351F6894k9171r8508L0117R7656l0902r6112L1562R5043l3210r3103L3652R1893
363F5811l5285r0387L6669Q8537l8775q7352M0182Q6305m2693q5430M4024Q4316
375F5922m5885q4321M7759Q2552m8860q2229M9309Q1594n0972q0767N0902P9798
$$ plain form
387 64802 12684 -66985 -14295 63307 10203 -66560 -13788 61841 8077 -66366 -12008 59734
399 59734 5271 -65708 -10440 58007 2741 -64187 -8079 57668 -484 -64202 -5422 57052
411 57052 -2842 -63606 -1908 57691 -4299 -63152 1023 59233 -5117 -62114 3893 61125
423 61125 -4919 -60859 6150 62270 -3963 -58725 8367 62644 -4503 -56145 11646 62616
435 62616 -4495 -53060 14227 61381 -6258 -51955 16475 60153 -9302 -51509 19170 59318
447 59318 -12209 -51209 20793 58222 -15397 -52235 20906 56093 -18267 -54334 20076 53760
459 53760 -21434 -55389 18996 51237 -23571 -55266 18666 48428 -25869 -54864 18030 45251
471 45251 -28425 -54780 18340 42588 -30080 -52896 20398 42050 -30321 -49704 22884 41565
$$ packed form
387F4802n2118p9669N2690P7602n3104p6763N2772P5629n3764p4443N4358P1742
399E9734n4463p0979N5268O8447n5266o6928N6108O5747n8152o3718N8780O2474
411E7052n9894o0764O1698N9599o1990n8853O4175N8210o4350n6997O6007N7232
423F1125o6044n5940O7009N6120o6233n4762O7092N4277o7147n1642O7791N0970
435F2616o7111m8565O7287M7154o7639m5697O8430M3678o9455m2207P0679M0148
447E9318p1527l9000P2002L7429p3619l6838P3141L5187p4360l6067P4410L3684
459E3760p5194l3955P4385L2241p4808l1695P3932K9762p4297k8995P2894K7221
471D5251p3676k6355P3120K4248p2668k2816P3294K1652p2371j9383P2588J8681
$$ plain form
483 41565 -30809 -47762 25406 41458 -31446 -45985 27996 42079 -30675 -42722 31796 43852
495 43852 -29390 -39477 34956 44576 -28952 -37827 35806 43638 -29544 -36312 36344 43160 -29066
508 -29066 -34152 38258 42651 -28965 -31920 38511 39388 -31482 -32159 37819 35526 -35296 -32522 37172
522 37172 33008 -37212 -31538 38765 31751 -38656 -31944 37942 29636 -41189 -33012 36358 26707
535 26707 -43103 -33406 35659 25613 -41917 -30423 37226 25377 -41122 -27682 37808 22869
547 22869 -41762 -26642 37267 20679 -42480 -24424 39198 21336 -40166 -20316 41873 21420
559 21420 -39758 -18470 42210 20099 -41247 -18675 41766 18296 -41445 -17245 41867 18402
571 18402 -39594 -14689 42957 17295 -39319 -13411 41540 14139 -41245 -14526 39171 10784
$$ packed form
483D1565p2374j6953P3168J6052p2904j4539P3981J4083p2754j2047P4518J2056
495D3852p3242j0087P4433R620p3528q875P3633P832p3182o768P2656O816p2226
508b9066n086P2410M393p1616k955P0431Q77p0870o77O9978k293p0822K774O9694
522C7172m164p0220N674P0303p014p0407O712O9886q306p0825Q177O9370r651
535B6707o9810R697O9065j0046o7530J1494O7649j1849o6499J3440O5490j4939
547B2869o4631J5120O3909j6588o3159J8056O3622j7862o1502J9850O2189k0453
559B1420o1178K1288O0680k2111o1346K2572O0441k3470n9741K4200N9112k3465
571A8402n7996K4905N7646k5662n6614K5908N4951k7401n5384K6719N3697k8387
$$ plain form
583 10784 -42019 -12941 40343 10727 -40841 -9617 41267 9509 -41062 -8884 40521 6512
595 6512 -43205 -9269 39645 5185 -43196 -7385 41697 6132 -41048 -3737 43383 6704
607 6704 -40025 -3334 41948 4193 -40662 -3524 40280 3493 -39080 -868 41166 3757
619 3757 -36239 2598 41165 2166 -36538 2973 39042 -2231 -38856 2209 37604 -4413
631 -4413 -39019 4063 38574 -4634 -38002 4967 38087 -5838 -39213 3315 34911 -8361
643 -8361 -40538 1986 33008 -9490 -38980 3853 33314 -8548 -35915 6224 32782 -9817
655 -9817 -35568 6630 30281 -12428 -35351 8358 30829 -12476 -32823 12244 33372 -11048
667 -11048 -30542 15407 34755 -11733 -30470 15338 33236 -13214 -30911 16185 33540 -12190
$$ packed form
583A0784n2803K9078N3284k9616n1568L1224N0884l1758n0571L2178M9405l4009
595F512m9717L3936M8914l4460m8381L5811M9082l5565m7180L7311M7120l6679
607F704m6729L6691M5282l7755m4855L7138M3804l6787m2573L8212M2034l7409
619C757l9996L8837L8567l8999l8704L9511L6069m1273l6625M1065L5395m2017
631d413l4606M3082L4511m3208l3368M2969L3120m3925l3375M2528L1596m3272
643h361l2177M2524L1022m2498k9490M2833K9461m1862k7367M2139K6558m2599
655i817k5751M2198K3651m2709k2923M3709K2471m3305k0347M5067K1128m4420
667a1048j9494M5949J9348m6488j8737M5808J7898m6450j7697M7096J7355m5730
$$ plain form
679 -12190 -28425 18410 34985 -10964 -26560 19343 33497 -12506 -26617 17272 29769 -15081
691 -15081 -27336 17303 28203 -15614 -24665 19369 27497 -16093 -23870 19580 25305 -19478 -25595
704 -25595 18281 21781 -23144 -26475 18500 21580 -23406 -25564 19637 22451 -22708 -24879 19419
717 19419 20850 -23600 -25506 17316 18471 -24177 -24525 17883 18365 -22348 -21235 19993 18392 -21454
731 -21454 -18807 20399 16536 -23678 -18484 20989 14868 -24633 -16764 23236 15958 -23345 -14314
744 -14314 26131 17088 -23022 -13383 26381 16206 -23658 -13944 25265 15013 -23591 -12933 26252
757 26252 15560 -22207 -10106 27550 15463 -21636 -9422 26725 13155 -23033 -9548 25843
769 25843 10884 -23408 -8116 26217 10409 -22548 -6204 26712 9278 -23849 -6258 25821
$$ packed form
679a2190j6235M6835J6575m5949j5596M5903J4154m6003j4111M3889J2497m4850
691a5081j2255M4639J0900m3817r051M4034Q128m3590p777M3450N725m4783o117
704b5595M3876L500m4925l331M4975L080m4986k158M5201K814m5159k171M4298
717A9419J431m4450j906M2822J155m2648l48M2408M82m0713J113M1228j601l9846
731b1454K647L9206l863m0214N194L9473o121l9501P869M0000p278l9303R031
744a4314M0445r043m0110R639L9764j0175l9864R714L9209j0252l8604J0658L9185
757B6252j0692l7767J2101L7656j2087l7099J2214L6147j3570l6188J3485L5391
769B5843j4959l4292J5292L4333j5808l2957J6344L2916j7434l3127J7591L2079
$$ plain form
781 25821 6702 -26041 -7119 24638 4881 -26881 -7461 24485 4760 -26304 -6250 24157
793 24157 3924 -27044 -7296 22091 1437 -27548 -7335 21070 233 -27070 -5749 21506
805 21506 -43 -26059 -3177 22282 -612 -25825 -2383 22239 -1830 -25691 -1064 23203
817 23203 -1210 -24865 1507 25516 80 -22599 3456 26600 526 -22066 4292 26182
829 26182 432 -21045 5068 26391 -171 -19067 7277 26655 -154 -18247 8693 25960
841 25960 -1972 -19002 8225 24518 -3822 -20219 7901 23115 -5715 -21218 7858 22492
853 22492 -7077 -21910 7303 20860 -9233 -23002 5674 18710 -11121 -23796 5085 17344
865 17344 -11894 -23243 5762 16549 -12344 -22410 6126 15393 -13161 -21896 7179 15363 -13432
$$ packed form
781B5821j9119l2743J8922L1757j9757l1762J9420L1946j9725l1064K0054L0407
793B4157k0233l0968J9748K9387k0654k8985K0213K8405k0837k7303K1321K7255
805B1506k1549k6016K2882K5459k2894k5213K3442K4622k4069k3861K4627K4267
817B3203k4413k3655K6372K4009k5436k2679K6055K3144k6074k2592K6358K1890
829B6182k5750k1477K6113K1323k6562j8896K6344J9378k6809j8093K6940J7267
841B5960k7932j7030K7227J6293k8340j6397K8120J5214k8830j5503K9076J4634
853B2492k9569j4833K9213J3557l0093j3769K8676J3036k9831j2675K8881J2259
865A7344k9238j1349K9005J0787k8893j0066K8536R267k8554q735K9075Q184k8795
$$ plain form
878 -13432 -20568 8490 15276 -13160 -18535 10877 16683 -11840 -17092 12657 17678 -11936 -16156
891 -16156 14262 18457 -11134 -15124 15062 19380 -10323 -13637 16208 19550 -9807 -12253 16419
904 16419 18286 -10328 -11710 16218 16979 -10884 -11482 15831 15647 -12742 -11378 16272 13823 -14760
918 -14760 -11864 16299 12207 -16572 -12613 15408 10776 -17948 -13616 14773 10362 -18511 -13718
931 -13718 14618 9787 -18809 -13308 14023 8751 -18530 -12629 14106 8006 -17768 -11400 14778
944 14778 7619 -17541 -9571 15647 7131 -17250 -8276 16364 6857 -17153 -6800 17421 6890
957 6890 -16943 -5534 18540 7298 -16734 -5114 19218 7455 -16763 -4431 19292 6885
969 6885 -16851 -4520 18874 6635 -16268 -3691 18786 5735 -16490 -3907 17941 4645
$$ packed form
878a3432p136K9058O786k8436n375K9412N806k8523n252K9749N021k9614m220
891a6156L0418M195k9591l990L0186M318k9703l314K9845L342k9357k446K8672
904A6419J867k8614j382K7928P61k7863n98K7313j84k8389J364K7650k449k8583
918a4760K896K8163m092k8779L959K8021m632k8724M332K8389m411k8873M793
931a3718K8336m831k8596N501K7331n272k7281N901K6735o100k5774O368K6178
944A4778p159k5160P970K5218q516k4381Q974K4640r507k4010J0353K4221j0531
957F890k3833J1409K4074j1242k4032J1620K4332j1763k4218J2332K3723j2407
969F885k3736J2331K3394j2239k2903J2577K2477j3051k2225J2583K1848j3296
$$ plain form
981 4645 -16549 -2772 17351 3239 -16630 -2271 17033 2251 -17004 -1398 17659 931
993 931 -17550 -439 18024 281 -18167 -238 18324 27 -18448 -525 18595 -85
1005 -85 -17786 -383 17817 -181 -18249 -334 16838 -1009 -17386 499 16242 -1490
1017 -1490 -16811 1040 15505 -2561 -16645 1718 15060 -3645 -16844 2332 15339 -4503
1029 -4503 -16683 3348 15055 -4778 -17091 3754 15329 -4946 -16612 3834 15470 -5014
1041 -5014 -15835 4637 15841 -4691 -15261 4984 16052 -4319 -14147 5956 15426 -4332
1053 -4332 -13347 7298 15585 -4608 -11942 7850 15431 -4926 -11681 8623 14998 -5658 -11615
1066 -11615 9278 14570 -6480 -11689 9142 14033 -7785 -12345 9292 13728 -8551 -13356 8606
$$ packed form
981D645k1194J3777K0123j4112j9869J4359J9304j4782j9255J5606J9057j6728
993I31j8481J7111J8463j7743j8448J7929J8562j8297j8475J7923J9120j8680
1005h5j7701J7403J8200j7998j8068J7915J7172j7847j6377J7885J5743j7732
1017a490j5321J7851J4465j8066j4084J8363J3342j8705j3199J9176J3007j9842
1029d503j2180K0031J1707j9833j2313K0845J1575k0275j1666K0446J1636k0484
1041e014j0821K0472J1204k0532j0570K0245J1068k0371r828K0103R470j9758
1053d332r015K0645Q287k0193p334J9792P581k0357o755K0304O375k0656n957
1066a1615K0893N292k1050n209K0831M891k1818m560K1637M436k2279m805K1962
$$ plain form
1079 8606 12526 -9384 -13981 7731 11388 -10193 -13572 7049 10022 -10814 -13429 7033 9007
1092 9007 -11201 -12690 6949 7974 -12101 -11877 8136 7793 -12040 -11035 9236 8599 -12028 -9967
1106 -9967 10459 8859 -11344 -9526 10956 9408 -10558 -8377 12085 10132 -9377 -7011 12608
1119 12608 10377 -8470 -5853 13000 10102 -8299 -5034 13144 9253 -9202 -4668 13333 8487
1132 8487 -9356 -4175 13284 7599 -10571 -4340 13086 5886 -12031 -5135 12001 4337 -13036
1145 -13036 -5700 11523 3559 -13660 -6244 11139 2703 -14125 -5850 10325 2002 -14281 -6036
1158 -6036 9767 1362 -14290 -5414 9741 1361 -13196 -3829 10906 1434 -12454 -2684 11340
1171 11340 1024 -12782 -1429 12076 721 -11817 121 12891 1598 -11164 968 14223
$$ packed form
1079H606L920k1910m597K1712L657k1581l379K0621K973k0836k615K0462J974
1092I007k0208j489J9639J025k0075K24K0013l43j9833J005K0271o37k0627K061
1106i967K0426j600k0203J818K0482j548j9966K181K0462j953j9509K366J9619
1119A2608k231j8847K617J8853k898j8401L265J8178l891j8455M534J8001m846
1132H487j7843N181J7459n685j8170O231J7426p200j7917O896J7136p664j7373
1145a3036P336J7223p964j7219P416J7383q436j6828Q275J6175q323j6283Q245
1158f036J5803q405j5652Q876J5155q380j4557R367J4735r472j3888R770J4024
1171A1340j0316j3806J1353J3505j1355j2538J1938J2770j1293j2762J2132J3255
$$ plain form
1183 14223 2165 -10827 1069 13790 1937 -10670 1071 13011 1357 -10059 1554 12713
1195 12713 1166 -9962 2105 12253 206 -10324 1937 11383 -1836 -10880 1829 10904
1207 10904 -2588 -11466 2168 10732 -2759 -11523 2741 10810 -3649 -12248 2645 10305 -4398
1220 -4398 -12381 2117 9897 -4407 -11903 2935 10050 -4074 -10636 3843 9854 -4102 -10646
1233 -10646 3941 9539 -4756 -10227 4212 9108 -5021 -9671 5609 9497 -5355 -8884 6359
1246 6359 9516 -5988 -9405 5927 9018 -6894 -9473 6227 8999 -6407 -9054 6923 9290
1259 9290 -6137 -8247 6565 8832 -6341 -8700 6442 7973 -6848 -7875 5951 7476 -6664
1272 -6664 -7213 7615 7650 -6813 -5832 8132 7184 -7656 -6312 8461 6515 -8590 -6046 9511
$$ packed form
1183A4223j2058j2992J1896J2721j1853j2607J1741J1940j1654j1416J1613J1159
1195A2713j1547j1128J2067J0148j2047j0530J2261R446j3219r044J2709R075
1207A0904j3492q878J3634Q564j3491q764J4264Q069j4459q599J4893P660j4703
1220d398p983J4498P780j4304p496J4838P115j4124o562J4479O011j3956o544
1233a0646J4587N598j4295n471J4439M896j4129m650J5280L888j4852l529J5243
1246F359L157j5504l417J5332L091j5912k579J5700K772j5406k647J5977K367
1259I290j5427k110J4812K267j5173k359J5142J531j4821j027J3826J525j4140
1272f664n49J4828L5j4463R81J3964r48j4840J344J4773j946j5105K544J5557
$$ plain form
1286 9511 6886 -8452 -5797 9718 7061 -8097 -5631 9549 7052 -8706 -6209 8233 5667
1299 5667 -8901 -6120 8175 5245 -8653 -5349 8194 4302 -9145 -4826 8177 3266 -10207
1312 -10207 -5362 7516 2105 -10848 -4833 8227 2151 -10724 -4227 9174 2353 -10721 -4295
1325 -4295 9415 2179 -10833 -3860 9508 2451 -10468 -3477 10050 3208 -9421 -2395 10702
1338 10702 3710 -8614 -860 10369 2984 -8344 -644 10735 2723 -8067 243 10764 2355
1351 2355 -7589 1072 11020 1660 -8430 995 11043 462 -9446 737 10393 -34 -10380
1364 -10380 -210 10307 -126 -10814 -175 9971 -939 -10875 -633 8645 -1916 -11386
1376 -11386 -919 7962 -2297 -11132 -559 7538 -2968 -10498 845 7882 -3228 -9913 1545
$$ packed form
1286I511k625j5338K655J5515k657j5158K466J5180k497j5758K497J4442k566
1299E667j4568K781J4295k930j3898L304J3543l892j3447M319J3003m911j3473
1312a0207M845J2878n411j2953O015J3060o076j2875O497J3401o821j3074O426
1325d295J3710p236j3012O973J3368p057j2919O991J3527o842j2629P026J3097
1338A0702o992j2324P754J1229p385j1328P700J1379q012j0790Q310J0521q409
1351B355r944Q661R948r360j0090R425J0048j0581r908J0183R656j0427j0346
1364a0380J0170J0517j0433j0688J0639J0146j0910r936J0242R278j0561r470
1376a1386J0467Q881j0259q835J0573Q097j0506p530J1343P037j1110o685J1458
$$ plain form
1389 1545 8144 -3425 -10563 1917 9045 -3232 -9729 3022 9897 -2584 -8922 3952 10131
1402 10131 -2483 -8701 3817 10211 -2539 -8502 4063 10035 -2202 -7441 4779 9947 -2278
1415 -2278 -7130 5309 9624 -3185 -7460 4743 8678 -4006 -7510 5332 7846 -4724 -7932
1428 -7932 5193 7804 -5430 -7701 4996 7470 -6223 -8595 5025 6867 -6720 -8850 4423
1441 4423 7032 -6812 -8659 5024 7044 -6495 -7892 5185 6583 -6247 -7292 5615 6222 -6385
1455 -6385 -6955 6028 6482 -6661 -6240 7129 6095 -6976 -5490 7936 5993 -7195 -5300 7793
1469 7793 6227 -7552 -5752 7969 5830 -6991 -5215 7899 5905 -7153 -5388 7464 5370
1482 5370 -7724 -5280 7345 4356 -8029 -5041 7558 4050 -8110 -4125 7829 3882 -8145
$$ packed form
1389A545O599j1569p138J2480P128j2277o497J2751O875j2481o338J2874O179
1402A0131j2614o218J2518O394j2750n963J2565N972j2237n239J2220N168j2225
1415b278m852J2439M315j2809m275J2203L935j2684l504J2842K514j2570l208
1428g932J3125K611j3234k271J2697K474j3693k372J3620J842j3587k130J3273
1441D423K609j3844j847J3683K020j3539j397J3077J398j2830j045J2907O07j2607
1455f385n70J2983M54j3143M21J3369j034j3071J486J3426j943j3188J895J3093
1469G793j566j3779J800J3721k139j2821J776J3114j994j3058J765J2852k094
1482E370j3094K444J2625k989j2385K988J2599l508j2160L985J1954l947j2027
$$ plain form
1495 -8145 -4068 8275 3370 -8614 -3969 8189 3541 -9000 -3705 8637 3370 -8556 -3386
1508 -3386 8684 3634 -8252 -3220 8780 3561 -8373 -2655 8906 2992 -7978 -2320 8933
1521 8933 2746 -7637 -1821 8563 2411 -8221 -1886 8317 1788 -8388 -1448 8409 1001 -9088
1535 -9088 -1187 8471 481 -9259 -1088 8049 148 -9718 -1030 8501 111 -9775 -1428 8141 24
1550 24 -9755 -1037 8129 -170 -8958 -521 7965 -28 -8591 -193 8140 -246 -8178 714 8294
1565 8294 -903 -7590 1526 8412 -771 -7983 1830 8799 -1065 -7777 2179 9147 -1438 -7885 2450
1580 2450 9233 -1432 -7934 2359 9042 -1146 -8222 2171 8386 -1557 -8011 1923 7929 -2153
1594 -2153 -7691 2106 7285 -3185 -7972 2469 6655 -3537 -7977 2446 6823 -3983 -7993 2998
$$ packed form
1495h145M077J2343m905j1984M645J2158m648j2541N295J2342n267j1926N170
1508c386J2070n050j1886N032J2000n219j1934N718J1561n914j0970N658J1253
1521H933o187j0383N816J0384o152j0632O335J0203o529j0176O940R857p408j0089
1535i088P901R658p990r740Q171R137p901r866Q688R531q390r886Q347R569q117
1550B4r779Q718R166q299q788Q437Q486p993q563Q398Q333q386p932Q892P580
1565H294r197o687R116O886r183p212R813O969r864o712R956O968j0585o447J0335
1580B450O783j0665o502J0293O683j0188p076J0393O215r943o454R934O006j0082
1594b153n538R797N179j0470m787J0441M186j0192m440J0423M377j0806m010J0991
$$ plain form
1608 2998 6633 -4081 -8078 3561 6891 -4146 -7856 3952 7275 -4025 -7332 3837 7687
1621 7687 -4045 -7126 4365 7500 -3894 -6511 5034 7298 -3694 -6151 4725 6790 -3430
1634 -3430 -5485 5125 6743 -4268 -5116 5289 5726 -4622 -5250 5420 5758 -5553 -5498 5590 5601
1649 5601 -6350 -5399 5661 5393 -6443 -5945 5469 5038 -6259 -5982 5403 4902 -6345 -5828 5218
1664 5218 4283 -6130 -5171 5014 3868 -6563 -4856 5724 3945 -6143 -4225 6366 3635 -6250
1678 -6250 -3553 6490 3956 -6464 -2965 7178 4206 -6376 -2710 7798 4122 -6447 -2771
1691 -2771 7610 3993 -6351 -2597 7761 3707 -6415 -2496 7464 3246 -6480 -2367 7024 2808
1705 2808 -6801 -2359 6801 1886 -7372 -1994 6817 1534 -7621 -2188 6730 743 -7775 -1811 6525
$$ packed form
1608B998L635j0714l997J1639L330j1037l710J1808L323j1300l307J1169L850
1621G687j1732l081J1491L135j1394k617J1545K264j0992k457J0876K065j0220
1634c430k055J0610J618j1011q48J0405M37j0348o28J0670L38j1311N5J1088J1
1649E601j1951R51J1060k68j1836M98J1414m31j1297K77J1385n01j1247N17J1046
1664E218r35j0413R59J0185j146j0431J707J0580j779j0088J918J0591k731r885
1678f250K697J0043k534j0420L499J0143k972j0582L666J0508l676j0569L676
1691b771J0381l617j0344L754J0358m054j0122L919R960m218r726M113R391m216
1705B808r609M442R160m915r258N378Q811n283r155N433Q918n987q518N964Q336
$$ plain form
1720 6525 482 -8044 -1809 6721 813 -7815 -1510 7035 667 -7870 -1197 7148 321 -7244 -762
1735 -762 7061 961 -7001 -189 7358 663 -6613 157 7536 436 -6583 728 7627 195 -6501
1750 -6501 1199 7529 -138 -6851 1136 7736 -575 -6744 1757 7895 -781 -7134 1518 7611 -1239
1765 -1239 -7367 1387 7427 -1531 -7440 1376 6985 -1515 -7285 1480 6976 -1933 -6781 1651 6487
1780 6487 -2498 -6833 2190 6325 -3057 -6938 2427 6587 -2967 -6824 2710 6615 -3113 -6902 3234
1795 3234 6625 -2983 -6669 3050 6467 -3354 -6833 3487 6658 -3352 -6164 3613 6735 -3182
1809 -3182 -6097 3313 6338 -3502 -6131 3426 6147 -3503 -5783 3654 5377 -4234 -5300 4111 5438
1824 5438 -4496 -5528 4621 5591 -4680 -5646 5098 5373 -4852 -5252 4908 5783 -4826 -5149 4812
$$ packed form
1720F525o043q526O235Q530n908q628O305Q545o368q537O673Q345o827p565O482
1735g62P823o100p962O812P547o695p276O770P379p100p019P311O899p432o696
1750f501P700O330p667o713P987O600q311o169Q501O138q676o353Q652O093q850
1765a239o128Q754O040q958n909Q816N609q500n770Q765N496q909m848Q432M836
1780F487q985m335R023M135r382l881R365M160r554l857R534L905r728l789J0136
1795C234L391r608l686R719L417r821l479J0320L171j0010k812R777L122r917
1809c182k915R410L025r840k629R557K721r650k280R437J723r611j066R411J327
1824E438r934j032J0149R70j0271r66J0744K75j0225m00J0160Q75j0609l23R961
$$ plain form
1839 4812 5277 -4813 -5008 5384 5287 -4354 -4504 5156 5218 -4561 -4425 5312 4886 -4547 -3914 5813 4740
1856 4740 -5310 -4386 5858 4163 -5601 -3739 5549 3835 -5965 -4160 5954 3926 -6305 -4547
1870 -4547 5654 3289 -6727 -4421 5471 3168 -6779 -4224 5269 2807 -6461 -3781 5263 2559
1884 2559 -6312 -3332 5521 2729 -6368 -2842 5874 2494 -6118 -2569 6672 2531 -6119 -1527 6916
1899 6916 2991 -5858 -1358 7246 2763 -6114 -1563 7395 3101 -5891 -1383 7432 2573 -5844 -1332
1914 -1332 7122 2805 -6205 -1263 6726 1718 -6456 -1604 6286 1332 -6650 -1422 5986 604 -6646
1929 -6646 -1439 6077 -20 -7250 -1137 5942 -689 -7736 -1409 5853 -662 -7908 -1116 6208 -633
1944 -633 -8124 -905 6188 -481 -7853 -456 6509 -525 -6978 -307 6385 -167 -6388 148 6561
$$ packed form
1839D812M65j0090j95J0392r7r641j50R660O2r779J36R737m26r433O33R727j073
1856D740j0050R24J0244j695r764J862R288j714r800J805J0114k028j0231J758
1870d547J0201k365j0016K306R892k303r947K555R493k462r268K680R044k704
1884B559q871K980Q853k792r097L526Q716l380q612L549R241m141q650M592Q443
1899F916l925q849M500Q604m483q877M551Q958m294q992M508Q815m859q417M512
1914a332Q454m317r010M942P989n008q174M852P890m954p982N228P408n382p250
1929f646N207P516o097p230O113P079o631p047O327P262o515p246O792P324o841
1944f33p491P219P093o669p372P397O965p034o453O671O692o552o221O536O413
$$ plain form
1959 6561 146 -5587 948 7070 103 -5710 1868 7267 -256 -5123 2100 7324 -242 -5239 2261
1974 2261 7543 -445 -5750 2566 7157 -950 -5908 2126 7025 -1362 -6202 1324 6311 -1668 -6444
1989 -6444 1513 5666 -1896 -6678 1437 5631 -2656 -6653 1338 4868 -3374 -6612 1335 4825 -3481
2004 -3481 -6530 1692 4606 -3683 -6362 2183 5125 -3687 -6091 2534 5244 -3484 -5808 2916 5348
2019 5348 -2949 -5495 3151 5621 -2956 -5460 3852 6232 -2897 -4643 3746 5615 -2442 -4352 4030
2034 4030 5390 -2652 -3989 4185 5225 -3524 -3805 4434 5063 -3535 -4301 4321 4763 -3892 -4580 4723
2050 4723 4866 -4597 -4888 4332 4492 -4334 -4743 4106 4154 -4667 -4631 3857 3843 -4817 -4577 3873 3438 -4688
2068 -4688 -4261 3977 3575 -4730 -3701 4306 3179 -5104 -3592 4382 3479 -4947 -3210 5037 3291 -4937
$$ packed form
1959F561o415n733O535O122o967n813P578N399p523m867P223N224p566m997P500
1974B261N282p988n305Q316M591q107m958Q034M899q387m840P526M987p979m776
1989f444P957M153p562m782Q115M194q287l997P991L530q242l238P947L490q306
2004c481l049Q222K914q289k679Q545K942q812k404Q625K710q728k324Q724K432
2019E348q297k546Q646K470q577k504R312K380r129j746Q389J869q057j910Q382
2034D030J360q042j337Q174J040q749k81Q239O29q598p66Q622M42q655o88R303
2050D723J43r463k91R220J60q826m09Q849M8q821L6Q488j4q660K40Q450m35q126
2068d688M27Q238m02q305J029Q007j127q283J512P974r03q426J737Q247j746q228
$$ plain form
2084 -4937 -3251 4870 3140 -4826 -3288 5194 3192 -5261 -3115 5348 3066 -4818 -2893 4937 2982
2099 2982 -4979 -2651 5280 2599 -5111 -2371 4976 2348 -5019 -2267 5063 2257 -5401 -2111 4928
2114 4928 1813 -5112 -1710 5172 1725 -5283 -1391 5663 1433 -5090 -1426 5765 1622 -5466 -1534
2129 -1534 5336 1479 -5082 -1098 5554 1476 -4944 -1283 5489 1468 -4708 -593 4953 956 -4782
2144 -4782 -225 5328 564 -5138 -313 5298 32 -5465 -568 5210 328 -5485 -643 5071 -137
2159 -137 -6087 -537 5068 -631 -5781 -517 4668 -112 -5721 -556 4968 -275 -5299 68 4768
2174 4768 -823 -5097 418 5164 -686 -4896 930 4830 -808 -4897 1233 4917 -746 -4604 1561
2189 1561 5391 -664 -4468 2088 5253 -986 -4801 1727 5205 -880 -4245 1654 5158 -1293 -5052
$$ packed form
2084d937J686Q121j730p966J538Q482k002q453K146Q463k282p884J925P830j955
2099B982p961K328P931k681p710K740P347k628p367K752P330k806p658L290P039
2114D928l115o925L402O882l447p008L892P054m230o523L664P191m143p088L932
2129a534O870l857o561L984O652m078o420L661O772m021o176M115N546l997n738
2144d782M557N553m764n702M825N611n266n497M897N778m882n813M842N714n208
2159a37n950N550N605n699n150N264N185m780n609N165N524n243n024N367M700
2174D768n591m274N515M746n850m210N826L900n638m089O130L684n663l858O165
2189A561L830o055l804O556L165o239l815O528L478o085l365N899L504o451l759
$$ plain form
2204 -5052 1512 4966 -1137 -5161 1304 4703 -1719 -4769 1347 4088 -2263 -4806 1619 3904 -2175
2219 -2175 -4495 1970 3734 -2872 -4679 2122 3780 -3009 -4584 2189 4073 -2881 -4203 2609 4184
2234 4184 -2657 -4276 3019 4482 -2640 -4051 2757 4483 -2262 -3768 2968 4082 -2450 -3574 3139
2249 3139 4264 -2499 -2854 3605 3843 -2928 -2744 3284 3355 -2925 -2870 3384 3266 -2956 -3344 3454 3032
2266 3032 -3324 -3003 3424 2506 -4262 -3356 3590 2802 -4219 -3608 3243 2570 -4064 -3542 3275 2227 -4249
2283 -4249 -3449 3276 2417 -3666 -2676 3189 2157 -3828 -2577 3763 2152 -3884 -2201 3998 2294 -3805
2299 -3805 -1767 4229 2247 -4054 -1702 4291 1993 -3804 -1297 4614 2562 -3999 -1438 4657 2154
2314 2154 -3796 -1529 4316 2073 -4253 -1264 4209 1494 -4318 -1428 3841 1266 -4169 -1549 3759
$$ packed form
2204e052O564L454o103m024O465L399o422l050O116K741o351k543O425K285o079
2219b175k320O465J764o606j807O801J658o789j575O773J884o954j322O812J575
2234D184o841j619P295J463p122j411O808J726o745j506O736J114o532j124O713
2249C139J125o763l55O459K38o771J84O028P1o280N5O254j18o222l88O798m22
2266C032o356L21O427r18o768R06O946p88p021O11O851o73o634N22O817j048o476
2283d249Q00O725q59o083R90N865j032n985J251O340j611o036J683O199j704o099
2299c805K038N996j982o301K352N993k298n797K507N911k052o561K561O095k503
2314B154n950K267N845k243o326K989N473k715n812K890N269k575n435K620N308
$$ plain form
2329 3759 1121 -4781 -1198 3926 384 -4640 -1124 3723 692 -4813 -1239 4269 507 -4991 -964
2344 -964 4454 918 -4768 -814 4461 784 -4148 -635 4506 747 -4390 -246 4323 703 -4237
2359 -4237 -265 4652 924 -3695 133 4522 112 -3738 69 4373 47 -4095 279 4580 -101
2374 -101 -4343 241 4329 -296 -4404 176 4428 -578 -4536 44 4139 -901 -4280 110 3734
2389 3734 -594 -4241 227 3783 -1049 -4236 533 3757 -876 -4151 335 3790 -1141 -4033 974
2404 974 3917 -1112 -3952 1445 4012 -989 -3575 1446 4239 -1120 -3408 1960 4598 -1059 -3641
2419 -3641 1824 4248 -1113 -3498 1660 4116 -1130 -3588 1736 3876 -1261 -3509 1604 3360 -1734
2434 -1734 -3399 1420 3042 -2025 -3566 1571 3191 -2562 -3937 1943 2950 -2595 -3814 1728 2886
$$ packed form
2329C759k638n902L583N124l542n024L516M847l031n505L574N508l762n498M027
2344i64N418l536n686L954N275l677m932L513N141l759n137M144M569l620m940
2359d237L972M917l728m619L828M389m410l850L807M304m326m142M374M301m681
2374a01m242M584M088m625m108M580M252n006l958M580M095n040l379M390L624
2389C734m328l647M468L556m832l187M769L224m633l275M486L455m931k892N007
2404I74K943n029k840N397K567n001k586N021K793n359k288N368K638n657k582
2419c641N465K424n361k385N158K456n246k458N324K140n137k248N113J756n094
2434a734j665M819J622n067j541N137J620n753j375N880J007n545j219N542J158
$$ plain form
2449 2886 -2431 -3663 1577 2853 -2319 -3574 1777 3047 -2496 -3256 1883 3100 -2227 -2634 2221
2464 2221 2901 -2075 -2840 2449 3171 -1818 -2438 2500 3106 -2090 -2060 2886 2792 -2040 -1840 3227 2778 -2255
2482 -2255 -2087 3306 2846 -2506 -2302 3206 2974 -2470 -2269 3186 2655 -3040 -2791 2629 2325 -3083 -2913
2499 -2913 2287 1864 -3303 -2692 2247 1464 -3213 -2382 2116 1234 -3450 -2090 2240 913 -3315 -2052
2515 -2052 2788 1347 -3467 -1586 3128 1395 -3472 -1394 3441 1599 -3145 -1333 3465 1905 -3032
2530 -3032 -1381 3414 2112 -2490 -966 3677 1954 -2263 -928 3359 1594 -2487 -547 3474 1499
2545 1499 -2653 -440 3301 927 -2974 -572 3241 1146 -3389 -738 2939 804 -3595 -678 2858
2560 2858 368 -3454 -758 3165 508 -3579 -800 3300 157 -3910 -763 2954 -134 -3167 -880
$$ packed form
2449B886n317j232N240J276n172j255N351J270n543p60N139J217n327m07M855
2464B221O80m976p65N289P22m989o20M938O06n196L0M946r4m832K00N067m49n033
2482b255J68N393m60n352K04N508k32n444K01N455n31n695K49N420l04n408J70
2499b913N200m23n167O11M939p83m677Q31M498q82m684J360M330j327m228J263
2515b052M840j441m814J881M714j733m867K078M835j842m744J812M798j560m937
2530c032J651M795j302m602J524M643j723m217J335M287j765m081J940M021j975
2545A499m152K213L741k374l901K402L813k095m535K651L677k135m399K917L536
2560B858k490l822K696L923k657m087K779M100l143m067L147L717l088l033K287
$$ plain form
2575 -880 2661 40 -3051 -102 2796 177 -2941 -135 2681 253 -2696 253 3118 -25 -2824
2590 -2824 416 3116 -75 -2554 533 3196 -103 -3178 322 3332 -218 -2990 6 3303 -172
2605 -172 -2888 193 2973 -44 -2999 275 2664 -514 -2860 414 2793 -379 -2616 535 2124
2620 2124 -706 -2486 571 2485 -1055 -2471 1074 2451 -1065 -2770 1254 2848 -1089 -2813 956
2635 956 2557 -870 -2387 1287 2783 -856 -2127 1201 2599 -1014 -2264 1255 2422 -1086 -2224
2650 -2224 1099 1926 -1242 -2072 1226 2113 -1252 -2310 1368 2112 -1562 -2255 1322 1853 -1993 -2250 1353
2667 1353 1850 -1490 -2326 1285 1561 -1978 -2285 1551 2038 -2073 -2185 1324 1894 -1407 -1859 1460 1965
2684 1965 -1332 -1623 1662 2049 -1252 -1551 1734 2163 -980 -962 1936 1762 -1234 -1291 2417 1681 -1624
$$ packed form
2575h80L541k621l091K949K898k619l118K806K816k428k949K949K865l143k799
2590b824L240K700l191k479L087K663l299l075L500L010l550k772K996L297l475
2605a72k716L081K780l017k955L274K389l178k346L274K379l172k237L151J589
2620B124k830j780L057J914l540j416L545J377l516j705M024J594l937j724L769
2635I56J601l427j517L674J496l639j271L328J398l613j250L519J167l508j138
2650b224L323Q27l168q30L298Q87l365j058L678P44l674o93L577N31l846k57L603
2667A353M97l340q36L611K76l539l07L836M87m111j12L509N70l301m52L319N05
2684A965l297k91L285L87l301k99L285M29l143J8K898j74k996n7L708p36l305
$$ plain form
2701 -1624 -991 2260 1519 -1510 -1330 2418 1481 -1825 -859 2269 1401 -1931 -1341 1688 1331 -1994 -1612
2718 -1612 1580 1127 -2007 -1558 1729 1009 -2335 -1471 1217 540 -2094 -1187 1298 359 -2376 -935 1668
2735 1668 88 -2259 -1040 1594 388 -2244 -633 2083 427 -2009 -217 2224 757 -2255 -218
2750 -218 2312 823 -1830 -105 2395 931 -1307 -70 2420 788 -1501 178 2243 767 -1443
2765 -1443 146 2306 425 -1893 204 2099 242 -1905 326 2314 125 -2193 -148 2157 -50
2780 -50 -2443 -595 1792 -389 -2398 -239 1781 44 -2250 -337 1601 -565 -2275 -186 1423
2795 1423 -327 -1960 71 1572 -302 -1808 274 1928 -558 -1639 645 2159 -508 -1906 725
2810 725 2262 -467 -2032 724 2268 -308 -1807 565 2363 -238 -1520 446 2179 -223 -1584
$$ packed form
2701a624O33L251p41l029J80L748r37l306R66L128q68l332N90L029l57l325L82
2718a612L192m53l134M49L287p20l344Q64K688o77k634R07K485r39k735J441K603
2735A668j580k347J219K634j206k632J611K716j656k436J792K441j467l012K037
2750b18K530j489k653J725K500j464k238J237K490j632k289J679K065j476k210
2765a443J589K160j881k318K097J895j857k147K231J988k189k318K045K305k207
2780e0k393J848K387k181k009K159K020j737k294J913J938k166j710K089J609
2795A423j750j633K031J501j874j506K082J654k486j081K284J514k667j398K631
2810G25J537k729j565K756J544k576j499K372J798k601j282J966J733k402j361
$$ plain form
2825 -1584 574 1975 -517 -1625 852 1773 -474 -1468 402 1507 -635 -1654 358 1278 -790 -1667
2841 -1667 759 1134 -1156 -1702 756 1293 -1048 -1859 1028 1511 -1126 -1732 520 1590 -1025 -1420 718
2858 718 1733 -827 -1714 937 1503 -903 -1342 923 1580 -816 -1117 1373 1579 -706 -989 1050 1212
2875 1212 -701 -1142 1427 1110 -964 -1170 1340 1053 -1457 -1016 1228 1331 -1423 -1520 1228 1177 -1749
2892 -1749 -1339 1213 1071 -1277 -1588 1226 903 -1569 -1023 996 735 -1259 -1017 1010 867 -1188 -948
2909 -948 1139 864 -1121 -779 1431 824 -1167 -288 1293 954 -1250 -584 1658 1261 -1529 -735 1506
2926 1506 853 -996 -595 1822 1271 -1399 -536 1563 920 -1236 -512 1314 1000 -1430 -584 1027 342
2943 342 -1440 -564 1086 -16 -1332 -623 1339 79 -1622 -662 791 -212 -1658 -478 1039 -228
$$ packed form
2825a584K158J401k492j108K477R21k247r94J870J105k142j019K012R20k068q77
2841a667K426L75k290n46K458N37k341q11K887M83k637o06K252J070k615l95K138
2858G18J015k560q87K651N66k406m39K265O57k396l01K490K06k285k83K039J62
2875A212j913m41K569l17k074k06K510k87k510M41K244J03k754r7K748n1k926
2892a749M10K552j42k348l11K814l23k472N46K019k61j994K42K027j43k055K40
2909i48K087k75j985L42K210o07j991Q79J581l39k204O66K242l97k790P94K241
2926A506o53j849M01K417n51k670Q63K099o43k156P24J826l14k430Q46J611o85
2943C42j782Q76J650j102j316P09J962j260j701R60J453j003j446J180J517j267
$$ plain form
2959 -228 -1698 -405 1404 206 -1517 -379 1430 127 -1757 -466 1321 440 -1180 -173 1474
2974 1474 514 -1172 -97 1221 425 -943 166 1293 133 -430 426 1321 81 -848 391 1626
2990 1626 71 -918 102 1603 27 -796 540 1366 85 -1298 98 996 -7 -1267 -129 1074
3006 1074 -301 -1155 -87 1032 -297 -1458 -150 796 -356 -1125 34 901 -591 -1291 159 996
3022 996 -741 -1235 533 1291 -657 -1115 627 944 -267 -993 350 1134 -515 -1176 441 1110 -363
3039 -363 -1096 676 925 -335 -993 483 1329 -405 -877 297 1073 -262 -701 384 946 -576 -440
3056 -440 452 777 -859 -884 302 393 -874 -784 379 333 -781 -1062 278 611 -644 -852 367 711 -550
3075 -550 -697 551 839 -783 -357 636 919 -321 -561 474 858 -314 -314 804 598 -105 -175 971 679
$$ packed form
2959b28j470J293J809j198j723J138J809j303j884J291J787q81j620J007J647
2974A474r60j686J075J318p96j368J109J127j160n63Q56Q95j240r29J239J235
2990A626j555r89J020J501j576q23J336Q26j281j383J396Q98j003j260J138J203
3006A074j375q54J068J119j329j161J308R46j152p69J159Q67j492p00J450Q37
3022I96j737m94J768P58j948m58J742L17j211p26J343P84j649o61J617O69j473
3039c63p33J772K49j260o58J476Q46j734m72J174P76j335m39J085N62j522J36
3056d40Q92L25j636k5J186R1j267R0J163m6j114k81J340L33j255k08J219L44j261
3075e50j47J248K88j622M26R93K83j240k40J035L84j172%J118k06p03p0J146k92
$$ plain form
3094 679 -222 182 860 605 -532 -199 1193 775 -490 -634 980 399 -703 -530 440 538 -692 -750 484
3113 484 223 -1194 -743 230 108 -1268 -798 115 -472 -1030 -546 -94 -103 -973 -355 263 -154 -698 -530 417
3133 417 -291 -887 -34 505 -129 -759 95 833 234 -586 -46 1137 72 -732 232 1041 876 -112 378
3152 378 1126 458 -70 336 1079 404 -212 162 736 241 -275 291 747 -166 -450 301 473 -585 -594 419
3172 419 633 -565 -1040 -284 7 -593 -1271 -344 267 -738 -1036 -291 77 -607 -739 -121 325 -345 -654
3191 -654 -78 293 -726 -520 249 538 -384 -367 382 426 -295 -474 315 194 -172 -472 845 380 -237 -219
3211 -219 504 833 -44 -195 878 690 19 -304 903 315 -26 -474 804 764 -259 -361 540 72 -354
3230 -354 -271 381 436 -738 -78 254 189 -646 -419 341 5 -614 -421 249 138 -932 -469 547 199 -899
$$ packed form
3094F79r01M04O78k55j137L33J392m18j265j44J614n81j102J73R70R8j230n8J234
3113D84k61j417M51R73j22j376M70R13n87n58M84M52rq70O18O18m17n44J68R47
3133D17p08n96Q53N39o34o30Q54P38n99q20N40J183j065q04R64Q09j65r88M90
3152C78P48o68n28M06P43o75o16L74N74m95n16N66M56r13k84P51J72j058rJ013
3172D19K14j198m75P56K91o00o78R27O11j005k98P45L68o84j32O18M46o70l09
3191f54N76L71j019K06P69K89r22J7P49M4p21j79P89j21l66l00J317m65o17J8
3211b19P23L29q77j51J073j88o71l23J207n88l41m48J278m0j023j02R01m68m26
3230c54Q3O52N5j174O60L32o5q35K27P60l36o19J93O70j11j070M63J016l48j098
$$ plain form
3250 -899 -208 785 400 -835 -346 503 326 -463 -201 719 349 -376 -197 634 343 -337 -84 641 -135 -504
3270 -504 -104 603 -191 -684 31 541 -259 -621 137 637 -279 -675 -146 706 38 -425 65 512 -71 -830
3290 -830 -369 652 11 -872 -295 299 212 -573 -43 673 102 -403 268 614 -343 -594 332 443 -337 -611
3310 -611 400 345 -176 -465 315 1017 -62 -548 419 759 -268 -717 454 735 -108 -667 184 788 -277
3329 -277 -621 425 646 -519 -695 248 525 -420 -744 124 383 -441 -745 -44 317 -655 -735 573 358
3348 358 -889 -576 508 346 -482 -576 425 462 -746 -726 358 503 -344 -813 438 487 -248 -295 488 778
3368 778 -387 -343 568 178 -460 -21 516 595 -226 -260 651 588 -362 -355 786 412 -292 -291 920 455 -529 -327
3390 -327 542 302 -730 -560 421 473 -736 -658 401 315 -812 -505 344 -127 -1027 -508 131 246 -1032
$$ packed form
3250h99O91R93l85j235M89Q49j77p89K62R20l70p25J79Q31k91o80K53P25p76l69
3270e04M00P07p94m93P15N10q00l62P58N00r16l96N29Q52o68m63M90M47n83p59
3290h30M61J021o41q83N77N94q7p85N30P16n71n05O71L46r57k51R26J11p80k74
3310f11J011n5n21k89P80P02j079m86R67L40j027m49J171K81q43n59Q51O04j065
3329b77l44J046K21j165j76R43K77r45l24Q68K59q24l04P01L61r72q0J308k15
3348C58j247L13J084j62q28r4J001L7j208K0J084J45q47m69J251M9p35m7P83K90
3368G78j165M4R11l90o38M39N37P9q21l4R11o3r50PJ141l74p04JJ211m65r84K02
3390c27Q69k40j032J70R81N2j209P8J059q6j127L07Q49m71r00N19O39J15j278
$$ plain form
3409 -1032 -389 96 -27 -798 -33 473 207 -703 -418 510 -25 -662 -273 691 204 -577 25 896 63 -563
3429 -563 -89 891 630 -588 52 932 576 -283 -19 639 518 -491 -247 554 141 -371 -137 409 63
3448 63 -437 105 501 -416 -835 -293 523 -256 -935 19 477 -532 -807 -215 558 -142 -1017 -220 602 -86
3468 -86 -936 -393 648 -98 -754 2 685 -156 -319 -200 243 108 -509 178 859 21 -81 182 758 13
3488 13 -339 420 849 108 -794 394 756 -123 -259 446 772 89 -727 271 611 -244 -595 118 358 -261
3508 -261 -550 117 237 -285 -482 210 476 -514 -710 284 65 -423 -704 146 317 -520 -636 161 284 -540
3528 -540 -305 456 431 -661 -331 692 870 -549 -561 611 492 -227 -394 753 722 -425 -560 669 839
3547 839 -365 -137 163 404 -302 -207 828 319 -450 -85 913 419 -523 -543 404 316 -606 -289 690 -155
$$ packed form
3409a032O43M85j23p71P65N06k66r10K85R28n35o37L89R64m87p81O02Q71q33o26
3429e63M74R80k61j218O40Q80l56q59K64O58j21j009K44Q01m13n12K34N46l46
3448F3n00N42L96r17m19N42Q16p79o79R54M58j009k75N92P73p00q75P97Q22o88
3468h6q50N43J041p46o56P56O83q41j63J19M43j35o17O87O81q38j02K63N76p45
3488A3l52P59M29p41r02J188L62q79j36P05L26o83q16R98L40q55l51P13K40o19
3508b61k89O67J20n22j97O92K66r90j96R94k19m88k81Q50J71q37j16P97J23q24
3528e40K35P61k5j092L30J023J78j419j2J172j19p19j67J147l1j147j35J229J70
3547H39j204K28L00K41p06R5J035n09p69L65R98m94r42k0R47q8r22L17R79q45
$$ plain form
3567 -155 -819 -182 268 5 -857 -618 496 63 -908 -409 368 90 -669 -626 376 -52 -697 -363 448 282
3587 282 -596 -239 729 181 -398 -2 563 173 -493 16 717 456 -540 204 822 113 -681 118 1105 496
3607 496 -95 467 974 257 -606 -89 773 359 -617 -155 740 295 -983 -312 458 -145 -711 -144 409 -113
3627 -113 -1055 -85 179 -66 -940 -203 626 -393 -958 -238 419 -340 -833 -47 447 -373 -671 170 816 -43
3647 -43 -870 243 831 307 -397 283 847 -107 -533 314 735 296 -569 389 992 -523 -300 317 611 125
3667 125 -481 618 801 -204 -611 212 702 -497 -620 358 614 -57 -734 -5 683 -355 -573 160 710
3686 710 -581 -688 511 624 -654 -857 229 717 -108 -600 342 468 -254 -932 388 293 -647 -417 531
3705 531 625 -435 -365 923 755 -557 -536 670 885 -543 -807 846 987 -488 -829 555 741 -518
$$ packed form
3567a55o64O37M50k63q62K39J114m33r71M99P77k78p59M3J002m28o45L34Q11j66
3587B82q78L57R68n48n79L96N65l90o66N09P01k61r96P44O18p09p94P99R87o09
3607D96n91N62N07p17q63N17Q62m14r76M62Q95m45j278O71P70o03n66N67N53n22
3627a13r42R70K64k45q74P37Q29j019n65P20O57p59m93P86M94q20k98Q41O46q59
3647d3q27J113N88n24p04O80N64r54m26Q47M21m39q65R58O03j515K23O17K94m86
3667A25o06J099J83j005m07Q23M90j199j23R78K56o71o77P29O88j038k18P33N50
3686G10j291j07J199J13j278k03J086M88q25m92R42J26p22o78J320r5r40K30R48
3705E31R4j060P0J288j68j312K1J206K15j428k64J653J41j475l41J384J86j259
$$ plain form
3723 -518 -652 763 923 -537 -713 670 634 -375 -602 530 534 -688 -499 440 232 -841 -230 462 597
3742 597 -694 -299 691 228 -871 -675 811 165 -1007 -548 704 363 -926 -402 1110 691 -703
3759 -703 -564 597 623 -626 -265 626 658 -863 -140 644 586 -430 -444 717 447 -594 -301 791 329
3778 329 -501 -152 780 353 -932 -153 947 99 -1069 -442 702 161 -962 -534 870 346 -982 -503
3796 -503 818 305 -1273 -627 874 42 -1163 -372 641 280 -1039 -607 435 224 -773 -428 793
3813 793 332 -1111 454 908 136 -782 -120 1025 43 -923 94 1266 113 -863 38 1361 370 -793
3831 -793 98 978 -61 -922 -52 958 104 -852 -168 837 398 -784 120 470 88 -808 -96 653 -17
3850 -17 -964 -241 647 -69 -1094 303 989 -298 -1248 -31 1011 -329 -1127 -97 583 -121 -1135 -53
$$ packed form
3723e18j34J415J60j460j76J383l6j009k27J132Mj222J89R39k08j073O11O92J35
3742E97j291L95R90m63j099J96J486o46j172M59J252l41j289N24J512m19j394
3759g03J39J161K6j249L61Q91L2j521P23P84n8j016j4J161k70j041K93J092m62
3778C29q30L49R32m27j285P79J100q48j168O27J144n41j123M28J404n24j328M79
3796e03J321n13j578O46J501q32j205P91J013l61j319M32J042k11r97L45J221
3813G93m61j443J565M54p72r18O62J145r82r66J017J172j153r76R01J323r91j163
3831g93Q91Q80j039q61Q70J010q54r56O84J005m39j182R04L50l82q96P12P49o70
3850a7r47P23Q88p16j025J397O86j287r50J217J042j340p98J030O80p04j014J082
$$ plain form
3868 -53 1218 27 -983 55 1166 -54 -603 -95 734 77 -197 288 1019 -80 -541 189 686 -143
3886 -143 -833 373 1001 -109 -579 454 552 -181 -791 186 737 -638 -973 245 1007 -305 -868 120
3904 120 670 -226 -1030 285 437 -746 -1260 358 639 -342 -953 254 619 -364 -705 412 1013 -546
3922 -546 -595 455 1014 -643 -750 529 849 -396 -690 1032 1017 -460 -510 611 855 -400 -561 798
3940 798 885 -717 -221 772 806 -417 -445 578 712 -236 -698 723 736 -372 -379 834 472 -684 -735 222
3960 222 537 -915 -552 226 863 -899 -770 249 488 -987 -552 483 463 -822 -801 471 278 -805
3978 -805 -612 474 244 -904 -482 537 722 -631 -458 577 463 -429 -387 721 505 -393 -69 982
3996 982 498 -467 -351 935 122 -863 -264 880 482 -475 -458 601 268 -887 -138 766 278 -600 -361
$$ packed form
3868e3J271j191j010J038J111j220n49N08Q29o57k74M85P31j099m61P30M97q29
3886a43o90J206O28j110m70J033R8p33o10R77N51j375l35J218P62j312n63R88
3904A20N50q96q04J315J52j183n14J618K81r81o11J207L65r83l41J117O01j559
3922e46m9J050N59j657j07J279L20j245k94J722j5j477n0J121K44j255j61J359
3940G98Q7j602M96R93L4j223k8J023J34r48m62J421J3j108pJ213l62j156n1R57
3960B22L15j452L63P78O37j762J29J019K39j475M35J035k0j285K1J272j93j083
3978h05J93J086k30j148M22J019J85j353J73J035j14q92M2J108k16q98L24J051
3996I82m84r65J16J286q13r85N99J144l98r57J7J059l33j155P49R04m88q78K39
$$ plain form
4015 -361 657 539 -913 -398 729 283 -683 -436 640 2 -1127 -93 708 -193 -923 -200 884 76
4033 76 -972 -120 467 -139 -1015 -139 660 -95 -887 -141 680 95 -841 10 894 158 -683 -183 952 294
4053 294 -461 -141 467 34 -502 -5 631 151 -909 -88 640 -55 -920 -37 844 -290 -400 322 390 95
4073 95 -725 367 624 -657 -510 253 618 -39 -900 71 849 -218 -922 -107 632 -116 -439 19 347
4092 347 -125 -641 245 666 -102 -771 288 537 -196 -487 450 785 0 -453 148 842 -164 -518 265
4111 265 481 -330 -570 270 685 -579 -723 278 942 -236 -839 260 442 -285 -657 310 668 -311 -615
4130 -615 253 158 -535 -766 448 403 -667 -469 350 935 -346 -810 517 305 -738 -555 627 457 -300
4149 -300 -552 237 940 -267 -461 702 654 -395 -631 397 692 -419 -589 788 689 -758 -275 466
$$ packed form
4015c61J018j18j452N15J127m46r66K47J076o38j129J034Q01r01p30P23J084q08
4033G6j048Q52N87o06q76Q76P99p55p92P46Q21n85r36Q51Q84p36q41N00J135o58
4053B94p55L20O08m33n36M97O36m80j060Q21P28o95q65Q83Q81j134j10P22O8k95
4073I5q20J092K57j281J47P63L65o57q61R71P78j067p04Q15P39p48l23M58L28
4092C47m72n16Q86M21p68o69J059K49p33k91R37L35p85m53O01O94j006l54P83
4111B65K16q11k40Q40M15j264j44J001O64j178o03J099J82p27l72R67L58r79l04
4130f15Q68r5o93k31J214m5j070J98Q19N85j281m64J327k12j043J83J182j70p57
4149c00k52P89P03j207j94J163m8j049k36J028K95j111j70J377r9j447M83P41
$$ plain form
4167 466 625 -554 -322 620 360 -821 -307 551 418 -472 -509 579 340 -861 -348 291 60 -866 -579
4186 -579 478 264 -902 -707 648 90 -1039 -519 506 431 -1204 -706 504 204 -566 -728 510 229
4204 229 -542 -628 577 310 -595 -156 607 422 -647 28 1009 274 -356 -109 714 248 -846 -16 1208
4223 1208 444 -423 173 899 318 -704 65 898 323 -507 -427 872 466 -803 -365 800 243 -821
4241 -821 -263 667 40 -1045 -320 478 75 -505 -431 430 -469 -865 -318 236 -420 -969 -377 872 197 -955
4261 -955 -187 814 -254 -744 232 772 356 -498 -138 914 129 -827 82 792 30 -615 31 818 82
4280 82 -513 369 929 -39 -527 145 591 -58 -437 358 783 -147 -1018 292 917 -59 -430 -6 754 -300
4300 -300 -1147 119 555 -470 -829 -201 596 -206 -753 -775 486 -328 -723 107 490 12 -899 311 611
$$ packed form
4167D66J59j179K32R42k60j181N14Q58j33q90l7J088k39j201N13O39k31r26K87
4186e79J057k14j166J95J355n58j129N20J025p5j635M98J210l00p70j62J238k81
4204B29p71q6J205k67r05M39P63j85j069O75R81p35o30K47Q23m66j094Q30J224
4223A208p64q67N96P26n81j022P69Q33n75q30Q0J299m06j269M38J165n57j064
4241h21N58R30o27j085P25P98m03n80P4Q61q99l96N47N54o56n49N92J249o75j152
4261i55P68J001j068m90R76N40m16q54L60J052p85r56R09P10p62o45O46P87p36
4280H2n95Q82N60r68m88O72M46o49l79P95M25r30q71J310O25r76l71M24P60j054
4300c00q47J266M36j025l59O28P97q02n47k2J261q14l95Q30L83m78r11J210L00
$$ plain form
4319 611 -300 -887 219 534 -285 -931 13 748 -267 -588 460 777 -325 -906 197 629 -134 -570
4337 -570 267 975 -87 -754 173 836 41 -674 272 451 -311 -688 156 637 -314 -480 266 765 -301
4356 -301 -791 -28 524 -284 -337 -222 481 -525 -487 249 514 -508 -538 338 498 -625 -730 546 702 -289
4376 -289 -573 376 635 -334 -566 437 665 -149 -511 541 477 -387 -352 301 704 -455 -566 557 156
4395 156 -432 -515 618 409 -486 -689 372 504 -501 -245 623 315 -564 -631 263 350 -644 -620 538 393
4415 393 -836 -404 354 342 -515 -701 441 544 -488 -518 443 616 -646 -345 330 220 -330 -227 453
4434 453 270 -117 -7 895 365 -429 -259 693 813 -404 -78 875 513 -303 -202 700 355 -579 -170 725
4454 725 466 -599 -124 510 431 -681 -204 707 162 -430 -218 453 41 -365 -111 502 268 -997 -518
$$ packed form
4319F11r11n87J106L15q19o46R44P35j015l21J048L17j102n81J103M32p63m36
4337e70Q37P08j062o67R27O63p95p15R46J79p62l77Q44M81r51j66P46M99j066
4356c01m90P63N52q08n3J15P03j006L8P36K65j022l0Q76J60j123j05J276J56r91
4376b89k84R49K59r69k32J003K28q14l62J052o4q64L5O53M03j159j11J123m01
4395A56n88q3J133k09q95k03J061J32j005K56Q68l08q79o7Q94Q7r94K4J158j45
4415C93j229M32P58j2q57j86J142J03j032l0R61J73j262L01O75j10n50J03O80
4434D53j83l87J10R02n30p94J70R52J20j217L26R53l62q16J01R02l45r34M09Q95
4454G25k59j065M75O34p9j112M77R11n45n92K12O71m12m06K54O13k34j265M79
$$ plain form
4473 -518 71 68 -1020 -510 501 53 -1028 -293 608 -198 -470 -390 461 143 -580 -376 541 403 -451 191
4493 191 642 249 -342 -224 586 226 -250 24 840 -64 -295 95 591 373 -313 101 682 -32 -453 17
4513 17 690 -15 -512 64 938 288 -572 87 727 -87 -544 -151 681 7 -760 -213 602 111 -766 -327
4533 -327 573 -80 -710 -271 483 -135 -644 132 220 364 -597 116 293 64 -312 238 489 -193 -701 -46
4553 -46 614 -134 -536 24 371 23 -448 210 729 -213 -513 85 629 -260 -609 11 289 103 -465 120
4573 120 82 -136 -511 76 771 -128 -357 412 250 -286 -471 -76 431 -211 -440 4 275 13 -740 109
4593 109 503 -195 -535 112 368 -200 -245 328 564 -134 -509 248 675 -294 -507 157 334 111 -143 131
4613 131 127 -59 -304 248 275 -331 -541 526 577 -406 -367 365 337 -351 -578 171 252 -343 12 288 -226 -248
$$ packed form
4473e18N89lj088N10J011m48j081P35R01q06k72Q0Q51l18p23K04R17j38q54O42
4493A91M51l93n91J18Q10l60m76K74Q16r04k31L90M96k18o86M14N81p14m21M70
4513A7O73p05m97N76Q74o50q60O59O40q14m57L93Q32o74p67N47Q15m91q77M39
4533c27R00o53o30M39P54o18n09P76Q8J44r61P13J77k29l76N50K51o82n08O55
4553d6O60p48m02N60L47l48m71O58N19r42l00N98N44q89l49O20K78j86n68N85
4573A20l8k18l75N87O95q99k29P69j62n36j85L95N07o42k29M44K71k62p53Q49
4593A09L94o98l40O47K56n68m5N73K36o98l75P57M27r69k13O64J77k23k54K74
4613A31mj86k45N52K7o06k10J067N1r83L9P32k8o88k27P49Q1n95L55K76n14k2
$$ plain form
4635 -248 -292 -118 373 -104 -429 153 373 -123 -593 108 56 -354 -170 348 -61 17 -347 313 -103 -459 235
4656 235 292 123 -468 302 672 402 -262 -82 547 280 -344 -8 554 509 -645 141 363 245 -424 -254
4676 -254 615 384 -336 -200 425 186 -306 25 349 -227 -284 -296 144 -106 -531 -134 435 -52 -340 -367 199
4697 199 11 -599 -183 269 35 -144 -218 515 105 -483 -203 321 229 -394 -515 333 206 -44 120 435 -165
4718 -165 -437 -135 471 209 -175 -74 406 178 116 -130 535 316 -458 -215 353 -287 -283 -9 473 413 -270
4739 -270 196 309 5 -697 -4 353 339 -215 -311 38 -109 -540 -271 143 -310 -409 259 317 -142 -501 -61
4760 -61 225 -197 -617 102 329 -339 -375 316 25 0 -454 276 685 -106 -226 -15 720 277 -365 355 677
4781 677 152 -499 -127 615 -38 -291 36 430 218 -307 310 522 200 -241 -116 353 -183 -340 -57 424
$$ packed form
4635b48m4J74M91m77l25N82K20m96m70P01n2m10J84N18m09P8l64O60m16l56O94
4656B35N7j69n91P70L70k70o64J80O29k67o24L36N62m5j154P86K22j18o69J70
4676b54Q69k31p20J36O25k39m92L31L24n76n7j2M40k50m25L97N69m87k88k7N66
4697A99j88o10M16M52k34j79p4P33m10n88K80N24r2o23j21Q48j27k50J64L15o00
4718a65k72L02O06k62l84J01M80k28o2k46O65k19p74K43N68o40MK74M82o0o83
4739b70M66J13l04p02O93L57j4n54r6L49j47m31K69M14m53r9O68N8m59l59M40
4760f1K86m22m20P19K27o68l6O91k91k5m54P30M09p91j20K11P35m43o42P20L22
4781F77n25o51L72P42o53k53L27L94k12n25O17K12l22m41J25M69n36j57K83M81
$$ plain form
4801 424 -355 -110 202 175 -366 -438 235 230 -70 -626 186 259 -253 -534 233 397 -53 -628 -81 326 -223 -328
4823 -328 -223 554 -360 -146 149 288 -194 -15 212 296 27 -5 40 611 -86 -77 157 481 190 -379 225 301
4845 301 -155 -229 449 306 -225 38 386 323 -206 -417 228 678 -251 -81 344 254 -410 -222 76 391 -206
4866 -206 -260 40 439 11 -202 139 128 -188 -606 118 97 -86 -333 103 396 -294 -388 188 323 -142 -123 123
4888 123 375 -256 -197 298 96 -71 -147 262 -60 131 -202 218 89 -15 -92 306 182 -279 -461 -52 266
4909 266 -226 -159 62 -200 -115 -345 90 -113 -326 -98 353 181 -419 33 435 64 -50 -251 -127 101 -297
4930 -297 -316 -22 88 -62 -185 7 147 -169 112 34 112 -40 57 212 291 -275 30 251 291 -233 0 412
4952 412 -4 -258 -301 480 260 57 62 309 360 -355 -21 302 19 33 -87 453 -98 -264 -384 170 18 -51
$$ packed form
4801D24p79K45L12k7n41p2O73nl00n56Q12P3n12k81P67J64m50n75N47M07n49j05
4823c28J05P77r14K14K95J39m82J79K27Q4k69l2M5N71o97RK34L24k91n69O04P6
4845C01m56p4O78j43n31K63L48o3n29k11O45M50r29J70M25r0o64J88K98L15n97
4866b06n4L00L99m28k13L41j1l16m18P24k1j83k47M36K93o90r4N76J35m65J9K46
4888A23K52o31N9M95k02j67p6M09l22J91l33M20j29j04p7L98j24m61j82M09L18
4909B66m92O7K21k62Q5k30M35k03k13K28M51j72o00M52M02l71j14k01J24K28l98
4930b97j9K94J10j50j23J92J40l16K81p8P8j52R7J55P9n66L05K21M0n24K33M12
4952D12m16k54m3P81k20k03NK47N1p15L34L23k83J4j20N40n51j66j20N54j52o9
$$ plain form
4974 -51 -287 -174 197 -580 -100 71 149 -575 -12 122 38 -138 -352 -94 168 -273 -304 217 -113 -401 -10
4995 -10 311 211 -119 206 454 130 156 12 267 256 -330 -33 279 182 56 -175 320 296 -133 23 176 48
5017 48 34 -20 349 67 102 -22 -135 -353 -212 -126 93 -324 -461 -146 -19 -178 -366 -365 126 58 -373 -469 297
5040 297 -12 -300 -67 -166 -105 -288 -61 -70 -107 -362 -208 317 37 -368 51 -39 -6 -383 193 226 78 38 79
5063 79 157 217 3 194 86 90 153 -15 322 145 -110 126 291 54 -5 249 181 116 -87 125 132 288 -351 -115
5087 -115 299 -68 -329 75 20 255 -258 55 -34 -307 -134 -259 -195 -158 34 -1 -129 -488 -243 -226 174 -305
5109 -305 15 265 328 -253 -246 -218 89 -252 -69 92 103 300 -118 82 -99 -15 144 42 42 27 -45 449 -94
5132 -94 -1 102 -72 175 -173 20 -114 225 -123 -123 123 291 -248 -140 82 446 -195 -367 -6 234 92
$$ packed form
4974e1k36J13L71p77M80J71P8p24N63J34q4j76k14K58K62m41l1N21l30k88L91
4995a0L21j00l30L25K48l24K6j44K55j1n86K97L12r7j26k31M95k4m29J56J53j28
5017D8j4n4L69k82L5j24j13k18J41Q6K19m17j37L15J27j59j88JM91o8m31r6P66
5040B97l09k88K33r9O1j83K27rl7k55J54N25k80m05M19r0L3l77N76L3j48m0M1
5063G9P8O0k14J91j08MO3j68L37j77k55K36J65k37n9K54o8o5k03K12PJ56o39K36
5087a15M14l67k61M04n5K35n13L13q9k73J73j25O4L7J92l5j28l59K45J7M00m79
5109c05L20K50O3n81PK8L07l41J83J61J1J97m18K00j81Q4J59j02%j5p2M94n43
5132i4R3J03j74K47l48J93j34L39l48%K46J68n39J08K22L64o41j72L61K40j42
$$ plain form
5153 92 -128 -261 138 -422 -140 75 185 -68 270 -302 166 110 0 285 297 209 37 122 308 -356 365 193
5175 193 -164 234 -16 269 141 -79 -141 394 155 163 -65 93 58 -15 36 -173 275 -186 -351 -151 132 160
5197 160 67 -200 -212 -149 162 161 -409 -331 217 155 -140 -169 97 -93 -94 -133 -310 50 232 -182 22 -192 -179 -89
5221 -89 -322 30 327 -16 -8 189 -108 -19 -58 -7 129 258 -88 -16 115 200 -135 473 -145 434 104 148 145 59
5245 59 74 153 30 -258 219 81 248 -260 -57 232 -127 -106 -220 -91 13 85 -171 -231 -168 -248 -357 -210 -194
5268 -194 105 -177 -325 44 -188 -159 -126 77 -15 205 -35 63 82 66 27 257 -85 150 70 -185 217 99 -140
5291 -140 384 -56 -88 206 12 -25 -141 368 128 -117 -276 -86 -16 -151 94 -192 37 -67 41 -55 -90 -135
5313 -135 -148 217 -56 -110 32 -154 98 231 -148 183 -374 -255 -252 -55 -28 38 -36 160 -72 -496 -190 283
$$ packed form
5153I2k20j33L99n60K82K15J10k53L38n72M68n6j10K85J2q8j72Q5J86o64P21j72
5175A93l57L98k50K85j28k20o2N35k39Qk28J58l5p3N1k09M48m61j65K00K83K8
5197A60r3k67j2O3L11jn70P8N48o2k95k9K66j90jl9j77L60J82m14K04k14J3R0
5221h9k33L52K97l43QJ97k97Q9l9N1J36J29l46P2J31Q5l35O08o18N79l30M4lq6
5245E9J5P9j23k88M77j38J67n08K03K89l59K1j14J29J04P2k56o0O3q0j09J47J6
5268a94K99k82j48L69k32K9L3K03r2K20k40R8J9j6l9K30l42K35q0k55M02j18k39
5291a40N24m40l2K94j94l7j16N09k40k45j59J90P0j35K45k86K29j04J08r6l5m5
5313a35j3L65k73n4J42j86K52J33l79L31n57J19LJ97K7O6p4J96k32m24L06M73
$$ plain form
5335 283 -58 153 81 -93 402 163 -81 178 271 33 10 156 79 273 114 298 51 127 -32 -7 249 133
5357 133 -158 -270 54 -159 -210 -66 71 -28 -187 28 170 31 -49 -51 47 -297 -108 223 366 -17 -45 -77 -216
5380 -216 169 -181 13 238 -287 167 -127 131 -81 -223 -17 245 4 -56 306 283 -152 -30 134 -252 -237
5401 -237 -346 376 200 -51 -139 199 48 -171 165 86 294 6 -106 83 176 152 -76 -33 -118 -386 -231 -55
5423 -55 -369 21 -176 132 106 12 -65 -10 -75 23 -69 129 51 -9 -24 161 -304 -246 130 116 4 43 78 39 384
5448 384 -235 42 87 309 211 30 444 -126 -205 5 134 30 49 246 170 184 -22 -151 -179 124 -44 19 86
5471 86 -116 -144 125 95 -210 -21 -159 60 59 -245 36 -356 77 -189 -21 78 13 -210 89 -49 329 -174
5493 -174 -251 -127 -30 25 -43 68 55 93 -120 -301 21 -185 -236 380 -195 -97 39 450 150 30 -140 161 140
$$ packed form
5335B83l41K11p2j74M95k39k44K59R3k38k3J46p7J94j59J84k47P6j59K5K56j16
5357A33k91j12L24k13n1J44J37r9j59K15J42j39q0kR8l44J89L31J43l83k8l2j39
5380b16L85l50J94K25n25M54k94K58k12j42K06K62k41o0L62k3m35J22J64l86J5
5401b37j09P22j76k51q8L38j51k19L36p9K08k88j12J89R3k4k28M3q5k68J55J76
5423e5l14L90j97L08k6r4p7N5o5R8r2J98p8o0j5J85m65N8L76j4j12L9L5l9L45
5448C84o19K77M5K22r8j81M14n70p9K10J29j04J9J97p6J4k06j29k8L03j68O3O7
5471H6k02k8K69l0l05J89j38K19jl04K81l92M33k66J68R9o5k23K99j38L78n03
5493a74p7J24R7N5o8J11j3L8k13j81L22k06n1O16n75R8J36M11l00j20j70L01k1
$$ plain form
5516 140 28 180 452 269 -407 -208 224 92 18 -80 -202 -42 -134 -279 -315 -278 -45 157 82 -263 80 -215
5538 -215 31 -26 -116 -111 -71 -262 -326 -255 211 -184 -105 -329 23 -46 -109 118 167 7 -387 -47 30 47 -40 -93 -168
5563 -168 332 -321 125 82 133 -2 40 412 169 -361 98 283 -88 -336 -151 228 190 24 -34 -17 -265 -131
5585 -131 234 479 98 -213 -113 -44 -224 42 67 119 -37 -245 -108 38 -223 -177 -208 -289 -125 -343 -203 2
5607 2 -107 -344 -70 219 55 -385 236 99 -4 -170 138 -208 186 -138 324 598 -35 258 -143 372 -22
5628 -22 -165 245 195 236 -193 275 333 -49 -320 130 369 -226 -79 -84 13 180 30 87 305 211 37 -253 -196
5651 -196 -260 -285 -30 20 -324 -434 7 -64 -85 -257 -120 -1 -353 -243 92 349 -86 -426 20 195 -170 -366
5673 -366 92 260 -254 -265 -153 67 198 -304 -12 329 -10 -152 -282 452 386 -105 -204 256 -63 64 232
$$ packed form
5516A40j12J52K72j83o76J99M32j32p4r8j22J60r2j45l6L7K33K02p5l45L43k95
5538b15K46n7r0NM0j91o4P1M66l95P9k24L52o9o3K27M9j60l94L40P7J7q7n3p5
5563a68N00o53M46m3N1j35M2L72k43n30M59J85l71k48J85L79l8j66n8J7k48J34
5585a31L65K45l81l11J00O9j80K66K5N2j56k08J37J46k61M6l1q1J64k18J40K05
5607Bj09k37K74K89j64m40O21j37j03j66L08l46L94l24M62K74o33K93m01N15l94
5628b2j43M10n0M1m29M68N8l82k71M50K39n95J47nR7J67j50N7K18r4j74k90N7
5651a96o4k5K55N0l44j10M41p1k1j72J37J19l52J10L35K57m35l40M46J75l65j96
5673c66M58J68n14j1J12K20J31n02K92L41l39j42j30P34o6m91r9M60l19J27J68
$$ plain form
5694 232 242 -83 -99 411 361 99 -229 -143 338 -349 66 61 215 65 -197 1 261 -486 -315 -38 104 -74
5716 -74 -491 30 164 -85 -551 -15 35 -75 -414 -34 318 -184 -313 132 48 -50 -67 186 124 -122 129 209
5738 209 386 22 -81 80 306 -365 -191 302 311 234 -207 -159 59 -16 -217 -112 297 -242 -181 204 204 64 -175
5761 -175 -202 136 -230 -303 63 191 -153 -113 -323 10 13 86 187 -124 -254 -193 -83 282 -44 -135 318 360 -120
5784 -120 231 220 88 79 -50 416 47 -94 16 270 266 80 40 73 252 -161 -173 -14 -50 -155 121 354 387
5807 387 39 -310 -102 55 49 -297 88 -52 -202 -204 207 -9 244 -288 7 -54 -287 -106 196 -95 -219 -102
5829 -102 103 112 -246 -50 156 -172 -240 -171 155 220 -385 -246 120 299 -274 161 413 106 -49 -150 378 76
5851 76 -328 -320 397 -111 -206 -7 -83 122 -154 -274 271 94 -101 -85 15 -40 -126 -136 172 -133 -176 -168 5 190
$$ packed form
5694B32J0l25j6N10n0k62l28Q6M81o87M15nJ54j50k62J98K60p47J71K77J42j78
5716g4m17N21J34k49m66N36N0j10l39L80L52n02j29M45q4r8j7K53o2k46K51Q0
5738B09J77l64j03J61K26o71J74M93Rp7m41M8K18p5k01J05M09n39O1L85%j40k39
5761a75k7L38l66p3L66J28l44M0k10L33LP3J01l11j30O1J10L65l26r1M53M2m80
5784a20L51j1j32rj29M66l69j41J10K54mj86m0L3J79m13j2J59l6j05K76K33L3
5807C87l48l49K08J57ol46L85j40j50kM11k16K53n32K95o1k33J81L02k91j24J17
5829a02K05Rl58J96K06l28o8O9L26O5o05J39L66J79n73M35K52l07j55j01N28l02
5851G6m04QP17n08r5J99p6K05k76j20N45j77j95J6J00n5q6j0L08l05m3QJ73J85
$$ plain form
5875 190 -546 -74 -84 194 -179 -157 384 136 -282 1 214 -54 -366 170 194 21 -3 105 224 87 -50
5896 -50 -232 -75 -19 -21 8 323 35 -310 175 -191 339 35 270 221 173 -303 124 283 233 -120 -9 285 -53
5919 -53 -90 85 177 64 -43 154 43 -208 -190 -165 -96 -76 -98 -32 157 166 -4 167 186 52 -392 198 -8 -62
5943 -62 -98 -252 -19 -236 10 -57 376 52 -149 310 11 -193 -301 181 351 69 154 287 30 110 -35 -43
5965 -43 252 38 -299 8 344 157 186 92 11 -53 -26 215 2 -37 -170 63 -7 -150 -76 257 233 -9 -104 132
5989 132 401 -228 -249 -95 429 -45 -313 222 415 -311 -211 224 241 37 -80 -12 155 -174 85 330 188
6010 188 -203 -199 212 384 397 209 38 69 103 -324 59 128 93 25 110 86 -260 -247 215 232 -382 -114 -121 303 -459
6035 -459 -113 119 84 -266 -159 64 192 123 -21 74 49 -480 -335 42 61 -406 -63 289 266 -360 -255 -14
$$ packed form
5875A90p36M72j0K78l73K2N41k48m18K83K13k68l12N36K4j73k4J08J19j37j37
5896e0j82J57N6kK9L15k88l45M85l66N30l04K35m9m8m76M27J59n0l53J11K94l38
5919e3l7J75R2j13j07J97j11k51J8K5O9K0k2O6J89Rj70J71J9j34m44N90k06n4
5943f2l6j54K33k17K46o7M33l24k01M59k99k04j08M82J70k82Q5J33k57Q0j45q
5965d3K95k14l37L07L36j87K9r4q1o4K7K41k13l9j33K33p0j43P4L33k4k42r5K36
5989A32K69o29k1J54N24m74k68N35J93p26J00M35J7k04j17O8J67l29K59K45j42
6010A88l91MM11J72J3j88j71L1L4m27L83O9l5o8Q5k4l46J3M62J7o14K68pM24p62
6035d59L46K32l5l50J07K23J28o9j44R5k5n29J45L77J9m67L43L52k3o26J05K41
$$ plain form
6057 -14 -131 -338 -81 390 187 -408 -282 31 -13 -129 4 134 -69 -294 252 121 356 -253 -142 584 405
6078 405 110 159 351 129 -102 159 176 -110 -64 -88 399 82 12 -39 195 -220 -282 201 91 -143 -303 -210 111
6101 111 336 -255 -282 -228 136 -133 -233 -61 72 -281 -537 102 -175 -417 -156 206 142 -167 240 77 -118
6122 -118 -41 -245 -54 34 -284 -273 339 119 -247 -42 276 -103 -151 148 137 -201 -160 235 284 -157 10 84 353
6145 353 -45 -428 -346 59 227 103 -77 95 -39 -205 -176 204 -97 -375 -158 205 157 -595 -43 53 -46 -173
6167 -173 -180 97 -262 -458 153 226 -190 -239 153 120 -115 -144 182 -71 -123 -285 -108 357 111 61 293 275 55
6190 55 -407 169 415 270 -131 138 454 -203 -61 -43 350 -194 -170 -6 229 -169 -102 49 205 -127 -268
6211 -268 161 339 -267 -323 -79 -214 2 -267 -182 -246 -429 -181 245 41 20 -149 -172 233 95 -259 166 256
$$ packed form
6057a4j17k07K57M71k03n95J26L13m4j16J33J30k03k25N46j31K35o09J11P26j79
6078D05k95M9J92k22k31K61J7k86M6k4M87l17p0n1K34m15o2M83j10k34j60R3L21
6101A11K25n91k7N4L64k69j00J72J33l53k56O39k77k42K61L62o4l09M07j63j95
6122a18P7k04J91Q8l18J1O12k20l66K05L18l79m8K99j1l38M1L95M9m41J67P4K69
6145C53l98l83Q2M05J68j24j80J72j34j66K9L80l01k78K17L63m8p52N52R6r9j27
6167a73pK77l59j96O11P3m16m9L92l3k35k9L26k53n2j62J77M65k46n0K32j8k20
6190E5m62N76K46j45m01K69L16o57J42J8L93n44K4J64K35l98O7J51J56l32j41
6211b68M29J78o06n6K44j35K16k69Q5o4j83K48M26k04k1j69k3M05j38l54M25R0
$$ plain form
6233 256 -92 -359 -101 270 -71 -302 213 149 -152 125 139 141 -7 -53 -66 199 104 -278 142 596 -69 -418
6255 -418 -120 304 70 -219 98 175 -14 -20 94 26 -74 -157 342 151 -370 -108 20 122 -312 -179 96 -169
6277 -169 -373 -461 213 239 -250 -453 200 375 -372 -371 248 146 129 -36 -7 -5 -97 183 228 107 -255 -179 -96 209
6301 209 -92 -231 331 163 236 66 453 95 -113 75 332 69 -165 -220 64 279 17 -268 149 351 256
6322 256 8 157 156 -74 -6 197 360 -321 -88 359 7 -358 -267 228 -99 -52 7 182 123 -292 -31 204
6344 204 -254 -140 -86 137 213 576 -226 -82 42 -312 -6 122 -75 129 76 158 159 -67 108 259 -24 -198
6366 -198 54 113 79 159 37 -34 13 -232 19 187 100 -263 -173 176 84 -183 -29 145 -131 -311 90 -38 -177
6389 -177 -401 -266 174 418 -168 -21 194 228 18 -237 -64 42 -171 314 -88 -88 -259 -15 -27 -22 -409 -54
$$ packed form
6233B56l48k67K58L71l41k31N15o4l01K77J4Kj48m6j3K65r5l82M20M54o65l49
6255d18K98M24k34k89L17P7j89oJ14o8j00q3M99j91n21K62J28J02m34J33K75k65
6277a69k04q8O74K6m89k03O53J75p47JO19j02j7j65K9Kr2K80M5j21l62P6Q3L05
6301B09l01j39N62j68P3j70L87l58k08J88K57k63k34n5K84K15k62k85M17K02r5
6322B56k48J49jk30O8K03J63o81K33M47l52l65R1M95l27M7N9J75n9m15K61K35
6344B04m58J14N4K23P6L63q02J44J24l54L06J28j97K04n3Q2Jk26J75J51k83j74
6366a98K52N9l4Q0j22p1M7k45K51J68q7l63R0L49r2k67J54J74k76j80M01j28j39
6389a77k24J35M40K44n86J47K15L4k10k55J73J06k13M85m02%j71K44j2Nl87L55
$$ plain form
6411 -54 177 63 -494 52 290 97 -5 326 185 233 -275 25 62 2 9 -9 240 -258 -18 -344 146 164 -424
6434 -424 -264 286 -121 0 -165 -141 -192 -513 -74 225 83 -197 102 -25 -163 -281 -141 193 196 -48 -316
6455 -316 55 -179 -15 -120 189 -68 -381 -3 435 -69 -204 250 -180 -74 -48 387 200 -223 -61 -95 292
6476 292 132 -57 75 218 122 -87 160 150 177 -132 -5 262 147 -304 177 145 103 -156 -127 150 -216 -96
6498 -96 -144 231 -255 -147 -174 -79 153 -126 -19 -213 -130 30 120 78 -18 -208 156 59 -257 -6 79 -70 33
6521 33 -271 52 307 179 -389 -93 204 138 -75 4 271 -405 -243 -222 318 -216 65 341 169 -276 -184 111
6543 111 312 -34 -157 291 -142 -538 -69 146 -101 79 -119 15 123 -145 -112 30 101 -287 -170 -322 -72
6564 -72 -207 -323 167 -8 -123 -114 30 266 2 -108 195 106 20 -210 199 155 -287 -220 112 168 -40 14 52
$$ packed form
6411e4K31j14n57N46K38j93j02L31j41M8n08L00L7o0Pj8K49m98K40l26M90J8n88
6434d24J60N50m07J21j65K4n1l21M39K99j42k80K99j27j38j18J40L34Lk44k68
6455c16L71k34J64j05L09k57l13L78M38n04j35M54m30J06K6M35j87m23J62l4L87
6476B92j60j89J32J43r6k09K47j0K7l09J27K67j15m51M81l2m2k59K9K77l66J20
6498i6m8L75m86J08k7R5K32k79J07j94Q3J60R0m2r6j90L64r7l16K51Q5j49J03
6521C3l04L23K55j28n68K96K97o6k13P9K67o76J62K1N40n34K81K76j72m45R2K95
6543A11K01l46j23M48m33l96M69K15k47J80j98J34J08k68L3J42P1l88J17j52K50
6564g2j35j16M90j75j15RJ44K36k64j10L03q9q6k30M09m4m42O7L32N6k08N4L8
$$ plain form
6587 52 106 -160 12 240 218 124 -115 53 87 -108 223 16 -6 -300 -217 -13 -10 -265 -49 354 105 -15 -4
6610 -4 59 -96 -326 -468 61 126 51 49 58 -280 -110 -308 224 -110 -199 -362 -259 82 -156 144 147 -19 -113 -4
6634 -4 403 167 -11 177 38 129 -260 130 60 126 -114 375 278 -280 -121 21 89 35 -42 -161 140 45 -116
6657 -116 -274 129 -72 -155 11 -22 515 -243 -134 137 258 -132 -238 -177 -254 52 -271 -87 -194 -205 -218 -38
6679 -38 351 -287 -43 291 -210 -115 63 113 -180 -88 144 154 44 -69 173 366 174 -50 194 133 19 -159
6701 -159 78 -117 -126 -456 -147 170 -72 162 204 85 -27 -10 -139 -63 -94 -92 -12 215 -112 -147 -206 236 -187 -248
6725 -248 118 10 -61 -425 -243 155 -79 -266 -79 328 130 -241 -262 -88 62 -37 11 331 0 -20 438 52
6747 52 -201 -167 195 168 -45 41 270 56 54 -358 222 127 -155 141 195 -71 -74 -174 438 218 -143 66 -183
$$ packed form
6587E2N4k66J72K28k2r4k39J68L4j95L31k07k2k94Q3K04Lk55K16M03k49j20J1
6610dO3j55k30j42N29O5p5kRl38J70j98N32l34q9j63J03L41k38L00Lj66r4J09
6634dM07k36j78J88j39R1l89L90p0O6k40M89r7n58J59J42O8n4p7j19L01r5j61
6657a16j58M03k01q3J66l3N37p58J09K71J21l90j06O1p7L06l23J84j07j1j3J80
6679c8L89o38K44L34n01R5J78N0k93R2K32J0j10j13K42J93j92k24K44o1j14j78
6701a59K37j95rl30L09L17k42K34M2j19j12J7j29P6l1KQ0K27l27l5n9M42m23o1
6725b48L66j08p1l64J82L98k34j87J87M07j98l71k1J74J50r9M8L20l31k0M58l86
6747E2k53L4L62k7k13Q6K29k14km12N80r5k82K96N4k66lj00O12k20l61K09k49
$$ plain form
6770 -183 -152 -203 -34 -44 397 -137 -284 21 311 -22 -117 163 202 -49 -24 212 139 -51 71 98 181 -19 -10 -65
6794 -65 -33 -128 -230 -100 15 276 -43 211 114 -17 172 214 329 364 -88 276 244 -50 -25 107 303 -267 -121
6817 -121 -70 84 65 -349 156 219 -183 -100 40 23 -71 -376 -181 139 -267 -109 64 -200 -85 -106 280 291 -166
6840 -166 136 -75 235 -197 112 159 44 -167 -185 103 510 -150 -35 -28 61 112 -72 192 -215 -57 37 -154
6862 -154 134 -185 131 159 -223 -145 -20 -17 328 -64 301 296 -120 151 -18 118 85 -115 -301 -4 89 -92 42
6885 42 -36 25 -381 -253 102 -168 -342 -229 202 81 -330 -36 21 -22 8 -24 -62 -251 -408 -72 131 -229 -132
6908 -132 132 -95 19 -100 -54 134 182 -338 279 116 354 -146 -274 262 -200 31 87 316 237 14 79 176
6930 176 137 68 -319 -74 -155 -107 -105 -77 211 -282 38 151 -155 -166 -61 5 -55 180 -263 191 139 -259 -80 90
$$ packed form
6770a83L1n1J69j0M41n34j47L05K90l33r5K80L9k51K5K36p3j90J22K7Q3k00Rn5
6794f5L2r5j02J30J15K61l19K54r7j31J89M2J15L5m52L64l2k94K5J32J96n70J46
6817a21N1J54j9m14N05O3m02Q3J40j7r4l05J95L20m06J58J73k64J15k1L86J1m57
6840a66L02k11L10m32L09M7j15k11j8K88M07o60J15PQ9N1j84K64m07J58R4j91
6862a54K88l19L16K8l82P8J25LL45l92L65nm16K71j69J36l3k00j86K97R3j81J34
6885D2p8O1m06J28L55k70j74J13M31j21m11K94N7m3L0l2l8j89j57L36K03l60R7
6908a32K64k27J14j19M6J88M8n20O17j63K38n00j28N36m62K31N6K29p9k23O5R7
6930A76l9o9l87K45q1M8KK8K88m93L20J13l06j1J05O6o0K35m43M54n2l98J79J70
$$ plain form
6954 90 18 43 66 366 -131 -78 -221 90 289 85 -42 252 -27 62 101 -261 44 -47 12 203 84 160 159 240
6978 240 99 56 220 333 28 -10 149 -222 79 -119 -103 -151 267 -290 109 11 -127 35 -226 310 74 -46
7000 -46 241 75 37 -295 -102 -98 51 186 -74 317 -99 -39 106 204 -212 -52 -220 -35 105 24 143 130 124
7023 124 -3 -197 -104 -35 -112 -91 16 -248 -171 186 130 5 161 -161 49 -179 -68 229 352 -141 168 11
7045 11 113 406 104 19 174 -21 -326 88 -37 -27 -25 -273 -69 -202 -61 -79 89 140 -181 -167 -283 -139 -224
7068 -224 23 -69 -56 -188 -57 294 -135 -216 92 29 -194 229 -171 94 -77 -235 -117 -17 102 -192 -64
7089 -64 -195 -169 -114 242 -106 -61 -172 442 152 -27 -153 -75 276 82 10 -9 -318 -112 -231 88 -173 -71
7111 -71 152 -380 78 -192 -161 -114 -24 163 -223 130 -108 85 -88 -37 363 -56 -247 100 331 -31 -24 -70 -158
$$ packed form
6954I0p2K5K3L00m97N3j43L11J99k04j27K94k79Q9L9l62L05r1N9J91j19P6jQ1
6978B40j41m3J64J13l05l8J59l71L01j98J6m8M18n57L99r8j38J62k61N36k36j20
7000d6K87j66l8l32J93MJ49J35k60L91m16O0J45R8m16J60j68J85J40q1J19j3o
7023A24j27j94R3O9p7K1J07k64P7L57n6j25J56l22K10k28J11K97J23m93L09j57
7045A1J02K93l02q5J55j95l05M14j25J0Kk48K04j33J41j8J68N1l21J4j16J44q5
7068b24K47r2J3j32J31L51m29q1L08o3k23M23m00K65j71j58J18J00J19k94J28
7089f4j31K6N5L56l48M5j11O14k90j79j26P8L51j94p2j9l09K06j19L19k61J02
7111g1K23n32M58k70L1M7R0J87l86L53k38J93j73N1M00m19j91L47K31l62Pm6q8
$$ plain form
7134 -158 -142 224 165 82 -165 -37 -65 199 -108 -187 185 -53 227 -117 37 -12 436 -107 133 -273 -106 -274
7156 -274 191 154 -368 -190 82 -116 -291 107 380 -238 -197 -131 -192 -159 -122 -169 -199 -92 -35 -3 74 123 141 -152
7180 -152 -106 -374 157 -65 -245 14 -188 38 103 186 -99 -95 13 81 -106 152 168 -123 -211 155 265 -6 -211
7203 -211 -242 -104 -8 228 81 48 204 -130 34 48 27 -49 164 300 171 28 52 62 164 -21 -335 -386 -140
7226 -140 -207 115 127 -87 -293 -233 130 -274 -291 57 -80 147 4 -152 252 -123 264 65 -17 19 65 -160
7248 -160 238 -50 130 -205 89 119 -114 3 11 196 -119 34 36 -3 -79 -194 -30 100 45 230 161 103 77 -79
7272 -79 -92 -58 -78 132 -7 8 120 -8 -152 117 -31 -148 -64 -17 129 -195 137 130 19 -135 144 168 -601
7295 -601 -391 -318 176 3 -218 -39 62 -192 122 12 -30 5 -24 273 -6 -167 71 206 338 -136 64
$$ packed form
7134a58J6L66n9q3k47J28k8K64l07p9L72k38K80l44J54m9M48n43K40m06J67j68
7156b74M65l7n22J78K72j98j75L98K73o18M1O6o1L3L7m7l0J07N7L2P7M9J8k93
7180a52M6k68N31k22j80K59k02K26O5Q3k85MJ08O8j87K58J6k91q8L66J10k71k05
7203b11l1J38R6K36j47l3J56l34J64J4k1p6K13J36j29j43K4J0J02j85l14n1K46
7226a40o7L22J2k14k06O0L63m04j7L48j37K27j43j56M04l75L87j99q2L6M6k25
7248a60L98k88J80l35K94L0k33J17QJ85l15J53Kl9p6j15J64J30n5J85o9n8k6j56
7272g9j3L4k0K10j39J5J12j28j44K69j48j17Q4M7J46l24L32pj11j54K79K4p69
7295f01K10P3M94j73k21J79J01k54L14j10m2L5k9K97k79j61K38J35J32m74K00
$$ plain form
7316 64 185 132 10 -22 378 337 -44 -243 419 -90 -35 -328 -6 -69 -103 -138 -159 112 -132 254 50 -34 -161
7339 -161 -205 95 -73 -105 80 41 -41 -208 -164 -41 126 -41 64 -176 -71 -155 -187 145 -38 -252 -147 -124 195
7362 195 -372 -22 -142 -3 -54 -30 184 -134 301 -147 424 194 -239 -80 47 318 -129 70 -43 122 -186
7383 -186 -151 -247 -69 -79 142 -142 88 -293 69 202 -302 -73 97 252 16 69 212 16 93 26 67 64 -266
7406 -266 -290 98 -182 -129 -10 -1 415 202 -18 -63 36 -11 -176 -43 148 -73 144 -185 196 -371 -116 -43 42
7429 42 104 12 -28 154 125 181 267 -43 79 15 366 9 199 -256 104 205 -233 -112 110 -31 216 -70 237
7452 237 -177 -117 -95 12 -14 -25 -230 123 35 -304 -247 -201 206 9 -135 190 221 -167 54 -291 0 99 85
7475 85 81 169 301 154 -30 286 24 72 113 249 149 -327 112 89 69 66 -6 139 54 -2 -38 107 310 53 64
$$ packed form
7316F4J21n3j22l2M00m1l81j99O62n09N5k93L22o3l4l5k1K71k44L86k04q4j27
7339a61m4L00j68l2J85l9q2j67M4J23J67j67J05k40J05q4l2L32j83k14J05K3L19
7362A95n67L50j20J39n1K4K14l18M35m48N71k30m33J59J27K71m47J99j13J65l08
7383a86L5r6J78j0K21k84K30l81L62J33n04K29J70J55k36N3J43j96P7o7M1ll30
7406b66k4L88k80N3J19RM16k13k20m5R9m7j65J33J91k21K17l29L81n67K55P3Q5
7429D2O2r2m0J82k9N6Q6l10J22o4L51l57J90m55L60J01m38J21K22j41K47k86L07
7452B37m14O0K2J07k6j1k05L53q8l39N7M6M07j97j44L25L1l88K21l45K91R9j4
7475H5mQ8J32j47j84L16k62M8M1J36j00m76M39k3k0lp2J45q5n6l6J45K03k57J1
$$ plain form
7500 64 -43 -322 -73 220 329 -246 -199 266 83 -188 -131 25 74 -4 -175 -70 -9 -303 141 -23 -123 -160
7522 -160 88 -222 53 -18 -250 -166 9 -20 -71 119 178 96 -228 103 -187 -44 -54 205 122 232 -34 64 313
7545 313 -145 -34 2 182 -186 133 153 304 -15 60 -131 117 -196 -532 221 -81 84 -162 26 -54 35 167
7567 167 1 343 -129 -91 -47 270 -51 -57 -53 -190 99 104 1 70 -326 -206 -51 -96 -21 -235 -389 143 -69 -172
7591 -172 -19 344 -268 46 54 -9 -115 203 249 275 -349 -67 303 42 -299 -345 298 -120 -54 82 276 -74
7613 -74 38 -120 -210 102 111 234 86 318 -60 -49 -167 -13 -176 120 177 -162 4 -419 -19 42 53 -37 -68
7636 -68 109 126 -92 50 -350 12 138 51 -154 -58 212 -237 -132 -66 -102 470 66 -108 271 37 135 -163
7658 -163 -197 -31 133 -131 -91 35 10 55 -111 89 -218 -168 -3 398 -172 199 -85 162 -254 281 81 28
$$ packed form
7500F4j07k79K49K93J09n75M7M65j83k71N7J56M9p8j71J05O1k94M44j64j00l7
7522a60K48l10K75p1k32Q4J75k9n1J90N9q2l24L31k90J43j0K59q3J10k66R8K49
7545C13m58J11L6J80l68L19K0J51l19P5j91K48l13l36P53l02J65k46J88q0Q9J32
7567A67j66L42m72L8M4L17l21oMj37K89Nj03O9l96J20J55m5P5k14j54N32k12j03
7591a72J53L63o12L14Qo3j06L18M6K6o24K82L70k61l41m6O43m18O6J36J94l50
7613g4J12j58r0L12RJ23j48K32l78J1j18J54j63K96N7l39J66m23M00O1J1r0l1
7636f8J77J7k18J42m00L62J26q7k05R6K70m49J05O6l6N72m04j74L79k34R8k98
7658a63l4J66J64k64M0J26k5M5j66K00l07N0J65M01n70L71k84K47m16N35k00n3
$$ plain form
7680 28 -86 26 78 212 163 -196 19 142 -53 -25 287 286 125 29 11 -9 -79 -64 90 178 141 -56 250 94
7704 94 204 -239 -55 -3 -266 -279 -59 -47 -76 45 -172 13 -122 14 -142 311 -68 96 88 61 111 41 -154
7727 -154 -22 79 -126 28 -256 -144 -77 -49 -40 -195 -55 -235 -37 -221 -77 172 -226 -258 -348 -187 -172 -189 177
7750 177 -50 -76 51 39 -8 -143 8 -35 4 325 -67 85 120 -32 -269 -344 81 -34 52 -196 -69 -34 -7
7773 -7 -35 154 -19 -60 -133 6 -108 -145 -254 6 37 -10 -76 -84 113 9 -119 -275 110 -225 10 352 108 -110
7797 -110 -352 -115 92 -77 27 187 -97 60 -8 93 181 -195 295 43 -48 -153 -154 101 -60 -96 -8 218
7819 218 140 349 49 61 106 -118 101 -12 154 -90 -92 184 -293 -132 45 -99 163 -393 -160 40 185 113
7841 113 -30 -218 -16 -2 -245 305 58 -152 57 126 -29 4 140 55 63 -297 43 -231 -112 51 117 -158
$$ packed form
7680B8j14J12N2J34m9l59K15J23j95K8L12jj61r6j8k0p0J5J54Q8l7j97L06j56
7704I4J10m43J84N2k63j3K20J2k9J21k17J85j35J36j56M53l79J64qk7N0p0j95
7727a54J32J01k05J54k84J12O7K8Rj55J40j80J98j84J44K49l98l2r0J61J5j7L66
7750A77k27k6J27j2m7j35J51m3L9L21l92J52L5j52k37p5M25j15Q6k48J27L5K7
7773gk8J89j73m1p3J39j14l7j09K60L1m7o6qJ97j04j28j56L85l35K35L42k44k18
7797a10k42K37K07j69J04J60k84J57o8J01Q8l76M90k52r1j05jK55j61l6Q8K26
7819B18p8K09l00J2M5k24K19j13J66k44kK76m77J61J77j44K62n56K33K00J45p2
7841A13j43j88K02J4k43N50k47k10K09O9j55L3J36q5Ql60L40k74J19J63O6k75
$$ plain form
7863 -158 11 107 -29 90 410 -103 199 14 89 -222 122 117 -28 260 14 351 -115 -205 -183 56 -161 -47
7885 -47 233 120 -56 -128 100 233 210 -113 92 -59 63 7 218 -3 132 -96 -229 37 76 67 189 43
7907 43 -230 315 42 -132 -30 -229 -308 -157 3 -134 -141 -284 -65 296 137 115 -194 -170 90 263 269 134 103
7930 103 353 113 2 55 189 74 233 145 224 -189 -243 175 89 -14 -228 -107 7 -67 -283 83 147 -154
7952 -154 -38 33 226 -198 -209 -175 294 8 -3 -67 -9 195 -32 -164 -18 121 248 -10 -68 -17 -131 -102 100
7975 100 -72 -166 146 39 -204 87 -377 22 158 139 -279 81 62 46 201 213 -16 172 -27 191 -11 137
7997 137 -106 389 -112 -189 347 279 94 11 -438 101 -283 109 -136 -96 -68 -284 -28 196 -95 -249 229 28
8019 28 -107 126 53 151 -68 -48 -159 -68 -102 -227 -67 214 -177 -224 -95 197 42 -123 -155 -130 136 -81 30
$$ packed form
7863a58J69R6j36J19L20n13L02j85P5l11L44nj45K88k46L37m66r0K2K39k17J14
7885d7K80j13j76p2K28J33k3l23K05j51J22n6K11k21J35k28j33K66L9rJ22j46
7907D3k73N45k73j74J02j99p9J51J60j37pj43K19L61j59k2l09K4K60J73Oj35l1
7930A03K50k40j11N3J34j15J59q8P9m13n4M18q6j03k14J21J14p4k16L66O4l01
7952a54J16P1J93m24j1L4M69k86j1o4N8K04k27j32J46J39J27k58n8N1j14K9K02
7975A00j72r4L12j07k43K91m64L99J36j9m18L60j9j6J55J2k29J88j99K18k02J48
7997A37k43M95n01p7N36o8j85q3m49N39l84L92k45M0K8k16K56K24k91j54M78k01
8019B8j35K33p3R8k19K0j11R1l4j25J60K81l91m7J29K92j55j65l2K5K66k17J11
$$ plain form
8042 30 16 148 -61 90 74 97 26 -14 350 20 -155 173 134 -68 -194 -47 -42 -109 -355 266 -94 117 -350
8065 -350 81 -107 -402 118 -49 -185 191 85 60 -123 -127 -31 -64 -121 -175 -28 16 259 185 -62 39 -194 319
8088 319 100 -20 -159 -267 66 -156 195 2 208 126 168 -139 -61 -163 -65 4 180 79 122 182 135 72 71 134
8112 134 27 -27 -72 106 294 -186 78 78 64 -235 -70 -43 95 232 19 -167 -90 141 -388 -138 62 11 -267
8135 -267 -175 0 -150 105 -354 -148 -133 -70 95 -35 56 19 31 -39 37 -454 28 116 50 -212 197 -100 -174 396
8159 396 -253 96 -145 123 277 -140 -9 59 -179 27 90 -110 65 -277 231 -112 30 -13 -110 15 -64 54
8181 54 -80 125 46 -120 191 207 51 -382 -65 159
$$ packed form
8042C0j4J32k09J51j6K3p1m0L64l30j75L28l9k02j26J47No7k46O21l60K11m67
8065c50M31j88k95N20j67j36L76j06k5j83mR6l3n7n4J47M4K43p4k47J01k33N13
8088C19k19j20j39j08L33k22L51j93K06q2M2l07P8j02R8O9J76j01M3O0m7o3jO3
8112A34j07n4m5J78J88m80K64%j4k99J65K7J38J37k13j86P7K31n29K50K00n1k78
8135b67R2J75j50K55m59K06J5O3J65j30R1l7J2p0P6m91M82Q8o6k62M09k97p4N70
8159C96o49L49k41K68J54m17J31O8k38K06O3k00J75l42N08l43J42m3r7J25p9J18
8181E4j34K05p9j66L11J6j56m33L17K24
8191A59
$$ Imaginary data points
##PAGE= N=2
##DATA TABLE= (X++(I..I)), XYDATA
$$ plain form
0 0 0 0 0 0 0 0 0 0 -8 5 -8 8 -8 8 -16 16 -24 24 -29 33 -40 45 -53 61 -70 80 -91 103 -118 133 -149 168
32 168 -187 209 -233 259 -288 320 -355 396 -436 481 -531 590 -655 726 -809 903 -1010 1136
50 1136 -1288 1471 -1698 1988 -2375 2920 -3737 5103 -7805 15160 -76197 -216161 10291 96990
64 96990 -104890 -191099 31408 119395 -86285 -176367 25019 96651 -108870 -189259 11081
75 11081 80886 -111670 -170633 30899 90901 -101795 -153231 41995 86109 -107811 -142390
86 -142390 64780 110020 -81070 -109767 91996 119551 -85672 -115683 88458 116619 -82103
97 -82103 -100145 112117 142424 -54732 -71957 132841 151329 -53835 -77082 118934 132886
108 132886 -66021 -78286 121307 136178 -56871 -66764 123978 127319 -65928 -70042 117375
$$ packed form
0@%%%%%%%%qJ3j3J6j6J6k4L2m0M8n3O2p3Q5r8J14j31J50j71J94k21K51k82L17
32A68l55L96m42M92n47O08o75P51q32R17j012J121j245J381j535J712j913K146
50A136k424K759l169L686m363N295o657Q840j2908K2965r1357j39964K26452Q6699
64I6990k01880q6209K22507Q7987k05680r0082K01386P1632k05521q0389K00340
75A1081O9805j92556n8963K01532O0002j92696n1436J95226M4114j93920l4579
86a42390K07170M5240j91090k8697K01763K7555k05223l0011K04141K8161j98722
97h2103j8042K12262L0307j97156j7225K04798J8488k05164k3247J96016J3952
108A32886j98907j2265J99593J4871j93049r893J90742L341j93247m114J87417
$$ plain form
119 117375 113839 -76391 -74393 109092 95473 -94199 -85222 96435 77460 -109840 -91077
130 -91077 93736 71950 -111752 -86353 97145 67263 -121224 -97773 80559 46256 -136865
141 -136865 -103760 77851 45801 -128864 -89467 87499 50046 -121674 -80565 88707 43526
152 43526 -124354 -77107 88890 39803 -121423 -66108 97445 43818 -114444 -54375 106491
163 106491 49796 -104704 -41720 114839 52466 -101969 -38173 113118 47377 -102433 -34187
174 -34187 115067 48790 -94053 -22061 122773 52691 -87307 -14922 121388 43745 -93591
185 -93591 -17729 114494 34539 -95937 -13396 116179 32694 -94556 -8663 117435 28579
196 28579 -96849 -8093 113064 19399 -103741 -12421 106255 10503 -108126 -12715 103412
$$ packed form
119A17375l536j90230J998J83485j3619j89672Q977J81657j8975j87300J8763
130i1077J84813k1786j83702K5399J83498k9882j88487K3451J78332l4303j83121
141a36865L3105J81611l2050j74665L9397J76966l7453j71720M1109J69272m5181
152D3526j67880M7247J65997m9087j61226N5315J63553n3627j58262O0069J60866
163A06491n6695j54500O2984J56559o2373j54435O3796J51291o5741j49810O8246
174c4187J49254o6277j42843P1992J44834p0082j39998P2385J36310p7643j37336
185i3591P5862J32223p9955j30476Q2541J29575q3485j27250Q5893J26098q8856
196B8579j25428Q8756J21157r3665j23140R1320J18676r5752j18629R5411J16127
$$ plain form
207 103412 6545 -108164 -9471 103170 3800 -107418 -9343 97044 -4934 -112076 -12648
218 -12648 89278 -12325 -112435 -9319 88861 -14162 -108000 -2679 89458 -17029 -106397
229 -106397 92 86020 -23055 -107495 2467 85504 -24554 -104317 8711 88500 -22748
240 -22748 -98767 15675 91788 -20324 -93789 19370 91378 -20965 -90032 22092 90649
251 90649 -19937 -83866 28616 92290 -17616 -76027 36399 92748 -18965 -72509 39912
262 39912 89940 -23720 -72186 42283 88950 -26158 -70569 45817 88876 -28561 -70454
273 -70454 46567 86109 -33064 -72462 44724 80942 -38175 -74351 42781 75287 -42393
284 -42393 -74063 41775 70893 -45473 -73253 41383 65162 -50313 -73718 40450 59606
$$ packed form
207A03412r6867j14709R8693J12641r9370j11218R8075J06387j01978j07142R9428
218a2648J01926j01603j00110J03116R8180j03023r3838J05321R2137j06487q9368
229a06397J06489Q5928j09075q4440J09962Q3037j10058p9763J13028P9789j11248
240b2748p6019J14442P6113j12112p3465J13159P2008j12343o9067J12124O8557
251I0649j10586o3929J12482O3674j09906n8411J12426N6349j11713n3544J12421
262C9912N0028j13660m8466J14469M6667j15108m4411J16386M3059j17437m1893
273g0454J17021L9542j19173l9398J17186L6218j19117l6176J17132L2506j17680
284d2393l1670J15838K9118j16366k7780J14636K3779j15475k3405J14168J9156
$$ plain form
295 59606 -55516 -73158 41456 55870 -58054 -70376 43567 54408 -59480 -67488 46509
306 46509 52783 -60768 -65073 48950 52398 -60338 -61857 52219 52936 -59066 -57894 54790
318 54790 53407 -56833 -53209 57001 53084 -54900 -48884 58086 51279 -53948 -43889 59730
330 59730 48935 -52490 -39063 62428 46650 -53834 -36006 64052 43780 -56174 -34061
341 -34061 65610 41492 -58436 -32792 66616 39201 -60405 -32727 66597 37122 -61874 -32554
353 -32554 65128 34690 -62667 -31779 63704 31294 -63025 -30379 62340 27585 -63623 -27661
365 -27661 61966 23759 -64685 -25381 61383 19898 -66422 -23060 61970 17106 -67346 -21029
377 -21029 62654 14318 -68177 -19127 62619 12846 -68384 -18038 62461 11176 -68551 -16419
$$ packed form
295E9606j15122j7642J14614J4414j13924j2322J13943J0841j13888q008J13997
306D6509O274j13551m305J14023L448j12736j519J14076P17j12002J172J12684
318E4790j383j10240L624J10210l917j07984O016J06970o807j05227J0059J03619
330E9730j0795j01425J3427J01491j5778j00484J7828J00058k0272r9954K2113
341c4061R9671k4118r9928K5644R9408k7415r9606K7678R9324k9475r8996K9320
353c2554R7682l0438r7357L0888R5483l2410r4319L2646R2719l4755r1208L5962
365b7661Q9627l8207q8444L9304Q6764m1485q6320M3362Q5030m4864q4452M6317
377b1029Q3683m8336q2495M9050Q1746m9773q1230N0346Q0499n1285p9727N2132
$$ plain form
389 -16419 62873 10004 -67430 -14374 62128 8560 -65992 -11606 61852 7518 -63847 -8698
401 -8698 61310 6056 -62097 -5270 61411 4135 -59955 -1048 61982 2837 -58564 2698
413 2698 63088 1358 -57720 5894 64411 404 -57316 8005 64995 -405 -57366 8882
425 8882 64832 -1659 -56760 10208 63988 -3027 -55917 10637 61596 -5856 -55977 10848
437 10848 58310 -9545 -56250 11566 55501 -13756 -56430 12686 53831 -17578 -57496 13814
449 13814 51757 -21151 -59315 13509 50072 -24057 -59929 14689 49544 -24809 -58924 16135
461 16135 49366 -25273 -56825 17633 48476 -25230 -55290 19018 47423 -25477 -51440 22088
473 22088 48014 -24060 -47496 26003 48668 -23746 -44089 28833 48332 -24381 -41850 31271
$$ packed form
389a6419P9292n2869p7434N3056P6502n3568p4552N4386P3458n4334p1365N5149
401h698P0008n5254o8153N6827O6681n7276o4090N8907O3030n9145o1401O1262
413B698O0390o1730n9078O3614N8517o4007n7720O5321N6990o5400n6961O6248
425H882N5950o6491n5101O6968N3780o7015n2890O6554N0959o7452n0121O6825
437A0848M7462o7855m6705O7816M3935o9257m2674O9116M1145p1409l9918P1310
449A3814L7943p2908l8164P2824L6563p4129l5872P4618L4855p4353l4115P5059
461A6135L3231p4639l1552P4458L0843p3706l0060P4308K8405p2900k5963P3528
473B2088K5926p2074k3436P3499K2665p2414k0343P2922J9499p2713j7469P3121
$$ plain form
485 31271 48007 -25054 -39799 33772 48557 -24979 -37428 35868 48132 -26365 -37489 35764
497 35764 45584 -28583 -38589 34328 43156 -30704 -38838 34777 41392 -31474 -37716 33883 38316
510 38316 -34049 -38457 32275 33744 -37567 -38652 31947 30694 -39540 -37096 33141 29526 -40027
523 -40027 -35347 35373 29015 -41816 -35041 35427 27458 -43145 -34101 36478 27629 -41464 -31395
536 -31395 38630 28796 -39243 -27816 39668 27775 -38674 -25871 39571 25744 -39010 -23780
548 -23780 40453 24802 -38099 -20672 42935 24944 -37349 -18227 43723 22927 -39087 -18653
560 -18653 42074 19854 -41167 -18650 41870 19280 -41144 -16741 42422 18781 -40126 -15462
572 -15462 41604 15992 -41647 -16211 39398 12787 -42587 -15450 39479 11937 -40940 -11930
$$ packed form
485C1271J6736p3061j4745P3571J4785p3536j2449P3296J2264p4497j1124P3253
497C5764R820p4167j0006P2917Q828p3860q134P3615O615p2866o242P1599M433
510C8316p2365m408P0732J469p1311j085P0599j253p0234K444P0237l615o9553
523d0027M680P0720o358p0831O775P0468p969p0603R044P0579q849o9093J0069
536c1395P0025r834o8039J1427O7484j1893o6449J2803O5442j3827o4754J5230
548b3780O4233j5651o2901J7427O3607j7991o2293J9122O1950k0796o2014K0434
560a8653O0727k2220o1021K2517O0520k2590o0424K4403N9163k3641n8907K4664
572a5462N7066k5612n7639K5436N5609k6611n5374K7137N4929k7542n2877K9010
$$ plain form
584 -11930 41088 12197 -39890 -9819 41543 9715 -41278 -9564 40675 7832 -41887 -7981
596 -7981 41934 7981 -40152 -4756 44258 8689 -39399 -3583 43484 6316 -41186 -4560
608 -4560 40948 3907 -41255 -3723 40792 4126 -39237 -1552 41094 2849 -38049 -722
620 -722 38319 -1731 -40282 -1329 35681 -4620 -40909 430 36113 -5283 -39416 3137
632 3137 37272 -5705 -39773 3062 36076 -7763 -41166 1996 35211 -7819 -39523 4131
644 4131 36360 -5701 -35396 7065 36890 -5024 -33460 8340 35181 -7279 -33506 9363
656 9363 34276 -8353 -31162 12403 35735 -7624 -28220 15897 36654 -8409 -28832 16182
668 16182 34773 -11523 -30474 15155 33410 -12667 -30177 16456 33627 -12434 -29253 17241
$$ packed form
584a1930N3018k8891n2087L0071N1362l1828n0993L1714N0239l2843m9719L3906
596g981M9915l3953m8133L5396M9014l5569m8088L5816M7067l7168m7502L6626
608d560M5508l7041m5162L7532M4515l6666m3363L7685M2646l8245m0898L7327
620g22L9041m0050l8551L8953L7010m0301l6289M1339L5683m1396l4133M2553
632C137L4135m2977l4068M2835L3014m3839l3403M3162L3215m3030l1704M3654
644D131L2229m2061k9695M2461K9825m1914k8436M1800K6841m2460k6227M2869
656I363K4913m2629k2809M3565K3332m3359k0596M4117K0757m5063k0423M5014
668A6182J8591m6296j8951M5629J8255m6077j7510M6633J7171m6061j6819M6494
$$ plain form
680 17241 33008 -13925 -30398 14760 28925 -17424 -31692 13075 26226 -18237 -30038 14379
692 14379 26124 -17925 -27995 16040 24516 -19874 -27883 15245 21627 -22702 -28533 15865 21052
705 21052 -23391 -26259 18849 23029 -21561 -24396 20811 23318 -22264 -24540 20002 21945 -22333
718 -22333 -24150 20190 22082 -20474 -21111 22125 22855 -18231 -17557 23282 21793 -19139 -17010 22713
732 22713 19156 -20826 -15914 23691 18585 -20224 -13575 26505 18933 -20461 -12447 27213 18140
745 18140 -22405 -13819 25564 15835 -24109 -13815 25712 15707 -23160 -12436 26444 15412
757 15412 -22996 -12198 25259 13207 -24095 -12728 23182 10099 -26059 -12250 23175 9075
769 9075 -25502 -10400 23870 8078 -25630 -9737 23284 6076 -27341 -10118 22139 3853
$$ packed form
680A7241J5767m6933j6473M5158J4165m6349j4268M4767J3151m4463j1801M4417
692A4379J1745m4049j0070M4035Q476m4390q009M3128O382m4329n831M4398N187
705B1052m4443k868M5108M180m4590k835M5207K507m5582k276M4542J943m4278
718b2333j817M4340J892m2556o37M3236P30m1086O74M0839j489m0932K129L9723
732B2713l557l9982M912L9605n106l8809O649M0080p572l9394Q014L9660r073
745A8140m0545Q586L9383r729l9944J0294L9527j0005l8867J0724L8880j1032
757A5412l8408J0798L7457j2052l7302J1367L5910j3083l6158J3809L5425j4100
769I075l4577J5102L4270j5792l3708J5893L3021j7208l3417J7223L2257j8286
$$ plain form
781 3853 -28558 -9321 22990 3899 -27687 -7666 24280 4441 -27129 -7043 23738 3759
793 3759 -27349 -6991 23404 3250 -25861 -4966 24747 3796 -23476 -2124 25265 3855
805 3855 -22180 150 25402 3059 -22287 1103 26097 2191 -21600 3056 27416 2919
817 2919 -20742 4652 28302 2529 -20638 4368 27251 896 -21839 3686 26000 -94
829 -94 -21768 4120 24794 -1083 -21412 4177 23657 -3324 -22879 3599 21317 -6434 -24243
842 -24243 3176 19435 -8936 -25204 3370 19085 -9362 -25037 3939 18647 -10888 -25428
854 -25428 3657 18038 -11645 -25485 4175 17837 -10920 -23817 5813 18658 -10101 -21323
866 -21323 8026 19120 -9104 -19816 9646 19260 -8951 -18031 10884 19800 -8379 -16076 13146
$$ packed form
781C853l2411J9237L2311j9091l1586K0021L1946j9839l1570K0086L0781j9979
793C759l1108K0358L0395k0154k9111K0895K9713k0951k7272K1352K7389k1410
805C855k6035K2330K5252k2343k5346K3390K4994k3906k3791K4656K4360k4497
817B919k3661K5394K3650k5773k3167K5006K2883k6355k2735K5525K2314k6094
829i4k1674K5888K0674k5877k0329K5589J9480k6981j9555K6478J7718k7751j7809
842b4243K7419J6259k8371j6268K8574J5715k8447j5675K8976J4708k9535j4540
854b5428K9085J4381k9683j3840K9660J3662k8757j2897K9630J2845k8759j1222
866b1323K9349J1094k8224j0712K9462R614k8211r080K8915Q916k8179p697K9222
$$ plain form
879 13146 20706 -7715 -14068 14793 20766 -8602 -14164 15554 20453 -9340 -14162 15710 19921
892 19921 -10171 -14213 15628 19269 -10758 -14907 14683 17674 -11986 -15494 13403 15320 -13709
905 -13709 -15639 12318 13062 -14943 -15174 12166 11162 -16451 -15022 12609 10221 -17906 -15092 12947
919 12947 9316 -18982 -14651 13892 9541 -18991 -14441 14508 10065 -18259 -13407 15286 10602
932 10602 -17489 -12122 15672 10440 -16309 -10863 16046 10805 -15409 -8836 17144 10177 -15058
945 -15058 -7440 17623 9738 -14502 -6236 18020 8845 -15317 -5445 18876 8630 -15992 -4660
958 -4660 19111 7565 -16622 -5136 18792 7041 -17403 -5441 18679 6746 -17659 -5530
970 -5530 17895 5480 -17959 -5400 17393 4803 -18295 -5462 16945 3549 -17442 -4647
$$ packed form
879A3146P560k8421o353K8861N973k9368n562K9718M899k9793m822K9872M211
892A9921l0092m042K9841L641l0027m149K9590K991k9660l508K8897J917k9029
905a3709j930K7957P44k8005k31K7340j004k7613J429K7631k388k8127K814K8039
919A2947l631k8298M331K8543m351k8532M550K8949m443k8324M852K8693m684
932A0602k8091N367K7794n232k6749N446K6909n241k6214O573K5980o967k5235
945a5058P618K5063p885k4240Q266K4256r175k4162R872K4321j0246k4622J1332
958d660K3771j1546k4187J1486K3928j1751k4444J1962K4120j1933k4405J2129
970e530K3425j2415k3439J2559K2793j2590k3098J2833K2407j3396k0991J2795
$$ plain form
982 -4647 16130 2636 -17540 -3465 16616 1646 -17898 -2322 16486 708 -18067 -1275
994 -1275 17382 -175 -18217 -678 17969 -185 -18695 -701 17937 -580 -18873 -652
1006 -652 17419 -243 -18100 -415 16923 -821 -17502 51 16434 -1442 -17029 1128
1018 1128 15484 -2085 -16370 2045 15954 -3005 -16111 3166 15778 -3521 -15894 3807
1030 3807 16422 -3565 -15595 4931 16880 -3709 -15171 5477 17278 -3546 -15005 6075
1042 6075 17078 -3390 -14216 5960 16517 -3811 -13855 6563 15739 -4257 -13350 6442
1054 6442 15222 -5172 -13522 6641 13984 -6624 -13679 6536 13040 -7828 -14027 6502 12068
1067 12068 -8989 -14431 7005 11922 -9828 -15112 6868 11112 -10900 -15291 6468 10850 -10920
$$ packed form
982d647K0777j3494k0176J4075K0081j4970j9544J5576J8808j5778j8775J6792
994a275J8657j7557j8042J7539J8647j8154j8510J7994J8638j8517j8293J8221
1006f52J8071j7662j7857J7685J7338j7744j6681J7553J6383j7876j5587J8157
1018A128J4356j7569j4285J8415J3909j8959j3106J9277J2612j9299j2373J9701
1030C807J2615j9987j2030K0526J1949k0589j1462K0648J1801k0824j1459K1080
1042F075J1003k0468j0826K0176J0557k0328j0044K0418R176j9996r093J9792
1054F442Q780k0394q350K0163P343k0608p055K0215O504k0868o199K0529N566
1067A2068k1057n442K1436M917k1750n284K1980M244k2012m391K1759M382k1770
$$ plain form
1080 -10920 -14741 7036 11391 -10226 -13878 7392 10708 -9781 -12676 7927 10698 -9730 -11157
1093 -11157 9335 10286 -9273 -9469 10986 10990 -8888 -8071 12315 11233 -8851 -7052 13060 11728
1107 11728 -9044 -7159 13621 11151 -9048 -7191 12850 11062 -8890 -6532 12543 10194 -9419
1120 -9419 -6910 11647 8418 -10679 -7446 10903 6840 -11541 -7297 10687 5576 -12228 -7323
1133 -7323 10123 4163 -13861 -7793 9669 3227 -14431 -7837 9574 2917 -14801 -7212 10447
1146 10447 3044 -14214 -6131 10767 3358 -13567 -5811 11147 3148 -12940 -4662 12006 3837
1159 3837 -11553 -2989 13001 4104 -10454 -1323 13324 3876 -10210 -396 13472 3211 -10357
1172 -10357 394 13671 2608 -10154 1016 14182 2566 -10843 1036 13769 1724 -11500
$$ packed form
1080a0920l821K1777M355k1617l652K1270L316k0489k895K0603K771k0428j427
1093a1157K0492R51j9559j96K0455Mj9878Q17K0386j082k0084J799K0112j332
1107A1728k0772J885K0780k470k0199J857K0041j788j9952K358J9075k349j9613
1120i419K509J8557l229j9097L233J8349m063j8381M244J7984n111j7804M905
1133g323J7446n960j8024O068J7462o442j7658O594J7411o657j7718P589J7659
1146A0447p403j7258Q083J6898p409j6925P756J6958p999j6088Q278J6668q169
1159C837j5390Q564J5990q897j4558R131J4647r448j4086R814J3868j0261j3568
1172a0357J0751J3277j1063j2762J1170J3166j1616j3409J1879J2733j2045j3224
$$ plain form
1184 -11500 233 12979 823 -12192 -222 12050 532 -11713 -347 11331 -551 -11813
1196 -11813 -569 10210 -1854 -12286 -53 9296 -2947 -12401 660 9585 -3574 -12107 1682
1209 1682 10158 -3902 -11899 1842 10317 -4061 -12381 2254 10440 -3985 -11945 2712 11116
1222 11116 -3210 -10707 3845 11308 -2728 -10350 3834 10532 -3656 -9737 4101 10178 -4110
1235 -4110 -9474 5027 9859 -4314 -9031 5776 9789 -5116 -8363 6052 9141 -5985 -9316
1248 -9316 6385 9267 -6625 -9412 6654 9751 -5964 -8848 7051 8950 -6478 -8843 6824
1261 6824 8699 -6780 -8899 6412 8321 -6532 -7725 7238 8164 -6433 -6915 7349 7755 -6712
1275 -6712 -6474 7385 6539 -7809 -6920 7648 6434 -8482 -6397 8460 6392 -8560 -6572 8626
$$ packed form
1184a1500J1733J2746j2156j3015J1970J2272j1518j2245J1366J1678j1882j1262
1196a1813J1244J0779j2064j0432J2233R349j2243r454J3061Q925j3159q533J3789
1209A682Q476j4060p997J3741Q475j4378q320J4635Q186j4425p960J4657Q404
1222A1116j4326p497J4552P463j4036p622J4184O698j4188o081J3838O077j4288
1235d110n364J4501M832j4173m717J4807M013j4905l247J4415L089j5126l331
1248i316J5701K882j5892k787J6066L097j5715k884J5899J899j5428k365J5667
1261F824J875j5479k119J5311J909j4853j193J4963R26j4597m82J4264M06j4467
1275f712K38J3859q46j4348Q89J4568j214j4916K085J4857k068j4952J988J5198
$$ plain form
1289 8626 6263 -9248 -7221 8090 5558 -9776 -7382 7596 4977 -9449 -6591 7702 5036
1302 5036 -8744 -5735 7810 4178 -9247 -5242 7741 3314 -9814 -4736 8802 3329 -9399
1315 -9399 -3426 9935 3782 -9260 -2396 10609 4023 -9280 -2460 10471 3739 -9329 -2084
1328 -2084 11127 4327 -8692 -1539 11544 4843 -8033 -1070 10999 3898 -8631 -1576 10419
1341 10419 3029 -8896 -1419 9829 1956 -8687 -889 9676 1177 -9721 -719 9122 87
1354 87 -10660 -1476 8688 -1308 -11754 -1543 8712 -1541 -11930 -1086 9199 -1492 -11800
1367 -11800 -990 8998 -1617 -11622 -1416 8374 -1403 -10455 -501 9021 -877 -9577 1002
1380 1002 9547 -983 -8620 2062 9786 -1169 -8086 2892 9814 -1722 -8447 3535 10867
$$ packed form
1289H626k363j5511K027J5311k532j5334K394J4978k619j4426K858J4293k666
1302E036j3780L009J3545l632j3425M005J2983m427j3128N078J3538n473j2728
1315i399N973J3361o153j3042O864J3005o586j3303O820J2931o732j3068P245
1328b084J3211o800j3019P153J3083o701j2876O963J2069p101j2529P055J1995
1341A0419p390j1925P477J1248p873j0643P798J0565q499j0898R002R841r035
1354H7j0747R184J0164r996j0446J0211J0255j0253j0389J0844J0285j0691j0308
1367a1800J0810R988j0615j0005J0206R790r777r052R954R522r898q700J0579
1380A002Q545j0530p637J0682P724j0955o917J0978O922j1536o725J1982P332
$$ plain form
1393 10867 -1546 -7735 4577 11077 -1775 -8199 4482 10804 -2303 -8555 3891 10101 -2756
1406 -2756 -8722 3980 9626 -2616 -8395 3826 8757 -3595 -8777 3492 7750 -4860 -9095
1419 -9095 2996 7289 -5335 -8837 3934 7340 -5732 -8497 4264 6858 -6131 -8798 4503
1432 4503 6997 -6450 -8617 4968 7414 -6238 -8239 5718 7558 -5544 -7607 6168 7818
1445 7818 -5704 -7171 6074 7553 -5438 -6547 6527 7349 -5635 -5842 7183 7203 -5571 -5132
1459 -5132 7625 6746 -6374 -5754 7592 6201 -6789 -5622 7515 6136 -7330 -5854 7700 5697
1473 5697 -7385 -6089 7522 5702 -8130 -5684 7278 4887 -7871 -5459 7375 4700 -7853
1486 -7853 -4786 7497 4441 -7797 -4168 8024 4196 -8027 -4007 8223 3810 -8177 -3525
$$ packed form
1393A0867j2413o189J2312O500j2852o424J2681O322j3107o252J2446O210j2857
1406b756n966J2702N646j2242n779J2221M931j2352n182J2269M258j2610m235
1419i095J2091M293j2624l502J2771L406j3072k765J2761K594j2989k667J3301
1432D503K494j3447k167J3585K446j3652k001J3957J840j3102k063J3775J650
1445G818j3522j467J3245J479j2991j109J3074Q22j2984k07J3025K0j2774M39
1459e132J2757q79j3120O20J3346j391j2990J167J3137j379j3466J476J3554k003
1473E697j3082J296J3611j820j3832K446J2962k391j2758K412J2834k675j2553
1486g853L067J2283l056j2238L629J2192l828j2223M020J2230m413j1987M652
$$ plain form
1499 -3525 8423 3815 -8376 -3155 9165 4022 -8036 -2887 9001 3707 -8048 -3139 8999
1512 8999 3729 -8439 -3109 8601 3042 -8247 -2810 8346 2389 -8517 -2422 7905 1563
$$ packed form
1499c525J1948m608j2191N221J2320n143j2058N149J1888n294j1755M909J2138
1512H999n270j2168N330J1710n559j1289N437J1156n957j0906O095J0327o342
$$ [...]
8191a6
##END NTUPLES=NMR FID
##END=
