##TITLE=1H_LR-679-MC2-2
 CDCl3, 8 sc, 
 1.7.2019
##JCAMPDX= 6.0         $$ Bruker NMR JCAMP-DX V2.0
##DATA TYPE= NMR FID
##DATA CLASS= NTUPLES
##ORIGIN= UXNMR, Bruker Analytische Messtechnik GmbH
##OWNER= root
$$ XWIN-NMR		Version 3.5
$$ Mon Jul  1 14:42:01 2019 Russian Standard Time (UT+4h)  she@DPX200
##.OBSERVE FREQUENCY= 200.13155
##.OBSERVE NUCLEUS= ^1H
##.DELAY= (6, 6)
##.ACQUISITION MODE= SIMULTANEOUS
##.ACQUISITION SCHEME= undefined
##.AVERAGES= 8
##.DIGITISER RES= 18
##SPECTROMETER/DATA SYSTEM= spect
##.PULSE SEQUENCE= zg30
##.SOLVENT NAME= CDCl3
##.SHIFT REFERENCE= (INTERNAL, CDCl3, 0, 15.7039)
##AUDIT TRAIL= $$ (NUMBER, WHEN, WHO, WHERE, WHAT)
$$ ##TITLE= Audit trail, XWIN-NMR		Version 3.5
$$ ##JCAMPDX= 5.01
$$ ##ORIGIN= Bruker BioSpin GmbH
$$ ##OWNER= she
$$ F:/spectra/data/she/nmr/H-F/1/audita.txt
$$ ##AUDIT TRAIL=  $$ (NUMBER, WHEN, WHO, WHERE, WHAT)
(   1,<2019-07-01 14:41:02.71 +0400>,<she>,<DPX200>,
      <created by zg, POWCHK disabled, PULCHK disabled
       configuration hash MD5:
       00 E9 B6 7A A2 85 ED C7 34 08 36 98 17 FE 4E 26
       data hash MD5: 16K
       CB AE 22 B8 A5 E9 13 74 01 0E 10 BA 7D 48 E0 BF>)
$$ ##END=
$$ 
$$ hash MD5
$$ E9 DA 80 81 3A 50 51 80 1C 2E D7 8C DD 58 A2 F8
##$RELAX= 
##$RELAX= 
##$RELAX= 
##$RELAX= 
##$RELAX= 
##$RELAX= 
$$ Bruker specific parameters
$$ --------------------------
##$DU= <F:/spectra>
##$EXPNO= 1
##$NAME= <H-F>
##$PROCNO= 1
##$TYPE= <nmr>
##$USER= <she>
##$AMP= (0..31)
100 100 100 100 100 100 100 100 100 100 100 100 100 100 100 100 100 100 
100 100 100 100 100 100 100 100 100 100 100 100 100 100 
##$AQSEQ= 0
##$AQ_mod= 1
##$AUNM= <au_zg>
##$AUTOPOS= <>
##$BF1= 200.13
##$BF2= 200.13
##$BF3= 200.13
##$BF4= 200.13
##$BF5= 200.13
##$BF6= 200.13
##$BF7= 200.13
##$BF8= 200.13
##$BYTORDA= 1
##$CFDGTYP= 0
##$CFRGTYP= 5
##$CHEMSTR= <none>
##$CNST= (0..31)
1 1 145 1 1 1 1 1 1 1 1 1 1 1 1 1 1 1 1 1 1 1 1 1 1 1 1 1 1 1 1 1 
##$CPDPRG= <>
##$CPDPRG1= <>
##$CPDPRG2= <>
##$CPDPRG3= <>
##$CPDPRG4= <mlev>
##$CPDPRG5= <mlev>
##$CPDPRG6= <mlev>
##$CPDPRG7= <mlev>
##$CPDPRG8= <mlev>
##$CPDPRGB= <>
##$CPDPRGT= <>
##$D= (0..31)
0 1.2 0 0 0 0 0 0 0 0 0 0.03 0 0 0 0 0 0 0 0 0 0 0 0 0 0 0 0 0 0 0 0 
##$DATE= 1561977662
##$DBL= (0..7)
120 120 120 120 120 120 120 120 
##$DBP= (0..7)
150 150 150 150 150 150 150 150 
##$DBP07= 0
##$DBPNAM0= <>
##$DBPNAM1= <>
##$DBPNAM2= <>
##$DBPNAM3= <>
##$DBPNAM4= <>
##$DBPNAM5= <>
##$DBPNAM6= <>
##$DBPNAM7= <>
##$DBPOAL= (0..7)
0.5 0.5 0.5 0.5 0.5 0.5 0.5 0.5 
##$DBPOFFS= (0..7)
0 0 0 0 0 0 0 0 
##$DE= 6
##$DECBNUC= <off>
##$DECIM= 24
##$DECNUC= <off>
##$DECSTAT= 4
##$DIGMOD= 1
##$DIGTYP= 9
##$DL= (0..7)
0 120 120 120 120 120 120 120 
##$DP= (0..7)
150 150 150 150 150 150 150 150 
##$DP07= 0
##$DPNAME0= <>
##$DPNAME1= <>
##$DPNAME2= <>
##$DPNAME3= <>
##$DPNAME4= <>
##$DPNAME5= <>
##$DPNAME6= <>
##$DPNAME7= <>
##$DPOAL= (0..7)
0.5 0.5 0.5 0.5 0.5 0.5 0.5 0.5 
##$DPOFFS= (0..7)
0 0 0 0 0 0 0 0 
##$DQDMODE= 0
##$DR= 18
##$DS= 0
##$DSLIST= <SSSSSSSSSSSSSSS>
##$DSPFIRM= 0
$$ [...]
##$SUBNAM2= <"">
##$SUBNAM3= <"">
##$SUBNAM4= <"">
##$SUBNAM5= <"">
##$SUBNAM6= <"">
##$SUBNAM7= <"">
##$SUBNAM8= <"">
##$SUBNAM9= <"">
##$SW= 24.9336996594482
##$SWIBOX= (0..15)
0 0 2 0 0 0 0 0 0 0 0 0 0 0 0 0 
##$SW_h= 4990.01996007984
##$TD= 16384
##$TD0= 1
##$TE= 0
##$TE2= 300
##$TE3= 300
##$TEG= 300
##$TL= (0..7)
0 120 120 120 120 120 120 120 
##$TP= (0..7)
150 150 150 150 150 150 150 150 
##$TP07= 0
##$TPNAME0= <>
##$TPNAME1= <>
##$TPNAME2= <>
##$TPNAME3= <>
##$TPNAME4= <>
##$TPNAME5= <>
##$TPNAME6= <>
##$TPNAME7= <>
##$TPOAL= (0..7)
0.5 0.5 0.5 0.5 0.5 0.5 0.5 0.5 
##$TPOFFS= (0..7)
0 0 0 0 0 0 0 0 
##$TUNHIN= 0
##$TUNHOUT= 0
##$TUNXOUT= 0
##$USERA1= <user>
##$USERA2= <user>
##$USERA3= <user>
##$USERA4= <user>
##$USERA5= <user>
##$V9= 5
##$VALIST= <valist>
##$VCLIST= <CCCCCCCCCCCCCCC>
##$VD= 0
##$VDLIST= <DDDDDDDDDDDDDDD>
##$VPLIST= <PPPPPPPPPPPPPPP>
##$VTLIST= <TTTTTTTTTTTTTTT>
##$WBST= 1024
##$WBSW= 4
##$XGAIN= (0..3)
0 0 0 0 
##$XL= 0
##$YL= 0
##$YMAX_a= 91941
##$YMIN_a= -84205
##$ZGOPTNS= <>
##$ZL1= 120
##$ZL2= 120
##$ZL3= 120
##$ZL4= 120
##$ABSF1= 10
##$ABSF2= 0
##$ABSG= 5
##$ABSL= 3
##$ALPHA= 0
##$AQORDER= 0
##$ASSFAC= 0
##$ASSFACI= 0
##$ASSFACX= 0
##$ASSWID= 0
##$AUNMP= <proc_1d>
##$AZFE= 0.1
##$AZFW= 0.1
##$BCFW= 1
##$BC_mod= 2
##$BYTORDP= 1
##$COROFFS= 0
##$CY= 11.3945322036743
##$DATMOD= 1
##$DC= 2
##$DFILT= <>
##$DTYPP= 0
##$F1P= 18.9103706918063
##$F2P= -1.10871071338519
##$FCOR= 0.5
##$FTSIZE= 0
##$FT_mod= 4
##$GAMMA= 1
##$GB= 0.15
##$INTBC= 1
##$INTSCL= 1
##$ISEN= 128
##$LB= 0.24
##$LEV0= 0
##$LPBIN= 0
##$MAXI= 10000
##$MC2= 0
##$MEAN= 0
##$ME_mod= 0
##$MI= 1.114404
##$NCOEF= 0
##$NC_proc= 0
##$NLEV= 6
##$NOISF1= 3.799351
##$NOISF2= 2.8
##$NSP= 1
##$NTH_PI= 0
##$NZP= 0
##$OFFSET= 15.70392
##$PC= 1
##$PHC0= -8657.22
##$PHC1= 12.60097
##$PH_mod= 1
##$PKNL= yes
##$PPARMOD= 0
##$PSCAL= 0
##$PSIGN= 0
##$REVERSE= no
##$SF= 200.130013532006
##$SI= 16384
##$SIGF1= 3
##$SIGF2= 2
##$SINO= 400
##$SIOLD= 16384
##$SREGLST= <1H.CDCl3>
##$SSB= 0
##$STSI= 0
##$STSR= 0
##$SW_p= 3612.71676300578
##$SYMM= 0
##$S_DEV= 0
##$TDeff= 0
##$TDoff= 0
##$TI= <>
##$TILT= no
##$TM1= 0
##$TM2= 0
##$TOPLEV= 0
##$USERP1= <user>
##$USERP2= <user>
##$USERP3= <user>
##$USERP4= <user>
##$USERP5= <user>
##$WDW= 1
##$XDIM= 8192
##$YMAX_p= 0
##$YMIN_p= 0
$$ End of Bruker specific parameters
$$ ---------------------------------
##NTUPLES= NMR FID
##VAR_NAME=  TIME,          FID/REAL,        FID/IMAG
##SYMBOL=    X,             R,               I
##VAR_TYPE=  INDEPENDENT,   DEPENDENT,       DEPENDENT
##VAR_FORM=  AFFN,          ASDF,            ASDF
##VAR_DIM=   8192,          8192,            8192
##UNITS=     SECONDS,       ARBITRARY UNITS, ARBITRARY UNITS
##FACTOR=    0.0002004,     1,               1
##FIRST=     0,             0,               0
##LAST=      1.6414764,     0,               0
##MIN=       0,             -84205,          0
##MAX=       1.6414764,     91941,           0
$$ Real data points
##PAGE= N=1
##DATA TABLE= (X++(R..R)), XYDATA
$$ [...]
$$ plain form
1886 2470 -1376 -2111 1581 2382 -1558 -2089 1672 2153 -1589 -2121 1630 2071 -1746 -2097 1515 1874 -1879
1903 -1879 -2299 1435 1677 -1964 -2178 1634 1725 -2151 -2204 1679 1502 -2285 -2100 1694 1454 -2244 -1887 1852
1921 1852 1572 -2204 -1754 1790 1498 -2188 -1656 2022 1498 -2153 -1287 2318 1467 -1974 -1161 2522 1703
1938 1703 -2000 -1039 2531 1679 -2124 -932 2670 1551 -1972 -1062 2669 1726 -2095 -924 2661 1443
1954 1443 -2249 -1025 2575 1201 -2431 -1083 2439 1063 -2517 -1010 2299 747 -2666 -1113 2185
1969 2185 545 -2817 -1225 2119 403 -2816 -1156 2208 310 -2918 -1077 2232 400 -2808 -959
1984 -959 2241 341 -2660 -721 2368 347 -2629 -514 2455 514 -2314 -432 2574 452 -2193
1999 -2193 -100 2805 519 -2210 100 2730 501 -2172 116 2759 471 -2113 357 2870 358
$$ packed form
1886B470l846p35L692Q01l940n31L761M81l742n32L751M41l817l51L612L59l753
1903a879m20L734K42l641k14L812R1l876n3L883j77l787J85L794k40l698L57L739
1921A852k80l776M50L544k92l686N32L678n24l651Q66L605q51l441Q13L683q19
1938A703l703R61L570q52l803J192L602j119l523R10L731r43l821J171L585j218
1954A443l692J224L600j374l632J348L522j376l580J507L309j552l413J553L298
1969B185j640l362J592L344j716l219J660L364j898l228J841L309j832l208J849
1984i59L200j900l001J939L089k021k976K115K969j941k828J882L006k122k645
1999b193K093K905k286k729K310K630k229k673K288K643k288k584K470K513k512
$$ plain form
2014 358 -2202 373 2740 109 -2298 267 2633 -83 -2459 178 2399 -135 -2557 149 2391
2029 2391 -432 -2680 169 2232 -666 -2658 195 2198 -699 -2684 134 2203 -822 -2655 263
2044 263 2233 -792 -2529 486 2308 -774 -2504 579 2229 -842 -2412 474 2310 -706 -2302
2059 -2302 804 2400 -649 -2208 884 2336 -692 -2116 970 2248 -643 -2052 1155 2291 -913
2074 -913 -1981 1217 2297 -871 -1951 1160 2259 -891 -2000 1061 2036 -1167 -2075 1235 2064 -1128
2090 -1128 -1985 1274 1988 -1296 -1992 1242 1795 -1333 -1939 1300 1832 -1485 -1848 1263 1756 -1436 -1843
2107 -1843 1411 1557 -1462 -1659 1551 1610 -1588 -1584 1644 1575 -1658 -1680 1690 1508 -1615 -1556 1619 1528 -1633
2126 -1633 -1569 1710 1500 -1769 -1437 1725 1423 -1834 -1397 1705 1251 -1815 -1266 1720 1241 -1836 -1176
$$ packed form
2014C58k560K575K367k631k407K565K366k716k376K637K221k534k422K706K242
2029B391k823k248K849K063k898j992K853K003k897j985K818K069l025j833K918
2044B63J970l025j737L015J822l082j730L083J650l071j570K886J836l016j596
2059b302L106J596l049j559L092J452l028j424L086J278k891j409L207J136l204
2074i13j068L198J080l168j080L111J099l150j109L061R75l203r08L310Q29l192
2090a128q57L259P14l284o96L234N53l128o06L239N32l317l63L111M93l192m07
2107a843L254J46l019j97L210N9l198ML228o9l233k2L370j82l123N9L175r1l161
2126a633O4L279k10l269L32L162l02l257M37L102m54l066N49K986m79l077O60
$$ plain form
2143 -1176 1768 1089 -2021 -1203 1953 1036 -1803 -1162 1868 1066 -1836 -1032 1892 1168 -1851 -860 2077
2160 2077 1134 -1888 -811 2026 964 -1846 -859 2046 943 -1900 -708 2002 794 -1767 -736
2175 -736 2034 751 -1987 -651 1989 683 -2101 -562 2035 618 -1969 -581 2095 425 -2090
2190 -2090 -611 1914 324 -2095 -399 2095 280 -2137 -570 1898 282 -2219 -259 1924 127
2205 127 -2182 -350 2013 120 -2094 -186 1989 105 -1887 -51 2046 9 -2016 69 2165
2220 2165 225 -1945 189 2058 -8 -1833 230 2052 -20 -1934 164 2227 -80 -1942 286
2235 286 2118 -197 -1869 369 2064 -334 -2028 342 2034 -377 -1925 281 1814 -494 -2083
2250 -2083 194 1858 -427 -1974 357 1747 -578 -1987 367 1738 -702 -2011 446 1796 -674
$$ packed form
2143a176K944o79l110Q18L156r17k839O41L030q02k902Q04K924p24l019R91K937
2160B077r43l022J077K837j062k810R87K905j103k843J192K710j208k561J031
2175g36K770j283k738J336K640j306k784J539K597j417k587J388K676j670k515
2190b090J479K525j590k419J696K494j815k417J567K468j616k501J960K183j797
2205A27k309J832K363j893k214J908K175j884j992J836K097k037k025K085K096
2220B165j940k170K134J869k066j825K063J822k072j914K098K063k307j862K228
2235B86J832k315j672K238J695k398j694K370J692k411j548K206J533k308j589
2250b083K277J664k285j547K331J390k325j409K354J371k440j309K457J350k470
$$ plain form
2265 -674 -1915 622 1792 -701 -1894 702 1837 -585 -1779 883 1911 -704 -1705 883 1898
2280 1898 -601 -1619 983 1932 -621 -1602 887 1837 -790 -1548 1085 1848 -766 -1670 1008 1666 -912
2297 -912 -1572 1006 1529 -1165 -1541 1071 1344 -1232 -1492 982 1349 -1360 -1686 1096 1401 -1329 -1695
2314 -1695 1107 1368 -1328 -1602 1072 1337 -1373 -1537 1128 1302 -1377 -1392 1288 1427 -1367 -1180 1493
2331 1493 1314 -1314 -1340 1521 1353 -1405 -1166 1502 1306 -1283 -1107 1627 1319 -1226 -1061 1520 1263
2348 1263 -1319 -1124 1525 1166 -1457 -1030 1471 1047 -1425 -899 1538 865 -1448 -1054 1443 869 -1551
2365 -1551 -966 1402 723 -1511 -1046 1342 736 -1659 -851 1444 677 -1629 -834 1455 507 -1602 -795
2382 -795 1434 647 -1647 -499 1530 682 -1419 -544 1569 670 -1472 -363 1740 616 -1517 -333
$$ packed form
2265f74j241K537J170k493j193K596J135k422j194K662J028k615j001K588J015
2280A898k499j018K602R49k553r81K489R50k627p58K633P63k614r04K678O58k578
2297i12o60K578N23k694l76K612K73k576k60K474L67k709l26K782L05k730l66
2314a695K802K61k696k74K674K65k710j64K665J74k679j5K680J39k794J87K673
2331A493j79k628k6K861j68k758K39K668j96k589J76K734l08k545J65K581k57
2348A263k582J95K649l59k623M27K501m24k472N26K437o73k313L94K497n74k420
2365a551N85K368o79k234M65K388o06k395Q08K295p67k306P95K289r48k109Q07
2382g95K229p87k294J148K029q48k101Q75K113q99k142J109K103j124k133J184
$$ plain form
2398 -333 1678 528 -1494 -300 1720 459 -1556 -208 1667 311 -1632 -266 1659 256 -1706
2413 -1706 -289 1649 214 -1648 -256 1646 28 -1668 -228 1452 56 -1700 -342 1484 -39
2428 -39 -1646 -87 1586 -94 -1618 -84 1551 -69 -1534 37 1582 -81 -1505 73 1626
2443 1626 -27 -1509 179 1715 -51 -1473 412 1803 -74 -1408 436 1802 -177 -1506 372
2458 372 1618 -123 -1550 419 1549 -239 -1299 433 1458 -327 -1499 372 1438 -416 -1454
2473 -1454 332 1214 -559 -1524 346 1269 -634 -1517 388 1284 -688 -1513 426 1332 -878 -1511 441
2490 441 1283 -784 -1446 559 1291 -733 -1397 615 1357 -679 -1144 733 1372 -664 -1167 953 1419
2507 1419 -666 -1063 975 1322 -602 -940 987 1525 -680 -950 1048 1375 -728 -1031 1051 1215 -783
$$ packed form
2398c33K011j150k022J194K020j261k015J348J875j356j943J366J925j403j962
2413a706J417J938j435j862J392J902j618j696J440J680j396j756J358J826j523
2428c9j607J559J673j680j524J534J635j620j465J571J545j663j424J578J553
2443A626j653j482J688J536j766j422J885J391j877j334J844J366j979j329J878
2458C72J246j741j427J969J130j788j060J732J025j785j172J871J066j854j038
2473a454J786Q82j773r65J870R23j903q83J905Q96j972q25J939R06k210o33J952
2490D41Q42k067o62K005P32k024o64K012P42k036m65J877O39k036n03K120M66
2507A419k085l97K038L47j924l38J927N38k205k70J998L27k103l03K082J64j998
$$ plain form
2524 -783 -1110 991 1128 -1039 -1216 847 1093 -976 -1140 796 1088 -1045 -1257 897 868 -1063 -1174 908
2542 908 838 -1046 -1103 815 884 -1116 -1099 919 780 -1168 -913 901 798 -1161 -815 1105 770 -1091
2560 -1091 -748 1249 897 -1007 -702 1222 877 -998 -589 1298 881 -1055 -641 1331 836 -1002 -535
2577 -535 1262 750 -1100 -538 1256 656 -1048 -389 1217 657 -1082 -486 1206 393 -1250 -373 1226
2594 1226 398 -1197 -512 1150 368 -1294 -688 1066 329 -1285 -511 1112 269 -1320 -492 1056 366
2611 366 -1223 -469 1165 330 -1226 -429 1141 224 -1268 -200 1176 242 -1238 -242 1283 254 -1106
2628 -1106 -107 1309 317 -1170 -211 1245 239 -1113 -142 1216 177 -1130 -20 1101 110 -1088
2644 -1088 72 1222 133 -1260 -19 1073 -16 -1236 40 1083 59 -1053 32 1166 -248
$$ packed form
2524g83l27K101J37k167j77K063K46k069j64J936K92k133k12K154k9j931j11K082
2542I08p0j884n7J918O9k000J7K018j39j948K55J814j03j959L46J920l35j861
2560a091L43J997l52j904L05J924l45j875M09J887m17j936M14J972m95j838M67
2577e35J797n12j850N62J794o00j704O59J606n60j739N96J692q13j643Q77J599
2594A226q28j595O85J662p82j662O06J754p37j614P74J623q43j589Q28J548o90
2611C66j589P54J634q35j556P97J570r17j492J068J376r34j480R96J525j029j360
2628a106R99J416r92j487R59J456j006j352R71J358j039j307J110J121r91j198
2644a088J160J150j089j393J241J092j089j220J276J043j024j112J085J134j414
$$ plain form
2659 -248 -1202 -35 1004 -78 -1100 130 1105 20 -1203 148 1047 -135 -1052 283 1069 -187
2675 -187 -895 336 1161 -192 -915 266 1051 -191 -1010 254 1149 -269 -992 284 932 -389 -968
2692 -968 343 829 -522 -989 286 927 -463 -1148 327 977 -489 -1082 362 770 -626 -968 496
2709 496 893 -452 -1060 416 747 -461 -843 501 916 -604 -901 475 855 -508 -733 541 885
2726 885 -429 -849 721 963 -521 -620 725 870 -539 -658 774 923 -667 -689 618 883 -596 -700
2744 -700 614 794 -736 -687 622 751 -662 -688 561 640 -699 -764 568 627 -836 -778 552 528 -852
2763 -852 -838 617 407 -871 -671 640 454 -753 -570 689 370 -810 -545 691 406 -856 -470 654
2781 654 450 -709 -546 787 513 -610 -299 748 658 -845 -288 885 582 -712 -367 944 560 -676
$$ packed form
2659b48r54J167J039j082j022J230R75j085j223J351Q99j182r17J335P86j256
2675a87p08J231Q25j353p23J181P85j242q19J264Q95j418p23J276O48j321n79
2692i68J311M86j351m67J275O41j390o85J475O50j466n93J444M08j396l42J464
2709D96L97j345o08J476L31j208l82J344M15j520k97J376L80j363k25J274L44
2726H85j314m20J570K42j484r9J345J45j409j19J432J49j590k2J307K65j479j04
2744g00J314J80j530M9J309J29j413k6J249P9j339o5J332N9j463N8J330k4j380
2763h52J4J455k10j278K00J311j86j207J83J259l19j180K65J236k85j262L86J124
2781F54k04j159J63J333k74j123L11J047r0j503N57J173l03j294L45J311l84j236
$$ plain form
2799 -676 -208 997 417 -817 -320 918 339 -826 -291 737 240 -751 -352 783 149 -834 -383 835
2817 835 104 -879 -346 712 28 -935 -449 662 208 -807 -284 686 183 -939 -255 699 166 -824 -206
2836 -206 717 122 -712 -99 869 130 -752 -66 945 137 -686 46 831 85 -666 64 805 111 -694 227
2856 227 727 80 -740 -8 768 52 -814 22 776 28 -823 76 781 -126 -671 -21 820 -64 -778 -118
2876 -118 578 -189 -829 33 638 -244 -806 66 594 -232 -728 6 418 -254 -740 302 923 -154 -672
2895 -672 279 675 -181 -730 259 735 -46 -515 442 719 -75 -614 365 839 -229 -656 200 655 -178 -596
2915 -596 310 702 -286 -600 301 504 -399 -650 136 538 -421 -583 227 537 -337 -680 171 388 -349 -722
2935 -722 192 330 -502 -579 338 502 -526 -595 360 459 -458 -533 367 385 -476 -386 385 419 -377 -358 480 676
$$ packed form
2799f76M68J205n80j234M97J238n79j165N35J028m97r91L99J135o34r83M51J218
2817H35p31r83N33J058o84r63M86J111m54j015N23R70n03j122O84R54n33r90O18
2836b06R23n95q34O13R68p39q82O86J011q08q23P32P85p46p51P30P41o94q05R21
2856B27N00o47q20P32P76p16q66Q36P54p48q51Q99P05r07n45O50Q41q84p14O60
2876a18O96p67o40Q62O05q82n62Q72N28q26m96P34M12o72m86J042O21j077n18
2895f72R51L96q56n49R89M76p81m69R57K77p94n39R79M74j068m27Q56M55q33m18
2915e96R06L92r88l14R01K03r03k51P86M02r59j62Q10L10q74l43Q51K17p37l73
2935g22R14J38q32p7R17J64j028o9R55R9r17p5R00J8q61R0P71L4p96J9Q38J96
$$ plain form
2957 676 -369 -340 538 405 -293 -240 522 496 -264 -368 593 510 -377 -280 468 367 -512 -284 415 291 -486
2978 -486 -343 476 375 -548 -490 371 277 -516 -427 481 275 -637 -377 469 130 -528 -428 328 224 -475 -307
2999 -307 473 171 -580 -382 465 241 -512 -301 544 106 -532 -142 602 121 -485 -177 618 309 -451 -184
3019 -184 569 196 -511 -99 547 302 -418 -27 498 152 -565 -100 547 41 -427 -149 531 176 -435 -2
3039 -2 545 100 -507 41 539 49 -683 -93 559 7 -563 -104 352 140 -427 -2 468 -87 -552 3 262
3060 262 17 -432 34 583 -118 -440 97 492 66 -510 81 469 -112 -426 223 383 43 -324 113 539
3080 539 -96 -426 164 470 -85 -445 180 348 -88 -497 91 533 -227 -488 72 350 -114 -446 43 332
3100 332 -92 -487 -41 391 -212 -471 -52 341 -197 -405 76 337 -255 -304 66 443 -28 -345 262 471
$$ packed form
2957F76j045K9Q78j33o98N3P62k6p60j04R61q3q87R7P48j01q79K28O99j24p77
2978d86J43Q19j01r23N8Q61r4p93Q9R08k06r12K60Q46l39o58J00P56j04o99J68
2999c07P80l02p51J98Q47k24p53K11Q45m38o38L90P44m81o06L08P95l09p60K67
3019a84P53l73p07M12O46k45p20L91N25l46p17M65O47n06m68K78O80l55o11M33
3039bN47m45o07N48M98m90p32N90O52n52n70M59M56k12n67M25M70n55m65N55K59
3060B62k45m49M66N49p01l22N37L95m26n76N91L88n81l14O49J60l40l67M37M26
3080E39o35l30N90L06n55l60O25J68m36m09N88M42p60k61N60K78m64l32M89K89
3100C32m24l95M46M32o03k59M19L93n38k08M81K61n92m9L70L77m71l17O07K09
$$ plain form
3120 471 -49 -142 265 387 -49 -249 351 316 -156 -196 252 394 -47 -253 419 324 -188 -319 274 235 -146 -348
3142 -348 178 286 -354 -345 139 178 -343 -212 75 172 -154 -444 50 134 -412 -412 168 49 -359 -439 153 43 -369
3165 -369 -176 231 138 -240 -254 264 227 -375 -105 307 182 -365 -99 174 251 -310 -63 407 212 -180 -15
3186 -15 434 282 -144 6 444 170 -211 -44 399 274 -246 46 460 52 -233 -52 429 -3 -374 -142
3206 -142 243 4 -226 -72 231 45 -295 -170 222 -41 -372 -98 149 24 -509 -164 236 6 -458 -102
3226 -102 111 -37 -326 -148 228 -115 -434 -49 194 -23 -270 -38 251 -55 -412 148 364 25 -312 142
3246 142 393 60 -203 196 463 -20 -200 119 402 -108 -195 112 302 -20 -240 83 263 -76 -249 -7
3266 -7 278 -122 -381 98 214 -62 -134 -51 196 -233 -276 101 192 -101 -257 31 188 -173 -353 23 276 -206
$$ packed form
3120D71n20r3M07J22m36k00O00l5m72m0M48J42m41k06O72r5n12j31N93l9l81k02
3142c48N26J08o40RM84L9n21J31K87R7l26k90M94Q4n46%N80j19m08q0N92j10m12
3165c69J93M07r3l78j4N18l7o02K70M12j25n47K66K73P7n61K47M70j95l92J65
3186a5M49j52m26J50M38k74l81J67M43j25n20K92M14m08k85J81M81m32l71K32
3206a42L85k39k30J54L03j86l40J25L92k63l31K74K47j25n33L45M00k30m64L56
3226a02K13j48k89J78L76l43l19L85K43k17k47K32K89l06l57N60K16l39l37M54
3246A42K51l33k63L99K67m83j80L19K83n10q7L07J90l22k20L23J80l39j73K42
3266gK85m00k59M79J16k76p2Q3K47m29m3L77R1k93j56K88J57l61j80L76K53m82
$$ plain form
3288 -206 -389 26 87 -122 -278 139 254 -187 -197 167 274 -106 -115 157 219 -100 -223 141 232 -155 -72 141
3310 141 248 -117 -106 306 194 -236 -252 133 79 -259 -170 147 199 -170 -116 89 212 -256 -23 98 54 -191
3332 -191 -77 126 95 -50 -231 123 240 -290 -72 147 32 -263 -55 103 121 -267 -16 285 99 -55 -162
3353 -162 303 -18 -119 -7 281 55 -157 -87 227 100 -93 66 208 115 -238 -72 75 82 -274 -79 188
3374 188 52 -297 -161 107 -47 -174 -146 96 -172 -213 -23 138 -18 -273 -96 161 -30 -296 -46 204 -69
3395 -69 -282 52 188 82 -190 28 212 -14 -146 107 228 -11 -5 86 248 148 -112 99 305 27 -346
3416 -346 26 128 -12 -206 170 256 -113 -119 97 150 -113 -157 -6 154 -176 -93 -37 9 -211 -310 17 188 -249
3439 -249 -304 54 148 -174 -92 40 -46 -172 -214 61 118 -110 -166 121 95 -147 -167 80 95 -142 -199 180 94 -106
$$ packed form
3288b06j83M15O1k09j56M17J15m41j0L64J07l80rK72O2l19j23L64R1l87Q3K13
3310A41J07l65J1M12j12m30j6L85n4l38Q9L17N2l69N4K05J23m68K33J21m4k45
3332a91J14K03l1j45j81L54J17n30K18K19j15k95K08J58J8l88K51L01j86j54j07
3353a62M65l21j01J12K88k26k12P0L14j27j93J59J42r3l53J66J47Pl56J95K67
3374A88j36l49J36K68j54j27K8K42k68m1J90J61j56k55J77K57j91k66K50K50k73
3395f9k13L34J36j06k72K18J84k26j32K53J21k39OR1J62j00k60K11K06k78l73
3416c46L72J02j40j94L76Q6l69oK16N3k63m4J51J60l30Q3N6M6k20r9L27J71m37
3439b49n5L58R4l22Q2J32q6j26m2K75N7k28n6K87k6k42k0K47J5k37n7L79q6k00
$$ plain form
3463 -106 -99 232 288 -161 -122 227 177 -81 -38 200 154 -127 -22 195 201 -166 -241 116 271 -162 -105 62 86 -73
3487 -73 -122 142 71 -140 -115 78 105 -177 -122 30 -144 -200 -41 157 -51 -231 -103 177 11 -258 -158 193
3509 193 86 -154 -74 148 42 -195 -156 221 40 -95 -53 210 103 -179 2 331 41 -162 166 140 46 -111
3531 -111 108 201 72 -187 -24 212 -31 -189 -5 116 45 -180 44 178 18 -377 -24 223 2 -315 -27
3552 -27 200 -111 -209 -55 49 -89 -297 3 145 -36 -246 -17 214 3 -159 -11 283 53 -149 125 274
3573 274 -1 -111 102 250 -8 -167 59 370 158 -117 129 196 -7 -148 74 214 26 -124 100 115 -3
3594 -3 -175 25 179 -129 -214 52 109 -126 -216 114 50 -235 -251 24 107 -245 -231 58 111 -156 -170 -55 140 -188
3618 -188 -19 95 100 -108 -134 90 175 -1 -180 91 129 -154 -48 208 152 -139 -63 159 189 -211 55 178 121
$$ packed form
3463a06PL31N6m49L9L49n0k58M3K38m6k81J05K17Ol67p5L57J55m33N7J67K4j59
3487g3m9K64p1k11K5J93K7k82N5J52j74n6J59J98k08j80J28K80j66k69J00L51
3509A93j07k40Q0K22j06k37L9L77j81j35M2K63j07k82J81L29k90k03L28k6r4j57
3531a11K19R3j29k59J63K36k43j58J84J21p1k25K24J34j60l95L53K47k21l17K88
3552b7K27l11r8J54J04j38k08L00J42j81k10K29K31k11j62J48K94k30k02K74J49
3573B74k75j10K13J48k58j59K26L11k12k75K46O7k03j41K22J40j88j50K24J5j18
3594cj72K00J54l08q5K66N7k35r0L30o4k85j6K75Q3l52J4K89N3k67j4J15J95l28
3618a88J69J14Nk08k6K24Q5j76j79K71L8k83J06K56n6k91P6K22L0m00K66J23n7
$$ plain form
3641 121 -121 -54 250 66 -116 79 354 196 -157 -25 111 129 -190 -178 251 44 -157 -131 145 94 -244 -2
3663 -2 129 -40 -195 -85 -47 37 -108 -117 125 -45 -273 -130 285 15 -148 29 102 159 -237 -101 74 -5 -164
3686 -164 -82 255 -19 -278 -76 252 104 -199 47 213 92 -3 197 215 61 -219 43 183 10 -181 73
3707 73 273 61 -165 140 106 -89 -157 53 55 -106 -174 60 207 -62 -178 61 158 -16 -249 -24 139 -136
3729 -136 -98 28 119 -49 -235 -18 209 -97 -278 55 293 -234 -24 37 130 -14 -70 154 206 -129 -172 158
3751 158 251 18 -297 159 338 -36 -286 190 415 -47 -90 110 183 -133 -87 164 178 -123 -124 95 199 -154
3773 -154 -203 67 116 -52 -204 54 89 -159 -65 -54 236 -273 -254 38 59 -194 -143 88 37 -253 -189 155 199 -9
3797 -9 -122 25 210 -153 -223 196 117 -142 -139 243 115 -78 -78 192 127 -108 -77 227 222 -223 -46 82 -75 -254
$$ packed form
3641A21k42O7L04j84j82J95K75j58l53J32J36J8l19J2M29k07k01K6K76n1l38K42
3663bJ31j69j55J10L8Q4j45rK42j70k28J43M15k70j63J77P3N7l96J36J75p9j59
3686a64Q2L37k74k59K02L28j48l03K46J66j21r5K00J8j54k80K62J40j73j91K54
3707G3K00k12k26L05l4j95o8K10Kj61o8K34J47k69j16K39R7j74k33K25J63k75
3729a36L8J26R1j68j86K17K27l06j81L33K38n27K10O1R3j44n6K24N2l35m3L30
3751A58R3k33l15M56J79l74k50M76K25m62m3K00P3l16M6K51J4l01jK19J04l53
3773a54m9K70M9j68j52K58L5k48R4J1K90n09J9K92K1k53N1K31n1k90O4L44M4k08
3797ij13J47J85l63p0M19p9k59LL82j28j93%K70o5k35L1L04nm45J77J28j57j79
$$ plain form
3821 -254 -64 94 108 -352 -78 140 21 -117 -87 189 25 -234 -172 178 16 -226 -115 384 128 -297 -206
3842 -206 65 151 -194 -240 279 47 -94 -85 122 126 -284 -144 160 127 -130 -56 293 152 -232 -117 333 77 -158
3865 -158 61 281 111 -199 15 282 108 -123 -39 223 5 -300 -58 209 58 -215 -134 221 100 -219 -31
3886 -31 201 128 -211 -131 158 -28 -221 -77 75 59 -270 -3 153 -25 -287 -23 284 -14 -192 -71 322
3907 322 39 -120 -14 184 -144 -264 111 281 51 -201 153 313 -12 -250 78 274 87 -193 87 187
3927 187 -223 -121 96 193 -6 -128 1 302 -136 -318 4 216 -40 -243 51 189 -109 -210 -21 189
3947 189 -60 -315 -13 185 -147 -246 38 238 -119 -221 73 239 -8 -226 29 205 -71 -219 129 100 -198
3968 -198 -89 155 265 -54 -152 202 217 -83 -167 247 159 -22 -67 111 143 -106 -208 97 190 -174 -182 114 210
$$ packed form
3821b54J90J58J4m60K74K18j19j38L0K76j64k59O2L50j62k42J11M99k56m25R1
3842b06K71Q6l45m6N19k32j41RK07Mm10J40L04l3k57P4L49j41l84J15M50k56k35
3865a58K19K20j70l10K14K67j74k31Q4K62k18l05K42K67j51k73Q1L55j21l19J88
3886c1K32p3l39Q0K89j86j93J44J52j6l29K67J56j78k62K64L07k98j78J21L93
3907C22k83j59J06J98l28j20L75J70k30k52L54J60l25k38L28J96j87k80K80J00
3927A87m10J02K17R7j99j22J29L01m38j82L22K12k56k03K94J38k98j01J89K10
3947A89k49k55L02J98l32r9K84K00l57j02K94J66k47k18K55J76k76j48L48k9k98
3968a98J09K44J10l19r8L54J5l00q4M14q8j81m5J78L2k49j02L05R3l64qK96R6
$$ plain form
3991 210 -220 -213 237 47 -98 -125 136 116 -258 -222 153 85 -202 -146 14 58 -269 -130 97 69 -158 -175 108
4014 108 100 -158 -96 152 193 -48 -261 287 90 -54 -165 207 238 -196 -122 240 215 -46 -24 93 189 -142 -70
4037 -70 231 100 -234 3 205 118 -90 -106 207 227 -205 -152 247 153 -281 -72 139 -19 -156 -200 132 122 -221
4060 -221 -48 147 -17 -405 -16 119 5 -233 -94 169 110 -259 -26 174 50 -222 12 225 82 -279
4080 -279 19 354 -1 -141 -67 262 48 -84 -43 283 65 -263 5 234 50 -182 -24 247 89 -231 52
4101 52 203 -6 -204 -27 253 65 -197 9 325 8 -151 -63 174 98 -228 -22 128 35 -263 -2 144
4122 144 -46 -300 35 218 -135 -253 116 224 -77 -227 -45 278 1 -223 47 200 158 -289 23 182
4142 182 -115 -254 -6 234 101 -259 34 136 -67 -268 129 168 -55 -195 116 260 1 -239 61 137 -87
$$ packed form
3991B10m30PM50j90j45k7K61k0l74L6L75o8k87N6J60M4l27J39K27k8k27j7K83
4014A08qk58O2K48M1k41k13N48j97j44j11L72L1m34P4L62k5k61K2J17R6l31P2
4037g0L01j31l34K37K02q7k08j6L13K0m32N3L99r4m34K09K11j58j37m4L32j0l43
4060b21J73J95j64l88L89J35j14k38J39K63n9l69K33K00j24k72K34K13j43l61
4080b79K98L35l55j40P4L29k14j32M1L26k18l28K68K29j84k32J58K71j58l20K83
4101E2J51k09j98J77K80j88k62K06L16l17j59Q8K37p6l26K06J50r3k98K61J46
4122A44j90k54L35J83l53j18L69J08l01j50J82L23k77k24K70J53m2m47L12J59
4142A82k97j39K48K40j33l60K93J02k03k01L97L9k23j40L11J44k59k40L00P6k24
$$ plain form
4163 -87 -225 22 206 -13 -161 32 217 -174 -247 114 176 -96 -228 65 209 -132 -218 163 265 -228 -242 119
4185 119 197 -103 -130 167 138 -110 -134 253 252 -37 -151 206 71 -142 -184 155 63 -48 -125 79 227 -149 -114
4208 -114 144 191 -205 -272 272 63 -138 -189 172 95 -159 -241 47 106 -120 -147 87 51 -264 -217 52 183 -204
4231 -204 -278 133 51 -320 -102 120 184 -151 -199 106 98 -177 -108 143 70 -182 -84 331 150 -44 -95 219 163 -101
4255 -101 -51 267 205 -95 79 245 139 -119 -11 206 124 -171 -38 149 64 -153 -56 185 165 -235 -125 225
4277 225 119 -195 -143 167 109 -294 -238 153 60 -184 -165 100 -84 -297 -94 83 17 -264 -137 168 -61 -101
4299 -101 -163 230 8 -184 20 80 38 -173 -80 224 137 -141 -31 277 96 -165 -4 413 104 -177 -16 190
4321 190 41 -230 52 205 128 -6 10 242 26 -71 116 265 54 -285 85 266 100 -171 -106 149 68 -282
$$ packed form
4163h7j38K47J84k19j48J93J85l91p3L61O2k72j32K93J44l41q6L81J02m93j4L61
4185A19P8l00k7K97k9k48k4L87jk89j14L57j35k13m2L39r2j11p7K04J48l76L5
4208a14K58M7l96o7N44k09k01n1L61p7k54q2K88N9k26k7K34l6l15M7K69J31l87
4231b04p4M11q2l71K18K22O4l35m8L05qk75O9K51p3k52R8M15j81j94n1L14n6k64
4255a01N0L18o2l00J74J66j06k58J08K17q2k95J33J87q5k17R7K41k0m00J10L50
4277B25j06l14N2L10n8m03N6L91r3k44J9K65j84k13K03J77o6k81J27L05k29m0
4299a01o2L93k22j92K04O0m2k11R3L04q7k78J10L08j81k61J61M17l09k81J61K06
4321A90j49k71K82J53p7j34J6K32k16r7J87J49k11l39L70J81j66k71O5K55q1l50
$$ plain form
4343 -282 -2 267 -93 -301 28 -40 -31 -323 -77 161 -80 -236 -118 134 -89 -68 -62 150 -64 -169 42 118
4365 118 -125 -233 103 187 -27 -173 63 160 -106 -156 15 190 34 -222 122 162 -15 -214 60 193 -22
4386 -22 -186 3 302 75 -191 104 187 -136 -59 44 241 -131 -194 214 93 -66 -151 80 131 -50 -211 236
4408 236 11 -45 -133 9 104 -160 -97 165 159 -106 -99 45 133 -112 -187 8 123 22 -122 116 223 17 -188
4431 -188 -29 158 -51 -73 28 150 -135 -125 88 80 -102 -126 11 138 -135 -142 0 12 -209 65 146 140 -166 -42
4455 -42 137 109 -40 -218 257 159 -86 -110 206 52 -223 -142 117 116 -234 -127 128 181 -84 -57 188 138 -32
4478 -32 -72 237 185 -179 -254 188 111 -157 48 179 138 -97 -36 286 62 -44 -23 129 -53 -181 -121 141 -39
4501 -39 -192 -34 92 -94 -80 -183 159 24 -255 -42 153 66 -171 -108 164 50 -226 -109 76 81 -276 -53
$$ packed form
4343b82K80K69l60k08L29o8Rk92K46K38k41j56J18K52k23K1OK12k14j05K11P6
4365A18k43j08L36Q4k14j46K36R7k66n0J71J75j56k56L44M0j77j99K74J33k15
4386b2j64J89K99k27k66K95Q3l23P7J03J97l72o3M08j21j59q5K31N1j81j61M47
4408B36k25n6q8J42R5k64O3K62ok65PJ44Q8k45p5J95J15j01j44K38J07k06k05
4431a88J59J87k09k2J01J22k85J0K13qj82k4J37J27k73pJ42J2k21K74Q1ol06J24
4455d2J79k8j49j78M75r8k45k4L16j54k75Q1K59jl50J07K55N3k65K7K45n0j70
4478c2m0L09n2l64p5M42p7k68K05J31m1k35O1L22k24j06K1J52j82j28O0K62j80
4501c9j53J58J26j86J4j03L42j35k79K13J95q7k37O3K72j14k76J17J85Nl57K23
$$ plain form
4523 -53 208 68 -115 88 117 26 -86 -78 180 23 -124 29 194 112 -188 -68 224 115 -100 106 183 31
4545 31 -178 -3 259 -16 -156 -107 138 6 -154 56 99 143 -171 132 129 29 -47 62 157 54 -199 -42 37
4568 37 -20 -66 -76 333 50 -100 38 213 25 -251 -19 72 -92 -214 18 30 147 -156 37 206 -103 -130
4590 -130 38 271 -102 -184 54 116 137 -57 -7 229 -24 -69 5 125 -13 -54 32 88 24 -35 2 83 -69 -143 112
4615 112 80 -87 -169 -70 131 -56 -120 98 158 -2 -89 8 65 -176 -205 52 105 -94 -73 68 266 -84 -53 12
4639 12 179 9 -98 101 115 -41 -19 151 140 -8 -145 107 88 -160 -227 -12 -3 -48 -121 119 -43 -53 -211 188
4663 188 34 2 -60 81 198 -125 -77 63 38 -144 -60 14 18 37 -137 150 127 30 -30 73 120 -156 -47 200
4687 200 104 -59 8 -8 61 -71 -5 108 125 -158 -77 24 173 -64 -59 65 10 122 -117 213 197 -19 -61 165
$$ packed form
4523e3K61j40j83K03K9r1j12QK58j57j47J53J65q2l00J20K92j09k15K06P7j52
4545C1k09J75K62k75j40M9K45j32j60K10M3M4l14L03lj00p6J09R5j03k53J57P9
4568C7n7m6j0M09k83j50J38J75j88k76K32R1j64j22K32J2J17l03J93J69l09k7
4590a30J68K33l73q2K38O2K1j94N0K36k53m5P4J20j38m1Q6N6o4n9L7Q1j52p4K55
4615A12l2j67q2R9K01j87o4K18O0j60q7R7N7k41k9K57N3j99K1J41J98l50L1O5
4639A2J67j70j07J99J4j56K2J70j1j48j37K52j9k48o7K15Rm5p3K40j62j0j58L99
4663A88j54l2o2J41J17l23M8J40k5j82Q4P4MJ9j74K87k3r7o0J03M7k76J09K47
4687B00r6j63O7j6O9j32O6J13J7k83Q1J01J49k37NJ24n5J12k39L30j6k16m2K26
$$ plain form
4711 165 131 -128 29 125 46 -107 -102 6 40 -117 -55 6 46 -107 9 137 -14 -40 -49 140 -33 -298 -154 80
4735 80 -65 -240 -166 130 55 -154 -89 99 -55 -95 -159 114 11 -26 51 123 -5 -239 51 68 -14 -46 -102 145
4759 145 -44 -194 6 226 49 -125 -77 259 95 -25 33 195 121 -78 87 134 49 -253 40 200 50 -128
4781 -128 38 114 20 -169 -24 48 -55 -119 -90 70 -64 -142 -9 32 182 -219 -19 73 -7 -94 -100 134 29 -174
4805 -174 -96 39 5 126 -20 97 -124 -140 -22 7 91 -172 76 170 -7 -6 -25 92 60 -247 27 150 -108
4828 -108 -91 58 252 56 -144 172 186 -28 -173 -25 19 -111 -21 64 203 -62 -127 152 90 -140 -170 81 154
4851 154 -37 -77 8 65 -124 -216 -27 38 -115 -91 1 55 -21 -113 15 -9 -108 -143 -42 86 -56 -16 11 2 61 -106
4877 -106 48 188 -73 -111 133 92 73 -51 18 198 44 -99 115 47 -111 -123 58 18 -193 -138 120 174 -17
$$ packed form
4711A65l4k59J57R6p9j53NJ08L4j57O2O1M0j53J16J28j51k6rJ89j73k65J44K34
4735H0j45j75P4K96p5k09O5J88j54m0o4K73j03l7P7P2j28k34K90J7q2l2n6K47
4759A45j89j50K00K20j77j74M8L36j64j20N8J62p4j99J65M7q5l02K93J60j50j78
4781a28J66P6r4j89J45P2j03o4K9J60j34p8J33M1J50m01K00R2q0q7oK34j05k03
4805a74P8J35l4J21j46J17k21j6J18K9Q4k63K48R4j77Jj9J17l2l07K74J23k58
4828a08J7J49J94j96k00L16J4k14j45J48M4j30R0Q5J39k65o5K79o2k30l0K51P3
4851A54j91m0Q5N7j89r2J89O5j53K4R2N4p6r2J28k4r9l5J01J28j42M0K7rN9j67
4877a06J54J40k61l8K44m1j9j24O9J80j54j43K14o8j58j2J81m0k11N5K58N4j91
$$ plain form
4900 -17 -130 17 -13 -39 -9 87 -91 -60 -143 16 75 -158 -102 34 -4 -140 -138 44 36 -122 8 30 19 -83 -138 123
4926 123 157 -8 -101 78 -71 -36 -56 24 -96 -31 -18 31 102 -48 6 209 36 -49 -116 -31 -53 -39 -40 29 95 -17
4952 -17 13 111 -2 -112 -79 101 30 -108 39 131 91 -50 -193 100 112 -135 127 40 82 13 -51 123 9 -101
4976 -101 -74 71 16 -144 -19 113 34 2 -150 113 12 -78 -11 140 49 -50 -15 32 -14 -76 -122 207 26 -109
5000 -109 -42 84 -9 -80 -32 94 -5 -114 64 154 49 -207 -37 94 197 -147 -40 77 90 -87 160 44
5022 44 -102 -112 91 -19 25 -30 -133 236 -66 -14 -28 198 -119 -118 102 126 -38 -115 72 32 -19 30 19 229 -30
5047 -30 -100 51 68 -77 -52 16 54 147 -43 -49 80 -36 -42 -20 16 -147 -35 -43 -1 133 23 1 22 -88 -115 -11
5073 -11 58 51 -144 0 144 -75 -84 -12 63 -10 -64 -19 114 -126 -64 53 2 41 -92 3 147 -12 -73 138 45 -64
$$ packed form
4900a7j13J47l0k6L0R6j78L1q3J59N9k33N6J36l8j36KJ82qj58J30K2j1j02n5K61
4926A23L4j65r3J79j49L5k0Q0j20O5J3M9P1j50N4K03j73q5o7Q5k2J4jO9O6j12
4952a7L0R8j13j10L3J80p1j38J47R2m0j41j43K93J2k47K62q7M2o9o4J74j14j10
4976a01K7J45n5j60J25J32p9l2j52K63j01r0O7J51r1r9L5M7m6o2m6L29j81j35
5000a09O7J26r3p1M8J26r9j09J78R0j05k56J70J31J03l44J07J17J3j77K47j16
5022D4j46j0K03j10M4n5j03L69l02N2j4K26l17JK20K4j64p7J87m0n1M9j1K10k59
5047c0p0J51J7j45K5O8L8R3j90oJ29j16oK2L6j63J12qM2J34j10k2K1j10k7J04
5073a1O9pj95J44J44k19rP2P5p3n4M5J33k40O2J17n1L9j33R5J44j59o1K11r3j09
$$ plain form
5099 -64 -116 -20 73 -47 30 26 128 115 -30 20 122 -25 -141 49 129 3 1 -25 191 -56 -51 51 -7 -45 61 -20
5125 -20 32 -122 19 -83 74 -32 21 -84 103 -7 -63 -37 -9 -45 -34 -48 99 35 -11 -54 103 -119 -163 96
5149 96 -102 -10 -29 82 73 -117 27 -73 21 -59 -76 15 -31 -54 -54 71 6 -110 -59 67 28 17 29 50 26 -78 -1
5176 -1 59 56 33 5 55 -1 -85 -37 83 66 -97 14 -89 -31 -168 -4 83 -84 22 -51 111 30 -74 69 67 56
5202 56 5 37 89 13 48 -27 67 35 -60 -58 -29 -33 -26 -62 -24 59 -79 -35 4 102 -61 25 -9 5 -3 12 -14 21 20 -3 90 -34
5234 -34 -66 -72 -28 -103 47 -103 4 29 -95 73 0 -32 39 1 20 5 -126 71 148 66 -112 85 -102 13 -3
5259 -3 89 139 -26 20 52 57 40 35 -16 6 65 54 4 49 -11 -15 135 91 -114 30 -124 50 36 -20 -23 36 89 -125 158
5288 158 139 -38 -32 -76 -21 -19 -99 -11 -25 -55 -37 -69 -42 161 -139 85 -69 72 -20 63 50 77 -32 -60 24 109 81
$$ packed form
5099f4n2R6R3j20P7mJ02j3j45N0J02j47j16J90Q0j26kk6K16k47NJ02n8l8J06q1
5125b0N2j54J41j02J57j06N3j05J87j10n6K6K8l6J1j4J47o4m6m3J57k22m4K59
5149I6j98R2j9J11rj90J44j00R4q0j7R1m6k3%J25o5j16N1J26l9j1J2K1k4j04P7
5176aO0lk3k8N0n6q4M8J20j7j63J11j03N8j37J64Q7j67J06p3J62q1j04J43kj1
5202E6n1L2N2p6L5p5R4l2r5KK9mPl6L8Q3j38M4L9R8j63Q6l4J4qJ5k6L5jk3R3j24
5234c4l2oM4p5J50j50J07K5j24J68p3l2P1l8J9j5j31J97P7q2j78J97j87J15j6
5259cR2N0j65M6L2Nj7nn1K2N9j1n0M5o0mJ50m4k05J44j54J74j4n6lN9N3k14K83
5288A58j9j77Om4N5Kq0Q8j4l0J8l2K7K03l00K24j54J41r2Q3j3K7j09k8Q4Q5k8
$$ plain form
5315 81 -3 11 -11 48 34 57 -75 35 69 128 129 73 98 74 6 -47 -13 105 42 50 -41 53 -10 18 -43 14 17 11 21 -42 -3
5346 -3 31 21 -42 30 74 -32 -94 105 -28 -43 53 28 -28 6 -81 -18 -65 11 81 -3 48 -78 -128 5 37 63 38 19
5374 19 -32 -6 -47 -102 25 106 24 -36 -39 135 24 -105 96 43 120 89 42 -51 80 42 -41 -114 117 70 71 85 -37
5401 -37 -117 -31 29 -29 20 -98 -46 27 88 -97 -40 -72 74 2 63 12 -12 -17 90 -44 -120 -48 93 97 -6 -2 82 16
5429 16 45 119 -17 -18 -53 -46 24 100 28 51 -2 30 31 8 63 -17 69 17 -67 -2 45 -88 28 -20 32 -54 55 -3 119
5458 119 -14 -66 -115 -158 -62 -103 -47 -48 45 -66 62 -104 20 -61 -20 14 -81 40 7 -42 -113 -130 -11 -23 18 -80 8
5485 8 -37 -112 -20 -46 -87 -76 3 22 -50 -70 0 26 -15 -49 -61 -65 101 35 -160 33 -30 81 11 -6 60 -61 -39 -89 48
5514 48 101 -13 11 -41 -37 28 -49 40 123 78 -39 -108 -55 -24 -57 -4 -58 81 -45 -30 -37 11 20 75 -44 -9 80 -79 37
$$ packed form
5315H1q4J4k2N9j4K3j32J10L4N9Jn6K5k4o8n3L4J18o3Qr1R4o3K8o1N7LoJ0o3L9
5346cL4j0o3P2M4j06o2J99j33j5R6k5n6L4q7O3m7P6P0q4N1j26n0J33L2K6k5j9
5374A9n1K6m1n5J27Q1q2o0lJ74j11j29K01n3P7l1m7r3J31l8q3p3K31m7JJ4j22
5401c7q0Q6O0n8M9j18N2P3O1j85N7l2J46p2O1n1k4nJ07j34p6P2J41Mj03MQ4o6
5429A6K9P4j36jl5PP0P6p2K3n3L2Jk3N5q0Q6n2q4O5M7j33J16m8N2q6J09n8J22
5458A19j33n2m9m3R6m1N6jR3j11J28j66J24q1M1L4r5J21l3m9p1j7J19j2M1r8Q8
5485Hm5p5R2k6m1J1P9J9p2k0P0K6m1l4j2mJ66o6j95J93o3J11p0j7O6j21K2n0J37
5514D8N3j14K4n2MO5p7Q9Q3m5j17o9N3L1l3N3n4J39j26J5pM8RN5j19L5Q9j59J16
$$ plain form
5543 37 70 -3 23 23 -56 -41 -124 49 40 -65 20 111 -52 18 -4 -87 60 -23 -139 -2 -16 99 -122 96 -32 -49
5569 -49 -63 -87 -14 114 15 -10 94 -149 37 90 -28 53 46 -38 3 164 -15 -57 -11 102 1 18 44 -75 -96 -31
5595 -31 -10 19 110 43 -54 -60 -5 -104 -36 -92 -49 -36 -20 -36 72 -120 23 -80 75 -54 -26 102 -146 -11 48 111
5621 111 23 2 63 38 38 -39 49 104 -115 112 88 114 11 -23 -53 -58 -89 -160 -2 5 116 -43 44 -12 21 -2 -20 34
5649 34 -87 -40 6 57 28 -3 -25 56 60 11 20 -43 -41 -84 -16 30 17 -135 -5 -13 -79 49 -29 -13 -4 48 12 35 -126 -48
5679 -48 37 134 78 -38 -23 76 -73 -46 -23 -16 47 -76 37 -50 -19 -99 28 -55 -64 -97 18 74 44 22 42 -31 -89 71
5707 71 54 46 10 -79 54 -7 -50 1 -45 14 1 -18 -134 -2 -105 -24 71 15 -139 12 88 34 -10 73 -11 -79 -56 66
5735 66 79 -9 69 -66 20 18 -1 57 97 44 45 -111 56 92 -70 3 -29 -8 95 13 59 -99 -30 -56 50 15 65 57
$$ packed form
5543C7L3p3K6%p9J5q3J73rj05Q5R1j63P0k2q3J47q3j16J37j4J15k21K18j28j7
5569d9j4k4P3J28r9k5J04k43J86N3j18Q1pq4M1J61j79m2M6J13j01J7K6j19k1O5
5595c1K1K9R1o7r7oN5r9O8n6M3J3J6j6J08j92J43j03J55j29K8J28k48J35N9O3
5621A11q8k1O1k5%p7Q8N5k19K27k4K6j03l4l0nl1p1J58PJ11j59Q7n6L3k3j8N4
5649C4j21M7M6N1k9l1k2Q1Mm9Ro3Km3O8M6j3j52J30qo6J28p8J6RN2l6K3j61P8
5679d8Q5R7n6j16J5R9j49K7K3PO3j23J13q7L1q0J27q3rl3J15N6l0k2K0p3n8J60
5707G1j7ql6q9J33o1m3N1m6N9j3j9j16J32j03Q1R5n6j54J51P6n4m4Q3q4o8K3J22
5735F6J3q8P8j35Q6kj9N8M0n3Jj56J67L6j62P3l2K1J03q2M6j58O9k6J06l5N0q
$$ plain form
5763 57 42 143 -114 27 -42 -4 -19 -32 -5 -34 -86 55 55 -56 -6 -49 9 25 -56 -7 -34 -75 -95 -14 148 -34 38
5790 38 -193 -21 27 -155 118 33 -8 -42 24 -59 -45 -34 17 45 -83 -122 -131 51 -12 -121 2 2 -97 -60 88 54 95
5817 95 63 -98 57 69 -116 -17 48 17 -97 72 180 -53 -53 39 11 -140 -12 32 63 -1 -123 -38 83 22 -48
5842 -48 45 27 52 -105 77 52 107 -4 -12 -60 -61 28 2 65 -96 -141 -159 84 -15 -33 -78 7 -33 75 -78 -8 -36 2
5870 2 9 60 40 82 101 33 125 79 90 58 10 38 -32 79 49 -41 48 101 198 -11 -13 -3 -32 -126 -47 81 -40 31 57 85
5900 85 -7 65 75 -101 -18 -9 108 18 -153 -68 38 56 -31 -13 -11 26 71 -29 22 -7 21 -132 -64 -37 -60 -151 -69 95
5928 95 -124 48 -44 -61 81 -52 -76 -4 -50 -58 -59 16 29 -21 96 79 -84 52 14 30 112 -88 0 24 207 30
5954 30 -69 69 -19 -18 4 3 89 -19 66 65 79 -48 11 -17 41 -96 57 20 -84 -60 -64 54 -151 -125 -73 26 -71 1
$$ packed form
5763E7j5J01k57J41o9L8j5j3K7k9n2J41%j11N0m3N8J6q1M9k7m1k0Q1J62j82P2
5790C8k31J72M8j82K73q5m1l4O6q3J4J1N1K8j28l9rJ82o3j09J23%r9L7J48l4M1
5817I5l2j61J55J2j85R9O5l1j14J69J08k33%R2k8j51J28M4L1o4j22Q5J21o1p0
5842d8R3j8K5j57J82k5N5j11qm8jQ9k6O3j61m5j8K43r9j8m5Q5m0J08j53P0k8L8
5870BPN1k0M2J9o8R2m6J1l2m8K8p0J11l0r0Q9N3R7k09kJ0k9r4P9J28j21P1K6K8
5900H5r2P2J0j76Q3RJ17r0j71Q5J06J8q7J8KL7M5j00N1k9K8j53O8K7k3r1Q2J64
5928I5k19J72r2j7J42j33k4P2m6qjP5J3n0J17j7j63J36l8J6Q2k00Q8K4J83j77
5954C0r9J38q8JK2jQ6j08Q5jJ4j27N9k8N8j37J53l7j04K4mJ18k05K6N2R9r7P2
$$ plain form
5982 1 20 14 -70 -79 138 -41 -43 38 -1 36 -47 -202 -27 5 -32 -37 -69 53 -49 3 -68 -65 81 23 0 31 46 128 29 21
6012 21 7 11 -84 34 -39 -136 -100 39 -81 94 -30 70 1 -68 27 -24 12 45 23 27 -93 27 17 127 -151 40
6038 40 58 60 -30 -154 92 -45 -14 16 105 -28 86 -74 -37 126 87 -100 53 29 43 51 196 -30 -76 13 114
6063 114 -82 22 70 117 78 -52 -3 30 111 63 1 30 78 -6 -2 -2 -9 -139 -26 4 -139 -139 -7 114 -1 -22 -15 83
6091 83 57 -19 5 211 16 105 -3 -37 45 -144 -51 39 133 52 34 -34 -28 79 -32 85 -25 19 -44 89 -1 27
6117 27 -12 57 112 -121 18 67 14 170 28 -35 33 -161 56 -91 36 -11 -11 37 -69 -37 22 -46 -46 -66 -20 41 30
6144 30 32 127 -10 33 120 94 102 -32 63 73 -92 -129 42 60 -55 -126 -16 21 28 -48 -69 -13 45 12 -149 -12 47 42
6172 42 -46 77 28 66 150 -8 53 102 -23 48 31 -41 2 59 66 -24 -9 24 10 -9 -47 12 -85 22 -12 28 -22 -27 -7
$$ packed form
5982AJ9oq4rK17j79kQ1l9L7q3j55J75L2l7nl2J22j02N2p1LJ46n8k3L1J5Q2r9q
6012B1j4Mr5J18p3r7L6J39j20J75j24J00o9o9R5n1L6L3k2Mj20J20j0J10k78J91
6038D0J8Kr0j24K46j37L1L0Q9j33J14j60L7J63l9j87J53k4J4QJ45k26m6Q9J01
6063A14j96J04M8M7l9j30M9L3Q1m8o2K9M8q4M%pj30J13L0j43%J32J21j15k1PR8
6091H3k6p6K4K06j95Q9j08l4Q2j89R3R0R4q1j8o8OJ07j11J17j10M4o3J33r0K8
6117B7l9O9N5k33J39M9n3J56j42o3O8j94K17j47J27m7%M8j06L2N9o8%k0M6O1j1
6144C0KR5j37M3Q7k6Qj34R5J0j65l7J71J8j15p1J10L7Pp6k1N6N8l3j61J37N9n
6172D2q8J23m9L8Q4j58O1M9j25P1j7p2M3N7Pr0J5L3j4j9l8N9r7J07l4M0n0nK0
$$ plain form
6201 -7 -40 -50 -124 -66 -124 88 74 -29 -148 60 -3 -105 23 27 -31 13 63 143 9 -93 71 35 -28 -85 9 -64 -19
6228 -19 -56 44 116 90 -67 106 47 -21 -17 49 -135 35 16 -15 32 -24 46 57 12 5 -173 -35 60 -35 -37 142 -47
6255 -47 -41 47 28 27 40 -45 8 8 -51 -41 55 -13 -64 64 -61 86 -58 7 -33 5 -122 -16 146 82 -25 -155 18
6282 18 28 -120 52 -38 -70 -112 -21 11 -76 6 -74 -80 -22 18 -25 -17 103 -42 1 63 67 -134 8 -34 -4 6 7 -94 -124
6311 -124 -64 -74 27 -74 -119 4 41 -132 -13 13 215 68 -47 128 2 -93 -16 -115 20 -60 -15 60 93 84 12
6336 12 19 70 -15 -47 -112 8 -123 52 -18 36 4 38 77 -22 12 -102 23 -2 112 -38 63 173 -58 -120 53
6361 53 -20 -110 -157 48 35 -90 16 17 -7 40 58 -31 -28 -100 92 -20 -72 25 -2 64 -45 37 -6 24 171 -31 11
6388 11 -14 30 79 -20 -5 17 -126 4 79 98 64 -109 37 20 -83 -85 29 58 16 -38 34 122 -30 -49 -33 -53 45
$$ packed form
6201gl3j0p4N8n8K12j4j03j19K08o3j02J28Mn8M4N0Q0j34j02J64l6o3n7R4p3M5
6228a9l7J00P2k6j57J73n9o8MO6j84J70j9l1M7n6P0J1m5pj78J38R5r5kJ79j89
6255d7OQ8j9jJ3q5N3%n9J0R6o8n1J28j25J47j44O5m0L8j27J06J62o4j07j30J73
6282A8J0j48J72r0l2m2R1L2q7Q2q0oN8M0m3QJ20j45M3O2Mk01J42m2L0J0Jj01l0
6311a24O0j0J01j01m5J23L7j73J19K6K02j47j15J75j26r5P7r9J35q0M5P5L3rp2
6336A2PN1q5l2o5J20j31J75p0N4l2L4L9r9L4j14J25k5J14j50J01J10k31o2J73
6361E3p3r0m7K05j3j25J06Jk4M7J8q9Lp2J92j12n2R7k7O6j09Q2m3L0J47k02M2
6388A1k5M4M9r9J5K2j43J30P5J9l4j73J46j7j03kJ14K9m2n4P2Q8j52j9J6k0R8
$$ plain form
6415 45 -223 -92 55 -38 -152 160 -54 73 0 44 78 -82 -94 -84 57 52 46 -37 11 -15 55 14 28 -18 -131 35
6441 35 106 -1 -70 -36 -10 -81 -75 62 78 -49 -86 -85 117 -51 45 -79 3 7 -30 22 47 -35 -66 -91 -40 -3 70 148 67
6470 67 87 -46 29 85 -48 -100 74 -32 -69 -29 -44 -16 -76 -32 74 -61 -47 -37 106 -2 6 -95 101 192 29
6495 29 -11 35 36 -30 -91 -1 94 -37 26 27 64 -54 -20 62 -68 2 9 -20 49 18 -20 61 -37 -51 -148 -12 57 -45 19
6524 19 26 59 -122 -69 -71 56 41 -26 32 -44 -105 -68 -3 46 -32 81 64 -2 3 -67 55 -18 -53 -43 58 58 -8 -2 53 -96
6554 -96 -143 78 -6 -5 -94 12 15 -25 139 -118 136 28 -20 12 30 129 5 -72 59 -61 -12 -61 54 84 -116 24
6580 24 80 -45 -26 -24 25 27 21 43 65 -10 -127 5 165 -48 -48 -69 -103 -9 19 -36 61 -59 -25 120 -66 44 -126
6607 -126 9 49 -10 -64 -129 10 45 126 -74 8 101 -80 -3 5 29 53 3 -38 -87 -28 16 62 43 83 -39 26 91 155
$$ packed form
6415D5k68J31J47r3j14L12k14J27p3M4L4j60j2J0J41noq3M8k6P0m1J4m6j13J66
6441C5P1j07o9L4K6p1OJ37J6j27l7JK02j68R6j24Q2Ml7N2K5q2l1k5N1L7P3P8q1
6470F7K0j33P5N6j33n2J74j06l7M0j5K8o0M4J06j35J4J0J43j08Qj01J96R1j63
6495B9m0M6Jo6o1R0R5j31O3JL7j18L4Q2j30P0Pk9O9l1l8Q1r8j4r7J36O9j02O4
6524A9PL3j81N3kJ27j5o7N8p6o1L7O5M9p8J13j7o6Np0J22p3l5J0J01%o6ON5j49
6554i6m7K21q4Jq9J06Lm0J64k57K54j08m8L2J8R9j24p7J31j20M9m9J15L0k00J40
6580B4N6j25J9KM9KoK2K2p5j17J32J60k13%k1l4R4K8n5R7j20L4J45j86J10j70
6607a26J35M0n9n4o5J39L5Q1k00Q2R3j81P7QK4K4n0m1m9N9M4M6j9M0j22O5O5O4
$$ plain form
6635 155 -5 -32 51 -9 19 15 54 -64 72 -3 65 -93 -21 -22 51 -82 -67 46 20 -54 -84 -30 -14 32 -67 80 -116
6662 -116 60 -90 -56 64 -36 68 72 99 52 -44 82 -5 -153 137 -36 85 53 95 56 -139 -1 -18 58 -36
6686 -36 -14 -8 75 97 -39 -51 99 4 -80 -42 29 6 172 24 78 -69 -10 -31 9 -52 -19 -57 -66 -18 -45 0 -7 73 -124
6715 -124 -24 59 -31 -78 -9 55 51 -9 -127 7 50 -15 11 38 -57 6 -6 -19 18 -103 43 45 -19 45 101 -17 -58 -21
6743 -21 42 88 -139 51 0 24 84 -1 3 35 -53 26 61 50 5 110 -16 104 62 -33 83 100 -3 -89 -69 -82 21
6770 21 -62 -37 9 -9 -141 129 2 -81 -9 31 -57 -95 -6 26 23 -35 53 52 49 4 -55 -88 -37 -90 1 -63 67 -151 83
6799 83 -21 128 -73 72 -100 13 28 11 61 15 79 -34 59 105 8 -24 -86 1 3 -25 117 -49 25 93 -15 -5
6825 -5 -84 30 81 -37 -35 -23 -1 3 -34 -54 46 34 -12 -58 23 19 -94 -13 119 7 12 -84 29 -76 -69 -50 76 48 -1
$$ packed form
6635A55j60k7Q3o0K8mL9j18J36p5O8j58P2jP3j33J5J13k6p4l0N4J6M6r9J47j96
6662a16J76j50L4J20j00J04MK7m7r6J26q7j48K90j73J21l2M2l9j95J38j7P6r4
6686c6K2OQ3K2j36j2J50r5q4L8P1k3J66j48N4j47N9k1M0o1L3l8rM8k7M5pQ0j97
6715a24J00Q3r0m7O9O4mo0j18J34M3o5K6K7r5O3j2j3L7j21J46Ko4O4N6j18m1L7
6743b1O3M6k27J90n1K4O0q5ML2q8P9L5j1m5J05j26J20m2r5J16J7j03q6K0j3J03
6770B1q3K5M6j8j32K70j27q3P2M0q8l8Q9L2ln8Q8jlm5n9l3N1n3R1o4J30k18K34
6799H3j04J49k01J45j72J13J5j7N0m6O4j13R3M6r7l2o2Q7Kk8J42j66P4O8j08J0
6825ep9J14N1j18KJ2K2Ml7k0J00j2m6m6Q1mj13Q1J32j12Nr6J13j05PJ9J26k8m9
$$ plain form
6854 -1 34 83 10 -4 122 158 70 -45 7 -5 57 66 172 65 66 107 -26 141 164 -80 7 91 52 66 -80 54 36
6881 36 -88 -38 35 16 22 106 36 31 108 -39 -49 -73 24 177 -41 -29 93 -101 -57 -42 22 -25 -63 -81 -63 -94 23 -44
6909 -44 -114 -9 22 -35 47 22 87 -105 97 -8 -72 71 -34 49 21 -11 67 -7 59 -72 1 71 53 4 -60 37 56
6936 56 61 -145 47 58 86 6 -111 65 -34 -4 4 18 102 -9 6 33 -6 -50 -11 68 -9 -116 -44 162 15 -11 38
6963 38 -17 7 92 9 25 49 5 32 14 -75 5 1 -100 3 -129 40 104 -23 -143 33 64 36 9 -55 59 47 -64
6990 -64 -113 107 -113 14 -29 -72 58 -74 -15 84 -5 4 -50 68 -5 -61 -76 -32 58 70 -51 -43 -35 -2 -19 95 105 -52
7018 -52 1 -42 -27 -94 69 -8 16 -9 -6 -16 -100 13 89 -53 24 -172 -42 -12 -35 -47 39 35 5 -56 -26 -118 -39 -12 -31
7047 -31 -26 -6 88 64 -16 -33 21 -43 27 -64 -7 92 -1 90 73 67 86 -55 53 -70 68 -17 12 -62 -31 48 -44 -99 -26
$$ packed form
6854aL5M9p3j4J26L6q8j15N2j2O2RJ06j07JM1j33J67K3k44Q7Q4l9J4j46J34j8
6881C6j24N0P3j9OQ4p0nP7j47j0k4R7J53k18J2J22j94M4J5O4m7l8j8J8l1J17o7
6909d4p0J05L1n7Q2k5O5j92K02j05o4J43j05Q3k8l2P8p4O6j31P3P0j8m9o4R7J9
6936E6Nk06J92J1K8q0j17J76r9L0QJ4Q4j11J5K7l9m4L9P9p7j07P2K06j47k6M9
6963C8n5K4Q5q3J6K4m4K7j8q9Q0mj01J03j32J69O4j27j20J76L1k8k7o4J14j2j11
6990f4m9K20k20J27m3m3J30j32N9R9q9Rn4J18p3n6j5M4R0J2j21QQL3j7J14J0j57
7018e2N3m3J5o7J63p7K4k5Lj0q4J13P6j42P7j96J30L0k3j2Q6ml0o1L0r2P9K7j9
7047c1NK0R4k4q0j7N4o4P0r1N7R9r3R1j7oJ9j41J08j23J38q5K9p4L1P9r2n5P3
$$ plain form
7076 -26 53 44 28 27 107 -144 -67 67 -86 78 117 -46 -48 -10 15 17 38 -73 75 57 -37 129 65 -30 47 13 -26 -130
7104 -130 48 -24 -38 0 -36 -79 28 71 -75 8 12 -44 -70 -76 -57 8 114 -7 -54 67 -48 -53 152 71 -34 -68 -35
7131 -35 -1 7 32 22 74 26 16 171 -73 94 0 28 69 -7 12 -24 81 63 38 48 -103 -73 -22 -52 67 33 15 -56
7159 -56 63 26 125 13 -26 98 -117 31 32 55 53 44 20 85 39 -35 -38 -51 48 -6 -65 -114 116 23 33 -27 115 144 30
7188 30 -44 116 14 18 0 54 32 -61 -80 103 -60 0 -18 36 8 -92 -51 -1 -81 -18 31 -3 119 -36 -6 -42 -97
7215 -97 -107 -121 12 21 -5 -41 -23 -26 -27 25 42 80 12 45 -10 -38 -39 -35 15 3 46 -122 -2 -28 -1 54 14 58 42 -31 35
7246 35 79 -55 22 1 -5 -58 -16 120 -23 21 55 2 -3 96 -92 76 84 -111 5 -49 68 109 0 -16 115 -68
7272 -68 4 -1 82 12 -30 -26 -1 43 32 -16 115 50 -32 7 31 -11 -22 -98 61 -7 -88 50 36 50 -170 41 39 3 -36
$$ packed form
7076b6P9rj6jQ0k51P7J34j53J64L9j63kL8K5KK1j11J48j8r4J66o4r5P7l4l9j04
7104a30J78p2j4L8l6m3J07M3j46Q3Mn6k6oJ9O5J06j21m7J21j15nK05q1j05l4L3
7131c5L4QK5j0N2m8j0J55k44J67r4K8M1p6J9l6J05j8k5J0j51L0N1l0J19l4j8p1
7159e6J19l7R9j12l9J24k15J48JK3krk4O5m6p4lj3R9n4n9m9K30r3J0o0J42K9j14
7188C0p4J60j02Mj8N4k2r3j9J83j63O0j8N4k8j00M1N0q0O3M9l4J22j55L0l6n5
7215i7j0j4J33Rk6l6J8ljN2J7L8o8L3n5k8jMN0j2M3j68J20k6K7N5m0M4j6p3O6
7246C5M4j34P7k1on3M2J36j43M4L4n3nR9j88J68Qj95J16n4J17M1j09j6J31j83
7272f8P2nQ3p0m2MK5M4j1m8J31o5q2L9K4m2j1p6J59o8q1J38j4J4k20K11kl6l9
$$ plain form
7301 -36 -79 48 12 114 -70 3 27 -68 30 57 11 35 -102 111 5 -105 -1 18 15 -5 122 15 50 24 -128
7326 -128 -81 -71 -35 98 -56 -17 -44 -55 -36 -41 2 77 -47 -70 -2 146 38 -33 -132 23 47 -14 -56 -19 -90 -115 56
7353 56 -15 -16 90 59 78 76 48 -14 -40 -46 -130 -3 121 -74 -72 -138 173 21 -26 103 -77 8 -35 -90 73 51 -44 39
7381 39 80 62 -41 39 -80 103 15 -82 41 67 19 -30 39 29 -8 -140 107 -17 19 55 -28 -122 10 -62 -49 97
7407 97 -103 -111 6 -9 68 101 10 16 43 119 11 -16 -46 -27 53 -28 23 32 27 -4 10 101 165 -13 -32 198 61 134 3
7436 3 -5 34 -34 26 117 64 -52 -28 -4 164 45 32 -45 73 -24 -79 -86 -111 -38 -37 -52 -39 23 -51 20 9 14 -64 -22 -49 -15
7467 -15 79 -66 46 127 65 78 -14 -31 1 -2 40 110 10 35 -45 19 10 37 22 -54 70 -7 101 20 67 11 -56 11 -48
7496 -48 -25 72 81 -46 29 44 38 -81 29 10 -12 60 -137 114 107 10 55 -37 -6 -16 -125 -4 -84 38 -62 -29 22
$$ packed form
7301c6m3J27l6J02j84P3K4r5R8K7m6K4j37K13j06j10J04J9lk0J27j07L5k6j52
7326a28M7J0L6J33j54L9k7j1J9nM3P5j24k3O8J48j08p1r9J55K4o1m2L7p1k5J71
7353E6p1jJ06l1J9kk8o2k6oq4J27J24j95Ko6L11j52m7J29j80Q5m3n5J63k2r5Q3
7381C9M1j8j03Q0j19J83q8r7J23K6m8m9O9j0l7j32K47j24L6L6q3r4J32p2J3J46
7407I7k00qJ17j5P7L3r1OK7P6j08k7l0J9Q0q1N1Rnl1J4R1O4j78j9K30j37P3j31
7436CqL9o8O0R1n3j16K4K4J68j19j3p7J18r7n5pk5P3Jj5J3O2p4P1j1Np8M2k7L4
7467a5R4j45J12Q1o2J3r2j7L2lM2P0j00K5q0O4rK7j5p6J24p7J08q1M7n6o7O7n9
7496d8K3R7Rj27P5J5oj19J10j9k2P2j97K51pr7M5r2L1j0j09J21q0J22j00L3N1
$$ plain form
7523 22 -126 13 41 -127 -91 -12 12 75 26 27 -8 20 12 45 110 -53 -17 -56 1 104 -1 -133 34 100 -79 83
7549 83 107 21 -14 49 -23 29 -1 -46 -2 64 12 52 98 -44 -43 31 -148 -25 30 48 59 30 -44 0 47 -50 -38 -12 -26
7578 -26 -103 3 81 68 46 24 58 130 46 -70 -69 53 83 -92 -104 34 109 59 -56 37 -48 7 -51 60 51 -136 -69
7605 -69 16 34 19 78 -60 104 56 58 62 -23 -42 -18 106 86 -43 -8 -38 150 129 -58 66 -18 -125 -116 46 -8 -43
7632 -43 -31 -43 103 14 -8 44 -89 77 26 50 77 -19 -18 -65 -13 -13 -28 11 -12 -17 -6 134 35 5 79 -76 -123 -16 -98
7661 -98 -5 -34 9 -121 -12 -78 -84 18 25 38 -30 50 15 16 24 51 27 11 73 44 -122 11 -93 54 1 34 9 106 -44
7690 -44 -18 -5 78 35 96 -69 -66 -3 54 59 9 68 25 -57 -122 60 22 36 -11 152 10 -16 87 -39 29 -54 -42 -8
7718 -8 -52 75 13 -102 18 53 107 123 -97 -37 59 16 12 53 26 12 -49 30 14 39 -33 29 -106 -11 -35 -49 37 89 -122
$$ packed form
7523B2j48J39K8j68L6P9K4O3m9Jl5K8qL3O5j63L6l9N7J03j05j32J67O6j79J62
7549H3K4q6l5O3p2N2l0m5M4O6n2M0M6j42JP4j79J23N5J8J1k9p4M4M7r7J2K6j4
7578b6p7J06P8j3k2k2L4P2q4j16JJ22L0j75j2J38P5n0j15R3q5N5n8J11rj87O7
7605f9Q5J8j5N9j38J64m8KMq5j9K4J24k0j29L5l0J88k1j87J24q4j07RJ62n4l5
7632d3J2j2J46q9k2N2j33J66n1K4K7r6Jm7N2%j5L9k3nJ1J40r9l0P4j55m7J07q2
7661i8R3k9M3j30J09o6oJ02PJ3o8Q0l5JQK7k4j6O2k9j66J33j04J47n3L3k5R7j50
7690d4K6J3Q3m3O1j65LO3N7Nn0N9m3q2o5J82l8J4m7J63j42k6J03j26O8q3J2L4
7718hm4J27o2j15J20L5N4J6k20O0R6m3mM1k7j4o1P9j6K5p2O2j35R5k4j4Q6N2k11
$$ plain form
7747 -122 14 5 107 -45 -4 -27 -78 86 109 -13 18 -11 81 62 66 -27 35 104 48 -142 -149 -65 -141 79 -43 18 -165
7774 -165 67 -74 3 -64 -32 -109 -86 51 -17 -4 -3 34 -37 -51 -78 12 74 -10 -36 46 63 -25 22 -88 44 -104 23
7801 23 89 0 -21 17 59 -26 16 127 14 -67 48 -46 -20 -54 -92 26 -2 -1 -16 17 38 -54 185 4 50 13 -119
7828 -119 23 -93 17 -145 -152 39 49 74 74 10 -67 -108 38 83 -1 -4 24 -28 -26 74 25 86 -46 26 15 -2 -19 108
7856 108 -91 86 142 -76 69 -79 36 -28 169 51 94 -139 -51 -45 -70 67 45 56 68 -60 -66 -38 9 48 40 68
7882 68 23 -47 -37 -23 -2 -9 55 -38 -57 -30 36 -89 32 -78 24 98 72 61 -25 -42 10 -32 -14 10 -28 65 19 -19 -9
7911 -9 45 -65 79 -45 -112 -74 14 -57 50 76 -25 33 11 -2 13 23 68 85 31 34 40 22 81 -35 21 -57 -27 59 -52
7940 -52 -3 3 -34 2 153 -42 -94 -41 4 22 -103 51 -77 -15 18 -7 60 -156 -28 -82 -2 -118 37 -126 -40 -12
$$ packed form
7747a22J36rJ02j52M1k3n1J64K3j22L1k9R2j9Mr3O2O9n6j90pQ4p6K20j22O1j83
7774a65K32j41P7o7L2p7K3J37o8J3JL7p1j4k7R0O2q4k6Q2J7q8M7j10J32j48J27
7801B3O6q9k1L8M2q5M2J11j13q1J15r4K6l4l8J18k8Jj5L3K1r2K39j81M6l7j32
7828a19J42j16J10j62pJ91J0K5%o4p7m1J46M5q4lK8n2KJ00m9O1j32P2j1j7j7J27
7856A08j99J77N6k18J45j48J15o4J97j18M3k33Q8Ok5J37k2J1J2j28oK8M7L9qK8
7882F8m5p0J0J4K1pO4r3j9K7O6j25J21j10J02P4k6j1q6j7N2m2J8K4l8R3m6l8J0
7911iN4j10J44j24o7L8Q8p1J07K6j01N8k2j3J5J0M5J7n4LOj8N9j16N6p8L0Q6j11
7940e2M9Ol7L6J51j95n2N3M5J8j25J54j28O2L3k5O7k16J28n4Q0j16J55j63Q6K8
$$ plain form
7966 -12 -95 75 -74 28 44 126 -10 27 -5 -151 9 -39 93 42 -9 -59 -44 -8 11 44 -93 53 -119 12 -116
7991 -116 -74 42 -7 -5 19 60 39 45 1 16 75 28 -66 -41 -141 24 -31 52 25 32 -12 -45 -149 47 -60 -1 11 -43
8019 -43 46 103 -9 49 -25 -90 6 -28 -105 -29 -23 -50 -13 -7 71 -143 16 -17 51 -69 57 38 -51 -26 -7 55 -44 -71 94
8048 94 -37 21 29 -126 -33 38 -39 27 -63 214 2 73 -106 19 79 20 -61 17 -142 15 97 12 18 2 -84 -31 36
8075 36 -11 -28 -96 -40 -12 59 -21 76 -7 6 50 69 75 -49 -17 -65 8 2 -62 57 -140 50 18 -37 -98 55 45 51 -30
8104 -30 -36 86 -143 18 -184 -64 -72 -26 -50 -80 -9 -22 -35 -14 -10 109 -63 55 21 32 -18 -45 89 -117 59 -125
8130 -125 -63 59 86 -29 -48 -41 -17 29 -104 6 83 61 -3 -92 -37 -26 5 51 -23 -36 72 -3 91 -84 -52 6 57
8157 57 0 -26 59 38 53 62 16 -61 7 -104 101 29 -12 16 -3 7 -8 -11 89 6 -32 -30 -146 -8 -88 -47 101 -65
$$ packed form
7966a2q3J70j49J02J6Q2j36L7l2j46J60m8J32n1n1n0J5L6J9L3j37J46j72J31j28
7991a16M2J16m9KK4M1k1Om4J5N9m7r4K5j00J65n5Q3k7Pm4l3j04J96j07N9J2n4
8019d3Q9N7j12N8p4o5R6l4p7P6Ok7L7OP8k14J59l3O8j20J26j9q9K5J9O2r9k7J65
8048I4j31N8Qj55R3P1p7O6r0K77k12P1j79J25O0n9q1P8j59J57Q2q5Oj6q6N3O7
8075C6m7j7o8N6K8P1q0R7q3J3M4J9Oj24L2m8P3oo4J19j97J90l2n5o1J53j0Oq1
8104c0oJ22k29J61k02J20qM6k4l0P1j3j3K1MJ19j72J18l4J1n0k7J34k06J76j84
8130a25O2J22K7j15j9PK4M6j33J10P7k2o4q9N5J1L1M6p4j3J08p5R4j75L2N8N1
8157E7n7k6Q5k1J5Rm6p7O8j11K05p2m1K8j9J0j5lJ00q3l8Kj16J38q0M1J48j66
$$ plain form
8185 -65 -39 44 71 127 23 -139
$$ packed form
8185f5K6Q3K7N6j04j62
8191a39
$$ Imaginary data points
##PAGE= N=2
##DATA TABLE= (X++(I..I)), XYDATA
$$ plain form
0 0 0 0 0 0 0 0 0 0 0 0 0 0 0 0 0 0 0 0 0 -6 7 -7 8 -8 8 -8 8 -13 13 -14 15 -18 21 -21 23 -28 29 -32 36 -39 44 -50
42 -50 54 -60 67 -74 83 -94 104 -119 137 -159 187 -227 281 -362 493 -734 1262 -2887 17053
61 17053 87639 14631 -57202 20666 89388 6870 -65933 12367 82533 5959 -58531 23163
73 23163 91941 15089 -48483 29340 90398 10057 -52219 25095 84070 6650 -49235 29144
85 29144 82813 1284 -56345 18069 67159 -12129 -61909 17698 67450 -10553 -57665 19215
97 19215 61736 -20193 -67223 7800 46047 -34647 -74970 4296 43941 -32970 -67598 11556
109 11556 45222 -35320 -69555 8500 38690 -40630 -69219 11336 39082 -41042 -65652 16106
121 16106 40812 -39126 -59698 23723 45965 -34478 -52108 32096 50826 -32226 -49054 34129
$$ packed form
0@%%%%%%%%%%%%%%%%%%%oJ3j4J5j6J6j6J6k1K6k7K9l3L9m2M4n1N7o1O8p5Q3r4
42e0J04j14J27j41J57j77J98k23K56k96L46m14N08o43Q55j227J996m149J9940
61A7053P0586p3008p1833P7868O8722q2518p2803P8300P0166p6574o4490Q1694
73B3163O8778p6852o3572P7823O1058q0341o2276P7314N8975p7420n5885P8379
85B9144N3669q1529n7629P4414M9090p9288m9780P9607M9752p8003m7112P6880
97A9215M2521q1929m7030P5023L8247q0694m0323P9266L9645p6911l4628P9154
109A1556L3666q0542l4235P8055L0190p9320k8589Q0555K7746q0124k4610Q1758
121A6106K4706p9938k0572Q3421K2242q0443j7630Q4204J8730q3052j6828Q3183
$$ plain form
133 34129 49193 -34622 -48074 38106 53904 -28028 -38221 47605 59677 -24662 -35396 47768
145 47768 56163 -28681 -37710 45287 52531 -30048 -35737 47360 52824 -28994 -33363 47414 49814
158 49814 -31760 -34579 44933 44924 -35809 -37213 40403 38478 -40380 -38970 38551 35999 -40328 -36950
172 -36950 38811 34105 -41397 -36942 35775 28483 -45918 -39780 31965 23709 -47269 -37239 33796
185 33796 24344 -44726 -33200 35377 22738 -45280 -31878 34784 19472 -46753 -30588 35072
197 35072 18131 -45679 -26218 38378 19095 -43184 -21363 41488 19510 -42143 -18630 42412
209 42412 17256 -43128 -17053 42917 16432 -41952 -12860 46226 17704 -39640 -8873 48565
221 48565 17081 -39559 -7697 47835 14577 -40769 -6810 48043 13759 -39963 -4370 49392
$$ packed form
133C4129J5064q3815j3452Q6180J5798q1932j0193Q5826J2072q4339j0734Q3164
145D7768Q395q4844r029Q2997P244q2579n689Q3097N464q1818m369Q0777K400
158D9814q1574k819P9512rq0733j404P7616j925p8858J410P7521k552p6327L378
172c6950P5761m706p5502M455P2717p292p4401O138P1745q256p0978J0030P1035
185C3796r452o9070J1526O8577j2639o8018J3402O6662j5312o6225J6165O5660
197C5072j6941o3810J9461O4596j9283o2279K1821O2851k1978o1653K3513O1042
209D2412k5156o0384K6075N9970k6485n8384K9092N9086k8522n7344L0767N7438
221D8565l1484n6640L1862N5532l3258n5346L3959N4853l4284n3722L5593N3762
$$ plain form
233 49392 13225 -39579 -2936 48989 11522 -40675 -3394 47072 8365 -42391 -4162 45423
245 45423 6499 -42599 -3661 44603 5003 -42962 -3542 42939 2482 -44299 -4767 40019
257 40019 -684 -45617 -5179 38609 -2106 -45286 -4102 38148 -3333 -44706 -3280 37224
269 37224 -4788 -44649 -2782 36091 -6139 -43800 -1140 36075 -6101 -41617 1451 36763
281 36763 -5847 -39506 3893 36957 -6144 -37746 6016 36951 -6569 -35991 8519 37535
293 37535 -6410 -33574 11445 37968 -6895 -31877 13392 37550 -7862 -31178 14716 36855
305 36855 -9213 -30411 15849 36494 -10274 -29747 16852 35433 -11782 -29736 17054 33713
317 33713 -13842 -30212 16988 32145 -15521 -30273 16892 30577 -17030 -30225 16955 29158
$$ packed form
233D9392l6167n2804L6643N1925l7467n2197L7281N0466l8707n0756L8229M9585
245D5423l8924m9098L8938M8264l9600m7965L9420M6481m0457m6781L9532M4786
257D0019m0703m4933M0438M3788m0715m3180M1184M2250m1481m1373M1426M0504
269C7224m2012l9861M1867L8873m2230l7661M2660L7215m2176l5516M3068L5312
281C6763m2610l3659M3399L3064m3101l1602M3762L0935m3520k9422M4510K9016
293C7535m3945k7164M5019K6523m4863k4982M5269K4158m5412k3316M5894K2139
305C6855m6068k1198M6260K0645m6768j9473M6599J8581m7215j7954M6790J6659
317C3713m7555j6370M7200J5157m7666j4752M7165J3685m7607j3195M7180J2203
$$ plain form
329 29158 -18640 -30503 16950 27636 -20078 -30590 17126 26541 -21245 -30206 17487 25962 -21966
342 -21966 -29857 18078 25524 -22410 -29345 18541 25246 -22519 -28444 19258 25043 -22323 -27324
355 -27324 19935 24686 -21951 -26007 20510 24188 -21773 -24576 21243 23616 -21451 -23022 21937
368 21937 22900 -21454 -21355 22737 22104 -21340 -19815 23594 21230 -21360 -18324 24040 20396 -21525
382 -21525 -16985 24618 19409 -21786 -15988 24852 18382 -21999 -14827 25083 17194 -22388 -13872
395 -13872 25188 15789 -22737 -12950 24956 14340 -23311 -12198 24790 12811 -24099 -11464
407 -11464 24799 11161 -24987 -10967 24415 9624 -25770 -10653 24350 8211 -26906 -10368
419 -10368 24419 7015 -27535 -10141 24379 6330 -28129 -9643 24580 5608 -28476 -9178
$$ packed form
329B9158m7798j1863M7453J0686m7714j0512M7716R415m7786q961M7693Q475m7928
342b1966p891M7935P446m7934o935M7886O705m7765n925M7702N785m7366n001
355b7324M7259M751m6637m056M6517L678m5961k803M5819K373m5067j571M4959
368B1937R63m4354R9M4092o33m3444J525M3409k364m2590L036M2364l644m1921
382b1525M540M1603n209m1195N798M0840o470m0381P172L9910p889l9582Q516
395a3872L9060r399l8526R787L7906j0616l7651J1113L6988j1979l6910J2635
407a1464L6263j3638l6148J4020L5382j4791l5394J5117L5003j6139l5117J6538
419a0368L4787j7404l4550J7394L4520j8049l4459J8486L4223j8972l4084J9298
$$ plain form
431 -9178 24584 5334 -28268 -8208 25121 5082 -27700 -7142 25483 4967 -26990 -5852
443 -5852 26040 4966 -26346 -4564 26535 4950 -25426 -3123 27206 4949 -24246 -1491
455 -1491 27618 4871 -23504 -526 27476 4273 -23268 13 27030 3554 -22812 897
467 897 26673 2686 -22462 1278 25755 1486 -22718 1364 24185 -525 -23040 1158
479 1158 22954 -1923 -23241 1639 21982 -3250 -23151 2018 20938 -4744 -23568 1957
491 1957 19721 -6453 -23944 2484 19421 -7088 -23424 3841 19667 -7411 -22618 4985
503 4985 19865 -8073 -22404 5846 19659 -8653 -21817 6936 20266 -8302 -20535 8900
515 8900 21350 -7877 -19519 10135 21354 -8405 -19478 10410 20982 -8923 -19087 11200
$$ packed form
431i178L3762j9250l3602K0060L3329k0039l2782K0558L2625k0516l1957K1138
443e852L1892k1074l1312K1782L1099k1585l0376K2303L0329k2257k9195K2755
455a491K9109k2747k8375K2978K8002k3203k7541K3281K7017k3476k6366K3709
467H97K5776k3987k5148K3740K4477k4269k4204K4082K2821k4710k2515K4198
479A158K1796k4877k1318K4880K0343k5232j9901K5169J8920k5682j8824K5525
491A957J7764k6174j7491K6428J6937k6509j6336K7265J5826k7078j5207K7603
503D985J4880k7938j4331K8250J3813k8312j3164K8753J3330k8568j2233K9435
515H900J2450k9227j1642K9654J1219k9759j1073K9888J0572k9905j0164L0287
$$ plain form
527 11200 21224 -8765 -18188 12221 21408 -8881 -17868 12165 20559 -9996 -18428 11487 19159
540 19159 -10967 -18555 11445 18683 -11138 -17692 11995 18223 -11383 -17510 11588 16759 -12585
553 -12585 -17987 10793 15325 -13215 -17328 11212 15366 -12635 -15951 12096 15297 -12404 -15182
566 -15182 12209 14010 -13286 -15028 11944 13076 -13318 -13858 12838 13334 -12830 -12191 14093 13091
580 13091 -12918 -11538 13961 11817 -14195 -11666 13779 10732 -14574 -10859 14625 11029 -14260
593 -14260 -9760 15634 10411 -15040 -9790 15021 8930 -16330 -10168 14697 8081 -16619 -9267
606 -9267 15562 8216 -15893 -8073 16182 8030 -16307 -8125 15736 6701 -17054 -8102 15751
619 15751 6519 -16555 -6509 16965 7080 -15610 -5109 17713 6973 -15688 -5080 17007
$$ packed form
527A1200J0024k9989r423L0409R187l0289q987L0033Q394l0555q432K9915P672
540A9159l0126p588L0000P238k9821o554K9687O228k9606o127K9098N171k9344
553a2585n402K8780M532k8540m113K8540M154k8001l316K8047L201k7701k778
566a5182K7391J801k7296j742K6972J132k6394n40K6696M96k6164O39K6284j002
580A3091k6009J380K5499k144k6012K529K5445l047k5306L715K5484l596k5289
593a4260M500K5394n223k5451N250K4811o091k5260O162K4865o616k4700P352
606i267K4829p346k4109P820K4255q152k4337Q182K3861r035k3755Q952K3853
619A5751r232k3074J0046K3474r885k2690J0501K2822j0740k2661J0608K2087
$$ plain form
631 17007 5989 -16295 -5059 16922 5863 -15700 -3953 17653 6512 -14862 -3285 17639
643 17639 5571 -15185 -3680 16226 4042 -15968 -4017 15464 3375 -15457 -3148 15720
655 15720 3186 -15183 -2396 15003 1742 -15934 -3159 13654 -97 -16680 -3040 13405
667 13405 -380 -16240 -1598 13953 -341 -15498 -817 13896 -1252 -15918 -838 13194
679 13194 -2220 -16037 -131 13722 -1915 -14499 1748 14698 -1257 -13516 2809 14633
691 14633 -1995 -13685 2870 14010 -2837 -13389 3838 14672 -2392 -12170 5484 15393
703 15393 -2245 -11768 5808 14889 -3464 -12500 5404 14130 -4229 -12871 5684 14304 -4089
716 -4089 -12252 6427 14340 -4140 -12215 5822 13092 -5572 -13232 5017 11901 -6368 -13248 5209
$$ packed form
631A7007j1018k2284J1236K1981j1059k1563J1747K1606j1141k1374J1577K0924
643A7639j2068k0756J1505J9906j2184k0010J1951J9481j2089j8832J2309J8868
655A5720j2534j8369J2787J7399j3261j7676J2775J6813j3751j6583J3640J6445
667A3405j3785j5860J4642J5551j4294j5157J4681J4713j5148j4666J5080J4032
679A3194j5414j3817J5906J3853j5637j2584J6247J2950j5955j2259J6325J1824
691A4633j6628j1690J6555J1140j6847j0552J7227J0834j7064r778J7654R909
703A5393j7638r523J7576R081j8353r036J7904Q726j8359q642J8555Q620j8393
716d089q163J8679P913j8480q075J8037P270j8664p660J8249O884j8269o880J8457
$$ plain form
730 5209 11941 -6317 -12523 5801 11821 -6798 -12486 5385 10683 -7896 -13189 4989 9836 -8311
744 -8311 -12662 5599 10109 -7741 -11615 6458 10208 -7820 -11218 6511 9454 -8493 -11336 6651
758 6651 9148 -8552 -10378 7351 9464 -7733 -8958 8421 9635 -7657 -8423 8704 8823 -8254
772 -8254 -8165 8960 8593 -7985 -7118 9779 8928 -7536 -6063 10646 8700 -7933 -5871 10413 7763
787 7763 -8637 -6053 10352 7377 -8770 -5501 10827 7385 -8753 -5216 10912 6684 -9645
800 -9645 -5539 10230 5625 -10536 -6104 9856 4949 -10849 -5718 9936 4606 -11021 -5777 9628
814 9628 3914 -11668 -6052 9059 3039 -12285 -6169 8984 2963 -11961 -5474 9511 3040 -11671
828 -11671 -4944 9692 2790 -11531 -4620 9713 2715 -11275 -3936 10164 3103 -10405 -2629
$$ packed form
730E209O732j8258o206J8324O020j8619n688J7871N298j8579n293J8178M847j8147
744h311m351J8261M510j7850l874J8073L750j8028l398J7729K943j7947k843J7987
758F651K497j7700j826J7729K113j7197j225J7379J214j7292p66J7127J19j7077
772h254Q9J7125l67j6578Q67J6897q51j6464J473J6709j946j6633K062J6284k650
787G763j6400K584J6405k975j6147L269J6328l442j6138L537J6128m228j6329
800i645M106J5769m605j6161M432J5960m907j5798N131J5654n330j5627N244J5405
814I628n714j5582N616J5111o020j5324O116J5153o021j4924O487J4985o471j4711
828a1671O727J4636o902j4321O911J4333o998j3990P339J4100p061j3508P776
$$ plain form
841 -2629 10959 3552 -9635 -1739 11412 3481 -9393 -1286 11385 3172 -9081 -680 11571
854 11571 3123 -8555 21 11807 2843 -8390 489 11373 2196 -8651 403 10926 1237
867 1237 -8941 343 10145 587 -9169 540 9699 -460 -9651 347 9032 -1433 -10271 -38
881 -38 8371 -2346 -10609 -27 8304 -2834 -10613 282 8066 -3126 -10777 503 7935 -3397
895 -3397 -10702 901 8050 -3376 -10297 1597 8419 -3159 -9633 2498 8855 -2966 -9144 3140
909 3140 9258 -2815 -8510 3739 9482 -2840 -8294 4354 9775 -2579 -7576 4880 9813 -2591
923 -2591 -7453 5004 9648 -2976 -7431 5008 9272 -3137 -7363 4834 8799 -3514 -7354 4651
937 4651 8234 -3960 -7351 4542 7579 -4576 -7373 4292 6718 -4988 -7369 4319 6265 -5548
$$ packed form
841b629J3588p407j3187P896J3151p931j2874Q107J2671q213j2253Q401J2251
854A1571q448j1678Q576J1786q964j1233Q879J0884r177j0847R054J0523r689
867A237j0178R284R802r558r756R709R159j0159r191R998Q685j0465q838J0233
881c8Q409j0717q263J0582Q331j1138p779J0895P784j1192p651J1280P432j1332
895c397p305J1603P149j1426o921J1894O822j1578o474J2131O357j1821o178J2284
909C140O118j2073n695J2249N743j2322n454J2648N421j2354m997J2456M933j2404
923b591m862J2457M644j2624m455J2439M264j2409m226J2197L965j2313l840J2005
937D651L583j2194l391J1893L037j2155k797J1665K426j1706k381J1688J946j1813
$$ plain form
951 -5548 -7206 4352 5782 -5865 -6981 4417 5388 -6054 -6767 4689 5204 -6280 -6464 5067
965 5067 5052 -6209 -6009 5353 5088 -6359 -5593 5711 5054 -6234 -5202 6103 5031 -6142 -4749
980 -4749 6504 4932 -6236 -4391 6734 4566 -6343 -4110 7035 4558 -6498 -3766 7241
993 7241 4229 -6790 -3505 7484 4191 -6812 -3453 7549 3980 -7097 -3297 7608 3842 -7191
1007 -7191 -3241 7667 3745 -7041 -3120 7489 3311 -7030 -2955 7458 3144 -7075 -2731
1020 -2731 7407 2909 -7052 -2561 7207 2555 -7151 -2348 7053 2078 -7326 -2230 7037 1776 -7318
1035 -7318 -2212 6765 1365 -7512 -1976 6507 984 -7396 -1859 6405 716 -7418 -1647 6267 508
1050 508 -7334 -1254 6380 120 -7398 -1039 6401 31 -7076 -527 6522 13 -6741 55 6772
$$ packed form
951e548j658J1558J430j1647j116J1398R71j1442p13J1456N15j1484j84J1531
965E067j5j1261K00J1362k65j1447P66J1304o57j1288J032J1305j072j1173J393
980d749J1253j572j1168J845J1125k168j0909K233J1145k477j1056K732J1007
993G241l012j1019L285J0989l293j1003L359J1002l569j1077L800J0905l766j1033
1007g191L950J0908l922j0786L921J0609m178j0341M075J0413m314j0219M344
1020b731J0138m498r961M491R768m652r706M803R401m975r404N096R267n261r094
1035g318N106Q977n400q877N536Q483n523q380N537Q264n689q134N771P914n759
1050E08p842O080P634o260p518O359P440o370p107O549P049o509o754O796O717
$$ plain form
1065 6772 -274 -6484 678 6875 -369 -6212 1247 7087 -308 -6121 1634 7324 -317 -5939 2045
1080 2045 7459 -524 -5773 2115 7301 -761 -5870 2344 7161 -1119 -5951 2325 6907 -1625 -6151
1095 -6151 2100 6542 -2184 -6354 1988 5967 -2545 -6654 1739 5560 -3023 -6864 1689 5238 -3318
1110 -3318 -6788 1634 4977 -3484 -6797 1606 4822 -3707 -6708 1818 4897 -3424 -6152 2494 5020
1125 5020 -3187 -5550 2823 5120 -3053 -5221 3100 5147 -2816 -4593 3604 5422 -2612 -3970 4159
1140 4159 5556 -2572 -3622 4486 5289 -2753 -3500 4555 5146 -2875 -3432 4668 4784 -3073 -3329 4779
1156 4779 4380 -3540 -3296 4330 3690 -4274 -3633 4123 3178 -4758 -3658 4092 2810 -5092 -3536 4136
1172 4136 2471 -5301 -3832 3770 2042 -5610 -3674 3912 1946 -5648 -3331 4263 2120 -5418 -3015
$$ packed form
1065F772p046o210P162O197p244n843P459N840p395n813P755N690p641n622P984
1080B045N414p983n249P888N186q062n109Q214M817q280m832Q276M582q532m526
1095f151Q251M442q726m170Q342L979q512m109Q393L821q583l841Q553L549q556
1110c318l470Q422L343q461l313Q403L216q529l001Q526L079q321k728Q646K526
1125E020q207k363Q373K297q173k168Q321K047p963j777Q197J818q034j358Q129
1140D159J397q128j050Q108Q03q042p47Q055N91q021n57Q100J16p857k56Q108
1156D779l99p920K44P626o40p964O41P756r45p936J100P750j282p902J556P672
1172D136j665p772J469P602j728p652J936P586j966p594K317P594k143p538K403
$$ plain form
1187 -3015 4431 2148 -5243 -2754 4635 2102 -5125 -2427 4955 2249 -4911 -1806 5295 2387 -4520
1202 -4520 -1362 5641 2351 -4641 -1312 5584 2058 -4730 -1199 5507 2093 -4617 -868 5656 1925
1217 1925 -4531 -781 5543 1624 -4765 -882 5149 1019 -5122 -985 4874 788 -4924 -685 4977
1232 4977 560 -4912 -546 4808 241 -5100 -550 4591 -213 -5222 -177 4630 -326 -5069 76
1247 76 4864 -300 -4928 274 4807 -668 -5024 268 4635 -863 -5123 576 4692 -943 -4695
1262 -4695 996 4794 -809 -4647 1005 4646 -1154 -4756 960 4343 -1551 -4840 1235 4433 -1459
1277 -1459 -4617 1641 4568 -1470 -4364 1914 4496 -1849 -4640 1675 4476 -2079 -4508 2076 4702
1292 4702 -1690 -4229 2333 4881 -1635 -4102 2171 4633 -1804 -4153 2434 4681 -1982 -3919 2636
$$ packed form
1187c015P446k283p391K489P389k533p227K698P382k706p160L105P101k908o907
1202d520L158P003l290o992L329O896l526o788L531O706l414o710L749O524l731
1217A925o456L750O324l919o389L883O031m130o141M137N859m086n712M239N662
1232D977m417n472M366N354m567n341M550N141m804n009N045M807m956m743N145
1247G6M788n164m628N202M533n475m356N292M367n498m260N699M116n635l752
1262d695N691L798n603l838N652L641n800l602N716L383n894l289O075L198n892
1277a459l158O258K927o038k894O278K582o345k791O315K801o555k429O584K626
1292D702o392k539O562K548o516k467O273K462o437k349O587K247o663j937O555
$$ plain form
1307 2636 4460 -1887 -3529 2673 4444 -2003 -3541 2750 3869 -2496 -3827 2521 3689 -2812 -3809
1322 -3809 2715 3393 -2964 -3541 2778 3327 -3185 -3718 2415 2729 -3556 -3905 2338 2553 -3617 -3605 2527
1339 2527 2587 -3603 -3289 2774 2639 -3530 -3185 2962 2304 -3611 -2915 3201 2313 -3476 -2375 3585 2643
1356 2643 -3269 -1914 3951 2634 -3194 -1784 4014 2438 -3289 -1699 4190 2532 -3268 -1364 4550
1371 4550 2633 -3126 -1361 4411 2435 -3366 -1262 4409 1909 -3754 -1610 4062 1579 -3858 -1539
1386 -1539 3972 1541 -3984 -1543 3870 1186 -4277 -1726 3590 720 -4571 -1778 3544 571 -4687
1401 -4687 -1484 3628 556 -4449 -1320 3593 470 -4440 -1322 3538 364 -4276 -1013 3721 463
1416 463 -3868 -285 4094 613 -3725 -66 4072 504 -3613 96 4171 397 -3583 369 4272
$$ packed form
1307B636J824o347j642O202J771o447j538O291J119o365j331O348J168o501r97
1322c809O524O78o357n77O319N49o512n33O133L14o285l49O243K15o170J2O132
1339B527O0o190L14O063j35o169L45O147o58n915O96O116q88n789J101N960r42
1356B643n912J355N865j317n828J410N798j576n727J590N889j658n800J904N914
1371D550j917n759J765N772j976n801K104N671k500n663K144N672k483n437K319
1386a539N511k431n525K441N413k684n463K551N316k870n291K793N322k973n258
1401d687L203N112l072n005L129M913l123m910L118M860l174m640L263M734l258
1416D63m331L583M379l481m338L659M138l568m117L709M075l774l980L952L903
$$ plain form
1431 4272 206 -3431 675 4222 253 -3354 717 4170 -120 -3517 638 3943 -374 -3624 761
1446 761 3852 -660 -3550 788 3708 -913 -3856 805 3578 -1174 -3958 874 3458 -1369 -3973
1461 -3973 1036 3449 -1436 -3903 1309 3471 -1504 -3755 1114 3548 -1779 -3676 1472 3555 -1693
1476 -1693 -3650 1711 3680 -1640 -3322 1869 3679 -1552 -3339 1828 3496 -1736 -3330 1897 3415
1491 3415 -1878 -3275 2005 3407 -1906 -3128 2096 3226 -2001 -3122 1971 2965 -2084 -3204 2131
1506 2131 2893 -2342 -3187 2083 2719 -2385 -2927 2181 2824 -2417 -2903 2190 2570 -2315 -2687 2410 2521
1523 2521 -2436 -2504 2494 2508 -2410 -2273 2759 2487 -2485 -1996 2858 2370 -2670 -1873 3097 2411 -2690
1540 -2690 -1888 3124 2287 -2728 -1948 3161 2128 -2755 -1902 3040 1979 -3064 -1979 3083 1775 -3068
$$ packed form
1431D272m066l637M106L547l969l607M071L453m290l397M155L305m317l250M385
1446G61L091m512k890M338K920m621k943M661K773m752k784M832K584m827k604
1461c973N009K413m885k467N212K162m975k251M869K434n327j897N148K083n248
1476a693j957N361J969n320j682N191J810n231j787N167J668n232j594N227J518
1491C415n293j397N280J402n313j222N224J130n227j121N093R94n049j120N335
1506B131P62n235q45N270O36n104n42N108O43n241m86N093L80m885l72N097J11
1523B521m957o8M998J4m918J37N032k72m972M89M854m88n040P97M970o86n101
1540b690Q02N012q37n015P80N109j033m883Q53M942j061n043J085N062j308m843
$$ plain form
1556 -3068 -1869 2987 1582 -3204 -1806 3053 1421 -3301 -1590 3058 1223 -3566 -1632 3118 1095
1571 1095 -3563 -1427 3107 1016 -3520 -1349 3328 987 -3532 -1035 3359 1083 -3405 -1074 3492
1586 3492 1081 -3295 -832 3521 1080 -3049 -684 3525 953 -3169 -493 3384 877 -3110 -380
1601 -380 3373 748 -3050 -303 3491 514 -3155 -219 3351 175 -3262 -182 3265 90 -3402
1616 -3402 -173 3232 -37 -3452 -93 3021 -327 -3409 13 3079 -349 -3469 147 3063 -486
1631 -486 -3397 307 3113 -479 -3165 409 3045 -539 -3027 762 3139 -580 -2970 1051 3243
1646 3243 -731 -2942 1266 3349 -794 -2778 1282 3335 -772 -2869 1275 3255 -943 -2814 1361
1661 1361 3175 -1040 -2911 1279 3095 -1368 -3033 1237 2862 -1488 -2936 1363 2691 -1558 -3097
$$ packed form
1556c068J199M856j405m786J398M859j632m722J711M648j835m789J934M750k023
1571A095m658K136M534k091m536K171M677k341m519K497M394k276m488K331M566
1586C492k411m376K463M353k441m129K365M209k572m122K676L877k507l987K730
1601c80L753k625l798K747L794k977l669K936L570l176l437L080L447l175l492
1616c402L229L405l269l415L359L114l348l082L422L066l428l120L616K916l549
1631d86k911L704K806l592k686L574K636l584k488L789K377l719k390M021K192
1646C243l974k211M208K083m143j984M060K053m107k097M144J980m198j871M175
1661A361J814m215j871M190J816m463j665M270J625m350j448M299J328m249j539
$$ plain form
1676 -3097 1280 2603 -1849 -3197 1240 2488 -1959 -2915 1529 2423 -1930 -2817 1443 2432 -1974 -2663
1692 -2663 1598 2477 -1853 -2496 1838 2674 -1843 -2322 2050 2454 -1746 -2161 2195 2416 -1825 -1934 2302
1709 2302 2520 -1865 -1837 2242 2340 -2020 -1742 2438 2311 -2048 -1823 2494 2078 -2209 -1736 2421 1824 -2444
1727 -2444 -1693 2446 1581 -2569 -1785 2343 1562 -2727 -1760 2486 1371 -2841 -1839 2238 1320 -2968
1743 -2968 -1638 2390 1257 -2828 -1523 2598 1221 -2838 -1566 2614 1045 -2939 -1379 2617 1055
1758 1055 -2749 -1171 2945 1236 -2740 -1010 2969 1183 -2742 -942 3073 1040 -2813 -675 3149
1773 3149 1124 -2593 -665 3066 1192 -2654 -523 3111 829 -2846 -486 3063 707 -2870 -651
1788 -651 2932 545 -2918 -453 2979 449 -2945 -452 3000 276 -2998 -474 2759 180 -3083
$$ packed form
1676c097M377J323m452j348M437J248m447r56M444Q94m353q87M260R89m406o89
1692b663M261Q79m330o43M334Q36m517m79M372M04m200m15M356K21m241j09M236
1709B302K18m385K8M079R8m360K78M180j27m359K25M317m16m287M73M157n97m268
1727b444P51M139q65m150P84M128p81m289R67M246j115m212J002M077r18m288
1743b968J330M028j133m085J305M121j377m059J272M180j569l984J560L996j562
1758A055l804J578M116j709l976J730L979j786l925J800M015k033l853K138L824
1773C149k025l717J928L731j874l846K131L634k282l675K360L549k356l577K219
1788f51L583k387l463K465L432k530l394K493L452k724l274K524L233k579l263
$$ plain form
1803 -3083 -288 2690 26 -2991 -277 2835 20 -3009 -26 2787 -93 -3073 75 2805 -290
1818 -290 -3006 165 2742 -278 -2796 283 2861 -342 -2747 419 2909 -363 -2832 507 2738
1833 2738 -555 -2811 522 2704 -571 -2738 649 2816 -636 -2625 731 2640 -705 -2733 833
1848 833 2741 -738 -2631 874 2737 -919 -2553 1047 2760 -709 -2641 1127 2718 -1165 -2599
1863 -2599 1294 2784 -1079 -2542 1294 2779 -1105 -2447 1435 2516 -1162 -2485 1405 2635 -1424
1878 -1424 -2465 1352 2411 -1362 -2402 1216 2234 -1451 -2462 1376 2038 -1690 -2307 1375 1978 -1902
1894 -1902 -2400 1375 1911 -1874 -2370 1405 1833 -1953 -2241 1645 1854 -1996 -2247 1730 1837 -1896 -1943
1911 -1943 1889 1840 -1911 -1724 1994 2026 -1728 -1517 2139 2004 -1728 -1443 2267 1903 -1858 -1186 2407
$$ packed form
1803c083K795K978k664l017K714L112k815l029K983K813k880k980L148K730l095
1818b90k716L171K577l020k518L079K578l203k405L166K490l272k469L339K231
1833B738l293k256L333K182l275k167L387K167l452j989L356J909l345k028L566
1848H33J908l479j893L505J863l656j634L600J713l469j932L768J591l883j434
1863b599L893J490l863j463L836J485l884j342L882J081l678j323L890J230m059
1878a424j041L817J059l773j040L618J018l685j011L838O62l728o17L682O03l880
1894a902m98L775N36l785m96L775M28l786k88L886K09l850k51L977J07l733m7
1911a943L832m9l751J87L718L2l754K11L656j35l732K85L710l64l761O72L593
$$ plain form
1928 2407 1802 -1910 -1081 2524 1740 -1880 -1180 2383 1646 -1958 -1248 2430 1368 -2160 -1257 2312 1240
1945 1240 -2421 -1285 2285 1130 -2470 -1357 2126 925 -2592 -1468 2121 668 -2730 -1558 1917
1960 1917 707 -2830 -1263 2009 666 -2683 -1334 2078 669 -2695 -956 2304 603 -2600 -836
1975 -836 2456 678 -2399 -546 2579 770 -2382 -273 2767 881 -2185 -376 2896 803 -2106
1990 -2106 -103 2808 794 -2100 111 2970 605 -2060 46 2798 594 -2328 -8 2683 355
2005 355 -2460 -73 2548 54 -2371 70 2484 -189 -2636 -162 2239 -223 -2832 -100 2007
2020 2007 -530 -2886 -134 2200 -479 -2844 -20 2191 -647 -2737 51 2226 -678 -2772 164
2035 164 2305 -525 -2571 452 2287 -542 -2453 675 2425 -392 -2358 636 2443 -460 -2197
$$ packed form
1928B407o05l712Q29L605p84l620P00L563p37l604P10L678j062l528R03L569j072
1945A240l661J136L570j155l600J113L483j201l517J124L589j453l398J172L475
1960A917j210l537J567L272j343l349J349L412j409l364J739L260j701l203J764
1975h36L292j778l077J853L125j809l152K109L040j886l066J809L272k093k909
1990b106K003K911k014k894K211K859k365k665K106K752k204k922K320K691k328
2005C55k815K387K621k494k425K441K414k673k447K474K401k462k609K732K107
2020B007k537k356K752K334k679k365K824K211k838k090K788K175k904k094K936
2035A64K141k830k046L023J835k829j911L128J750k817j966K994J807k903j737
$$ plain form
2050 -2197 737 2633 -388 -2197 978 2542 -545 -2072 945 2543 -626 -2067 1034 2379 -681
2065 -681 -2055 960 2308 -752 -2166 940 2293 -958 -2140 959 2226 -939 -2118 920 1999
2080 1999 -1075 -2199 883 2066 -1312 -2280 984 1907 -1321 -1994 1098 1984 -1299 -2042 1232 1809
2096 1809 -1449 -1929 1166 1756 -1448 -2011 1377 1763 -1377 -1725 1538 1753 -1427 -1787 1424 1677 -1586
2113 -1586 -1576 1598 1681 -1615 -1529 1645 1545 -1590 -1477 1629 1522 -1719 -1444 1807 1527 -1698 -1414 1599
2131 1599 1425 -1751 -1381 1833 1299 -1795 -1369 1799 1223 -1694 -1278 1864 1232 -1789 -1085 1835 1338
2148 1338 -1866 -1051 1980 1252 -1871 -1034 2005 1174 -1893 -953 1888 1033 -1848 -834 1936 890
2164 890 -1968 -894 1949 898 -1935 -735 1880 824 -2007 -835 1805 709 -2057 -842 1845
$$ packed form
2050b197K934J896l021j809L175J564l087j527L017J598l169j441L101J345l060
2065f81j374L015J348l060j414L106J353l251j182L099J267l165j179L038J079
2080A999l074j124L082J183l378r68L264R23l228o73L092Q86l283p43L274N77
2096A809l258m80L095N90l204n63L388L86l140l48L263K15l180l60L211K53l263
2113a586J0L174Q3l296Q6L174j00l135J13L106j07l241K75L251k80l225K84L013
2131A599j74l176L70L214n34l094M26L168n76k917M16L142o32l021P04K920m97
2148A338l204Q15L031p28l123Q37L039q31l067R40K841q55k881J014K770j046
2164H90k858J074K843j051k833J200K615j056k831J172K640j096k766J215K687
$$ plain form
2179 1845 584 -1987 -675 1854 442 -2107 -691 1779 452 -2119 -570 2053 305 -2068 -416
2194 -416 2006 377 -1954 -419 2095 263 -2052 -296 2162 271 -1982 -144 2109 221 -1877
2209 -1877 -41 2170 230 -1888 -35 2130 154 -1917 22 2114 114 -1910 169 2120 22
2224 22 -1961 248 1986 -68 -2137 209 2022 -257 -2073 48 2048 -302 -2227 154 1854
2239 1854 -208 -2093 228 1913 -341 -2177 367 1894 -603 -1973 276 1879 -447 -1991 432
2254 432 2028 -511 -1839 525 2054 -565 -1832 634 1975 -518 -1731 658 2013 -440 -1526
2269 -1526 823 1908 -434 -1684 792 1922 -590 -1714 805 1944 -692 -1710 819 1763 -799
2284 -799 -1790 900 1687 -917 -1703 705 1533 -979 -1780 876 1458 -988 -1828 857 1491 -1239 -1606
$$ packed form
2179A845j261k571J312K529j412k549J416K470j327k571J549K623j748k373J652
2194d16K422j629k331J535K514j832k315J756K458j891k253J838K253j888k098
2209a877J836K211j940k118J853K165j976k071J939K092k000k024K079J951k098
2224B2j983K209J738k054k069K346J813k279j816K121K000k350j925K381J700
2239A854k062j885K321J685k254j836K544J527k497j370K249J603k326j544K423
2254D32J596k539j328K364J529k619j267K466J341k493j213K389J355k453j086
2269a526K349J085k342j250K476J130k512j124K519J139k636j018K529R44k562
2284g99r91K690P87k604p86K408Q28k512q01K656N82k446q40K685O34k730l67
$$ plain form
2301 -1606 911 1462 -1051 -1502 1082 1404 -1163 -1625 1061 1473 -1107 -1490 1271 1390 -1130 -1472 1427
2318 1427 1472 -1165 -1261 1255 1388 -1140 -1265 1483 1468 -1207 -1051 1565 1517 -1241 -1087 1485 1336 -1284
2336 -1284 -1159 1461 1203 -1350 -1142 1507 1156 -1508 -1114 1349 1034 -1497 -1065 1390 947 -1550 -1325
2353 -1325 1428 942 -1544 -1101 1430 854 -1658 -1140 1512 838 -1576 -940 1435 891 -1419 -815 1473
2370 1473 869 -1434 -821 1441 799 -1487 -725 1652 806 -1403 -611 1623 740 -1468 -477 1720 859
2387 859 -1479 -518 1696 673 -1438 -428 1563 541 -1563 -451 1595 499 -1635 -511 1546
2402 1546 379 -1703 -432 1565 327 -1693 -493 1561 149 -1865 -331 1591 117 -1666 -368
2417 -368 1578 37 -1763 -209 1552 20 -1610 -77 1602 38 -1513 72 1697 154 -1479
$$ packed form
2301a606K517N51k513m51K584L22k567m62K686M12k580l83K761J19k520l42K899
2318A427M5k637r6K516J33k528j25K748j5k675J56K616m8k758J54K572j49k620
2336a284J25K620k58k553K08K649l51k664L94K463l15k531M32K455m43k497K25
2353a325K753m86k486M43K531n76k512N18K652o74k414O36K375n44k310O04K288
2370A473o04k303O13K262o42k286P62K377q46k209P92K234q83k208R91K197q61
2387H59k338R61K214j023k111J010J991j022k104J112K046j096k134J124K057
2402A546j167k082J271J997j238k020J200K054j412k014J534J922j474j783J298
2417c68J946j541j800J554J761j532j630J533J679j564j551J585J625j543j633
$$ plain form
2432 -1479 183 1753 86 -1437 229 1756 97 -1590 280 1726 60 -1426 219 1664 -37
2447 -37 -1565 67 1637 -210 -1523 95 1661 -268 -1633 268 1393 -356 -1755 169 1470
2462 1470 -430 -1722 137 1451 -486 -1638 193 1284 -552 -1558 346 1274 -618 -1468 323
2477 323 1396 -588 -1440 542 1351 -586 -1303 642 1605 -569 -1262 783 1583 -514 -1301 826 1468
2494 1468 -538 -1286 817 1589 -594 -1178 832 1426 -558 -1211 816 1513 -725 -1220 898 1345 -772
2511 -772 -1091 856 1138 -845 -1279 791 1107 -975 -1216 819 962 -1064 -1159 755 1040 -1171 -1323 757
2529 757 857 -1143 -1335 825 946 -1259 -1184 861 938 -1059 -1057 889 969 -997 -984 1002 995 -924 -885 1154
2549 1154 1128 -912 -698 1212 1024 -956 -766 1327 1003 -811 -683 1316 1085 -930 -552 1119 943
$$ packed form
2432a479J662J570j667j523J666J527j659j687J870J446j666j486J645J445j701
2447c7j528J632J570j847j313J618J566j929j365J901J125j749j399J924J301
2462A470j900j292J859J314j937j152J831J091j836j006J904R28j892q50J791
2477C23J073j984q52J982Q09j937p17J945R63k174o93K045Q00k097p87K127O42
2494A468k006p48K103P72k183n84K010N94j984o53K027O97k238m95K118M47k117
2511g72l19J947K82j983m34K070L16k082k41K035J43k026r5J914K85k211j52K080
2529G57J00k000j92K160J21k205P5K045P7j997KJ946Q0j966J3J986pj919L9K039
2549A154k6k040K14J910j88j980J90K093l24j814J28J999k31k015L78J671j76
$$ plain form
2566 943 -1063 -656 1130 875 -1039 -647 1191 721 -1068 -633 1144 585 -1319 -634 1084 494 -1261
2583 -1261 -746 1094 562 -1347 -625 1168 394 -1335 -565 1047 444 -1363 -528 1005 329 -1181 -591
2600 -591 959 387 -1225 -387 1186 360 -1167 -353 1262 444 -1156 -307 1207 466 -1148 -231 1265
2617 1265 310 -1001 -168 1335 228 -1240 -234 1159 360 -1138 -117 1251 148 -1183 -334 1205
2633 1205 100 -1210 -39 1187 205 -1165 -195 1167 87 -1301 -44 1151 131 -1289 -93
2648 -93 1168 -111 -1174 6 1129 64 -1127 82 1145 -52 -1130 110 1095 -106 -1085 182
2664 182 1213 -34 -1112 231 1038 -222 -1061 205 1081 -102 -1118 160 1031 -227 -990 218
2680 218 926 -294 -1045 291 913 -463 -1036 268 849 -482 -1091 354 812 -425 -914 286 966
$$ packed form
2566I43k006M07J786k55j914L92J838m70j789M35J777n59j904O85J718n90j755
2583a261N15J840n32j909P22J793p74j729P70J612o03j807Q35J533o76j510N90
2600e91J550n72j612Q38J573q26j527Q14J615q18j600Q49J514p41j614R17J496
2617A265r55j311Q33J503j107j468J006J393p99j498J021J368j103j331Q49J539
2633A205j105j310J171J226r82j370R70J362j080j388J257J195j020j420J196
2648i3J261j279j063J180J123j065j191J209J063j197j078J240R85j201r79J267
2664A82J031j247j078J343Q07j260q39J266Q76j183j016J278Q71j258p63J208
2680B18P08j220p51J336O22j376n73J304N81j331o09J445M58j237m89J200O80
$$ plain form
2697 966 -373 -947 314 978 -404 -885 442 896 -531 -897 459 987 -323 -868 505 1013 -357
2714 -357 -757 490 1038 -488 -685 717 870 -337 -803 646 931 -458 -688 700 835 -474 -823
2731 -823 607 786 -629 -720 561 658 -680 -840 455 727 -640 -800 555 580 -737 -849 513 655
2749 655 -835 -897 614 540 -764 -702 575 498 -709 -692 560 548 -775 -588 706 521 -642 -531 694
2768 694 535 -668 -579 869 675 -601 -406 933 674 -764 -335 762 488 -706 -372 889 584 -620
2786 -620 -373 891 528 -674 -420 822 479 -851 -431 836 323 -772 -344 717 295 -999 -485
2803 -485 631 287 -974 -418 733 314 -831 -379 654 82 -926 -235 808 181 -844 -203 808
2820 808 71 -907 -245 815 264 -941 -177 808 267 -884 -144 819 241 -669 -130 783 223 -744 -60
$$ packed form
2697I66j339n74J261O64j382m81J327M54j427l66J356N28j310n45J373N08j370
2714c57m00J247N48j526j97J402J53j207m66J449K85j389k30J388J35j309l49
2731h23J430J79j415r1J281R7j338j60J295K72j367j60J355K5j317j12J362J42
2749F55j490o2J511p4j304O2J277p7j207J7J252j2j323J87J294j85j163J11J225
2768F94j59j203Q9J448j94j276J95J339k59j438M29J097k74j194L34J261l05j204
2786f20K47J264l63j202K54J242l43j330M20J267n13j095M28J061m22j294N14
2803d85J116l44j261N56J151m19j145M52J033n72j008O91J043o27j025O41J011
2820H08p37r78O62J060n51j205P64R85n41j151P40R63n78r10N39R13n60r67O84
$$ plain form
2839 -60 876 210 -649 -8 841 110 -713 -108 840 116 -710 -53 784 112 -822 -104 841 -29 -868 -42
2859 -42 714 -38 -862 -66 701 -39 -734 -78 647 -81 -844 -8 732 21 -801 21 660 -75 -698 85
2879 85 670 -123 -676 155 698 -98 -609 186 664 -81 -678 252 803 -155 -587 108 726 -95 -512 124
2899 124 592 -76 -615 250 593 -147 -635 117 536 -261 -815 225 639 -359 -664 72 466 -379 -704 211
2919 211 666 -427 -606 211 544 -430 -737 357 543 -463 -624 271 480 -335 -704 458 595 -288 -362
2938 -362 377 712 -341 -386 406 632 -193 -408 496 528 -238 -353 458 499 -152 -361 516 438 -370 -283 514
2959 514 474 -502 -369 469 489 -487 -367 431 351 -398 -444 462 177 -599 -563 388 283 -484 -332 449 317 -558
2981 -558 -449 425 283 -576 -395 421 174 -596 -405 480 232 -542 -240 513 283 -482 -213 507 264 -482
$$ packed form
2839f0R36o66q59O41Q49p31q23O05R48p24q26O57Q37o72r34P18R45q70q39Q26
2859d2P56p52q24P96P67p40o95O56P25p28p63Q36P40p11q22Q22O39p35o23P83
2879H5N85p93n53Q31N43p96n11P95M78p45n97R30N51r58m32O95O18q21m17O36
2899A24M68o68n39Q65L43p40m88P52M19p97n54J040M14r98l05P36L94q45l25R15
2919B11M55j093j79Q17L33r74l07J094J86j006j61Q95K09q15l69J162J37q83p4
2938c62P39L35j053m5P92K26q25k15R04L2p66j15Q11M1o51k09Q77p8q08Q7P97
2959E14m0r76J33Q38K0r76J20P98q0p49m6R06k85p76L6R51j05p67J52P81j32q75
2981e58J09Q74j42q59J81Q16k47p70J91Q85k48p74L02P53k30p65K69P20k43p46
$$ plain form
3001 -482 -246 682 386 -349 -138 618 436 -477 -121 609 289 -391 -135 563 180 -519 -167 599 183 -444
3021 -444 -112 582 107 -636 -197 567 169 -600 -147 453 155 -633 -75 437 34 -624 -170 329 41 -636
3041 -636 -136 474 30 -514 -140 456 3 -425 25 429 207 -440 -2 417 49 -479 144 459 30 -431
3061 -431 50 541 -55 -421 39 556 -32 -406 72 511 28 -555 88 445 39 -379 100 393 -165 -421
3081 -421 205 445 -95 -567 -6 394 -139 -435 30 350 -238 -507 83 345 -32 -321 158 397 -155 -355
3101 -355 99 444 -152 -328 184 497 -37 -359 207 432 24 -223 288 370 21 -270 257 398 -237 -365
3121 -365 237 484 -55 -321 195 313 -213 -478 277 264 -210 -226 63 266 -255 -478 117 220 -471 -447 233
3142 233 244 -414 -316 117 210 -338 -479 91 95 -325 -291 132 260 -322 -180 198 180 -184 -299 378 275 -213
$$ packed form
3001d82K36R28k96p35K11P56j82r13L56P30l20o80K56O98l83o99L52P66m16o27
3021d44L32O94m75p43M39P64l98p69M53O00k98p88N58N12m03o58M54M99k88o77
3041f36N00O10m44n44L74N96m53m28M50M04k22o47M38M19l68n28O23L15m29m61
3061d31M81M91n96l66M60N17n88l74M78M39m83n83O43L57m06m18M79K93n58k56
3081d21O26K40n40m72N61M00n33k96M65L20n88k69N90K62l77k89M79K39n52k00
3101c55M54L45n96j76N12L13n34l22N66K25m08k47N11Q2l49k91N27J41o35j28
3121c65O02K47n39k66N16J18n26k65P55j3m74j6K89K03n21k23N95J03o91K4O80
3142B33J1o58R8M33R3n48j41N70Mm20L4M23J28n82J42L78j8l64j15O77j03m88
$$ plain form
3164 -213 -208 321 289 -259 -54 475 313 -59 -47 418 203 -183 -82 347 241 -84 -43 316 307 -231 -90 310
3186 310 189 -307 -118 228 185 -254 -181 297 -69 -295 -225 183 176 -372 -245 185 -77 -485 -152 203 -139 -479
3208 -479 -171 280 -101 -362 -113 294 133 -222 -120 198 -4 -454 56 316 64 -200 79 285 142 -211
3228 -211 29 492 90 -256 212 364 109 -176 146 340 152 -145 106 458 125 -247 53 382 -85 -335
3248 -335 67 365 -54 -207 21 231 -81 -247 -51 196 -131 -363 108 183 3 -348 -9 249 -89 -334
3268 -334 -3 246 -113 -327 -2 113 -83 -236 83 246 -78 -169 98 234 -85 -99 203 149 -113 -276 185
3289 185 267 -82 -271 141 255 -8 -235 48 216 -131 -199 236 120 -167 -229 110 152 -108 -173 70 165 -176
3311 -176 -85 201 136 -198 -242 139 66 -247 -123 59 182 -105 -224 190 79 -146 -54 150 156 -233 -161 214 165
$$ packed form
3164b13NN29l2n48K05N29j62l72J2M65k15l86J01M29j06l25M1L59rn38J41M00
3186C10j21m96J89L46m3m39P3M78l66k26P0M08pn48J27M30k62m08L33L55l42l40
3208d79L08M51l81k61K49M07j61l55J02L18k02m50N10K60k52k64K79K06j43l53
3228b11K40M63m02l46M68J52k55k85L22J94j88k97K51L52l33l72L00L29m67k50
3248c35M02K98m19j53K28K10l12j66J96K47l27k32M71P5j80l51L39K58l38k45
3268c34L31K49l59k14L25J15j96j53L19J63l24r1K67J36l19j4L02n4k62j63M61
3289A85Q2l49j89M12J14k63k27K83J68l47o8M35j16k87o2L39M2k60o5K43R5l41
3311a76R1K86o5l34m4L81p3l13J24J82J23k87j19M14j11k25R2K04Ol89P2L75m9
$$ plain form
3334 165 48 -45 240 271 -202 -128 167 82 -154 -60 242 95 -84 -91 123 37 -162 -182 272 71 -128 -142 131
3357 131 180 -205 -75 199 127 -230 -31 223 6 -324 -87 187 -32 -112 -49 146 -31 -265 -75 268 8
3378 8 -178 19 190 -64 -145 190 256 -61 -314 32 153 86 -227 9 267 96 -202 44 212 217 -94 7
3400 7 212 7 -103 14 262 -35 -153 78 233 31 -215 60 235 -58 -127 39 115 -30 -222 -32 114
3421 114 -141 -262 -4 64 -70 -224 73 50 -99 -160 140 147 -128 -129 -18 179 -101 -162 78 83 43 -173 78 215
3445 215 -100 59 103 243 -164 -98 205 195 -22 -158 159 229 5 -245 172 169 35 3 81 113 -63 -53 85
3468 85 126 -125 -180 268 18 -160 -150 42 53 -100 -78 72 88 -95 -250 162 -15 -188 -98 -19 -6 -152 -35
3491 -35 165 81 -172 -69 75 84 -211 -68 128 159 -240 -156 288 131 -90 -52 184 1 -97 44 155 40 8
$$ packed form
3334A65j17r3K85L1m73P4K95q5k36R4L02j47j79pK14q6j99k0M54k01j99j4K73
3357A31M9l85J30K74p2l57J99K54k17l30K37K74k19q0O3J95j77k34J90L43k60
3378Hj86J97J71k54q1L35O6l17k53L46J21o7l13K36K58j71k98K46J68Nl11J01
3400GK05k05j10J17K48k97j18K31J55k02k46K75J75k93o9J66P6j45j92J90J46
3421A14k55j21K58O8j34j54K97k3j49o1L00Pk75jJ11J97k80o1K40Nm0k16K51J37
3445B15l15J59M4J40m07O6L03j0k17j36L17P0k24k50M17lj34l2P8L2j76J0J38
3468H5M1k51n5M48k50j78J0J92J1j53K2J50J6j83j55M12j77j73R0P9J3j46J17
3491c5K00q4k53J03J44Rk95J43J96L1l99Q4M44j57k21L8K36j83r8J41J11j15l2
$$ plain form
3514 8 -74 372 79 -135 96 170 86 -129 -35 238 122 -179 -45 231 -34 -270 -64 58 44 -97 -17 67 -11
3537 -11 -339 -137 46 84 -312 -50 69 14 -249 -127 194 173 -236 92 122 -30 -106 -21 287 38 -118 22
3559 22 215 -23 -231 169 237 70 -73 147 352 111 -206 149 156 -6 -122 39 330 -23 -301 126 100 -156
3581 -156 -230 60 192 -142 -222 -148 212 -131 -293 25 167 -200 -292 -59 195 -16 -263 78 84 -105 -105 81 54
3604 54 -103 -221 76 139 -113 -145 117 96 -171 -97 124 189 -21 -53 225 33 -118 92 147 144 -175 -46 188
3627 188 207 -92 -160 266 264 -111 -239 214 176 -124 -182 312 31 -262 -18 191 110 -270 -121 116 126 -282 -156
3650 -156 92 24 -216 -199 34 120 -240 -86 81 -7 -242 -127 75 -50 -193 -142 165 -62 -228 2 182 7
3672 7 -37 -68 281 113 -265 45 241 122 -166 53 284 128 -110 126 299 93 -41 42 258 95 -241 54
$$ packed form
3514Hq2M46k93k14K31P4q4k15R4K73j16l01J34K76k65k36K06J22j4j41Q0Q4p8
3537a1l28K02J83L8l96K62J19n5k63J22L21k1m09L28L0j52p6Q5L08k49j56J40
3559B2J93k38k08M00O8j67j43K20K05k41l17L55Pj62j16J61K91l53k78M27k6k56
3581a56p4K90J32l34q0P4L60l43j62L18J42l67r2K33K54k11k47L41Oj89%J86k7
3604E4j57j18K97O3k52l2K62k1k67P4K21O5k10l2K78j92j51K10N5ll19J29K34
3627A88J9k99o8M26kl75j28M53l8l00n8M94k81k93K44K09q1l80J49K37J0m08J26
3650a56K48o8k40J7K33Q6l60J54J67q8k35J15K02j25j43N1L07k27j66K30J80j75
3672Gm4l1L49j68l78L10J96j19k88K19K31j56k38K36J73k06j34Q3K16j63l36K95
$$ plain form
3694 54 180 207 -211 -106 297 56 -76 73 95 -95 -292 -19 112 -65 -187 34 166 -130 -320 -1 160
3715 160 -96 -225 90 244 -77 -245 11 200 -103 -198 136 360 -9 -135 50 275 -16 -209 208 283 -66
3736 -66 -105 9 317 67 -113 155 239 -77 -243 148 197 -3 -169 170 253 -26 -204 168 140 -27 -189 152
3758 152 117 -95 -289 73 17 -128 -133 -99 200 -171 -156 116 171 -19 -368 147 97 -140 -210 91 192 2 -249
3781 -249 141 205 -183 -158 204 168 -206 3 114 151 -99 -150 115 65 -63 -54 231 263 -37 -229 237 143 -165
3804 -165 -163 162 57 -77 -84 23 202 -152 -87 160 207 -211 -163 45 7 -134 -239 103 196 -115 -325 -7 41
3827 41 -244 -101 61 42 -266 -203 65 90 -301 -173 176 280 -154 -126 280 77 -246 -56 310 131 -97 -66
3849 -66 184 139 -156 -61 195 84 -79 -52 293 85 -230 -126 323 74 -168 -37 283 21 -262 4 164
$$ packed form
3694E4J26K7m18J05M03k41j32J49K2j90j97K73J31j77j22K21J32k96j90L19J61
3715A60k56j29L15J54l21j68K56J89l03r5L34K24l69j26J85K25k91j93M17P5l49
3736f6l9J14L08k50j80K68Q4l16j66L91M9k00j66L39Q3k79j78L72k8j67j62L41
3758A52l5k12j94L62n6j45nL4K99l71J5K72N5j90l49N15n0k37p0L01J01j90k51
3781b49L90O4l88K5L62l6l74K09J11L7k50n1K65n0j28RK85L2l00j92M66r4l08
3804a65KL25j05j34pJ07J79l54O5K47M7m18M8K08l8j41j05L42R3l11k10L18M8
3827D1k85J43J62j9l08O3K68K5l91J28L49J04m34K8M06k03l23J90L66j79k28L1
3849f6K50m5k95R5K56j11j63K7L45k08l15J04M49k49k42J31L20k62k83K66J60
$$ plain form
3870 164 -2 -258 -86 193 29 -188 -63 201 35 -244 -68 154 35 -277 -119 199 111 -201 -50 207
3890 207 10 -178 15 131 20 -260 54 131 114 -150 34 232 116 -158 -54 344 -63 -181 154 276 11
3911 11 -238 115 132 53 -126 68 200 -69 -157 182 277 -13 -337 24 141 -56 -254 -56 365 -80 -164 -44
3933 -44 201 84 -266 74 144 -159 -201 14 143 -50 -114 -33 222 -31 -209 7 218 -122 -199 117 306 -62
3955 -62 -220 10 274 -37 -151 155 294 12 -241 307 158 -45 -177 161 364 -9 -228 129 233 -140
3975 -140 -205 266 223 -97 -150 63 286 -94 -261 105 186 -163 -193 53 132 -173 -316 113 230 -145 -278 118
3997 118 166 -157 -204 167 160 -250 -213 96 271 -168 -149 268 150 -177 6 235 228 -182 -107 109 245 -86 -132
4020 -132 156 194 -138 -194 189 302 -65 -62 160 300 -176 -109 253 53 -176 -155 151 125 -151 -96 175 151 -183
$$ packed form
3870A64j66k56J72K79j64k17J25K64j66k79J76K22j19l12J58L18q8l12J51K57
3890B07j97j88J93J16j11k80L14P7j7k64J84J98j16k74J04L98m07j18L35J22k65
3911A1k49L53J7p9j79J94J32k69q8L39R5k90l24L61J17j97j98J98M21m45q4J20
3933d4K45j17l50L40P0l03m2K15J29j93o4Q1K55k53j78K16K11l40p7L16J89l68
3955f2j58K30K64l11j14L06J39k82k53N48j49k03j32L38K03l73k19L57J04l73
3975a40o5M71m3l20n3K13K23l80j67L66Q1l49l0K46P9l05j43M29J17l75j33L96
3997A18M8l23m7L71pm10L7L09J75m39J9M17j18l27J83K29pm10P5K16J36l31m6
4020a32K88L8l32n6L83J13l67LK22J40m76O7L62k00k29K1L06k6k76N5K71k4l34
$$ plain form
4043 -183 -171 265 125 -251 -70 203 24 -300 -154 178 15 -227 -98 126 145 -256 -150 160 98 -254 -201
4064 -201 217 72 -125 2 147 177 -256 -18 122 98 -94 17 264 113 -165 -93 336 95 -224 -91 315
4085 315 -13 -78 -120 238 62 -237 -40 252 143 -247 -70 231 7 -199 -1 238 88 -287 -91 108 -45
4106 -45 -272 23 229 45 -249 -48 323 -88 -255 -19 208 81 -200 3 168 -68 -130 -8 271 -81 -397
4127 -397 -9 232 78 -264 -10 291 -119 -156 38 292 46 -225 102 263 -69 -272 98 259 -120 -223
4147 -223 73 311 -77 -144 -48 134 -78 -167 74 299 -49 -228 185 141 -81 -238 93 74 -162 -323 72 217
4169 217 -123 -128 96 262 0 -128 99 130 -61 -156 234 297 -57 -133 114 204 -135 -206 176 224 -114 -114 166 211
4193 211 -246 -168 271 224 -211 -249 177 120 -183 -123 43 281 -208 -292 -55 87 -150 -265 77 104 -100 -108 123
$$ packed form
4043a83J2M36j40l76J81K73j79l24J46L32j63k42J29K24J9m01J06L10o2l52N3
4064b01M18j45j97J27J45L0m33K38J40k4j92J11K47j51k78P2M29k41l19J33M06
4085C15l28o5m2L58j76k99J97K92j09l90J77L01k24k06J98K39j50l75J96J99j53
4106d5k27K95K06j84k94K01L71m11j67K36K27j27k81K03J65k36o2J22K79l52l16
4127c97L88K41j54l42K54L01m10l7J94K54k46k71L27J61l32k03L70J61l79j03
4147b23K96K38l88o7R6J82k12q9K41K25l48j79M13m4k22j57L31j9k36j61L95J45
4169B17l40nK24J66k62j28K27L1j91r5L90O3l54p6K47R0l39p1L82M8l38%K80M5
4193B11m57P8M39m7m35l8M26n7l03O0J66K38m89q4K37J42k37j15L42K7k04qK31
$$ plain form
4216 123 199 -110 -203 74 87 -65 -130 157 141 -72 -206 110 52 -194 -126 130 132 -54 -6 256 198 -56 -83 224
4240 224 264 -60 -94 246 224 -144 -141 289 222 -154 -89 169 237 -255 -99 240 23 -245 -125 52 95 -160 -125
4263 -125 226 26 -200 -192 90 92 -135 -160 94 96 -300 -127 55 122 -278 -134 149 83 -224 -101 98 -87 -200
4286 -200 -49 219 134 -374 -83 296 168 -29 52 318 -26 -197 -114 289 122 -134 41 300 99 -176 -68
4307 -68 293 5 -198 0 285 132 -102 -31 152 99 -225 -41 224 -46 -290 -94 232 -154 -277 -52 186
4328 186 -107 -411 -110 142 44 -290 -30 133 -13 -110 -117 168 30 -210 -67 173 62 -252 -7 161 32
4349 32 -187 -20 209 60 -225 -56 201 -16 -22 -18 207 -78 -128 38 320 6 -56 189 243 94 -181 62 77
4372 77 -97 -243 79 228 -82 -129 123 296 -60 -298 166 30 -73 -247 151 306 -175 -156 91 72 -71
$$ packed form
4216A23P6l09r3K77J3j52o5K87j6k13j34L16n8k46O8K56Kj86M8K62n8k54k7L07
4240B24M0l24l4L40k2l68LM30o7l76O5K58O8m92J56L39k17k68J20J77M3k55L5
4263a25L51k00k26QK82Kk27k5K54Kl96J73J82O7m00J44K83o6l07J23J99j85j13
4286b00J51K68q5n08K91L79j28j97Q1K66l44j71Q3M03j67k56J75K59k01k75J08
4307f8L61k88k03J98K85j53k34P1J83n3l24J84K65k70k44J96L26l86j23K25K38
4328A86k93l04L01K52r8l34K60J63j46r7pK85j38k40J43K40j11l14K45J68j29
4349C2k19J67K29j49k85J69K57k17oMK25k85n0J66K82l14o2K45N4j49k75K43J5
4372G7j74j46L22J49l10m7K52J73l56k38M64j36j03j74L98J55m81J9K47j9j43
$$ plain form
4393 -71 -230 8 -1 -39 -147 143 252 38 -191 154 153 -89 -156 34 135 -44 -213 292 99 -63 -55 148 128
4416 128 -173 -125 87 126 -161 -172 178 121 -81 -150 67 96 -116 -115 184 90 -116 -186 112 159 -164 -137 154 114
4440 114 -118 -53 179 131 -141 -124 208 71 -62 -72 141 62 -131 -137 216 102 -129 -141 47 214 -70 -76 251
4463 251 244 -47 88 251 166 -66 -45 279 298 -198 -80 237 76 -17 19 248 33 -173 -80 122 39 -236 -53
4486 -53 197 15 -184 -63 165 110 -297 -116 44 89 -88 -75 129 -19 -146 -152 67 -23 -146 -53 155 108 -193
4509 -193 -31 119 73 -228 -51 143 -34 -147 -14 270 -73 -177 60 205 80 -188 9 235 142 -164 11
4530 11 275 124 -86 -5 211 137 -168 4 137 30 -113 88 233 42 -183 41 122 72 -141 -51 184 50
4552 50 -132 55 201 30 -229 -47 175 -156 -109 -46 92 41 -150 -14 64 3 -130 38 177 -57 -222 -4
$$ packed form
4393g1j59K38rl8j08K90J09k14k29L45jk42o7J90J01j79j69N05j93j62QK03k0
4416A28l01M8K12L9k87j1L50n7k02o9K17K9k12JK99r4k06p0K98M7l23K7K91m0
4440A14k32O5K32m8k72J7L32j37j33j0K13p9j93oL53j14k31j2J88J67k84oL27
4463B51pk91J35J63q5k32K1L24J9m96J18L17j61r3L6K29k15k06R3K02q3k75J83
4486e3K50j82j99J21K28n5m07J81J60M5j77J3K04j48j27oK19r0j23R3K08m7l01
4509a93J62J50m6l01J77J94j77j13J33K84l43j04K37J45j25k68J97K26r3l06J75
4530A1K64j51k10Q1K16p4l05J72J33j07j43K01J45j91k25K24Q1n0k13R0K35j34
4552E0j82J87J46j71k59J82K22l31M7O3J38n1j91J36P8o1j33J68J39k34j65K18
$$ plain form
4574 -4 156 19 -188 -58 175 -49 -98 -21 340 -2 -75 -34 208 -48 -159 19 180 4 -228 8 140 -78
4596 -78 -188 26 96 120 -167 56 202 -77 -166 68 178 -96 -117 81 151 -29 -182 87 155 -117 -83 88 135
4619 135 -20 -105 57 154 1 -115 103 161 -63 -158 116 158 -5 -81 70 213 -62 -73 175 260 84 -59 185
4642 185 87 -101 -83 237 10 84 -37 -61 107 -31 -71 152 99 -184 -131 16 111 -110 -71 65 138 -61 -111 148
4666 148 142 -94 -180 78 -21 -197 -59 53 84 -117 -75 32 69 -47 -142 178 16 -145 2 177 66 -100 -73
4689 -73 114 113 -27 15 188 70 -45 -218 -3 103 -107 -32 -1 159 -107 -62 44 79 -88 -125 42 34 -73 -17
4713 -17 107 145 -79 -120 36 11 -52 -33 29 27 -166 -18 150 63 -53 -111 187 71 -130 26 155 111 -11 -41
4737 -41 177 48 -97 7 226 143 -49 70 313 51 -21 117 253 -12 -154 -100 91 -60 -60 -89 152 66 -124
$$ packed form
4574dJ60j37k07J30K33k24m9P7L61l42p3M1K42k56j11J78J61j76k32K36J32k18
4596g8j10K14P0K4k87K23J46k79q9K34J10k74k1J98P0j80j53K69O8k72L4J71M7
4619A35j55q5J62R7j53j16K18N8k24r5K74M2j63p6J51J43k75j1K48Q5j76j43K44
4642A85r8j88J8L20k27P4j21k4J68j38m0K23n3k83N3J47R5k21L9J36P3j99n0K59
4666A48ok36q6K58r9j76J38J12L1k01M2J07L7j16r5L20j62j61J47J75j11j66K7
4689g3J87jj40M2J73j18j15j73K15J06k10P5L1J60k66M5J06L5j67l7J67qj07N6
4713a7J24L8k24m1J56k5o3J9O2kj93J48J68q7j16n8K98j16k01J56J29m4j22l0
4737d1K18j29j45J04K19q3j92J19K43k62p2J38J36k65j42N4J91j51%k9K41q6j90
$$ plain form
4760 -124 -10 166 16 -70 -97 -15 76 -228 -104 16 48 -216 -118 64 -117 -152 -109 61 72 -96 -34 38 -81 -223
4784 -223 -8 140 79 -173 7 192 31 -94 -5 111 -103 -154 33 113 11 17 -13 34 33 -38 98 137 27 -122
4808 -122 163 135 -45 -150 6 208 -29 -162 46 82 10 -59 -46 84 92 -28 30 205 -18 -36 -34 108 8 -139
4832 -139 28 -44 -26 -145 -47 51 -41 -104 -18 59 -84 -55 27 114 89 -67 39 73 45 -79 31 187 -74 -107 111
4857 111 135 -3 -217 4 316 5 -113 105 157 71 45 93 105 67 11 75 138 -26 -164 96 303 -22 -56 27
4881 27 35 -76 -140 23 11 -6 -164 25 76 -72 -11 7 16 -109 20 49 -75 -141 -86 56 -15 -64 -96 85 66 -27
4907 -27 -119 -7 88 -77 -64 -35 -29 -96 7 -20 168 2 27 2 -66 -230 15 -48 -30 -102 -1 106 62 -80 -109 19
4933 19 73 -80 -56 30 196 -31 -70 114 27 36 -100 100 13 -38 15 14 89 -20 -30 155 47 26 -91 78 34 -114
$$ packed form
4760a24J14J76j50q6k7Q2R1l04J24J20L2k64R8J82j81l5M3J70J1j68O2P2j19j42
4784b23K15J48o1k52J80J85j61j25Q9J16k14n1J87Q0j02Ol0M7jp1J36L9j10j49
4808a22K85k8j80j05J56K02k37j33K08L6p2o9J3J30Qj20N8J75k23j8KJ42j00j47
4832a39J67p2J8j19R8R8r2o3Q6P7j43K9Q2Q7k5j56J06L4k8j24J10J56k61l3K18
4857A11K4j38k14K21L12l11j18K18N2q6k6M8J2l8n6O4O3j64j38K60K07l25l4Q3
4881B7Qj11o4J63j2j7j58J89N1j48O1J8Rj25J29K9j24o6N5J42p1m9l2J81j9r3
4907b7r2J12R5j65J3K9Oo7J03k7J88j66K5k5o8j64K45o3J8p2J01J07m4j42k9J28
4933A9N4j53K4Q6J66k27l9J84q7Rj36K00q7n1N3jP5j09j0J85j08k1j17J69m4j48
$$ plain form
4959 -114 -33 91 105 -21 -186 53 26 -153 60 84 111 1 -79 -46 77 1 -45 6 104 -151 24 86 8 28 -1
4984 -1 46 54 -153 11 109 -27 -116 -82 202 103 -119 -33 37 20 -126 -69 139 -124 -158 -46 44 18 4 13 165 82 -105
5011 -105 -175 5 -42 7 7 47 -14 -125 11 101 125 -133 59 14 163 -60 -36 151 -31 23 140 55 101 -130 -14
5036 -14 45 2 -69 -10 -5 33 93 30 108 6 -117 -124 9 51 -12 -119 105 -120 -89 13 -30 57 -36 -104 31 -48 -53 134
5064 134 31 -175 -46 -36 16 5 -51 4 161 -36 -110 -2 106 -2 -169 131 100 -7 -20 94 -7 -32 -100
5087 -100 29 115 56 58 -33 -57 -22 -21 14 118 -104 -76 101 -61 76 -66 131 74 -29 -43 75 129 -63 38 -63
5112 -63 14 -176 51 -77 27 -78 -67 16 74 31 -195 43 185 -59 -94 -94 -24 -22 -4 42 58 -16 -59 62 33 -86
5138 -86 -50 68 59 -126 107 24 189 -124 32 -6 140 -58 -34 66 55 13 -22 49 -6 -18 -163 18 68 2 22
$$ packed form
4959a14Q1J24J4j26j65K39k7j79K13K4K7j10q0L3J23p6m6N1R8k55J75O2p8K0k9
4984aM7Qk07J64R8j36q9L4K84r9k22Q6P0j7j46N7K08k63l4J12R0k6j4RJ52q3j87
5011a05p0J80m7M9%M0o1j11J36R0K4k58J92m5J49k23K4J87j82N4J17q5M6k31J16
5036a4N9m3p1N9NL8O0o3P8j02j23pJ33M2o3j07K24k25L1J02m3Q7r3o8J35p9nJ87
5064A34j03k06J29J0N2j1n6N5J57j97p4J08J08j08j67L00l1j07j3J14j01k5o8
5087a00J29Q6n9Kr1k4L5JL5J04k22K8J77j62J37j42J97n7j03j4J18N4j92J01j01
5112f3P7j90K27j28J04j05J1Q3N8m3k26K38J42k44l5%P0KJ8M6J6p4m3J21k9j19
5138h6L6J18rj85K33q3J65l13J56l8J46j98K4J00j1m2l5P1n5j2j45J81N0o6K0
$$ plain form
5163 22 -47 -58 37 33 11 13 4 -120 51 77 -6 99 51 55 49 -75 132 -11 -138 -118 89 -27 7 7 131 38 -13 -39
5191 -39 -4 62 57 31 49 65 8 30 -35 104 -22 18 36 19 -39 24 12 -51 -169 -19 64 153 -64 40 117 44 -94
$$ packed form
5163B2o9j1R5mk2Krj24J71K6q3J05m8Moj24K07j43j27K0K07j16L4%J24r3n1k6
5191c9L5O6nk6J8J6n7K2o5J39j26M0J8j7n8O3j2o3j18J50Q3Q9k17J04P7p3j38
$$ [...]
8191B7
##END NTUPLES=NMR FID
##END=
