##TITLE=1H_LR-679-H1-CR7
 D2O, 8 sc, 
 25.6.2019
##JCAMPDX= 6.0         $$ Bruker NMR JCAMP-DX V2.0
##DATA TYPE= NMR FID
##DATA CLASS= NTUPLES
##ORIGIN= UXNMR, Bruker Analytische Messtechnik GmbH
##OWNER= root
$$ XWIN-NMR		Version 3.5
$$ Tue Jun 25 13:59:41 2019 Russian Standard Time (UT+4h)  she@DPX200
##.OBSERVE FREQUENCY= 200.13155
##.OBSERVE NUCLEUS= ^1H
##.DELAY= (6, 6)
##.ACQUISITION MODE= SIMULTANEOUS
##.ACQUISITION SCHEME= undefined
##.AVERAGES= 8
##.DIGITISER RES= 18
##SPECTROMETER/DATA SYSTEM= spect
##.PULSE SEQUENCE= zg30
##.SOLVENT NAME= D2O
##.SHIFT REFERENCE= (INTERNAL, D2O, 0, 15.7039)
##AUDIT TRAIL= $$ (NUMBER, WHEN, WHO, WHERE, WHAT)
$$ ##TITLE= Audit trail, XWIN-NMR		Version 3.5
$$ ##JCAMPDX= 5.01
$$ ##ORIGIN= Bruker BioSpin GmbH
$$ ##OWNER= she
$$ F:/spectra/data/she/nmr/H-F/1/audita.txt
$$ ##AUDIT TRAIL=  $$ (NUMBER, WHEN, WHO, WHERE, WHAT)
(   1,<2019-06-25 13:58:46.07 +0400>,<she>,<DPX200>,
      <created by zg, POWCHK disabled, PULCHK disabled
       configuration hash MD5:
       00 E9 B6 7A A2 85 ED C7 34 08 36 98 17 FE 4E 26
       data hash MD5: 16K
       86 FE 1D 5F 37 3C F1 67 A5 B7 80 CC 6B 8B E0 93>)
$$ ##END=
$$ 
$$ hash MD5
$$ 72 31 B0 24 CC 17 03 5C 6D 12 8D 42 47 04 ED 51
##$RELAX= 
##$RELAX= 
##$RELAX= 
##$RELAX= 
##$RELAX= 
##$RELAX= 
$$ Bruker specific parameters
$$ --------------------------
##$DU= <F:/spectra>
##$EXPNO= 1
##$NAME= <H-F>
##$PROCNO= 1
##$TYPE= <nmr>
##$USER= <she>
##$AMP= (0..31)
100 100 100 100 100 100 100 100 100 100 100 100 100 100 100 100 100 100 
100 100 100 100 100 100 100 100 100 100 100 100 100 100 
##$AQSEQ= 0
##$AQ_mod= 1
##$AUNM= <au_zg>
##$AUTOPOS= <>
##$BF1= 200.13
##$BF2= 200.13
##$BF3= 200.13
##$BF4= 200.13
##$BF5= 200.13
##$BF6= 200.13
##$BF7= 200.13
##$BF8= 200.13
##$BYTORDA= 1
##$CFDGTYP= 0
##$CFRGTYP= 5
##$CHEMSTR= <none>
##$CNST= (0..31)
1 1 145 1 1 1 1 1 1 1 1 1 1 1 1 1 1 1 1 1 1 1 1 1 1 1 1 1 1 1 1 1 
##$CPDPRG= <>
##$CPDPRG1= <>
##$CPDPRG2= <>
##$CPDPRG3= <>
##$CPDPRG4= <mlev>
##$CPDPRG5= <mlev>
##$CPDPRG6= <mlev>
##$CPDPRG7= <mlev>
##$CPDPRG8= <mlev>
##$CPDPRGB= <>
##$CPDPRGT= <>
##$D= (0..31)
0 1.2 0 0 0 0 0 0 0 0 0 0.03 0 0 0 0 0 0 0 0 0 0 0 0 0 0 0 0 0 0 0 0 
##$DATE= 1561456725
##$DBL= (0..7)
120 120 120 120 120 120 120 120 
##$DBP= (0..7)
150 150 150 150 150 150 150 150 
##$DBP07= 0
##$DBPNAM0= <>
##$DBPNAM1= <>
##$DBPNAM2= <>
##$DBPNAM3= <>
##$DBPNAM4= <>
##$DBPNAM5= <>
##$DBPNAM6= <>
##$DBPNAM7= <>
##$DBPOAL= (0..7)
0.5 0.5 0.5 0.5 0.5 0.5 0.5 0.5 
##$DBPOFFS= (0..7)
0 0 0 0 0 0 0 0 
##$DE= 6
##$DECBNUC= <off>
##$DECIM= 24
##$DECNUC= <off>
##$DECSTAT= 4
##$DIGMOD= 1
##$DIGTYP= 9
##$DL= (0..7)
0 120 120 120 120 120 120 120 
##$DP= (0..7)
150 150 150 150 150 150 150 150 
##$DP07= 0
##$DPNAME0= <>
##$DPNAME1= <>
##$DPNAME2= <>
##$DPNAME3= <>
##$DPNAME4= <>
##$DPNAME5= <>
##$DPNAME6= <>
##$DPNAME7= <>
##$DPOAL= (0..7)
0.5 0.5 0.5 0.5 0.5 0.5 0.5 0.5 
##$DPOFFS= (0..7)
0 0 0 0 0 0 0 0 
##$DQDMODE= 0
##$DR= 18
##$DS= 0
##$DSLIST= <SSSSSSSSSSSSSSS>
##$DSPFIRM= 0
$$ [...]
##$SUBNAM2= <"">
##$SUBNAM3= <"">
##$SUBNAM4= <"">
##$SUBNAM5= <"">
##$SUBNAM6= <"">
##$SUBNAM7= <"">
##$SUBNAM8= <"">
##$SUBNAM9= <"">
##$SW= 24.9336996594482
##$SWIBOX= (0..15)
0 0 2 0 0 0 0 0 0 0 0 0 0 0 0 0 
##$SW_h= 4990.01996007984
##$TD= 16384
##$TD0= 1
##$TE= 0
##$TE2= 300
##$TE3= 300
##$TEG= 300
##$TL= (0..7)
0 120 120 120 120 120 120 120 
##$TP= (0..7)
150 150 150 150 150 150 150 150 
##$TP07= 0
##$TPNAME0= <>
##$TPNAME1= <>
##$TPNAME2= <>
##$TPNAME3= <>
##$TPNAME4= <>
##$TPNAME5= <>
##$TPNAME6= <>
##$TPNAME7= <>
##$TPOAL= (0..7)
0.5 0.5 0.5 0.5 0.5 0.5 0.5 0.5 
##$TPOFFS= (0..7)
0 0 0 0 0 0 0 0 
##$TUNHIN= 0
##$TUNHOUT= 0
##$TUNXOUT= 0
##$USERA1= <user>
##$USERA2= <user>
##$USERA3= <user>
##$USERA4= <user>
##$USERA5= <user>
##$V9= 5
##$VALIST= <valist>
##$VCLIST= <CCCCCCCCCCCCCCC>
##$VD= 0
##$VDLIST= <DDDDDDDDDDDDDDD>
##$VPLIST= <PPPPPPPPPPPPPPP>
##$VTLIST= <TTTTTTTTTTTTTTT>
##$WBST= 1024
##$WBSW= 4
##$XGAIN= (0..3)
0 0 0 0 
##$XL= 0
##$YL= 0
##$YMAX_a= 208472
##$YMIN_a= -411130
##$ZGOPTNS= <>
##$ZL1= 120
##$ZL2= 120
##$ZL3= 120
##$ZL4= 120
##$ABSF1= 10
##$ABSF2= 0
##$ABSG= 5
##$ABSL= 3
##$ALPHA= 0
##$AQORDER= 0
##$ASSFAC= 0
##$ASSFACI= 0
##$ASSFACX= 0
##$ASSWID= 0
##$AUNMP= <proc_1d>
##$AZFE= 0.1
##$AZFW= 0.1
##$BCFW= 1
##$BC_mod= 2
##$BYTORDP= 1
##$COROFFS= 0
##$CY= 11.3945322036743
##$DATMOD= 1
##$DC= 2
##$DFILT= <>
##$DTYPP= 0
##$F1P= 18.9103706918063
##$F2P= -1.10871071338519
##$FCOR= 0.5
##$FTSIZE= 0
##$FT_mod= 4
##$GAMMA= 1
##$GB= 0.15
##$INTBC= 1
##$INTSCL= 1
##$ISEN= 128
##$LB= 0.24
##$LEV0= 0
##$LPBIN= 0
##$MAXI= 10000
##$MC2= 0
##$MEAN= 0
##$ME_mod= 0
##$MI= 1.114404
##$NCOEF= 0
##$NC_proc= 0
##$NLEV= 6
##$NOISF1= 3.799351
##$NOISF2= 2.8
##$NSP= 1
##$NTH_PI= 0
##$NZP= 0
##$OFFSET= 15.70392
##$PC= 1
##$PHC0= -8496.882
##$PHC1= 6.400971
##$PH_mod= 1
##$PKNL= yes
##$PPARMOD= 0
##$PSCAL= 0
##$PSIGN= 0
##$REVERSE= no
##$SF= 200.130013532006
##$SI= 16384
##$SIGF1= 3
##$SIGF2= 2
##$SINO= 400
##$SIOLD= 16384
##$SREGLST= <1H.CDCl3>
##$SSB= 0
##$STSI= 0
##$STSR= 0
##$SW_p= 3612.71676300578
##$SYMM= 0
##$S_DEV= 0
##$TDeff= 0
##$TDoff= 0
##$TI= <>
##$TILT= no
##$TM1= 0
##$TM2= 0
##$TOPLEV= 0
##$USERP1= <user>
##$USERP2= <user>
##$USERP3= <user>
##$USERP4= <user>
##$USERP5= <user>
##$WDW= 1
##$XDIM= 8192
##$YMAX_p= 0
##$YMIN_p= 0
$$ End of Bruker specific parameters
$$ ---------------------------------
##NTUPLES= NMR FID
##VAR_NAME=  TIME,          FID/REAL,        FID/IMAG
##SYMBOL=    X,             R,               I
##VAR_TYPE=  INDEPENDENT,   DEPENDENT,       DEPENDENT
##VAR_FORM=  AFFN,          ASDF,            ASDF
##VAR_DIM=   8192,          8192,            8192
##UNITS=     SECONDS,       ARBITRARY UNITS, ARBITRARY UNITS
##FACTOR=    0.0002004,     1,               1
##FIRST=     0,             0,               0
##LAST=      1.6414764,     0,               0
##MIN=       0,             -411130,         0
##MAX=       1.6414764,     208472,          0
$$ Real data points
##PAGE= N=1
##DATA TABLE= (X++(R..R)), XYDATA
$$ [...]
$$ plain form
1938 -477 -190 -602 -17 511 535 385 -408 -273 -285 2 -73 412 -137 508 331 -183 -244 -174 101 438 409 423
1960 423 24 -138 -124 -444 -8 219 670 203 -132 30 -234 -672 -102 -84 402 224 204 50 -382 -276 26
1981 26 142 438 546 115 270 -149 -651 -52 241 264 430 513 88 -120 -268 -261 -104 95 71 316 181 -213
2003 -213 -62 -693 -148 384 458 409 109 -186 -410 -59 -241 19 352 355 108 73 -188 -297 58 52 216 208 775
2026 775 171 -103 -376 -389 124 305 316 111 245 406 -177 -333 -323 369 471 377 362 160 -135 -395 -257 -89
2048 -89 91 644 314 -73 -292 -301 80 -70 62 -2 181 242 -6 -780 -147 59 262 303 190 157 346 62
2070 62 -403 -496 5 625 236 -82 96 -104 -115 -355 -297 261 299 184 213 -414 -162 -170 -289 82 142 573 90
2093 90 -362 -184 -124 68 41 270 167 -44 165 -337 -411 -269 -271 460 427 33 81 -1 -323 -320 -206 -19 420 213
$$ packed form
1938d77K87m12N85N28K4j50p93J35j2K87p5M85n49O45j77n14o1P0K75L37k9J4
1960D23l99j62J4l20M36K27M51m67l35J62k64m38N70J8M86j78k0j54m32J06L02
1981B6J16K96J08m31J55m19n02N99K93K3J66Q3m25k08j48PJ57J99k4K45j35l94
2003b13J51o31N45N32P4m9l00k95k24L51j82K60L33Lk47l5k61j09L55oJ64qN67
2026G75o04k74k73j3N13J81J1k05J34J61n83j56J0O92J02r4j5k02k95k60J38J68
2048h9J80N53l30l87k19rL81j50J32o4J83O1k48p74O33K06K03M1j13l3J89k84
2070F2m65r3N01O20l89l18J78k00j1k40N8N58L8j15K9o27K52qj19L71O0M31m83
2093I0m52J78O0J92k7K29j03k11K09n02p4J42kP31l3l94M8q2l22LJ14J87M39k07
$$ plain form
2117 213 -72 308 -109 -442 -397 52 268 514 146 -7 -639 -272 -397 -138 -88 534 424 139 -392 -607 -173
2138 -173 62 63 159 709 6 61 -171 -56 -205 186 56 375 65 -114 -62 -458 -85 244 279 461 430 178
2160 178 -145 -248 -369 -239 43 318 329 24 -366 -86 -208 32 -144 -61 353 318 -232 -253 -287 134 252 269
2182 269 358 8 519 -2 -452 -167 -262 401 151 41 -34 43 -142 -396 -264 195 445 319 -16 -123 -122 31
2204 31 -332 -187 -66 122 304 86 -111 -325 -40 139 423 336 430 54 3 -439 -323 90 125 211 161 -297
2226 -297 87 -72 -423 27 -134 398 657 254 -631 -10 -167 -105 -289 65 479 415 -114 -411 -100 -144 -234
2247 -234 119 235 130 64 -23 -158 -24 -167 6 224 342 119 -29 -308 -206 -100 95 39 91 158 -59 -32
2269 -32 -256 -94 200 -240 328 270 141 -262 -270 -259 -123 -2 381 -7 -63 -80 -354 -266 -114 -62 -35 171 262 273
$$ packed form
2117B13k85L80m17l33M5M49K16K46l68j53o32L67j25K59N0O22j10k85n31k15M34
2138a73K35JR6N50p03N5k32J15j49L91j30L19l10j79N2l96L73L29L5J82l1k52
2160A78l23j03j21J30K82K75J1l05l90K80j22K40j76Q3M14l5n50k1l4M21J18J7
2182B69Q9l50N11n21m50K85r5O63k50j10p5P7j85k54J32M59K50j26l35j07JJ53
2204C1l63J45J21J88J82k18j97k14K85J79K84q7R4l76n1m42J16M13L5Q6n0m58
2226b97L84j59l51M50j61N32K59m03q85O21j57O2j84L54M14o4n29k97L11m4r0
2247b34L53J16j05o6q7j35J34j43J73K18J18k23j48k79J02J06J95n6N2O7k17K7
2269c2k24J62K94m40N68n8j29m03qJ1J36J21L83l88n6j7k74Q8J52N2K7K06R1J1
$$ plain form
2293 273 -46 -367 -52 29 245 91 151 -9 263 -260 -51 123 15 149 141 265 -144 329 -179 -335 19
2314 19 498 420 201 -166 127 -130 -286 1 -31 558 420 -139 55 -113 -179 -337 180 398 -100 0 142
2335 142 75 -404 -230 -20 359 23 31 -204 -297 -302 -346 71 188 525 166 -105 54 -46 -130 51 116 225 200
2358 200 -150 -41 -519 -712 63 71 536 190 36 -68 77 -211 -191 -25 97 145 276 20 -113 -140 -392 -7
2380 -7 133 243 166 225 5 -180 -147 139 213 264 223 69 -197 -15 -364 147 -63 275 81 244 -74 -132 -337
2403 -337 1 55 -52 33 -49 90 -535 -328 26 121 -86 83 249 -139 -431 -167 278 163 128 276 330 43
2425 43 6 -450 -209 44 77 444 161 88 117 -211 -41 -50 -124 69 263 193 -19 66 -239 -223 -306 -20 -151 276
2449 276 357 -168 -192 79 -167 39 59 281 25 176 -59 -105 -191 197 -10 106 297 49 -281 -85 -113 23
$$ packed form
2293B73l19l21L15Q1K16j54O0j60K72n23K09J74j08J34qJ24m09M73n08j56L54
2314A9M79p8k19l67K93k57j56K87l2N89j38n59J94j68o6j58N17K18m98J00J42
2335A42o7m79J74K10L79l36Qk35r3nm4M17J17L37l59k71J59j00q4J81O5J09k5
2358B00l50J09m78j93P75QM65l46j54j04J45k88K0J66J22M8J31k56j33k7k52L85
2380gJ40J10p7N9k20j85L3K86P4N1m1j54k66J82l49N11k10L38j94J63l18n8k05
2403c37L38N4j07Q5q2J39o25K07L54R5k07J69J66l88k92K64M45j15l5J48N4k87
2425D3l7m56K41K53L3L67k83p3K9l28J70rp4J93J94p0k12Q5l05J6q3K86j31M27
2449B76Q1n25k4K71k46K06K0K22k56J51k35m6q6L88k07J16J91k48l30J96k8J36
$$ plain form
2471 23 297 348 21 0 -33 -261 -164 -235 326 233 83 147 -29 -212 -99 13 151 -161 186 287 76 -175 -257
2494 -257 -70 13 398 46 -177 20 -5 -249 -389 234 41 327 -2 -148 -239 -31 -80 82 -161 117 384
2515 384 56 -159 -138 166 -30 31 110 338 130 -262 -64 -208 -130 132 -115 154 47 192 91 -223 -300 183
2537 183 156 183 1 -213 25 -72 -256 -424 112 116 273 69 -367 -472 -251 -145 -157 393 202 179 -64 40
2559 40 -203 -124 12 249 47 184 50 -162 -216 -173 -22 189 273 -141 22 175 -169 -247 -197 -35 167 159 -111
2582 -111 -65 -390 -85 145 -1 -3 400 250 237 -105 71 -7 -32 59 98 250 -52 15 -213 -89 153 -22 154
2605 154 136 220 -25 7 -127 -175 178 -64 194 210 121 136 -195 -141 180 -90 145 39 103 -64 -222 -165 -84 -113
2629 -113 124 344 166 299 -189 -273 69 -78 335 -50 -165 75 -229 -405 134 -234 -121 64 121 128 -321
$$ packed form
2471B3K74N1l27k1l3k28R7p1N61r3j50O4j76j83J13J12J38l12L47J01k11k51q2
2494b57J87Q3L85l52k23J97k5k44j40O23j93K86l29j46r1K08m9J62k43K78K67
2515C84l28k15K1L04j96O1P9K28k08l92J98j44P8K62k47K69j07J45j01l14p7M83
2537A83k7K7j82k14K38r7j84j68N36MJ57k04m36j05K21J06j2N50j91k3k43J04
2559D0k43P9J36K37k02J37j34k12n4M3J51K11Q4m14J63J53l44p8N0J62K02qk70
2582a11M6l25L05K30j46kM03j50j3l42J76p8k5R1L9J52l02O7k28J24K42j75J76
2605A54j8Q4k45L2j34m8L53k42K58J6q9J5l31N4L21k70K35j06O4j67j58N7Q1k9
2629a13K37K20j78J33m88q4L42j47M13l85j15K40l04j76N39l68J13J85N7Pm49
$$ plain form
2650 -321 -18 -44 243 41 -111 -39 -128 262 -117 -55 -15 452 143 60 113 -283 -261 -69 -386 -298 -90 122 253
2673 253 -189 -72 -318 201 104 4 -1 283 53 89 -183 -100 -42 322 -257 167 231 -156 -197 -193 -318 123 266
2696 266 150 -95 -291 6 -320 -224 -112 92 105 396 -4 124 -313 20 207 -292 -3 -134 100 7 -96
2717 -96 -92 124 442 12 182 16 447 157 14 -323 -127 252 187 -178 -16 -9 -81 -77 -59 208 230 -11 228 85
2741 85 6 -219 -50 -114 -54 -140 -326 -111 -146 51 187 -248 220 37 -249 -79 233 -61 -208 199 231 174 443
2764 443 93 -43 -56 -294 28 113 396 -167 84 -249 -25 84 161 -45 16 315 -53 238 -38 -151 -96 -91
2786 -91 -124 116 335 126 -249 -255 281 223 75 186 -72 -141 -8 -60 -36 -271 71 170 20 -21 -256 -24 -249
2809 -249 -183 120 -166 338 -47 -302 177 -314 -125 -120 -385 -63 209 -102 3 -218 -444 -57 -105 -22 74 -106
$$ packed form
2650c21L03k6K87k02j52P2q9L90l79O2M0M67l09q3N3l96K2J92l17Q8K08K12J31
2673B53m42J17k46N19r7j00nK84k30L6k72Q3N8L64n79M24O4l87m1Mj25M41J43
2696B66j16k45j96K97l26R6J12K04J3K91m00J28m37L33J87m99K89j31K34r3j03
2717i6MK16L18m30J70j66M31k90j43l37J96L79o5l65J62Pp2MJ8K67K2k41K39j43
2741H5p9k25J69o4O0q6j86K15l5J97J36m35M68j83k86J70L12k94j47M07L2n7K69
2764D43l50j36j3k38L22Q5K83n63K51l33K24J09P7k06O1K99l68K91k76j13N5N
2786i1l3K40K19k09l75oN36n8j48J11k58o9J33n2K4k35L42R9j50m1k35K32k25
2809b49O6L03k86N04l85k55M79m91J89Nk65L22K72l11J05k21k26L87m8Q3R6j80
$$ plain form
2831 -106 104 260 -184 -204 -22 221 155 -34 -119 17 -80 -62 -56 205 509 86 -5 -99 -146 -151 159 244 147 256 -77
2856 -77 55 154 121 133 72 112 -218 122 77 110 -374 -158 -19 -320 -46 47 191 129 256 -145 -260 -55 129
2879 129 144 -146 82 -269 -109 -95 118 -78 -13 -154 -49 -43 -109 58 57 -67 163 -13 92 -33 21 312 -19
2902 -19 71 131 351 184 -99 -110 -170 -88 236 299 -76 -49 183 -31 -218 -11 -66 -92 83 -171 -304 -87 -370
2925 -370 203 323 313 262 111 23 -78 132 -173 -249 5 -80 -32 146 -311 144 -85 -98 103 -87 -110 212 272
2948 272 163 -114 -3 152 380 -7 35 -20 -124 -5 -531 -129 201 73 38 28 -120 -65 -44 76 81 169 167 -158
2972 -158 -255 -135 200 109 -13 -31 78 296 -133 -380 -179 -89 30 -61 -204 -8 387 322 -269 -6 -211 42
2994 42 129 -34 -102 26 17 -314 132 -265 14 362 55 -122 40 -91 -27 17 6 197 129 73 -37 -143 96
$$ packed form
2831a06K10J56m44k0J82K43o6j89q5J36r7J8OK61L04m23r1r4m7nL10Q5r7J09l33
2856g7J32R9l3J2o1M0l30L40m5L3m84K16J39l01K74R3J44o2J27m01j15K05J84
2879A29J5k90K28l51J60J4K13j96O5j41J05Oo6J67jj24K30j76J05j25N4K91l31
2902a9R0O0K20j67k83j1o0Q2L24O3l75K7K32k14j87K07n5k6J75k54j33K17k83
2925c70N73J20j0n1j51q8j01K10l05p6K54q5M8J78m57M55k29j3K01j90k3L22O0
2948B72j09k77J11J55K28l87M2n5j04J19n26M02L30j28l5j0j48N5K1J20NQ8kl25
2972a58r7J20L35r1j22j8J09K18m29k47K01R0J19r1j43J96L95o5n91K63k05K53
2994D2Q7j63o8J28rl31M46l97K79L48l07j77J62j31O4M4j1J91o8n6j10j06K39
$$ plain form
3017 96 -107 340 -154 -17 165 -49 -270 -80 29 297 30 -65 280 -148 -216 -125 236 -87 -1 126 115 26
3039 26 -71 270 -327 244 26 65 -34 326 23 12 83 81 107 66 -106 -18 -12 -246 47 -16 -25 -182 164 17 -94
3064 -94 96 -58 -159 127 111 -128 -165 -49 -238 111 -328 103 293 379 0 -47 187 -128 220 67 206 98
3086 98 106 -3 158 -168 -256 73 -231 253 323 112 84 -1 -345 11 -40 77 69 -140 82 85 17 -218 -20 -281
3110 -281 -235 128 302 293 -291 -458 -42 81 3 -348 -241 -29 290 -16 -58 78 -201 55 89 -38 -97 32
3132 32 -150 -156 -183 172 -66 -152 55 -3 -2 258 109 149 10 271 -38 36 -129 -35 -461 -8 -76 -66 131 -164
3156 -164 306 158 -129 -224 243 -32 98 -142 -183 -171 176 -161 137 22 165 4 -331 31 -228 0 14
3177 14 65 147 134 104 -145 -200 120 41 178 -56 81 -123 -49 -194 -124 -117 -152 81 -178 -100 -22 74 -56 55 120
$$ packed form
3017I6k03M47m94J37J82k14k21J90J09K68k67r5L45m28o8R1L61l23Q6J27j1q9
3039B6r7L41n97N71k18L9r9L60l03j1P1kK6m1j72Q8Ok34K93o3rj57L46j47j11
3064i4J90j54j01K86j6k39l7J16j89L49m39M31J90Q6l79m7K34l15L48j53J39j08
3086I8Qj09J61l26q8L29l04M84P0k11k8q5l44L56n1J17qk09K22Lo8k35J98k61
3110b81M6L63J74rn84j67M16J23p8l51J07K12L19l06m2J36k79K56L4j27n9J29
3132C2j82ok7L55k38q6K07n8JK60j49M0j39K61l09P4j65R4m26M53o8J0J97k95
3156a64M70j48k87r5M67k75J30k40m1J2L47l37K98j15J43j61l35L62k59K28J4
3177A4N1Q2j3l0k49n5L20p9J37k34J37k04P4j45P0Pl5K33k59P8P8R6j30J11O5
$$ plain form
3202 120 -18 -79 259 -213 -24 54 114 251 92 -89 -15 352 143 -128 40 -101 261 167 77 -198 -311 -154
3224 -154 -3 -103 -50 -181 -57 -208 266 -67 -242 125 154 -294 -8 172 40 -65 33 -8 -174 115 218
3245 218 -105 119 -9 -205 15 -112 -130 156 259 -46 -44 -107 83 134 -187 73 -91 12 -82 128 -45 -200
3267 -200 188 72 21 53 -192 -115 -172 4 -77 54 260 -45 49 -41 361 -252 -141 210 234 84 48 166 -131
3290 -131 -432 52 219 -259 -68 19 -33 -55 -241 -188 138 49 -107 -152 186 -110 69 163 438 292 -181 -56
3312 -56 4 -195 99 96 320 117 197 96 194 90 -138 68 155 -1 72 -11 -198 -79 -470 -64 -48 -57 -75 -149 133
3337 133 -84 7 -179 -274 210 -47 140 -57 -47 -70 -576 -398 -75 -90 170 -328 -39 -316 -44 313 87 -296
3359 -296 143 207 28 -188 283 175 -459 -79 -9 -262 -145 -113 9 -10 -5 -74 -102 90 261 118 -29 73 -374
$$ packed form
3202A20j38o1L38m72J89P8O0J37j59j81P4L67k09k71J68j41L62r4r0k75j13J57
3224a54J51j00N3j31J24j51M74l33j75L67K9m48K86J80j32j05R8m1j66K89J03
3245B18l23K24j28j96K20j27j8K86J03l05Ko3J90N1l21K60j64J03r4K10j73j55
3267b00L88j16n1L2k45P7n7J76q1J31K06l05R4r0M02o13J11L51K4j50l6J18k97
3290a31l01M84J67m78J91Q7n2k2j86N3L26q9j56m5L38k96J79R4K75j46m73J25
3312e6O0j99K94lK24k03Q0j01R8j04k28K06Q7j56P3q3j87J19l91M06J6rj8p4K82
3337A33k17R1j86r5M84k57J87j97J0k3n06J78L23j5K60m98K89k77K72L57k26l83
3359b96M39O4j79k16M71j08o34L80P0k53J17L2J22j9No9k8J92J71j43j47J02m47
$$ plain form
3382 -374 -287 -79 108 34 159 40 -64 47 134 -41 -14 -91 -104 -206 124 -149 -2 -26 37 293 -188 201 147
3405 147 -268 -131 -30 -71 -254 60 -143 132 115 -139 105 31 97 -218 88 166 106 -24 -210 -76 -92 202
3427 202 -135 172 170 191 -88 96 343 14 -38 -14 -76 160 384 111 40 -85 -72 279 -49 -267 40 -18 -163
3450 -163 58 -118 126 -11 -107 17 12 -19 -199 -298 142 -92 -21 -110 -90 -51 -176 95 -3 -51 -282 -200 -124 -11
3474 -11 -89 -102 73 -214 -80 134 -345 192 76 -235 -55 178 360 -41 -252 51 311 143 -75 -42 -68 315
3496 315 -168 -71 -7 20 170 127 64 -233 -171 -211 337 8 -53 23 154 62 -1 -130 190 -375 -61 -132 -2 -75
3520 -75 -29 124 406 328 -192 111 -176 113 -29 -231 -130 -176 -54 123 202 -100 174 -69 -64 167 132 135 210 153
3544 153 -219 -170 52 55 -73 -27 188 302 15 -200 -79 38 -77 -191 5 347 160 -167 59 -205 103
$$ packed form
3382c74Q7K08J87p4J25j19j04J11Q7j75K7p7j3j02L30k73J47k4O3K56m81L89n4
3405A47m15J37J01m1j83L14k03K75j7k54K44p4O6l15L06P8o0j30j86J34j6K94
3427B02l37L07kK1k79J84K47l29n2K4o2K36K24k73p1j25J3L51l28k18L07n8j45
3450a63K21j76K44j37r6J24nl1j80r9M40k34P1q9K0L9j25K71r8m8k31Q2P6J13
3474a1p8j3J75k87J34K14m79N37j16l11J80K33J82m01k11L03K60j68k18L3k6L83
3496C15m83R7O4K7J50m3o3k97O2m0N48l29o1P6J31r2o3j29L20n65L14p1J30p3
3520g5M6J53K82p8n20L03k87K89j42k02J01m6J22J77P9l02K74k43NK31l5LP5n7
3544A53l72M9K22Lj28M6K15J14k87k15J21J17j15j14J96L42j87l27K26k64L08
$$ plain form
3565 103 9 -153 136 -222 186 -5 -105 -173 -32 -54 -79 -101 31 84 12 37 -23 255 50 -103 35 16 34 55
3589 55 96 -237 8 57 201 26 -65 111 -346 -298 28 -127 -166 25 -231 -94 113 31 240 -110 -10 50 11
3612 11 130 -255 39 -101 194 142 -315 -301 -326 -68 -32 -14 93 302 59 115 58 76 -89 37 89 137 -82 -76
3636 -76 -171 -299 77 -157 -256 229 -150 27 -58 78 67 -164 -103 73 92 -59 76 -194 -209 -103 -111 27 6 -212
3660 -212 -142 101 -62 -34 355 148 65 -165 129 -52 -34 154 -146 501 115 -322 169 -7 -192 -217 348 207
3682 207 -76 14 -107 168 -70 -157 -116 15 100 166 -241 -36 -200 124 -115 -197 65 113 -87 -105 111 87 -127
3705 -127 187 56 39 3 31 -68 64 -101 99 251 -52 20 -35 201 -69 -178 102 195 38 -63 -211 223
3727 223 -123 -68 -68 208 -16 -105 -63 -50 -333 42 70 282 108 -297 5 -146 356 -256 -86 138 212 -98 40
$$ packed form
3565A03r4j62K89l58M08j91j00o8J41k2k5k2J32N3p2K5o0K78k05j53J38j9J8K1
3589E5M1l33K45M9J44j75r1J76m57M8L26j55l9J91k56J37K07q2K09l50J00O0l9
3612A1J19l85K94j40K95n2m57J4k5K58L6J8J07K09k43N6n7J8j65J26N2M8k19O
3636g6r5j28L76k34r9M85l79J77q5J36j1k31O1J76J9j51J35k70j5J06qJ38k1k18
3660b12P0K43j63K8L89k07q3k30K94j81J8J88l00O47l86m37M91j76j85k5N65j41
3682B07k83R0j21K75k38q7M1J31Q5O6m07K05j64L24k39q2K62M8k00j8K16k4k14
3705a27L14j31j7l6K8r9J32j65K00J52l03P2n5K36k70j09K80R3j57j01j48M34
3727B23l46N5%K76k24q9M2J3k83L75K8K12j74m05L02j51N02o12J70K24P4l10J38
$$ plain form
3750 40 -201 44 215 -36 108 -173 167 6 29 152 -376 -314 -122 -112 -103 -108 48 23 -3 30 90 514 30 117
3774 117 -75 -88 -142 94 75 -212 -31 -17 171 -94 93 97 58 23 -54 260 165 232 51 -304 -51 201 43 -123
3798 -123 -49 -66 322 -67 -9 161 -91 68 -278 252 -10 271 -16 213 164 -39 138 283 44 -191 -232 -92
3820 -92 82 294 -199 95 -26 213 189 -86 149 115 95 -67 -16 329 -263 -56 -125 -90 -444 172 232 20 -140
3843 -140 -64 195 -5 254 88 -2 12 -28 226 72 21 148 -11 214 -68 52 315 268 130 -288 251 136
3865 136 -38 -121 -3 94 -14 -345 -15 150 95 -105 57 73 37 -33 81 188 -98 145 52 124 265 -12 -4
3888 -4 -33 114 -14 150 -200 86 -149 -52 143 26 184 -102 25 39 77 -42 7 58 -58 22 -65 -20 -211 142
3912 142 -67 -134 166 -35 245 -155 58 72 213 -381 -67 -214 173 189 138 -52 -137 -341 16 -67 -157 -226 173
$$ packed form
3750D0k41K45J71k51J44k81L40j61K3J23n28O2J92J0RnJ56k5k6L3O0M24m84Q7
3774A17j92j3n4K36j9k87J81J4J88k65J87Ml9l5p7L14r5O7j81l55K53K52j58j66
3798a23P4j7L88l89N8J70k52J59l46N30k62K81k87K29m9k03J77J45k39k35m1J40
3820i2J74K12m93K94j21K39k4k75K35l4k0j62N1L45n92K07o9L5l54O16O0k12j60
3843a40P6K59k00K59j66r0J4m0K54j54n1J27j59K25k82J20K63m7j38m18N39j15
3865A36j74q3J18R7j08l31L30J65n5k00J62J6l6p0J14J07k86K43r3P2J41k77Q
3888dk9J47j28J64l50K86k35R7J95j17J58k86J27J4L8j19M9N1j16Q0q7M5j91L53
3912A42k09o7L00k01K80m00K13J4J41n94L14j47L87J6n1j90q5k04L57q3r0o9L99
$$ plain form
3935 173 119 -26 156 -207 -88 -2 -271 189 91 4 218 -143 181 -53 142 282 7 -63 -97 -152 94 0 81
3958 81 -19 161 -34 -29 -115 176 -101 363 100 -345 76 23 227 -53 -269 167 -244 -283 -49 6 81 -2 19
3981 19 179 377 134 28 -73 180 160 -75 -404 -295 -269 -79 70 -53 -321 -225 22 39 -117 135 -57 184
4003 184 128 -143 79 -106 200 -142 -88 285 30 32 152 82 -158 -117 -58 -127 -7 59 -27 -159 -92 -139 110 -81
4027 -81 170 220 292 264 6 15 182 221 -124 20 -72 -12 -27 -124 -200 160 -84 -99 -101 -30 270 83 156 11 -72 268
4053 268 70 28 -65 292 67 -207 -123 -264 -290 40 245 25 87 79 -111 83 -8 -11 -116 -4 -62 -85 408 -43
4077 -43 145 -21 97 -14 219 -70 158 -51 105 237 -17 -188 -68 203 -291 -29 -228 224 285 33 14
4098 14 41 31 -8 -94 26 -111 -132 152 -53 95 -20 -23 -265 250 -29 65 29 43 -278 -386 248 -14 54 63 -102
$$ packed form
3935A73n4j45J82l63J19Q6k69M60r8q7K14l61L24k34J95J40k75p0l4n5K46r4Q1
3958H1j00J80j95Nq6K91k77M64k63m45M21n3K04k80k16M36m11l9K34N5P5q3K1
3981A9J60J98k43j06j01K53k0k35l29J09K6J90J49j23k68R6K47J7j56K52j92K41
4003A84n6k71K22j85L06l42N4L73k55KJ20p0k40M1N9o9J20O6q6j32O7m7K49j91
4027h1K51N0P2k8k58RJ67L9l45J44r2O0j5r7p6L60k44j5kP1L00j87P3j45q3L40
4053B68j98m2r3L57k25k74Q4j41k6L30K05k20O2qj90J94r1lj05J12n8k3M93m51
4077d3J88j66J18j11K33k89K28k09J56J32k54j71J20K71m94K62j99M52O1k52j9
4098A4K7j0l9q6J20j37k1K84k05J48j15lk42N15k79R4l6J4l21j08O34k62O8Rj65
$$ plain form
4123 -102 205 -97 -38 15 45 -115 125 -31 160 247 303 -88 2 -131 -123 130 -252 154 22 -18 -46 -57 7 167
4147 167 7 -239 329 -169 -314 189 -11 14 229 57 -39 -170 117 108 -77 47 291 314 -53 -160 -244 -26
4169 -26 -167 -153 117 -34 117 -164 -7 121 177 -107 -121 33 -90 152 -24 100 -284 -253 -48 -69 -4 -151
4191 -151 0 -18 235 -268 -51 46 301 51 41 -209 -73 30 364 6 -172 -118 -123 -112 -146 145 261 287 30
4214 30 100 -127 -198 164 4 134 244 161 -120 138 2 -67 139 165 188 -143 40 235 205 -48 -243 -208 -79
4237 -79 16 177 42 104 1 301 -355 75 -376 -41 -296 41 -155 -292 74 -324 78 -175 2 162 64
4258 64 85 -13 -441 -19 100 -111 -101 120 209 -61 -249 107 -132 155 22 -217 -23 -74 -88 137 98 426 87
4281 87 141 -140 63 -108 60 -58 148 -12 -227 -119 136 5 93 -111 138 -185 -2 -174 -209 54 153 -47
$$ packed form
4123a02L07l02N9N3L0j60K40j56J91Q7N6l91R0j33QK53l82M06j32m0k8j1O4J60
4147A67j60k46N68m98j45N03k00K5K15j72r6j31K87rj85J24K44K3l67j07q4K18
4169b6j41J4K70j51J51k81J57J28N6k84j4J54j23K42j76J24l84L1K05k1O5j47
4191a51J51j8K53n03K17R7K55k50j0k50J36J03L34l58j78N4nJ1l4K91J16K6k57
4214C0P0k27p1L62j60J30J10q3k81K58j36o9K06K6K3l31J83J95l0k53j95L5J29
4237g9R5J61j35O2j03L00o56M30m51L35k55L37j96j37L66l98M02k53J77J60r8
4258F4K1r8m28M22J19k11J0K21Q9k70j88L56k39K87j33k39J94n1j4K25l9L28l39
4281H7N4k81K03j71J68j18K06j60k15J08K55j31Q8k04K49l23J83j72l5K63R9k00
$$ plain form
4303 -47 -169 341 -249 51 -25 -57 138 36 290 333 82 -117 154 -110 -103 64 -165 -70 -202 -140 -391 -47 211
4326 211 -160 -57 -116 -81 106 187 -77 -133 215 -50 26 89 348 189 -267 -176 -85 -133 -151 -64 260 -451 -102 19
4350 19 48 -104 30 69 -52 -117 232 -143 -219 46 51 -204 -113 62 77 -94 2 222 -14 -96 2 49 134 -9 93
4375 93 -340 -134 -135 -23 -95 -164 76 -110 4 -105 -3 -70 104 -85 96 22 104 -7 254 153 41 -153 -5
4398 -5 -101 -496 82 75 -72 -129 -210 42 43 47 105 3 287 90 16 190 -43 -178 -123 202 195 -43 274 161 -103
4423 -103 123 139 -61 -81 78 77 146 -45 -73 -61 -191 -156 -199 259 141 -6 -104 -124 -4 -289 -90 -144 -259 48
4447 48 -261 103 153 51 -112 -72 37 -246 55 176 -132 71 168 154 30 232 23 -105 109 -285 307 327
4469 327 12 -13 -54 64 -69 -55 15 281 -100 102 24 162 -25 8 -93 130 162 -5 8 67 376 76 20
$$ packed form
4303d7j22N10n90L00p6l2J95j02K54M3k51j99K71k64PJ67k29R5j32O2k51L44K58
4326B11l71J03n9L5J87Q1k64n6L48k65P6O3K59j59m56R1R1m8j8Q7L24p11L49J21
4350A9K9j52J34L9j21o5L49l75p6K65Nk55R1J75J5j71R6K20k36q2R8M7Q5j43J02
4375I3m33K06jJ12p2o9K40j86J14j09J02o7J74j89J81p4Q2j11K61j01j12j94J48
4398er6l95N78pj47n7q1K52JMN8j02K84j97p4J74k33j35N5L25pk38L17j13k64
4423a03K26J6k00k0J59jO9j91k8J2j30L5m3M58j18j47r8k0J20k85J99n4j15L07
4447D8l09L64N0j02j63M0J09k83L01J21l08K03R7j4j24K02k09j28K14l94N92K0
4469C27l15k5m1J18j33J4P0K66l81K02p8J38j87L3j01K23L2j67J3N9L09l00n6
$$ plain form
4492 20 -199 -135 -333 370 -215 12 214 -23 -156 -176 194 265 -249 10 87 322 -143 90 -194 191 -60 2
4514 2 166 -25 87 46 28 -163 -155 112 -32 -223 -44 -262 33 -95 -163 -275 -126 -62 -12 -22 -87 -174 67 -224
4538 -224 12 -193 -95 -27 -232 139 116 -209 47 -244 -164 -142 145 270 139 401 -120 -31 196 109 81 309 -51
4561 -51 -134 16 68 -221 236 -79 -37 296 -5 -77 -200 -63 29 -34 259 12 152 -51 -21 -152 51 -100 -169
4584 -169 102 -141 4 161 47 136 -149 7 -297 -280 -63 -21 97 36 -120 -304 57 60 22 -198 -231 -120 23
4607 23 -48 -25 49 298 50 -49 213 271 -359 -83 -197 -75 -126 230 -286 -11 6 104 216 118 -86 273 -97
4630 -97 -47 -78 114 -155 81 -217 195 14 362 -77 -185 5 146 -387 -35 71 -309 309 32 207 63
4651 63 -160 304 93 -80 54 39 -86 -88 -83 -19 -192 -138 -73 128 -158 -253 52 -348 -225 -199 59 -139 189 -314
$$ packed form
4492B0k19O4j98P03n85K27K02k37j33k0L70P1n14K59P7K35m65K33k84L85k51O2
4514BJ64j91J12m1j8j91QK67j44j91J79k18K95j28o8j12J49O4N0j0o5q7K41k91
4538b24K36k05R8O8k05L71k3l25K56k91Q0K2K87J25j31K62n21Q9K27q7k8K28l60
4561e1q3J50N2k89M57l15M2L33l01p2j23J37R2o3K93k47J40k03L0j31K03j51o9
4584a69K71k43J45J57j14Q9k85J56l04J7K17M2J18o1j56j84L61Ll8k20l3J11J43
4607B3p1K3P4K49k48r9K62N8o30K76j14J22n1L56n16K75J7R8J12r8k04L59l70
4630i7N0l1J92k69K36k98M12j81L48m39j08J90J41n33L52J06l80O18k77J75j44
4651F3k23M64k11j73J34j5j25kNO4j73N4O5K01k86r5L05m00J23K6K58j98L28n03
$$ plain form
4675 -314 -257 93 20 24 -73 -124 -92 18 -18 30 33 182 34 164 -151 177 -158 32 161 183 -15 -126 6 -124
4699 -124 147 -71 81 -237 111 -43 -61 237 117 -83 127 36 188 143 -248 17 106 184 30 111 -333 -67
4721 -67 -62 8 -17 -332 301 -352 -208 164 -115 116 153 154 -119 -50 233 42 -165 -24 316 -190 -36 93 -206
4744 -206 29 182 -56 70 107 -250 425 223 -56 -23 83 -121 71 140 -48 43 -81 -204 -84 -43 -192 -43
4766 -43 -82 138 -35 -7 -269 78 -64 112 152 279 85 110 -218 98 388 -31 -8 92 173 -11 21 9 31
4789 31 274 -190 -17 -229 42 52 23 257 183 207 252 79 -155 83 20 -33 28 218 602 64 111 -239 40
4812 40 332 -211 -41 -25 15 -75 273 -111 -13 -46 127 7 -266 106 33 -29 60 69 9 -19 158 155 -28 220 210
4837 210 193 -157 277 -220 170 22 228 -351 168 15 342 -14 -292 16 70 382 -94 103 144 53 -228
$$ packed form
4675c14N7L50p3Mr7n1L2J10l6M8LJ49j48J30l15L28l35J90J29K2j98j11J32j30
4699a24K71k18J52l18L48j54j8K98j20k00K10r1J52m5l91K65Q9P8j54Q1m44K66
4721f7NP0k5l15O33o53J44L72k79K31L7Jk73O9K83j91k07J41L40n06J54J29k99
4744b06K35J53k38J26L7l57O75k02k79L3J06k04J92O9j88R1j24j23J20M1j49J49
4766d3l9K20j73K8k62L47j42J76M0J27j94K5l28L16K90m19K3J00Q1j84L2j2K2
4789C1K43m64J73k12K71J0k9K34p4K4M5j73k34K38o3n3O1J90L84n38M7l50K79
4812D0K92n43J70J6M0r0L48l84R8l3J73j20k73L72p3o2Q9Ro0k8J77lj83K48j0
4837B10j7l50M34m97L90j48K06n79N19j53L27l56k78L08N4L12m76J97M1r1k81
$$ plain form
4858 -228 53 188 72 82 -114 -30 91 -343 3 71 7 33 7 -45 61 -105 170 24 192 -123 -81 -37 39
4881 39 -65 -69 -127 29 2 13 -67 -25 14 -84 -82 139 -320 197 -90 23 54 283 -79 -106 -79 -51 -50 139 214 -39
4907 -39 335 -34 211 -20 10 151 368 48 -141 -281 59 65 -116 -116 110 373 57 155 -36 63 -155 -139 136
4930 136 -250 86 -238 40 154 60 15 -26 -238 -77 119 211 78 -121 -315 -128 105 53 -234 -259 -94 239
4952 239 21 39 -209 349 -330 23 305 -105 117 -334 -74 2 -93 -8 -50 2 -69 -20 11 -126 164 -1 -52
4975 -52 0 -151 -8 197 -218 -93 -172 30 -395 224 74 -28 -78 -98 126 205 -77 -128 -132 112 172 -42 -213
4998 -213 -103 -1 -169 -238 -106 130 -35 38 -149 173 173 -86 -140 -146 -127 89 43 0 26 158 -49 -170 298 82
5022 82 -4 70 135 49 -4 -222 -259 9 228 78 183 -150 -241 -17 -35 -144 33 198 -174 -78 75 -106 261
$$ packed form
4858b28K81J35j16J0j96Q4J21m34L46O8o4K6k6n2J06j66K75j46J68l15M2M4P6
4881C9j04mn8J56k7J1q0M2L9r8KK21m59N17k87J13L1K29l62k7K7K8JJ89P5k53
4907c9L74l69K45k31L0J41K17l20j89j40L40Oj81%K26K63l16R8j91R9k18J6K75
4930A36l86L36l24K78J14r4m5m1k12J61J96R2j33j99j94J87K33n2k87k5J65L33
4952B39k18J8k48N58o79L53K82m10K22m51K60P6r5Q5m2N2p1M9L1j37K90j65n1
4975e2N2j51J43K05m15J25p9K02m25O19j50j02n0k0K24P9k82n1mK44O0k14j71
4998b13J10J02j68o9J32K36j65P3j87L22%k59n4oJ9K16m6m3K6J32k07j21M68k16
5022H2q6P4O5q6n3k18l7K68K19j50J05l33r1K24j8j09J77J65l72R6J53j81L67
$$ plain form
5045 261 80 35 -218 -30 217 244 141 -237 -469 -34 56 169 60 35 -188 15 -163 232 49 41 -70 89
5067 89 216 428 -207 48 323 186 -118 -281 147 124 -442 80 118 119 249 185 -123 -270 74 -119 86 -128
5089 -128 132 -80 81 234 86 118 72 39 132 23 33 361 -140 -260 -420 -214 -281 35 189 77 -82 181
5111 181 -125 140 383 10 -37 -147 92 -45 266 -23 4 -94 196 -97 -228 61 -74 -528 30 -48 56
5132 56 25 59 198 -96 67 -162 -1 -153 284 219 122 13 132 -142 -87 108 41 179 431 -18 119 124 146
5155 146 33 11 -75 127 82 14 -96 389 -89 170 -179 258 -142 -310 13 -66 236 -311 -117 383 -241 229
5177 229 29 166 -26 -111 141 111 368 -48 126 -110 28 32 82 138 -46 136 -27 128 155 69 24 -21 -57 -175
5201 -175 80 -101 339 -288 -103 -40 -39 -143 73 185 -144 19 43 535 15 -192 326 41 -146 -133 -149 -119
$$ packed form
5045B61j81m5k53J88K47K7j03l78k32M35R0J13j09k5k23K03j78L95j83qj11J59
5067H9J27K12o35K55K75j37l04j63M28k3n66N22L8JJ30o4l08j47L44j93K05k14
5089a28K60k12J61J53j48L2m6l3R3j09J0L28n01j20j60K06o7L16J54j12j59K63
5111A81l06K65K43l73m7j10K39j37L11k89K7r8K90k93j31K89j35m54N58p8J04
5132E6l1L4J39k94J63k29J61j52M37o5r7j09J19k74N5J95o7J38K52m49J37NK2
5155A46j13k2q6K02m5o8j10M85m78K59l49M37m00j68L23p9L02n47J94N00o24M70
5177B29k00J37j92q5K52l0K57m16J74k36J38MN0N6j84J82j63J55K7q6m5m5l6j18
5201a75K55j81M40o27J85O3Jj04K16J12l29J63K4M92n20k07N18k85j87J3j6L0
$$ plain form
5223 -119 20 121 -19 -156 119 23 -175 34 -42 93 -56 124 22 176 -21 108 132 224 -31 162 -85
5244 -85 -121 -30 -201 -124 139 70 -16 76 18 -123 -67 234 -84 0 -68 107 -249 -55 -9 -282 -165 -217 68 160 -241
5269 -241 -27 4 405 231 -74 230 82 179 207 108 138 194 32 -85 102 176 -85 -109 -105 76 -122 -107 558 1
5293 1 -290 -296 147 176 -114 -89 -67 -144 -135 60 17 -89 -131 47 -208 201 -85 -162 -188 -49 39 50 172 -288 88
5318 88 149 127 36 -31 82 118 14 -85 -70 -145 -215 -80 -212 -7 112 181 -317 -49 14 -118 -42 -124 206 -205 20
5343 20 -144 -191 47 199 218 261 247 -210 -52 27 -94 -80 -36 -396 -29 64 -692 -215 -268 -165 20 5 127 257
5367 257 -38 262 61 -93 60 -137 -131 -149 -9 112 49 -162 89 213 121 335 -164 111 -121 42 176 179
5389 179 -93 55 -67 49 226 -75 39 -252 -113 -442 191 -149 101 206 -120 -121 101 82 -97 -128 5
$$ packed form
5223a19J39J01j40j37K75r6j98K09p6J35j49J80j02J54j97J29K4R2k55J93k47
5244h5l6R1j71P7K63o9q6R2n8j41N6L01l18Q4o8J75l56J94M6k73J17n2K85R2m01
5269b41K14L1M01j74l05L04j48R7K8r9L0N6j62j17J87P4k61k4MJ81j98J5O65n57
5293Ak91oM43K9k90K5K2p7RJ95m3j06m2J78k55M09k86p7k6J39Q8J1J22m60L76
5318H8O1k2r1o7J13L6j04r9J5p5p0J35j32K05J19O9m98K68O3j32P6q2L30m11K25
5343B0j64m7K38J52J9M3j4m57J58P9j21J4M4l60L67R3p56M77n3J03J85j5J22J30
5367B57k95L00k01j54J53j97Oj8J40J21o3k11K51J24r2K14m99K75k32J63J34L
5389A79k72J48j22J16J77l01J14k91J39l29O33l40K50J05l26jK22j9j79l1J33
$$ plain form
5410 5 329 212 -50 -79 34 13 -102 6 64 -210 -196 -161 159 68 0 -1 -69 125 -86 -147 -54 86 -150 -19 -4
5435 -4 39 -133 -100 10 55 45 -90 -150 91 174 -32 -268 -227 32 7 -292 34 199 -14 -306 -215 -190 51 -96
5459 -96 319 -79 355 66 317 7 -98 -62 -180 103 34 -414 -12 156 154 60 168 204 -123 -215 -224 -223 -97 -100 -93
5484 -93 159 -302 -7 -230 -93 10 -97 -13 27 19 -17 -131 -42 -146 19 106 -75 109 155 -199 307 51 10
5507 10 -131 292 223 84 -221 -37 33 -123 165 -171 -150 -14 54 -257 -333 16 126 42 21 99 -164 206 327
5530 327 66 97 19 150 33 21 -106 31 -28 -191 -54 -127 39 162 -16 -10 -183 33 188 -126 312 34
5552 34 -55 395 79 -120 180 -91 139 -84 -96 115 123 60 74 160 131 -12 212 108 -161 -203 -10 23 27 -55 -109
5577 -109 -46 -57 167 -166 73 34 -192 14 105 186 -140 22 -310 -74 63 148 126 -3 -7 -143 84 -19 50
$$ packed form
5410EL24j17k62k9J13k1j15J08N8k74J4L5L20r1o8jo8J94k11o1R3J40k36J31J5
5435dM3j72L3J10M5j0j35o0K41Q3k06k36M1K59k5k99L26J65k13k92R1K5K41j47
5459i6M15l98M34k89K51l10j05L6j18K83o9m48M02J68kr4J08L6l27r2rJJ26lP
5484i3K52m61K95k23J37J03j07Q4M0ql6j14Q9j04J65Q7j81J84M6l54N06k56m1
5507A0j41M23o9j39l05J84P0j56K88l36K1J36O8l11p6L49J10q4k1P8k63L70J21
5530C27k61L1p8J31j17j2j27J37n9j63J37p3J66J23j78Oj73K16J55l14M38k78
5552C4q9M50l16j99L00k71K30k23j2K11Qo3J4Q6k9j43K24j04k69m2J93L3Mq2n4
5577a09O3j1K24l33K39l9k26K06R1Q1l26J62l32K36J37Q5k2j29mj36K27j03O9
$$ plain form
5600 50 146 107 -149 114 159 189 -25 32 135 322 -97 -35 15 223 -195 -34 -305 -25 -74 96 -269 150 8
5623 8 -26 -92 -64 67 362 411 237 343 -261 159 -175 -223 -216 -10 -143 -217 125 -30 -218 -88 -59 -124 132 78
5647 78 9 331 15 -110 89 -126 56 -12 255 -166 -30 8 -63 -23 20 -240 1 145 -180 -7 -146 69
5669 69 -271 -24 132 165 -214 77 -80 -5 284 214 11 172 -392 -371 -118 -43 -354 86 -16 -138 -32 -201
5691 -201 -218 38 294 -143 173 14 130 -1 -61 -22 -6 64 -59 17 33 -79 124 -12 16 131 -15 186 290
5714 290 116 -68 167 -2 -15 54 -240 84 -219 191 -71 19 91 191 -139 -183 -423 -232 93 118 195 36
5736 36 -87 -51 -73 354 -135 252 13 -12 228 -25 -141 151 -147 -98 -97 -70 90 -270 -72 36 102 56 71 61
5760 61 -396 27 141 156 15 -104 -30 -71 196 -37 -16 -28 77 356 -68 8 18 -20 -172 -175 -252 -83 -58 71
$$ packed form
5600E0R6l9k56K63M5L0k14N7J03J87m19O2N0K08m18J61k71K80m9J70l65M19j42
5623Hl4o6K8J31K95M9j74J06o04M20l34m8PK06j33p4L42j55j88J30K9o5K56n4
5647G8o9L22l16j25J99k15J82o8K67m21J36L8p1M0M3k60K41J44l25J73j39K15
5669F9l40K47J56L3l79K91j57P5K89p0k03J61n64K1K53P5l11M40j02j22J06j69
5691b01j7K56K56m37L16j59J16j31o0L9J6P0j23P6J6j12K03j36K8J15j46K01J04
5714B90j74j84K35j69j3O9k94L24l03M10k62R0P2J00l30m4k40J91L25K5P7j59
5736C6j23L6k2M27m89L87k39k5K40k53j16K92k98M9JK7J60l60J98J08O6m6J5j0
5760F1m57M23J14J5j41j19P4m1K67k33K1j2J05K79m24P6J0l8j52lp7J69K5J29
$$ plain form
5784 71 295 233 -280 -67 -512 283 60 102 304 222 -21 175 23 -40 67 58 338 32 -79 -61 57 100 -192
5807 -192 100 -95 -62 83 -64 -183 36 28 -68 115 57 163 -106 -172 -1 -234 -54 32 118 -176 213 -171 29
5830 29 -168 130 120 22 141 -66 207 -46 -26 208 118 -100 35 -88 36 -29 15 -87 164 -134 194 152 14
5853 14 -34 -13 -186 -173 -66 66 -67 -233 47 -22 54 -39 -40 -112 -120 -279 -149 165 -123 15 9 110 201 -136 -40
5878 -40 -163 -199 -30 -217 230 225 34 -26 -114 0 92 115 -140 195 -235 -147 -18 -106 -16 -8 -141 -159 -163 -241 57 -134
5904 -134 4 219 99 132 134 150 -151 165 92 -124 172 -122 261 132 -50 2 -109 23 -125 114 -92 -193
5926 -193 116 34 -68 -326 -251 104 115 -6 -175 34 22 192 102 -167 -243 -284 -146 -214 150 215 84 -155 60
5949 60 -18 3 -85 81 46 -171 -149 -24 245 359 -260 107 251 158 -150 -58 -15 47 16 -102 -14 91 -113 -244
$$ packed form
5784G1K24o2n13K13m45P95k23M2K02q2k43J96j52o3J07rK80l06j11J8J18M3k92
5807a92K92j95L3J45j47j19K19qr6J83n8J06k69o6J71k33J80Q6Q6k94L89l84K00
5830B9j97K98j0r8J19k07K73k53K0K34r0k18J35j23J24o5M4j02K51k98L28m2j38
5853A4m8K1j73J3J07J32j33j66K80o9P6r3jp2qj59J30L14k88J38oJ01R1l37R6
5878d0j23l6J69j87M47nj91o0q8J14R2K3k55L35m30Q8J29q8R0Qj33j8mp8K98j91
5904a34J38K15j20L3KJ6l01L16p3k16K96k94L83j29j82N2j11J32j48K39k06j01
5926a93L09q2j02k58P5L55J1j21j69K09j2J70r0k69p6m1J38o8L64O5j31k39K15
5949F0p8K1q8J66l5k17K2J25K69J14o19L67J44r3l08R2M3O2l1j18Q8J05k04j31
$$ plain form
5973 -244 -38 -152 -98 85 67 5 -255 -149 232 225 1 23 126 201 -104 204 75 24 -14 142 -563 -48 124
5996 124 7 -108 191 134 259 274 -220 -185 -115 -287 332 112 157 120 212 -140 155 362 86 66 -218 -132 239
6019 239 58 -103 254 -219 140 -238 7 -143 -171 117 -8 58 -108 -234 -114 -70 339 124 -289 -42 -90
6040 -90 41 17 229 20 -48 -317 -126 -119 -23 41 -62 -10 256 47 -254 9 7 129 11 20 85 -49 18 -60 -22
6065 -22 -67 -150 -105 145 63 -241 75 -143 95 -282 -157 -153 -312 49 32 -20 -27 228 -143 -189 -25 -170 1 -155
6089 -155 227 51 206 -218 5 -468 -168 -67 92 -3 304 46 -56 12 107 -210 166 117 -347 -83 -77 -263
6111 -263 -45 245 -238 -120 -235 -282 217 177 35 81 2 -144 326 119 25 -21 280 -168 -175 45 -138 377 -164
6134 -164 7 304 17 -106 -4 182 -244 -41 -34 -78 316 -54 55 29 -65 -190 219 -6 226 -122 -158 85
$$ packed form
5973b44K06j14N4J83j8o2k60J06L81pk24K2J03P5l05L08j29n1l8J56p05N15J72
5996A24j17j15K99n7J25J5m94L5P0j72O19k20M5l7R2l52K95K07k76k0k84Q6L71
6019B39j81j61L57m73L59l78K45j50k8K88j25O6j66j26J20M4M09k15m13K47m8
6040i0J31k4K12k09o8k69J91PR6O4j03N2K66k09l01K63kJ22j18RO5j34O7p8L8
6065b2m5q3M5K50q2l04L16k18K38l77J25Mj59L61j7n2pK55l71m6J64j45J71j56
6089a55L82j76J55m24K23m73L00J01J59r5L07k58j02O8R5l17L76m9m64K64Oj86
6111b63K18K90m83J18j15m7M99m0j42M6p9j46M70k07r4m6L01m48pK20j83N15n41
6134a64J71K97k87j23J02J86m26K03Pm4L94l70J09k6r4j25M09k25K32l48l6K43
$$ plain form
6156 85 22 92 170 -4 33 -13 104 -153 -34 -236 169 -43 37 209 -303 -188 3 291 -67 -34 292 -173 127
6179 127 103 -208 97 -207 -55 -346 -144 -104 12 -30 101 -218 -300 -73 50 -23 58 -163 -57 -148 132 91 -101
6202 -101 -186 -44 89 196 -48 -145 151 -91 -77 -105 -99 -366 138 356 -121 182 190 27 496 213 -98 -89 -89 -13
6226 -13 77 107 86 -19 -289 -19 -35 -62 101 105 -123 5 -28 161 -203 57 22 192 -103 322 222 -140 222
6249 222 -218 -274 134 -132 47 137 59 -165 -26 -31 201 23 110 226 -205 -102 112 282 58 -32 437 -8
6271 -8 -242 -38 105 -340 295 280 -128 313 100 -15 -13 59 -146 47 86 -214 72 -271 -243 -100 -23 -101 -95 -132
6295 -132 19 -58 110 -155 156 29 80 -19 191 85 -153 333 226 223 -147 -11 175 79 110 -133 -96 133 287
6318 287 89 -5 -428 119 84 -60 17 -100 -123 -101 344 -250 578 -7 -155 170 3 96 -350 234 0 47
$$ packed form
6156H5o3P0P8j74L7m6J17k57J19k02M05k12Q0J72n12J15J91K88l58L3L26m65L00
6179A27k4l11L05l04J52k91K02M0J16m2J31l19q2K27J23p3Q1k21J06r1K80m1j92
6202a01q5J42J33J07k44r7K96k42J4k8Ok67N04K18m77L03Qj63M69k83l11R%P6
6226a3R0L0k1j05k70K70j6k7J63Mk28J28l3J89l64K60l5J70k95M25j00l62L62
6249B22m40n6M08k66J79R0p8k24J39nK32j78Q7J16m31J03K14J70k24r0M69m45
6271hk34K04J43m45O35j5m08M41k13j15KP2k05J93L9l00K86l43K8J43P7p8Ol7
6295a32J51p7J68k65L11j27N1r9K10j06k38M86j07ll70J36J86r6L1k43L7K29J54
6318B87j98r4m23N47l5j44P7j17k3K2M45n94Q28n85j48L25j67R3m46N84k34M7
$$ plain form
6340 47 41 -23 70 -93 4 72 137 3 16 26 170 38 -103 38 76 -153 -47 7 220 154 208 -73 131 -49 51
6365 51 115 19 -21 212 45 -101 57 161 22 1 23 86 -22 9 -138 -73 -161 -52 56 151 -249 -3 151 180
6389 180 -286 -203 187 23 92 282 311 153 -5 -97 72 -213 281 36 -28 -3 116 -335 3 -124 181 178 108
6412 108 -225 12 -105 31 91 -145 68 72 33 5 170 -157 -182 -119 -3 145 -101 -169 12 -38 -2 39 -54 47
6436 47 -15 -202 159 -182 -173 122 -144 -72 234 54 277 225 146 332 -136 113 -198 224 -19 -64 12 -246 79
6459 79 -17 -110 -163 110 28 -3 -26 -95 -30 -204 110 40 96 273 -24 -178 -183 114 276 276 -307 6 -158 38 -83
6484 -83 -306 -25 -103 143 -68 -113 -53 258 356 -316 83 -263 107 10 -190 282 113 -148 -218 134 -93 447
6506 447 -163 -97 101 -1 52 -26 -186 99 227 -10 -104 -215 -128 -141 -66 -66 245 -309 -103 -231 -135 87 100 -92
$$ packed form
6340D7oo4R3j63R7O8O5j34J3J0J44j32j41J41L8k29J06N4K13o6N4k81K04j80J00
6365E1O4r6m0K33j67j46J58J04j39k1K2O3j08L1j47O5q8J09J08R5m00K46J54K9
6389A80m66Q3L90j64O9J90K9j58j58r2J69k85M94k45o4K5J19m51L38j27L05lp0
6412A08l33K37j17J36O0k36K13Ml9k8J65l27k5O3J16J48k46o8J81n0L6M1r3J01
6436D7o2j87L61l41RK95k66P2L06j80K23n2p9J86m68K49l11M22k43m5P6k58L25
6459G9r6r3n3K73q2l1k3o9O5j74L14p0N6J77k97j54nK97J62%n83L13j64J96j21
6484h3k23K81p8K46k11m5O0L11R8o72L99l46L70r7k00M72j69k61p0L52k27N40
6506D47o10O6J98j02N3p8j60K85J28k37r4j11Q7j3P5%L11n54K06j28R6K22J3j92
$$ plain form
6530 -92 50 52 -27 12 -210 94 -71 149 -9 -26 -119 242 100 64 84 28 203 124 -45 257 114 8 -187 -8
6554 -8 -176 177 -120 -138 290 188 -93 -430 241 344 144 -181 63 -107 -132 34 -159 -279 -77 64 93 -32
6576 -32 273 348 96 -66 -33 88 -47 -123 -205 96 -46 56 -55 185 242 -68 96 -4 90 -101 -91 -75 115
6599 115 116 -52 168 -142 52 -16 -205 125 -26 127 147 90 -163 -99 -1 -99 2 -55 -57 -119 93 -86 102 -15
6623 -15 151 -403 74 -136 -279 -141 -45 223 -44 490 -126 182 -37 81 84 235 53 129 28 -207 138 -31
6645 -31 0 -109 177 30 -131 -184 -18 -156 -19 2 -116 211 -241 -96 -154 373 78 -15 -19 93 2 -121 225
6668 225 -69 -127 -40 -258 -62 -104 150 63 -65 -8 116 -356 219 142 346 52 38 42 74 -17 -214 36 432 29
6692 29 322 -110 181 186 146 -160 -99 -26 38 167 -89 5 -67 125 -186 -65 29 77 -136 44 -121 -144 -193 209
$$ packed form
6530i2J42Kp9L9k22L04j65K20j58j7r3L61j42l6K0n6J75p9j69L02j43j06j95J79
6554hj68L53k97j8M28j02k81l37O71J03k00l25K44j70k5J66j93j20K02J41K9j25
6576c2L05P5k52j62L3J21j35p6q2L01j42J02j11K40N7l10J64j00R4j91J0J6J90
6599A15Jj68K20l10J94o8j89L30j51J53K0n7k53O4R8r8J01n7ko2K12j79J88j17
6623a5J66n54M77k10j43J38R6K68k67N34o16L08k19J18LJ51j82P6j01k35L45j69
6645c1L1j09K86j47j61n3J66j38J37K1j18L27m52J45n8N27k95r3mJ12r1j23L46
6668B25k94n8Q7k18J96m2K54q7j28N7J24m72N75p7K04k94j4ML2r1j97K50L96m03
6692B9K93m32K91Nm0l06O1P3O4J29k56R4p2J92l11J21R4M8k13J80j65k3m9M02
$$ plain form
6716 209 186 -58 -62 204 55 153 72 125 -104 -130 -206 -193 -151 27 54 -297 112 101 84 29 -156 198 223 22 -25
6741 -25 -234 -102 184 28 158 93 -192 -257 129 168 -130 306 164 44 152 -27 268 123 189 218 391 69
6763 69 -184 -93 -186 88 -64 16 -89 -225 -21 -32 51 -38 -109 190 194 76 -20 -33 -63 -26 80 223 126 -51 -206
6788 -206 310 -78 -175 63 47 -35 334 -94 -115 -92 17 -16 109 -45 90 -253 -46 -83 182 58 -109 -85 111
6811 111 97 217 124 -92 -32 117 91 63 186 -136 112 262 74 43 340 204 43 78 -200 -71 97 -217
6833 -217 71 49 -34 22 144 -99 -92 40 101 -92 -56 -21 -106 196 104 245 -303 17 -168 53 83 -147 -53 302
6857 302 -32 -244 -3 156 -18 -47 -136 -201 -89 -108 132 63 -150 -32 182 -19 -248 -178 145 151 -42 24 -145
6880 -145 -184 -60 56 70 122 112 135 -180 75 -30 -226 207 -26 -54 -108 297 -60 2 60 162 96 -256 -143
$$ packed form
6716B09k3k44mK66j49R8q1N3k29k6p6J3M2J78K7l51M09j1j7n5j85L54K5k01m7
6741b5k09J32K86j56J30o5k85o5L86L9k98M36j42j20J08j79K95j45O6K9J73l22
6763F9k53R1r3K74j52Q0j05j36K04j1Q3q9p1K99Mj18r6j3l0L7J06J43r7j77j55
6788b06N16l88r7K38j6q2L69m28k1K3J09l3J25j54J35l43K07l7K65j24j67K4J96
6811A11j4J20r3k16O0J49k6k8J23l22K48J50j88l1K97j36j61L5k78J29J68l14
6833b17K88k2q3N6J22k43PJ32O1j93L6L5q5L02r2J41n48L20j85K21L0k30R4L55
6857C02l34k12K41J59j74k9q9o5J12j9K40o9k13J18K14k01k29P0L23Oj93O6j69
6880a45l9J24J16J4N2j0K3l15K55j05j96M33k33k8n4M05l57O2N8J02o6l52J13
$$ plain form
6903 -143 -67 206 221 30 172 -417 5 33 -94 -19 66 -264 -106 -19 -465 214 168 -101 -24 93 -74 201 84
6926 84 -190 19 -179 -196 -83 261 -47 -53 160 52 414 -102 -30 107 75 -180 107 -21 362 -95 23 108
6948 108 49 283 148 -179 222 -136 2 154 217 155 -53 -138 -55 86 118 -50 45 325 346 -102 -242 133 -187
6971 -187 6 246 48 -93 -36 22 205 272 -174 -170 211 154 85 313 213 -143 -147 100 143 -79 268 137 134 -66
6995 -66 69 -146 -218 13 6 1 14 -21 45 55 139 -203 -73 132 -49 256 6 42 192 -100 -107 208 -108 54 -172
7020 -172 -32 56 -314 -10 106 -101 -19 -363 -27 200 -88 -237 36 58 -17 93 -86 -38 -31 27 -182 10 173
7043 173 -100 -182 110 -146 454 61 105 16 222 -178 195 -104 -180 -59 -109 -63 -55 -39 -13 102 -168 -232 -25 36
7067 36 324 -355 -182 36 -216 -88 182 209 -51 100 19 -156 -266 -180 71 -57 216 -78 -192 -314 118
$$ packed form
6903a43P6K73J5j91J42n89M22K8j27P5Q5l30J58Q7m46O79m6k69P7J17j67K75j17
6926H4k74K09j98j7J13L44l08oK13j08L62n16P2J37l2k55K87j28L83m57J18Q5
6948A08n9K34j35l27M01l58J38J52O3o2k08q5Q3J41L2j68R5K80K1m48j40L75l20
6971a87J93K40j98j41N7N8J83O7m46ML81n7o9K28j00l56mK47M3k22L47j31lk00
6995f6J35k15p2K31pnJ3l5O6J0Q4l42J30K05j81L05k50L6J50k92pL15l16J62k26
7020a72J40Q8l70L04J16k07Q2l44L36K27k88j49K73K2p5J10j79M8PN8k09J92J63
7043A73k73q2K92k56O00l93M4q9K06m00L73k99p6J21n0M6QJ6K6J15k70o4K07O1
7067C6K88o79J73K18k52J28K70K7k60J51q1j75j10Q6K51j28K73k94j14j22M32
$$ plain form
7088 118 38 -121 35 -319 131 -87 -168 -40 -415 69 -71 50 -31 -68 0 -26 -91 9 92 50 -51 56 -93
7111 -93 104 -47 -17 59 74 183 -103 -152 229 8 10 308 -5 -91 3 33 -73 -97 -21 -83 -152 32 -216 -327 250
7136 250 -38 252 194 86 87 282 -51 -175 94 45 -125 -101 -13 -103 -53 187 -56 -441 169 -255 32 -231 -105
7159 -105 167 -115 188 -39 -111 248 -223 -78 -446 -228 -12 169 -100 204 195 264 115 -74 360 23 46 -282
7181 -282 -218 -220 -239 -51 -113 33 -179 -228 226 208 -90 192 145 -56 10 100 135 32 -188 -124 153 -125 -101 114
7205 114 -54 120 -1 204 -147 -63 17 107 -153 -396 -141 187 -123 -150 58 322 140 -80 86 409 55
7226 55 103 -94 20 61 -255 -188 -4 13 163 259 162 194 22 -66 26 -496 -6 264 43 47 -14 -92 -245 142 497
7251 497 -188 34 -137 262 -179 176 -47 -163 31 -3 248 -69 -20 -143 193 64 -28 -43 160 -184 -230 -20
$$ packed form
7088A18q0j59J56l54M50k18q1J28l75M84j40J21q1l7O8k6o5J00Q3m2j01J07j49
7111i3J97j51L0P6J5J09k86m9L81k21KK98l13q6R4L0j06k4P6o2o9J84k48j11N77
7136B50k88K90n8j08JJ95l33j24K69m9j70K4Q8r0N0K40k43l85O10m24K87k63J26
7159a05K72k82L03k27p2L59m71J45l68K18K16J81k69L04rO9j49j89M34l37K3l28
7181b82O4kj9J88o2J46k12m9M54j8k98K82m7k01O6R0L5j03k20O4K77k78K4K15
7205A14j68J74j21K05l51Q4Q0R0k60k43K55L28l10k7K08K64j82k20J66L23l54
7226E5M8j97J14M1l16O7J84J7J50R6r7L2j72q8R2n22M90K70k21Mo1p8j53L87L55
7251D97o85K22j71L99m41L55k23j16J94l4K51l17M9j23L36j29r2j5K03l44m6K10
$$ plain form
7273 -20 23 -115 71 -29 -33 -278 -82 107 -304 155 -11 -126 -154 12 70 181 14 200 -85 393 -550 58
7295 58 -35 73 -224 -58 233 -240 -437 7 -32 -159 90 137 -68 -68 -23 440 -120 240 -91 -105 48 -202 95
7318 95 264 -233 2 199 220 64 126 56 298 -108 -23 -30 -65 65 -190 -186 -223 -78 68 -331 -254 227 -132 115
7342 115 58 -67 88 216 -7 181 78 -50 -180 -196 -23 -365 24 -282 119 -114 -132 151 -36 -158 201
7363 201 -58 122 -101 7 -233 293 44 -124 -51 -25 212 244 -303 -71 63 -268 64 -172 -201 -294 55 136
7385 136 227 -24 -59 -186 -22 78 240 -67 23 80 -79 -285 -224 301 0 -128 -43 341 237 135 -28 79
7407 79 -131 280 -35 -1 11 -112 -195 -22 350 -116 -32 78 99 121 58 -66 -121 34 -225 48 168 253 -40
7430 -40 13 84 -55 -32 181 173 -10 129 -190 187 22 -67 -111 59 -3 63 122 109 -272 -256 189 173 119 -165 -6
$$ packed form
7273b0M3j38J86j00mk45J96J89m11M59j66j15k8J66N8J11j67J86k85M78r43O08
7295E8r3J08k97J66K91m73j97M44l9j27K49M7k05%M5M63n60L60l31j4J53k50K97
7318I5J69m97K35J97K1j56O2p0K42m06Q5pl5J30k55Ml7J45J46l99P7M81l59K47
7342A15n7j25J55J28k23J88j03j28j30j6J73l42L89l06M01k33j8K83j87j22L59
7363B01k59J80k23J08k40N26k49j68P3K6K37L2n47K32J34l31L32k36k9r3L49Q1
7385A36R1k51l5j27J64J00J62l07R0N7j59k06O1N25l01j28Q5L84j04j02j63J07
7407G9k10M11l15L4J2j23q3J73L72m66Q4J10K1K2o3j24n5J55k59K73J20Q5k93
7430d0N3P1j39K3K13qj83J39l19L77j65q9m4J70o2O6N9j3l81J6M45j6n4k84J59
$$ plain form
7455 -6 -37 -307 208 -149 155 190 83 284 -38 -84 -40 107 -41 87 -27 -20 -60 43 62 328 -130 -17 141
7478 141 108 76 -127 -15 283 -23 -195 -56 -77 4 -141 81 78 -114 85 -395 205 -114 162 -9 239 201
7500 201 96 -200 -49 39 229 71 37 -84 -301 49 197 131 146 119 183 63 -18 -162 48 146 94 166 -289
7523 -289 322 169 257 -12 63 90 -194 -95 -81 -138 159 4 -2 -251 104 99 -143 3 -274 301 -121 -40 -234 48
7547 48 -82 95 -220 62 92 49 69 72 -43 2 74 -231 -71 -430 -61 1 -191 123 -327 277 -225 252 64
7570 64 -134 -327 129 9 -106 78 -118 25 0 -130 270 -66 68 68 25 99 -233 106 -97 188 5 -48
7592 -48 89 57 171 235 -23 -9 166 -251 -5 85 211 -109 114 -160 114 -73 -11 59 178 220 -267 -136 -86
7615 -86 302 -164 -261 -98 -353 -117 181 76 50 66 -226 -89 208 231 55 30 -98 74 -151 46 -60 167
$$ packed form
7455fl1k70N15l57L04L5j07K01l22m6M4J47j48J28j14Pm0J03J9K66m58J13J58
7478A41l3l2k03J12K98l06j72J39k1Q1j45K22lj92J99m80O00l19K76j71K48l8
7500B01j05k96J51Q8J90j58l4j21k17L50J48o6J5k7O4j20q1j44K10R8n2P2m55
7523b89O11j53Q8k69P5K7k84R9J4n7K97j55ok49L55nk42J46k77N75m22Q1j94K82
7547D8j30J77l15K82L0m3K0Lj15M5P2l05J60l59L69O2j92L14m50O04n02M77j88
7570F4j98j93M56j20j15J84j96J43k5j30M00l36J34%m3P4l32L39k03K85j83n3
7592d8J37l2J14O4k58J4J75m17K46R0J26l20K23k74K74j87O2P0J19M2m87J31N0
7615h6L88m66r7J63k55K36K98j05k6J6k92J37K97K3j76k5j28J72k25J97j06K27
$$ plain form
7637 167 -51 39 265 108 -197 62 -43 154 48 -163 149 168 96 -24 103 216 -64 -252 18 141 333
7658 333 -113 229 167 -155 92 109 -43 -37 -182 70 -119 100 -162 -3 3 128 -76 170 81 81 201 221 -124
7681 -124 129 0 70 -272 187 -17 -479 141 -139 168 -109 32 274 -105 47 -128 125 56 -51 -3 72
7702 72 108 -345 139 -58 131 142 179 -77 -16 52 -213 -12 154 71 210 79 97 -4 238 309 130 29 -20
7725 -20 -30 49 19 -141 3 -108 -156 137 -20 81 -25 -91 127 3 72 -164 101 -377 -267 -62 8 131 181
7748 181 13 -32 -20 -31 312 -223 -75 -120 -81 64 -50 -99 -45 232 -207 -113 132 340 -16 38 133 84 -155 -83
7772 -83 0 172 -49 -216 -148 150 237 -61 190 -315 -75 167 -115 -83 -150 59 -13 -15 146 -46 79 230 -61
7795 -61 -79 106 121 126 127 46 -49 283 201 86 -291 -100 283 35 91 -254 -190 175 61 -162 253 -98 -7 -52 -66
$$ packed form
7637A67k18R0K26j57l05K59j05J97j06k11L12J9p2j20J27J13k80j88K70J23J92
7658C33m46L42o2l22K47J7j52Oj45K52j89K19k62J59OJ25k04K46q9%J20K0l45
7681a24K53j29P0l42M59k04m62O20k80L07k77J41K42l79J52j75K53o9j07M8P5
7702G2L6m53M84j97J89J1L7k56O1O8k65K01J66q3J39j31J8j01K42P1j79j01m9
7725b0j0P9l0j60J44j11m8K93j57J01j06o6K18j24O9k36K65m78J10K05P0J23N0
7748A81j68m5J2j1L43n35J48m5L9J45j14m9N4K77m39R4K45K08l56N4R5m9k39P2
7772h3Q3J72k21j67O8K98Q7k98K51n05K40K42k82L2o7K09p2kJ61j92J25J51k91
7795f1j8J85J5NJq1r5L32q2j15l77J91L83k48N6l45O4L65j14k23M15l51R1m5j4
$$ plain form
7820 -66 -85 -92 -21 -191 246 84 140 -200 219 17 -84 20 71 -20 -162 336 -199 60 -89 142 238 -25 114
7843 114 300 345 -126 -59 44 -39 -11 54 49 -280 -213 59 -43 -193 23 -30 81 -245 -197 -99 -98 45 92 259 52
7868 52 181 59 -72 135 -130 39 131 -431 -148 -15 85 -118 -74 14 -96 -68 -65 31 188 -138 -219 33 238
7891 238 -133 63 102 9 37 -55 -138 92 158 370 80 181 -128 -244 -20 -185 39 89 -326 -20 -14 216 165
7914 165 68 52 -48 -243 53 -60 -119 154 -6 -151 97 151 367 -82 31 96 -260 -13 -64 313 106 -257
7936 -257 84 -9 21 -14 21 -177 -46 -100 177 -13 88 201 183 231 122 -79 -46 172 -114 75 1 124 -71
7959 -71 75 131 -43 41 -103 -29 -135 89 174 -145 37 -182 12 -159 -157 295 99 -53 8 -221 -190 123 -179
7982 -179 -57 153 -43 -203 -153 161 -88 134 55 28 125 245 -11 185 86 99 11 -185 -98 -91 213 55 -386
$$ packed form
7820f6j9pP1j70M37j62N6l40M19k02j01J04N1r1j42M98n35K59j49K31R6k63J39
7843A14J86M5m71O7J03q3K8O5nl29O7K72j02j50K16n3J11l26M8R8JJ43M7J67k07
7868E2J29j22j31K07k65J69R2n62K83J33J00k03M4Q8j10K8LR6J57l26q1K52K05
7891B38l71J96L9r3K8r2q3K30O6K12k90J01l09j16K24j65K24N0m15L06OK30n1
7914A65r7j6j00j95K96j13n9K73j60j45K48N4K16m49J13O5l56K47n1L77k07l63
7936b57L41r3L0l5L5j98J31n4K77j90J01J13j8M8j09k01L3K18k86J89p4J23j95
7959g1J46N6j74Q4j44P4j06K24Q5l19J82k19J94j71KM52j96j52O1k29L1L13l02
7982a79J22K10j96j60N0L14k49K22p9k7R7J20k56J96r9J3q8j96Q7PL04j58m41
$$ plain form
8005 -386 110 -75 49 -133 258 -174 -135 -3 -26 40 -56 -106 0 4 -64 220 -202 101 24 -206 -123 -83 34 89
8029 89 -213 -71 38 199 94 -228 -60 101 -172 -47 31 58 99 271 159 344 76 -36 52 -114 228 24
8051 24 114 -220 -70 -150 -69 134 -50 -53 -49 125 180 437 139 24 133 -67 237 -65 -85 -137 130 -134 -92 26
8075 26 81 374 79 -23 -31 -65 -8 -165 50 -150 131 -119 -163 98 107 74 86 65 107 44 -272 68 -231 -30 -24
8100 -24 185 150 14 -60 -341 -87 55 -25 20 53 102 -5 -92 -137 0 59 12 223 140 83 -41 31 -65 -183 76
8125 76 107 106 138 114 -23 -155 39 -120 120 -223 -164 -80 21 121 114 169 -22 -167 44 216 17 -4 1 -75 167
8150 167 105 72 113 -176 -13 165 -25 -91 151 -224 48 -312 -5 -236 46 -184 146 -97 196 208 -54 -157
8172 -157 5 43 119 88 342 -330 -151 -188 -204 157 -154 101 14 317 -84 -233 -82 153 -185
$$ packed form
8005c86M96j85J24j82L91m32L9J32k3O6r6n0J06Mo8K84m22L03p7k30Q3M0J17N5
8029H9l02J42J09J61j05l22J68J61k73J25P8K7M1J72j12J85k68j12Q8j66L42k04
8051B4R0l34J50q0Q1K03j84lMJ74N5K57k98j15J09k00L04l02k0n2K67k64M2J18
8075B6N5K93k95j02ql4N7j57K15k00K81k50m4K61Rl3J2k1M2o3l16L40k99K01O
8100b4K09l5j36p4k81K54J42q0M5L3M9j07q7m5J37N9m7K11q3n7j24P2r6j18K59
8125G6L1jL2k4j37j32J94j59K40l43N9Q4J01J00pN5j91j45K11J72j99k1Np6K42
8150A67o2l3M1k89J63J78j90o6K42l75K72l60L07k31K82k30L30k43K93J2k62j03
8172a57J62L8P6l1K54o72J79l7j6L61l11K55q7L03m01j49J51K35l38
8191a85
$$ Imaginary data points
##PAGE= N=2
##DATA TABLE= (X++(I..I)), XYDATA
$$ plain form
0 0 0 0 0 0 0 0 -8 8 -8 8 -8 16 -16 17 -24 29 -33 40 -48 57 -65 77 -91 102 -118 135 -154 174 -197 222
30 222 -252 280 -315 353 -394 439 -486 541 -600 663 -735 815 -899 998 -1104 1227 -1365
47 -1365 1521 -1705 1917 -2169 2474 -2851 3338 -3978 4876 -6224 8466 -12892 24992 -128572
61 -128572 -411130 -160930 118734 146178 19557 57162 140904 43940 -187142 -235742 -72005
72 -72005 77170 85505 93433 137370 77846 -129744 -257581 -150007 58305 144973 117182 86425
84 86425 47713 -67664 -175264 -141438 -938 86705 93108 105086 113523 7689 -170735 -216037
96 -216037 -55481 123042 145463 78425 52793 34071 -69550 -177966 -132872 39482 151094
107 151094 122365 55720 21858 -34598 -133460 -159249 -37964 120079 159301 82647 855
$$ packed form
0@%%%%%%qJ6j6J6j6K4l2L3m1N3o2P3q8J05j22J42j68J93k20K53k89L28l71M19
30B22m74N32n95O68p47Q33r25J027j141J263j398J550j714J897k102K331k592
47a365K886l226L622m086M643n325O189p316Q854j1100J4690k1358L7884j53564
61a28572k82558K50200K79664K7444j26621L7605Q3742r6964k31082m8600J63737
72g2005J49175Q335P928M3937n9524k07590j27837J07574K08312Q6668k7791l0757
84H6425l8712j15377j07600L3826J40500Q7643O403J1978Q437j05834j78424m5302
96b16037J60556J78523K2421o7038k5632j8722j03621j08416M5094J72354J11612
107A51094k8729o6645l3862n6456r8862k5789J21285J58043L9222p6654q1792
$$ plain form
118 855 -44119 -87826 -119319 -77053 33108 121817 126472 65763 -21989 -113470 -154433 -88191
130 -88191 48344 132545 102298 26038 -15296 -39591 -88834 -118040 -52624 75562 146854 104746
142 104746 8533 -69729 -111823 -111388 -43460 69040 135676 97116 4966 -55543 -67970 -71485
154 -71485 -64283 -7668 83605 129715 82689 -17979 -95751 -113317 -72498 8099 88978 117514
166 117514 69947 -13249 -72057 -82810 -62104 -21990 36850 92147 98640 38885 -46348 -97959
178 -97959 -91182 -38682 32500 91778 102797 48641 -37324 -92920 -84144 -32357 18894 54053
190 54053 73907 67572 18709 -57368 -105965 -82201 -2289 71991 91566 58583 4869 -43055
202 -43055 -72165 -71777 -33638 29168 79008 82372 35988 -30127 -77231 -81103 -41707 19821 69313
$$ packed form
118H55m4974m3707l1493M2266J10161Q8709M655o0709q7752r1481m0963O6242
130h8191J36535Q4201l0247p6260m1334k4295m9243k9206O5416J28186P1292m2108
142A04746r6213p8262m2094M35O7928J12500O6636l8560r2150o0509j2427l515
154g1485P202N6615R1273M6110m7026j00668p7772j7566M0819Q0597Q0879K8536
166A17514m7567q3196n8808j0753K0706M0114N8840N5297O493n9755q5233n1611
178i7959O777N2500P1182N9278J1019n4156q5965n5596Q776N1787N1251L5159
190E4053J9854o335m8863p6077m8597K3764P9912P4280J9575l2983n3714m7924
202d3055k9110L88L8139O2806M9840L364m6384o6115m7104l872L9396O1528M9492
$$ plain form
215 69313 77716 42328 -14079 -59605 -73011 -50176 -3277 45733 73698 62683 15570 -44922
227 -44922 -82562 -70086 -12792 49506 76470 57122 12243 -30572 -56551 -58565 -32567 15560
239 15560 60166 71712 41375 -12349 -57199 -69983 -43653 8300 57739 72989 44532 -6400
251 -6400 -48002 -59803 -41609 -5872 33603 58710 54039 19469 -27651 -60846 -60533 -24408 27482
264 27482 63467 60537 20843 -27103 -55154 -52600 -26959 10106 43427 55771 37543 -3889
276 -3889 -45155 -62122 -43756 -1659 41705 60749 43631 411 -40206 -55226 -41164 -10407
288 -10407 24641 49576 50671 21096 -23948 -55516 -52601 -20305 20790 48769 51692 28020 -12094
301 -12094 -46596 -53197 -28647 10025 41165 50659 36105 2759 -34486 -53576 -41377 -4190
$$ packed form
215F9313Q403l5388n6407m5526j3406K2835M6899M9010K7965j1015m7113o0492
227d4922l7640J2476N7294O2298K6964j9348m4879m2815k5979k014K5998M8127
239A5560M4606J1546l0337n3724m4850j2784K6330N1953M9439J5250k8457n0932
251f400m1602j1801J8194L5737L9475K5107m671l4570m7120l3195L13L6125N1890
264B7482L5985k930l9694m7946k8051K554K5641L7065L3321J2344j8228m1432
276c889m1266j6967J8366M2097M3364J9044j7118m3220m0617j5020J4062L0757
288a0407L5048K4935J095k9575m5044l1568K915L2296M1095K7979K923k3672m0114
301a2094l4502o601K4550L8672L1140R494j4554l3346l7245j9090J2199L7187
$$ plain form
313 -4190 34779 53477 42796 9367 -27376 -48905 -43430 -14614 21445 45814 46569 22420 -14575
326 -14575 -44982 -50252 -26770 12306 42981 48145 27158 -7437 -37500 -47694 -32749 -322
338 -322 31784 46498 35644 5131 -28793 -47939 -40450 -10018 25376 45591 40163 12987 -20971
351 -20971 -42961 -41809 -18313 14543 39196 41820 22624 -8576 -35308 -43968 -28462 3440 34779
364 34779 46096 30662 -1312 -31178 -42121 -31205 -4077 24923 41987 35672 9362 -21867
376 -21867 -40658 -36574 -13106 17400 38474 38791 17988 -12824 -35961 -38969 -20724 8705 33364
389 33364 40012 24809 -4362 -30494 -39370 -26801 21 26429 39068 30150 4857 -23360 -37806
402 -37806 -31438 -8470 18867 36231 34208 13140 -15822 -36132 -36002 -15606 12716 32637 34694
$$ packed form
313d190L8969J8698j0681l3429l6743k1529N475K8816L6059K4369P55k4149l6995
326a4575l0407n270K3482L9076L0675N164k0987l4595l0063j0194J4945L2427
338c22L2106J4714j0854l0513l3924j9146P489L0432L5394K0215n428k7176l3958
351b0971k1990J152K3496L2856K4653K624j9196l1200k6732q660J5506L1902L1339
364C4779J1317j5434l1974k9866j0943J0916K7128K9000J7064o315k6310l1229
376b1867j8791M084K3468L0506K1074L17k0803l0812k3137l008J8245K9429K4659
389C3364O648j5203k9171k6132q876J2569K6822K6408J2639q918k5293k8217j4446
402c7806O368K2968K7337J7364k023k1068k8962k0310J30K0396K8322J9921K057
$$ plain form
415 34694 18232 -8495 -30348 -36547 -21886 3764 27383 35623 24710 -307 -25532 -37200
427 -37200 -27639 -2622 22908 34825 27375 6062 -18753 -33821 -30510 -10173 15525 32981 31464
440 31464 12914 -12461 -29786 -31868 -16142 8535 29102 34041 19465 -5747 -26598 -31819 -19822
453 -19822 2471 23093 32569 24393 2857 -20650 -31703 -24942 -4541 18250 30463 26711 8913
466 8913 -13838 -29327 -28404 -12160 11484 28373 29631 13597 -10009 -27018 -28525 -15239 4274
479 4274 21247 28189 19575 -1295 -22577 -30273 -20709 -631 17785 26701 22363 5847 -16662
492 -16662 -30334 -25302 -5431 15500 25531 22568 9132 -9278 -24274 -25966 -12267 8310 23646
505 23646 25429 14500 -3634 -20332 -26984 -17681 3450 22368 27254 17152 -543 -17271 -24630
$$ packed form
415C4694j6462k6727k1853o199J4661K5650K3619Q240j0913k5017k5225j1668
427c7200R561K5017K5530J1917p450k1313k4815j5068L311K0337K5698J7456j517
440C1464j8550k5375j7325k082J5726K4677K0567M939j4576k5212k0851n221J1997
453a9822K2293K0622R476q176k1536k3507j1053O761K0401K2791J2213l752j7798
466H913k2751j5489R23J6244K3644J6889J258j6034k3606j7009j507J3286J9513
479D274J6973O942q614k0870k1282p696R564K0078J8416Q916m338j6516k2509
492a6662j3672N032J9871K0931J0031k963j3436j8410j4996j692J3699K0577J5336
505B3646J783j0929j8134j6698o652R303K1131J8918M886j0102j7695j6728p359
$$ plain form
518 -24630 -18194 -1648 15154 23512 20105 7326 -10300 -24383 -24935 -8434 13781 24509 20092
531 20092 7327 -5968 -18517 -25132 -16153 5619 24270 24463 9110 -6403 -15005 -18824 -16971
544 -16971 -4835 14356 26081 19651 -26 -16988 -22526 -17161 -4082 10662 21193 19948 6588
557 6588 -10509 -20824 -20231 -8924 7411 19085 20358 10434 -4600 -16599 -20732 -14365 1329
570 1329 18500 23508 13421 -3615 -14951 -17245 -13466 -4369 10771 22548 20784 3212 -14968
583 -14968 -20411 -13630 -3113 6441 15569 19043 11396 -6013 -20246 -20789 -8543 6794 16624 17566
597 17566 10717 -1726 -14530 -19772 -13448 531 13997 19043 13090 191 -11505 -17722 -15054
610 -15054 -4507 8856 18173 17374 5753 -9588 -18574 -16873 -6250 7235 16564 16546 7221 -5410
$$ packed form
518b4630O436J6546J6802Q358l407j2779j7626j4083n52J6501K2215J0728m417
531B0092j2765j3295j2549o615Q979K1772J8651J93j5353j5513q602l819J853
544a6971J2136J9191J1725o430j9677j6962n538N365J3079J4744J0531j245j3360
557F588j7097j0315N93J1307J6335J1674J273r924j5034j1999m133O367J5694
570A329J7171N008j0087j7036j1336k294L779R097J5140J1777j764j7572j8180
583a4968n443O781J0517R554R128L474p647j7409j4233n43J2246J5337R830R42
597A7566o849j2443j2804n242O324J3979J3466N046n953j2899j1696o217K668
610a5054J0547J3363R317p99j1621j5341q986J701J0623J3485R329j8r325j2631
$$ plain form
624 -5410 -14470 -15745 -9570 548 12115 18158 13676 -149 -14476 -19235 -12323 829 12632 16666
638 16666 11582 1411 -9013 -14383 -13302 -5556 6794 16624 16191 6441 -6893 -15447 -15595 -7040
652 -7040 5410 15939 16464 6779 -5219 -12344 -12673 -9068 -1061 10600 18141 13278 -1187 -13385
666 -13385 -15008 -9364 -1754 6938 14852 15581 3937 -10619 -16526 -10864 -2511 4616 11080 14567 8868
681 8868 -5052 -15789 -14806 -5941 3619 10546 14338 10034 -2425 -13704 -14520 -6444 1145 6143 12122
696 12122 14068 5111 -11120 -18908 -11222 1574 8309 10515 11581 6937 -5861 -16231 -13199 -1074
710 -1074 6729 7600 9737 10981 2378 -13955 -19936 -7604 8886 13317 8712 4898 2168 -5946 -14524
725 -14524 -11973 741 10732 11600 7907 3856 -4084 -14176 -14995 -3025 10472 13241 7459 2024
$$ packed form
624e410r060j275O175J0118J1567O043m482j3825j4327m759O912J3152J1803M034
638A6666n084j0171j0424n370J081P746J2350R830m33r750j3334q554j48Q555
652g040J2450J0529N25r685j1998p125l29L605Q007J1661P541m863j4465j2198
666a3385j623N644P610Q692P914P29j1644j4556n907N662Q353P127O464L487n699
681H868j3920j0737R83Q865R560O927L792m304j2459j1279q16Q076P589M998N979
696A2122J946q957j6231p788P686J2796O735K206J066m644j2798j0370L032J2125
710a074P803Q71K137J244q603j6333n981J2332J6490M431m605l814k730q114q578
725a4524K551J2714R991Q68l693m051p940j0092q19J1970J3497K769n782n435
$$ plain form
739 2024 -2559 -9774 -13536 -7188 5482 12264 10314 4616 -700 -7654 -13795 -10954 1609 12727
753 12727 13148 5776 -1441 -6783 -11193 -9871 -1359 8849 11508 7072 2008 -2225 -9512 -14446 -7708
768 -7708 7585 16457 10304 -731 -5516 -6217 -8142 -7874 -247 10813 13642 5461 -3595 -8086 -8680
783 -8680 -8287 -2524 8080 14375 9582 -1714 -9125 -9513 -6350 -1656 4134 9399 10130 3775 -4494
798 -4494 -10016 -10863 -5753 4205 11842 11348 3133 -5284 -7785 -7297 -5774 -1382 7009 12681 8615 -1591
814 -1591 -9565 -9280 -5248 -1588 3895 10643 11520 2720 -8400 -12157 -6887 300 3917 5819 7743
829 7743 6259 -1159 -9671 -12104 -5909 3643 9951 9579 4465 -2326 -7301 -8685 -6112 198 6223
844 6223 9362 7091 874 -5315 -8997 -7839 -2822 4709 10115 9509 2827 -5844 -10015 -7080 -1657
$$ packed form
739B024m583p215l762O348J2670O782j950n698n316o954o141K841J2563J1118
753A2727M21p372p217n342m410J322Q512J0208K659m436n064m233p287m934O738
768g708J5293Q872o153j1035m785p01j925K68P627J1060K829q181r056m491n94
783h680L93N763J0604O295m793j1296p411l88L163M694N790N265P31o355q269
798d494n522q47N110R958P637m94q215q417k501M88J523M392Q391N672m066j0206
814a591p974K85M032L660N483O748Q77q800j1120l757N270P187L617J902J924
829G743j484p418q512k433O195R552O308l72n114o791m975j384K573O310O025
844F223L139k271o217o189l682J158N017P531N406o06o682q671m171K935N423
$$ plain form
859 -1657 2979 6229 7466 6344 -135 -7434 -10979 -6484 2214 8165 8631 5644 -114 -5978 -9177
874 -9177 -6681 -267 5867 8324 6056 1329 -3469 -7543 -8514 -4039 3686 9248 8923 2623 -3968 -7794
890 -7794 -7273 -3839 1403 6422 8135 4952 -986 -6058 -8615 -5796 -242 6128 8881 6255 169
905 169 -5454 -8114 -6341 -1100 4343 7624 6631 2435 -3374 -6883 -7565 -3958 2945 8110 8345 3357
921 3357 -3445 -6704 -6885 -3665 870 5076 7581 5553 -307 -5754 -7789 -5117 -560 4230 7763
936 7763 6817 1767 -4951 -8061 -5844 -975 3753 5689 5592 3542 -1357 -6212 -7278 -4001 1936 6466
952 6466 6910 3703 -926 -5336 -7219 -4209 202 4714 6820 5371 461 -4182 -6690 -5403 -1242
967 -1242 3329 6219 5895 2121 -2882 -6753 -6138 -2178 2614 5336 5597 3279 -365 -4937 -6711 -4439
$$ packed form
859a657M636L250J237j122o479p299l545M495Q698N951M66k987n758n864l199
874i177K496O414O134K457k268m727m798m074r71M475P725N562l25o300o591l826
890g794N21L434N242N019J713l183n938n072k557K819N554O370K753k626o086
905A69n623k660J773N241N443L281r93m196n809l509o82L607O903N165K35m988
921C357o802l259j81L220M535M206K505k028n860n447k035K672M557M790L533
936G763r46n050o718l110K217M869M728J936r7k050m899m855j066L277N937M530
952F466M44l207m629m410j883L010M411M512K106j449m910m643k508J287M161
967a242M571K890l24l774n003l871O15L960M792K722K61k318l644m572j774K272
$$ plain form
983 -4439 588 5689 6663 3766 -654 -4062 -5677 -4813 -929 3562 6195 4985 1226 -3067 -5985 -5229
999 -5229 -1910 2615 5199 5771 2850 -1962 -5163 -5374 -2781 1390 5028 5522 3177 -284 -3785 -5054
1015 -5054 -4330 -458 3447 5724 4449 947 -3589 -5397 -4319 -821 2549 4846 4608 2311 -1970
1030 -1970 -4766 -5360 -2238 1872 4678 4862 2880 -977 -3925 -4966 -3265 -1 3404 5269 3498
1045 3498 391 -3239 -4849 -4130 -968 2998 4983 4069 1032 -2649 -4589 -4369 -1470 1327 4085 4292
1061 4292 2709 -874 -3743 -4794 -3071 604 3755 4561 2857 -39 -3091 -4221 -3298 -508 3140
1076 3140 3976 3316 936 -1857 -4084 -4013 -1175 1680 4029 3865 1446 -1464 -3583 -3957 -2201 712
1092 712 3486 4350 2450 -537 -3269 -4023 -2689 -224 2443 4384 3163 -106 -2597 -3653 -2808 -404
$$ packed form
983d439N027N101R74k897m420l408j615Q64L884M491K633j210l759m293k918P56
999e229L319M525K584N72k921m812l201k11K593M171L638M94k345l461l501j269
1015e054P24L872L905K277j275l502m536j808J078L498L370K297k38k297m281
1030a970k796n94L122M110K806J84j982l857k948j041J701L264L405J865j771
1045C498l107l630j610P19L162L966J985r14l037l681j940K20K899K797K758K07
1061D292j583l583k869j051J723L675L151Q06j704k896l052j130R23K790L648
1076C140Q36o60k380k793k227P1K838K855K349j64k419k910k119l74J756K913
1092G12K774Q64j900k987k732p54J334K465K667J941j221l269k491j056Q45K404
$$ plain form
1108 -404 1479 3681 3748 1338 -1389 -3698 -3692 -1368 1377 3352 3705 1921 -940 -3208 -3291 -1946 495
1125 495 2225 3200 2985 632 -2344 -3920 -2937 -367 2363 3628 2465 882 -1484 -3195 -3126 -1229
1141 -1229 1527 2963 2857 1525 -324 -3005 -3396 -2019 558 2941 3604 1923 -650 -2602 -3182 -2202
1157 -2202 103 2234 2691 1890 727 -1375 -3049 -3143 -1238 2066 3465 3194 538 -1176 -2542 -2952
1173 -2952 -1580 942 2885 2809 1559 -501 -2205 -3119 -2241 346 2326 3274 2182 -44 -1462 -2889
1189 -2889 -2578 -265 1899 3143 2252 591 -1612 -2599 -2630 -1542 1246 2634 3114 916 -1281 -2256 -2429
1206 -2429 -1831 318 2378 3277 1878 -473 -2154 -2485 -1785 -818 1570 3091 2633 -39 -2201 -2667 -1673
1223 -1673 -219 1049 2231 2298 1332 -919 -2380 -2356 -1197 574 2295 3175 1752 -1171 -2319 -2407 -1131
$$ packed form
1108d04J883K202O7k410k727k309OK324K745J975L53j784k861k268q3J345K441
1125D95J730R75k15k353k976j576R83K570K730J265j163j583k366j711O9J897
1141a229K756J436j06j332j849k681l91J377K577K383O63j681k573j952n80R80
1157b202K305K131M57q01j163k102j674r4J905L304J399k71k656j714j366m10
1173b952J372K522J943p6j250k060j704r14Q78K587J980R48j092k226j418j427
1189b889L11K313K164J244q91j661k203r87l1J088K788J388M80k198k197r75j73
1206b429N98K149K060Q99j399k351j681l31P00R67K388J521m58k672k162m66R94
1223a673J454J268J182O7r66k251j461K4J159J771J721Q80j423k923j148q8J276
$$ plain form
1240 -1131 172 1277 2130 1975 328 -1871 -2409 -1415 50 802 2117 2459 1240 -1340 -3093 -2149 -184
1257 -184 1394 1561 1469 1175 -188 -2027 -2255 -1416 580 2022 2150 1223 -533 -1349 -1901 -1111 -181 936
1275 936 2232 1916 215 -1549 -2250 -1417 79 860 1290 1908 1662 -585 -2742 -2202 -109 1365 1470
1292 1470 1022 868 184 -1106 -2472 -1720 452 2177 2031 858 -379 -980 -1246 -1620 -451 1054 2469
1309 2469 1743 138 -1077 -1733 -1138 -517 248 1366 1803 1326 -408 -2138 -2107 -430 1033 1496 1228 672
1327 672 240 -787 -1706 -1632 -42 1710 1870 916 4 -909 -1389 -1487 -555 874 1441 1769 501 -1021 -1411
1346 -1411 -1057 -149 39 912 1420 1029 -154 -1660 -2056 -721 931 1155 823 503 8 -725 -1697 -1364
1364 -1364 66 1280 1333 646 494 -412 -1350 -2024 -769 1116 1448 1065 186 -346 -1049 -1446 -729 395
$$ packed form
1240a131J303J105Q53j55j647k199n38R94J465P52J315L42j219k580j753R44J965
1257a84J578J67r2k94j363j839k28Q39J996J442J28r27j756q16n52P90R30J117
1275I36J296l16j701j764p01Q33J496P81M30O18k46k247k157N40K093J474J05
1292A470m48j54o84j290j366P52K172J725j46j173j237o01k66l74J169J505J415
1309B469p26j605j215o56N95O21P65J118M37m77j734j730L1J677J463M63k68n56
1327F72m32j027r19P4J590J752J60r54r12r13m80r8R32J429N67L28j268j522l90
1346a411L54R08J88Q73N08l91j183j506l96J335J652K24l32l20m95p33r72L33
1364a364J430J214N3o87j52r06r38o74J255J885L32l83q79n32p03l97P17J124
$$ plain form
1382 395 1248 1403 611 29 -895 -1559 -1026 282 1109 1225 898 143 -524 -1087 -1452 -512 892 1198 807
1401 807 211 -197 -868 -1405 -807 244 1542 1194 506 -210 -777 -1009 -820 -130 1083 1273 638 39 -646
1420 -646 -623 -766 -525 714 1576 792 -11 -705 -568 -879 -309 145 691 1464 537 -438 -947 -591 -400 32
1440 32 426 1243 655 -88 -628 -768 -858 -387 704 875 550 159 -565 -833 -691 -672 186 1087 854 8 -758
1461 -758 -687 -439 -262 -119 636 1030 934 114 -1238 -910 -286 62 407 795 806 463 -679 -932 -825 273
1481 273 237 539 581 402 37 -900 -724 -494 451 780 872 368 -23 -294 -669 -375 127 428 752 423 198
1502 198 -301 -1014 -719 -149 368 603 1146 -134 -183 -797 -872 -283 519 883 746 513 77 -305 -954 -465
1522 -465 108 539 479 608 -218 -132 -800 -958 -348 179 780 501 -89 -373 -541 -312 -120 3 836 915 429
$$ packed form
1382C95Q53J55p92n82r24o64N33J308Q27J16l27p55o67n63l65R40J404L06l91
1401H07n96m08o71n37N98J051J298l48o88p16n67k32J89O90J213J90o35n99o85
1420f46K3j43K41J239Q62p84q03o94J37l11N70M54N46P73r27r75n09L56J91M32
1440C2L94Q17n88p43n40j40r0M71J091J71l25l91p24k68J42J9Q58R01k33q46p66
1461g58P1K48J77J43P55L94r6q20j352L28O24L48L45L88J1l43j142k53J07J098
1481B73l6L02M2j79l65r37J76K30R45L29R2n04l91k71l75K94N02L01L24l29k25
1502A98m99p13K95N70N17K35N43j280m9o14p5N89Q02L64j37k33m36l82o49M89
1522d65N73M31o0J29q26Q6o68j58O10N27O01k79n90k84j68K29J92J23Q33P9m86
$$ plain form
1543 429 -462 -855 -519 -47 -240 89 400 746 612 -637 -858 -549 118 626 319 607 47 -82 -611 -889
1563 -889 -161 130 508 296 56 -66 -681 -536 -504 -280 408 508 330 -239 -675 -617 -292 -51 50 570 180
1584 180 187 -48 -655 -614 -259 162 299 418 275 -221 -468 -461 -426 298 431 474 310 -68 -143 -647 -551 220 181
1607 181 420 585 293 -233 -418 -428 -122 217 475 199 208 -13 -229 -615 -601 228 622 671 156 -39 -345 -587
1629 -587 89 446 231 484 455 184 -18 -642 -27 -215 494 516 391 258 -204 -161 -533 -421 50 417 341
1650 341 362 83 -348 -444 -340 -306 569 415 339 -1 -314 -431 -237 -338 -62 438 342 116 -159 -421 -356 63
1672 63 -253 416 608 271 446 -632 -366 -536 313 48 501 376 206 25 -435 -534 -438 207 742 258 -8
1693 -8 56 -451 -327 -474 71 508 647 274 -220 -403 -479 -171 165 172 267 303 100 -341 -740 -297 -111 -25 320
$$ packed form
1543D29q91l93L36M72j93L29L11L46j34j249k21L09O67N08l07K88n60j29n29k78
1563h89P28K91L78k12k40j22o15J45L2K24O88J00j78n69m36N8L25K41J01N20l90
1584A80Pk35o07M1L55M21J37J19j43m96k47PL5P24J33M3j64l78p5n04R6P71l9
1607A81K39J65k92n26j85j0L06L39K58k76Rk21k16l86J4Q29L94M9n15j95l06k42
1629e87O76L57k15K53k9k71k02o24O15j88P09K2j25j33m62M3l72J12M71L67p6
1650C41K1k79m31r6J04L4Q75j54p6l40l13j17J94j01K76N00r6k26k75k62O5M19
1672F3l16O69J92l37J75j078K66j70Q49k65M53j25j70j81m60r9R6O45N35m84k66
1693hO4n07J24j47N45M37J39l73m94j83p6L08L36PR5L6k03m41l99M43J86Q6L45
$$ plain form
1716 320 65 161 -278 -366 -467 -267 85 427 594 395 -63 -234 -452 -124 -58 279 406 310 -4 -566 -463
1737 -463 -452 -328 132 227 434 156 -10 -402 -359 -272 -210 116 378 234 0 -230 -436 -361 354 477 355 304
1759 304 102 -289 -385 -149 48 366 385 220 235 24 -337 -324 -246 129 314 614 239 -420 -436 -219 -10 -132
1781 -132 300 532 168 -113 -263 -536 -438 -178 433 469 461 223 -93 -408 -28 -91 418 297 234 152 118 51 -564
1804 -564 -254 258 416 549 153 -187 -341 -456 16 -107 59 67 96 -165 -313 -352 -2 -79 261 557 281 -181
1826 -181 -170 -369 -390 -401 228 609 282 116 -21 -254 -89 102 -50 504 438 213 -136 -241 -235 -286 18 354
1848 354 524 315 -341 103 -434 -402 -131 277 520 321 -2 -51 -415 -118 -518 -14 260 371 435 -467 -281
1869 -281 -163 -357 -161 124 554 344 -178 23 -490 -360 -345 229 336 339 -49 -337 -345 -564 -560 -109 343 450
$$ packed form
1716C20k55R6m39q8j01K00L52L42J67j99m58j71k18L28O6L37J27r6l14n62J03
1737d63J1J24M60R5K07k78j66l92M3Q7O2L26K62j44k34k30k06P5P15J23j22n1
1759C04k02l91r6K36J97L18J9j65J5k11l61J3P8L75J85L00l75o59j6K17K09j22
1781a32M32K32l64k81j50k73R8K60O11L6qk38l16l15L80o3N09j21o3q2l4o7o15
1804e64L10N12J58J33l96l40j54j15M72j23J66QK9k61j48l9L50p7L40K96k76m62
1826a81J1j99k1j1O29L81l27j66j37k33J65J91j52N54o6k25l49j05On1L04L36
1848C54J70k09o56M44n37L2K71M08K43j99l23m9l64K97m00N04K74J11O4r02J86
1869b81J18j94J96K85M30k10n22K01n13J30J5N74J07Ll88k88qk19MM51M52J07
$$ plain form
1891 450 226 -590 -478 -355 -226 -50 270 530 280 -200 -498 -270 8 -234 -44 535 376 26 -285 -634
1911 -634 -170 85 373 282 228 275 -152 -521 -434 19 124 19 327 420 20 -772 -672 153 271 102 408 164
1933 164 120 -34 -412 -138 201 177 287 119 70 -235 -346 -357 -37 353 99 -233 47 463 -130 -601 -308
1954 -308 -36 388 526 133 381 -159 -455 -452 61 211 181 228 -157 -251 -320 -522 -56 411 167 173 5 -195 -313
1977 -313 -378 -293 204 345 278 162 -130 -252 -482 -106 -147 235 510 327 152 -289 -191 -359 -78 279 172 374
1999 374 296 -172 -50 -509 -135 122 250 253 215 -148 -92 -364 -128 85 225 128 416 39 -153 -531 -308 181
2021 181 130 203 308 82 -193 -776 -442 -55 369 458 193 -147 -95 -79 -376 -286 -25 642 666 72 -65 -202
2043 -202 -220 -252 -518 136 307 242 -113 -501 -127 -335 245 365 238 284 222 122 -57 -336 -517 157 751 246
$$ packed form
1891D50k24q16J12J23J29J76L20K60k50m80k98K28K78k42J90N79j59l50l11l49
1911f34M64K55K88r1n4M7m27l69Q7M53J05j05L08R3m00p92J00Q25J18j69L06k44
1933A64m4j54l78K74L39k4J10j68m9l05j11j1L20L90k54l32K80M16n93m71K93
1954c08K72M24J38l93K48n40k96LN13J50l0M7l85r4o9k02M66M67k44Oj68k00j18
1977c13o5Q5M97J41o7j16k92j22k30L76m1L82K75j83j75m41R8j68K81L57j07K02
1999C74p8m68J22m59L74K57J28Ll8l63N6k72K36K13J40r7K88l77j92l78K23M89
2021A81n1P3J05k26k75n83L34L87M24Q9k65l40N2J6k97R0K61O67K4n94j37j37
2043b02j8l2k66O54J71o5l55l88L74k08N80J20j27M6o2j00j79k79j81O74N94n05
$$ plain form
2065 246 -96 -140 -190 -378 -364 30 409 250 -218 -305 3 -22 -245 -301 -73 518 742 347 -680 -308 -122 -487
2087 -487 -72 208 353 443 -13 -527 -428 -234 134 231 269 362 -157 -261 -361 -257 -202 308 499 565 14 61 -106
2110 -106 -398 -1 244 395 299 78 -320 -497 -497 -106 193 230 375 431 13 -256 -438 23 119 173 188 193 -61
2133 -61 -273 -256 -316 33 280 35 -42 152 101 -255 -751 -65 -358 424 266 159 140 196 -254 -417 -56 191
2155 191 341 268 59 34 -163 -419 -136 244 254 378 -9 -482 -428 260 231 -105 7 72 273 15 -59 -382
2177 -382 -89 338 474 147 51 -196 -274 4 -130 -203 251 329 292 -165 -288 -67 -132 -260 -93 185 263 192 -468
2200 -468 -338 -37 53 101 36 457 169 15 -214 -344 -129 468 221 460 406 40 -385 -48 -99 13 201 168
2222 168 130 249 -182 -106 -351 -251 -133 260 303 92 -252 -204 -299 -242 -214 -245 131 331 -206 -166 -728 -234 -77
$$ packed form
2065B46l42m4n0j88J4L94L79j59m68q7L08k5k23n6K28N91K24l95j027L72J86l65
2087d87M15K80J45R0m56n14R9J94L68R7L8R3n19j04j00J04N5N10J91O6n51M7j67
2110a06k92L97K45J51r6k21l98j77%L91K99L7J45N6m18k69j82M61R6N4J5Nk54
2133f1k12J7o0L49K47k45p7J94n1l56m96O86k93P82j58j07j9N6m50j63L61K47
2155A91J50p3k09k5j97k56K83L80J0J24l87m73N4O88k9l36J12O5K01k58p4l23
2177c82K93M27J36l27r6k47p8K78j34p3M54P8l7m57j23K21o5j28J67K78P8p1o60
2200d68J30L01R0M8o5M21k88j54k29j30K15N97k47K39n4l66m25L37n1J12J88l3
2222A68l8J19m31P6k45J00J18L93M3k11l44M8r5N7K8l1L76K00n37M0n62M94J57
$$ plain form
2245 -77 -122 180 120 7 -147 -374 -374 -240 141 105 262 12 -65 -203 -4 -201 -14 157 182 338 -96 -86 -44
2268 -44 -172 -33 79 280 244 70 317 9 47 -10 -11 408 165 -24 -11 -301 43 -457 37 105 -37 48 92
2291 92 -276 -264 -30 375 278 232 331 -115 -4 -152 -333 -196 272 23 103 -91 90 6 -269 -205 19 -22 185
2314 185 149 138 -213 -225 -86 101 130 327 215 96 -180 -115 -372 -45 138 375 258 -9 -123 -279 -311 -52
2336 -52 35 397 59 162 172 -444 -347 -152 -109 99 34 281 -225 -67 79 38 -47 129 346 379 88 -172 -278
2359 -278 -73 1 55 -89 110 -77 -47 -106 -69 -82 186 229 464 211 -163 -171 -19 -75 -192 115 92 188 -159 -306
2383 -306 -59 174 33 225 245 20 194 266 -202 -183 -189 221 104 317 4 -38 -282 -135 49 75 220 128 -64
2406 -64 -75 -197 -174 -248 -137 -45 146 90 55 -71 -118 -322 -6 -115 161 -4 139 -29 24 -206 103 81 252
$$ packed form
2245g7m5L02o0j13j54k27%J34L81l6J57k50p7j38J99j97J87J71K5J56m34J0M2
2268d4j28J39J12K01l6j74K47l08L8n7jM19k43j89J3k90L44n00M94O8j42Q5M4
2291I2l68J2K34M05r7m6R9m46J11j48j81J37M68k49Q0j94J81q4k75O4K24m1K07
2314A85l6j1l51j2J39J87K9J97j12j19k76O5k57L27J83K37j17k67j14j56l2K59
2336e2Q7L62l38J03J0o16R7J95M3K08o5K47n06J58J46m1q5J76K17L3k91k60j06
2359b78K05P4N4j44J99j87L0n9L7j3K68M3K35k53l74qJ52n6j17L07k3R6l47j47
2383c06K47K33j41J92K0k25J74P2m68J9oM10j17K13l13m2k44J47J84K6J45r2j92
2406f4j1j22K3p4J11R2J91n6l5j26m7k04L16j09K76j65J43j68N3k30L09k2J71
$$ plain form
2429 252 -73 214 115 53 42 -5 138 -67 251 260 -156 -397 105 76 180 -143 46 434 -69 -238 -23 35 246
2452 246 -85 -3 22 52 7 -296 -71 165 36 164 259 26 141 108 -89 258 -66 151 122 82 281 18 -256
2475 -256 -234 13 28 -65 105 196 -153 98 40 21 -152 -115 43 -36 -252 -15 -189 -287 126 268 -29 -150 -72
2498 -72 13 -276 -236 -153 -25 118 107 51 19 -234 -441 16 145 422 97 127 -92 -207 -283 -162 54 110 -20
2521 -20 6 71 85 -330 -218 -34 151 205 84 -44 158 53 -122 -95 306 292 230 -407 170 -290 -413 -73 -66
2544 -66 147 185 -157 181 6 -625 8 142 329 -210 27 227 82 -228 -114 121 106 312 -76 -237 176
2565 176 -142 219 334 43 208 -32 94 -13 -47 28 34 39 20 240 289 297 -256 -267 -254 152 2 136 91 182 -388
2590 -388 -92 -303 -180 199 216 100 -20 -106 -10 -321 -86 36 387 103 101 103 91 -48 38 -262 119 275 -154
$$ packed form
2429B52l25K87r9o2j1m7J43k05L18Rm16k41N02k9J04l23J89L88n03j69K15N8K11
2452B46l31Q2K5L0m5l03K25K36j29J28R5k33J15l3j97L47l24K17k9m0J99k63k74
2475b56K2K47J5r3J70R1l49K51n8j9j73L7J58p9k16K37j74r8M13J42k97j21P8
2498g2Q5k89M0Q3J28J43j1n6l2k53k07M57J29K77l25L0k19j15p6J21K16N6j30
2521b0K6O5J4m15J12J84J85N4j21j28K02j05j75K7M01j4o2o37N77m60j23L40P
2544f6K13L8l42L38j75o31O33J34J87n39K37K00j45l10J14K35j5K06l88j61M13
2565A76l18L61J15k91J65k40J26j07l4P5ONj9K20M9Qn53j1J3M06j50J34m5R1n70
2590c88K96k11J23L79J7j16j20q6R6l11K35J22L51k84kKj2j39Q6l00L81J56m29
$$ plain form
2613 -154 410 -408 -305 -158 -276 -112 -67 -39 -132 82 -145 -107 -342 163 7 -238 14 24 -93 -527 -149 -36
2635 -36 311 263 100 213 -114 -432 -115 106 152 259 -212 -57 152 55 -136 -87 68 269 186 282 -149 161
2657 161 -71 -233 103 31 190 328 405 -225 -148 -181 28 228 171 47 56 -27 -312 -289 -174 344 -36 -83 115
2680 115 -66 -133 -303 -55 -164 168 -80 9 -158 -70 -11 -137 336 133 196 49 27 336 -24 -221 -166 207
2702 207 441 228 -42 15 -37 -7 -92 104 21 252 39 -149 13 230 -38 -32 120 -305 -142 -231 -190 5 -317
2725 -317 -22 -52 341 362 -89 325 -244 -193 178 94 113 338 -130 -215 4 -67 -170 387 -26 133 437 83
2747 83 -475 -27 101 135 -15 187 -104 -233 -19 -406 -62 99 68 -144 222 -114 -48 -178 57 -88 -143 79
2769 79 389 151 -180 28 58 243 107 -298 345 75 44 -157 -411 145 344 -183 4 341 -79 -60 51
$$ packed form
2613a54N64q18J03J47j18J64M5K8r3K14k27L8k35N05j56k45K52J0j17m34L78J13
2635c6L47m8j63J13l27l18L17K21M6J07m71J55K09r7j91M9J55K01q3R6m31L10
2657A61k32j62L36p2J59J38P7o30P7l3K09K00n7j24Rq3k85K3J15N18l80m7J98
2680A15j81o7j70K48j09L32k48Q9j67Q8N9j26M73k03O3j47k2L09l60j97N5L73
2702B07K34k13k70N7n2L0q5J96q3K31k13j88J62K17k68OJ52m25J63q9M1J95l22
2725c17K95l0L93K1m51M14n69N1L71q4J9K25m68q5K19p1j03N57m13J59L04l54
2747H3n58M48J28L4j50K02k91j29K14l87L44J61l1k12L66l36O6j30K35j45n5K22
2769G9L10k38l31K08L0J85j36m05O43k70l1k01k54N56J99n27J87L37m20J9J11
$$ plain form
2790 51 8 -92 71 78 -152 -13 79 -270 55 -12 -55 -85 135 6 114 -18 -131 232 -388 36 281 218 90
2813 90 -231 -388 -83 -271 189 67 131 147 101 -250 -150 -44 255 17 -92 -160 -26 -163 -369 103 -73 222
2835 222 149 147 -41 107 38 -50 -22 94 30 -202 -112 124 -57 -29 -287 204 160 178 28 202 -52 -114 1 -111
2859 -111 298 22 -10 97 -196 25 123 -90 -32 0 -217 210 69 -53 -99 -163 -32 91 243 18 -57 147
2881 147 156 -268 -18 -127 -8 -37 61 183 68 -57 -173 -10 173 -9 -153 -38 -340 -230 -108 4 255
2902 255 -24 186 -12 65 52 252 -18 173 -38 72 -171 -502 -138 -384 -172 318 273 -120 -318 47 -114
2923 -114 178 27 -65 122 171 127 -55 -66 -219 -36 -368 -44 46 -41 143 -117 -198 -93 168 37 182 -176
2945 -176 -76 -10 -121 -273 -163 33 -44 -242 -291 162 -385 15 -329 176 -231 221 11 -188 84 171 -56
$$ packed form
2790E1m3j00J63Pk30J39R2l49L25o7m3l0K20j29J08j32j13L63o20M24K45o3j28
2813I0l21j57L05j88M60j22O4J6m6l51J00J06K99k38j09o8J34j37k06M72j76K95
2835B22p3kj88J48o9q8K8J16o4k32R0K36j81K8k58M91m4J8j50J74k54o2J15j12
2859a11M09k76l2J07k93K21R8k13N8L2k17M27j41j22m6o4J31J23J52k25p5K04
2881A47Rm24K50j09J19k9R8J22j15j25j16J63J83j82j44J15l02J10J22J12K51
2902B55k79K10j98P7j3K00k70J91k11J10k43l31L64k46K12M90m5l93j98L65j61
2923a14K92j51r2J87M9m4j82j1j53J83l32L24R0q7J84k60q1J05K61j31J45l58
2945a76J00O6j11j52J10J96p7j98m9M53n47M00l44N05m07M52k10j99K72Q7k27
$$ plain form
2966 -56 -69 -73 -271 -151 71 75 -107 -203 67 120 -143 183 349 -137 -214 -109 -219 -83 293 9 -404 -367 -54
2989 -54 -41 -249 225 89 334 -22 166 76 220 107 -185 -111 115 -46 -327 -156 -182 101 24 442 257 65
3011 65 -26 -277 -425 -19 372 -69 43 101 384 283 -140 -115 -280 -101 134 182 203 92 -266 192 -297 211
3033 211 86 -63 31 -9 -356 -201 -52 50 50 377 9 16 -25 -235 -398 -40 47 214 177 -89 154 -165 112
3056 112 -75 20 -190 -81 110 349 -431 -313 58 179 -190 -91 158 73 82 115 66 32 184 226 -28 73 119
3079 119 -192 -7 -69 79 -95 209 -83 -207 -93 -159 275 -160 179 198 189 74 36 -43 -403 -137 180 -121
3101 -121 178 -108 -218 -154 31 148 103 118 533 198 -13 3 13 -78 -191 70 229 146 -155 34 -60 -254 -196
3124 -196 67 69 -30 130 -59 -86 364 184 -40 145 -32 32 -39 -141 -30 -16 -62 44 220 15 241 -180 -381
$$ packed form
2966e6j3mj98J20K22Mj82r6K70N3k63L26J66m86p7J05j10J36L76k84m13L7L13
2989e4J3k08M74j36K45l56J88r0J44j13k92P4K26j61k81J71k6K83p7M18j85j92
3011F5r1k51j48M06L91m41J12N8K83j01m23K5j65J79K35M8K1j11l58M58m89N08
3033B11j25j49R4m0l47J55J49J02%L27l68Pm1k10j63L58Q7J67l7k66K43l19K77
3056A12j87R5k10J09J91K39p80J18L71J21l69R9K49q5RL3m9l4J52M2k54J01M6
3079A19l11J85o2J48j74L04k92j24J14o6M34m35L39J9rj15l8p9l60K66L17l01
3101a21K99k86j10O4J85J17m5J5M15l35k11J6J0r1j13K61J59q3l01J89r4j94N8
3124a96K63Kr9J60j89k7M50j80k24J85j77O4p1j02J11J4m6J06J76k05K26m21k01
$$ plain form
3147 -381 -25 298 231 -50 -146 232 -43 -79 251 177 -48 -10 17 -4 -98 -197 -222 -158 -56 -298 343 -3 -148 38
3171 38 -217 -159 -112 -106 -9 -46 -56 -218 111 -175 77 -53 241 129 -98 -31 33 136 -37 257 171 54 -14 -81
3195 -81 -42 98 193 -124 243 -56 270 -357 -71 -176 77 -12 -103 48 226 -26 -106 -64 -117 -76 -221 -119 109
3218 109 -194 33 199 -96 4 -19 -80 -305 186 -1 12 96 48 -224 -29 46 66 -27 104 38 -32 -198 18
3241 18 -12 55 26 -172 -79 -110 -208 79 60 46 4 9 -122 -41 -55 -104 120 -4 -60 -184 279 -87 -200 24 -17 257
3267 257 15 -11 -67 -44 120 91 -97 -72 -43 53 -334 155 -169 -247 -81 164 297 -177 226 -3 -251 -35 150
3290 150 41 -3 119 103 4 113 -19 164 -234 197 119 58 140 -18 112 244 252 -261 174 258 -24 204 122
3313 122 120 102 -112 -73 -190 -52 106 17 112 110 32 407 43 82 -13 75 -344 -289 -105 -71 15 290 -97 -39 43 -283
$$ packed form
3147c81L56L23o7k81r6L78k75l6L30p4k25L8K7k1r4r9k5O4J02k42O41l46j45J86
3171C8k55N8M7OR7l7j0j62L29k86K52j30K94j12k27O7O4J03j73K94q6j17o8o7
3195h1L9J40R5l17L67k99L26o27K86j05K53q9r1J51J78k52q0M2n3M1j45J02K28
3218A09l03K27J66k95J00k3o1k25M91j87J3Q4m8k72J95P5K0r3J31o6p0j66K16
3241A8l0O7k9j98R3l1r8K87j9j4m2Nj31Q1j4m9K24j24n6j24M63l66j13K24m1K74
3267B57k42k6n6K3J64k9j88K5K9R6l87M89l24p8J66K45J33m74M03k29k48K16J85
3290A50j09m4J22j6r9J09j32J83l98M31p8o1Q2j58J30J32Qn13M35Q4k82K28q2
3313A22kj8k14L9j17J38J58q9R5kp8L75l64L9r5Q8m19N5J84L4Q6K75l87N8Q2l26
$$ plain form
3339 -283 40 20 48 -59 -2 178 29 -91 -99 -41 276 -218 -231 -124 97 -215 253 191 33 102 -255 -190 215
3362 215 17 -128 58 139 79 -129 -3 -3 -184 155 32 17 382 230 -22 -111 49 -4 47 53 -194 69 -32
3385 -32 -30 -26 -362 -277 94 -53 192 -96 -291 71 -99 -167 21 283 -22 401 253 -44 -111 198 259 18 34
3408 34 -126 286 -2 172 -326 78 60 68 -173 -154 209 179 18 209 121 -429 -146 278 13 115 -373 -84
3430 -84 24 -115 121 -44 -60 -306 -22 -100 485 -147 69 46 -85 -160 -155 -19 -100 -32 -113 -51 60 7 362 7
3454 7 89 246 12 -81 244 -168 -11 -174 -121 43 39 9 -267 122 -102 343 -167 173 7 55 -90 49 218
3477 218 -206 -12 -209 -336 122 -116 -8 90 -297 -146 -244 -116 110 163 -63 -37 -173 -13 0 -65 52 57 -5
3500 -5 89 190 -15 -153 96 -203 149 -223 217 -35 26 -51 -18 -134 -67 -200 219 295 -419 -128 -68 226 -190
$$ packed form
3339b83L23k0K8j07N7J80j49j20qN8L17m94j3J07K21l12M68o2j58O9l57O5M05
3362B15j98j45J86Q1o0k08J26%j81L39j23j5L65j52k52q9J60n3N1Ok47K63j01
3385c2KMl36Q5L71j47K45k88j95L62j70o8J88K62l05M23j48k97o7L09O1k41J6
3408C4j60M12k88J74m98M04j8Qk41J9L63l0j61J91q8n50K83M24k65J02m88K89
3430h4J08j39K36j65j6k46K84p8N85o32K16k3j31p5NJ36q1O8q1O2J11n3L55l55
3454GQ2J57k34r3L25m12J57j63N3J64ml0k76L89k24M45n10L40j66M8j45J39J69
3477B18m24J94j97j27M58k38J08R8l87J51r8J28K26N3k26K6j36J60J3o5J17No2
3500eR4J01k05j38K49k99L52l72M40k52O1p7L3j16O7j33M19P6p14K91O0K94m16
$$ plain form
3523 -190 73 -301 281 -3 4 149 18 18 41 -268 111 -60 -149 -91 -315 266 -27 235 -77 -125 -21 -112 150
3546 150 48 -203 -35 -83 -139 47 -14 41 -63 -95 188 275 44 -396 -31 58 73 13 336 216 -26 -125 32
3569 32 63 -130 80 287 163 63 19 61 11 91 -275 222 219 164 -38 -56 -111 -64 -91 93 -133 34 249 -142
3593 -142 4 -15 -105 53 -29 -169 -5 -57 -17 -6 -36 75 218 265 -55 -24 49 128 -144 -63 -188 96 -95 188
3617 188 -83 -98 -194 282 70 -9 196 -26 -30 -101 74 -40 -178 222 177 -1 -73 -127 -184 32 -115 -52 -92 209
3641 209 106 -204 155 -244 187 29 -47 23 48 78 120 120 223 -120 164 -54 -161 98 -157 -138 124 113 6
3664 6 66 175 162 -345 -171 87 16 34 -45 -125 229 47 -223 -17 34 80 330 -177 169 -18 169 88 -317 50
3688 50 273 -146 100 139 91 131 56 -142 -13 273 -178 14 -124 -259 -109 184 13 7 50 -66 83 230 -140
$$ packed form
3523a90K63l74N82k84PJ45j31%K3l09L79j71q9N8k24N81k93K62l12m8J04r1K62
3546A50j02k51J68m8n6J86o1N5j04l2K83Q7k31m40L65Q9J5o0L23j20k42r9J57
3569C2L1j93K10K07j24j00m4M2n0Q0l66M97ln5k02j8n5M7k7J84k26J67K15l91
3593a42J46j9r0J58q2j40J64n2M0J1l0J11J43M7l20L1P3P9k72Q1j25K84j91K83
3617A88k71j5r6M76k12p9K05k22mp1J75j14j38M00m5j78p2n4n7K16j47O3m0L01
3641B09j03l10L59l99M31j58p6P0K5L0M2%J03l43K84k18j07K59k55J9K62j1j07
3664FO0J09j3n07J74K58p1J8p9q0L54j82k70K06N1M6K50n07L46j87J87q1m05L67
3688E0K23m19K46L9m8M0p5j98J29K86m51J92j38j35J50K93j71oM3j16J49J47l70
$$ plain form
3711 -140 -191 58 25 -325 -95 -20 33 157 -51 205 158 350 -105 -58 -86 -125 181 -248 2 43 203 99 119
3734 119 272 111 149 -104 -240 333 42 6 138 -17 193 152 113 28 80 -23 -121 -53 -36 -252 -92 142 -306
3757 -306 -465 -130 -103 -150 294 307 27 145 -66 50 89 47 94 -81 -73 80 375 68 -215 -104 -90 56 -129
3780 -129 -113 172 -60 -165 -152 176 -98 98 -96 -300 210 -128 -124 268 -176 -20 363 149 -85 -111 -123 -47
3802 -47 69 213 -72 32 150 -40 174 -46 -270 -41 55 -312 214 38 -309 -130 -55 -168 -93 98 305
3823 305 220 -158 -238 -106 168 -25 165 -422 54 -117 -184 110 66 -226 196 252 54 296 81 -60 -271 30
3845 30 -263 -150 178 48 -52 130 89 21 14 126 -43 84 128 -194 -84 65 -5 284 -266 -223 183 -113 -2
3868 -2 -190 158 -199 -326 -158 278 203 3 -5 -140 40 -169 -111 256 5 -253 -120 -168 26 196 -82 -558
$$ packed form
3711a40n1K49l3l50K30P5N3J24k08K56m7J92m55M7k8l9L06m29K50M1J60j04K0
3734A19J53j61L8k53j36N73k91l6J32j55K10m1l9q5N2j03r8O8J7k16J60K34m48
3757c06j59L35K7m7M44J3k80J18k11J16L9m2M7j75QJ53K95l07k83J11J4J46j85
3780a29J6K85k32j05J3L28k74J96j94k04N10l38ML92m44J56L83k14k34k6j2P6
3802d7J16J44k85J04J18j90K14k20k24K29R6l67N26j76l47J79P5j13P5J91K07
3823C05q5l78q0J32K74j93J90n87M76j71o7K94m4k92M22N6j98K42k15j41k11L01
3845C0k93J13L28j30j00J82m1o8pJ12j69J27M4l22J10J49p0K89n50M3M06k96J11
3868bj88L48l57j27J68M36p5k00qj35J80k09N8L67k51k58J33m8J94J70k78m76
$$ plain form
3890 -558 15 382 128 -71 -13 273 199 257 -107 -130 -63 -163 -74 410 1 53 -37 -26 66 -40 -40 70 90 50 -158
3915 -158 48 -106 36 72 -92 -73 96 -42 -73 -77 43 -7 -82 195 94 259 267 -48 106 64 69 145 223 447 -8
3940 -8 12 3 -194 224 112 -116 82 -106 -36 70 9 226 -55 -10 -15 333 108 83 -138 4 275 45 96 -313
3964 -313 -336 -5 128 -181 117 12 104 230 10 95 180 -43 137 33 314 -209 144 72 -36 -76 -183 -94
3986 -94 38 85 130 30 -6 118 -96 20 200 -28 16 -195 -276 -47 -60 221 40 -236 -240 62 -26 0 94 -27
4010 -27 12 -219 93 -124 -245 90 -1 26 -104 19 49 85 10 272 70 -204 -232 -74 -7 115 110 -3 -51 64
4034 64 144 -138 74 -263 231 -132 130 85 -17 38 -126 41 137 -79 -21 116 40 19 -160 -65 365 32 -316
4057 -316 7 -58 48 116 -62 45 -61 -329 -22 -172 -198 26 196 -20 166 -276 110 -21 99 -65 -467
$$ packed form
3890e58N73L67k54j99N8K86p4N8l64k3O7j00Q9M84m09N2r0J1R2j06%J10K0m0k08
3915a58K06j54J42L6j64J9J69j38l1mJ20n0p5K77j01J65Ql15J54m2NP6P8K24m55
3940hK0rj97M18j12k28J98j88P0J06o1K17k81M5nL48k25k5k21J42K71k30N1m09
3964c13k3L31J33l09K98j05R2J26k20Q5Q5k23J80j04K81n23L53p2j08m0j07Q9
3986i4J32M7M5j00l6J24k14J16J80k28M4k11q1K29j3K81j81k76mL02q8K6R4j21
4010b7L9k31L12k17j21L35r1K7j30J23L0L6p5K62k02k74k8J58O7J22nj13m8J15
4034F4Q0k82K12l37M94l63K62m5j02N5j64J67R6k16N8J37p6k1j79R5M30l33l48
4057c16L23o5J06O8j78J07j06k68L07j50k6K24J70k16J86m42L86j31J20j64m02
$$ plain form
4078 -467 -122 -121 330 -338 -105 -45 167 44 233 117 20 -74 -83 152 -208 -1 174 236 -12 448 163 2 -454
4101 -454 -148 -24 -1 116 78 -4 -50 151 -179 -139 7 218 85 89 -114 47 -22 -55 174 148 83 115 102 32 28
4126 28 37 31 -23 -50 -54 -144 -208 -125 -302 230 18 139 -78 64 -35 91 -21 220 216 -23 -113 -25 -39 80 76 -82 -231
4153 -231 -118 -282 -209 51 -189 333 -231 188 75 262 86 -27 248 -197 -177 116 -309 -335 -152 231 -53
4174 -53 -73 -24 120 -134 -50 1 -200 5 16 -16 -36 -211 80 31 -27 -116 200 46 -106 -42 55 85 -18 186 84
4199 84 -34 -6 175 58 70 186 96 -133 269 348 38 -155 -161 -349 -76 3 92 -8 -6 -81 38 146 142 46 -306
4224 -306 -343 112 226 127 -106 -311 8 -88 27 121 -212 -21 392 72 -168 -85 178 -52 -131 102 -293 -61
4246 -61 -123 219 -61 -305 140 -69 159 34 87 236 163 -121 -121 -239 181 -306 222 -1 154 23 -57 -296
$$ packed form
4078d67L45JM51o68K33O0K12j23J89j16r7r4rK35l60K07J75O2k48M60k85j61m56
4101d54L06J24K3J17l8q2m6K01l30M0J46K11j33Mk03J61o9l3K29k6o5L2j3p0m
4126B8Ron4k7mr0o4Q3j77N32k12J21k17J42r9J26j12K41mk39r0Q8j4J19mj58j49
4153b31J13j64P3K60k40N22n64M19j13J87j76j13K75m45K0K93m25k6J83L83k84
4174e3k0M9J44k54Q4N1k01K05J1l2k0j75K91m9n8q9L16j54j52O4R7L0j03K04j02
4199H4j18K8J81j17J2J16r0k29M02P9l10j93oj88K73P9Q9j00Kp5J19J08mr6l52
4224c06l7M55J14r9k33k05L19r6J15R4l33J91M13l20k40Q3K63k30p9K33l95K32
4246f1o2L42k80k44M45k09K28j25N3J49p3k84%j18M20m87N28k23J55j31q0k39
$$ plain form
4268 -296 -3 51 204 41 -87 -138 -263 -152 74 -71 -100 -47 192 80 157 -292 -13 219 314 85 -48 195
4290 195 -166 205 138 -26 15 -60 -112 -108 94 6 -121 -349 11 -10 -36 236 -70 203 -157 73 -39 -342 -48
4313 -48 -237 -141 145 -276 -76 17 185 -21 72 35 -436 150 151 116 -247 -96 -148 -57 -56 -286 328 89 -92 -136
4337 -136 4 65 94 71 252 229 -48 182 36 -211 24 -35 79 145 -13 -116 -112 41 4 203 315 154 96
4360 96 1 -49 -144 277 -21 22 180 53 -41 -92 -288 32 -114 -32 144 -65 85 -3 179 -84 -187 75 47
4383 47 117 -57 -51 184 -322 -322 -34 147 191 210 -208 73 216 -6 -179 -33 -124 -55 80 259 -43 45 -40 -30
4407 -30 -116 198 21 -151 55 -77 -40 323 234 -234 -87 -139 -146 -22 236 -5 194 85 -325 55 -33 -33 147
4430 147 -101 -199 205 186 -16 140 -213 58 -269 12 2 -202 137 -229 -258 187 -134 63 -95 -149 129 -54
$$ packed form
4268b96K93N4J53j63j28n1j25J11K26j45k9N3K39j12P7m49K79K32R5k29j33K43
4290A95l61L71o7j64M1p5n2MK02q8j27k28L60k1k6K72l06K73l60K30j12l03K94
4313d8j89R6K86m21K00R3J68k06R3l7m71N86Jl5l63J51n2R1Jk30O14k39j81m4
4337a36J40O1K9k3J81k3k77K30j46k47K35n9J14O6j58j03MJ53l7J99J12j61n8
4360I6r5n0r5M21k98M3J58j27r4n1j96L20j46Q2J76k09J50q8J82k63j03K62k8
4383D7P0j74OK35n06%K88J81M4J9m18K81J43k22j73J46r1O9J35J79l02Q8q5J0
4407c0q6L14j77j72K06j32L7L63q9m68J47n2pJ24K58k41J99j09m10L80q8%J80
4430A47k48r8M04j9k02J56l53K71l27K81j0k04L39l66k9M45l21J97j58n4K78j83
$$ plain form
4452 -54 228 -143 -66 -123 -439 -172 200 -17 69 59 -89 -112 220 -12 44 76 -195 51 -125 -7 -168 -117 147
4475 147 -52 -344 60 -326 125 298 -423 -5 94 227 -89 228 172 -89 -48 -182 -46 -136 212 288 -77 119
4497 119 -21 -190 -235 -102 -83 82 -19 -65 -227 -146 -54 -219 -63 -63 -498 -76 -307 -198 198 178 -219 -111 43
4520 43 379 -106 -197 18 -86 13 -41 11 189 108 -175 -281 -173 -166 -46 -294 166 196 -98 -393 111 190 8
4543 8 -161 -198 -53 -51 259 -216 -129 182 31 207 49 168 -94 349 107 -230 -13 -6 -156 -95 -222 -55 117
4566 117 240 256 -55 -362 -35 41 -388 -24 159 -3 43 33 -92 -495 450 132 -188 266 -83 -35 137 -307
4588 -307 -73 4 1 -3 128 -164 -228 -139 391 -131 11 60 -130 -162 46 120 -156 -155 -65 -173 -304 -20 -3 -6 -273
4613 -273 73 -83 157 -21 -81 -273 -17 -90 101 320 -140 45 50 -101 45 153 -43 -200 28 -51 53 62
$$ packed form
4452e4K82l71P7n7l16K67L72k17Q6j0j48k3L32k32N6L2k71K46j76J18j61N1K64
4475A47j99k92M04l86M51J73p21M18R9J33l16L17n6k61M1j34J36r0L48P6l65J96
4497A19j40j69m5J33J9J65j01m6j62Q1R2j65J56%m35M22k31J09L96k0l97J08J54
4520D3L36m85r1K15j04R9n4N2J78q1k83j06J08PJ20k48M60L0k94k95N04P9j82
4543Hj69l7J45KL10m75Q7L11j51J76j58J19k62M43k42l37K17Pj50O1j27J67J72
4566A17J23J6l11l07L27P6m29L64J83j62M6j0j25m03R45l18l20M54l49M8J72m44
4588c07K34P7lmJ31k92o4Q9N30n22J42M9j90l2K08P4k76JR0j08j31K84J7lk67
4613b73L46j56K40j78o0j92K56p3J91K19m60J85Nj51J46J08j96j57K28p9J04R
$$ plain form
4635 62 96 97 -462 -195 177 236 -108 -14 -161 -318 -5 -46 9 142 -4 151 -153 -203 68 -12 265 -287 -81
4658 -81 343 1 310 -232 50 232 0 -67 -122 209 45 -217 90 91 6 -243 293 -164 169 -13 -71 28 -104
4681 -104 -18 145 119 -193 -28 110 -13 32 110 283 -159 192 103 -3 17 -307 92 127 159 -245 1 -220 -73
4704 -73 -316 -157 -127 -233 25 17 210 65 35 104 113 -144 -9 28 -34 15 97 -297 131 125 -2 -46 364 -63 111
4729 111 61 -43 92 134 144 97 -105 148 -91 134 65 -15 241 135 318 -108 217 -51 279 389 -87 100
4751 100 -53 84 -36 0 -2 -80 -85 60 -234 206 77 102 -32 -109 -77 129 27 149 194 -106 297 139 400
4774 400 -91 -95 -112 -111 107 35 154 160 15 -37 112 104 33 -68 -100 144 178 -13 -330 -268 30 -28 -82 -156 216 -39
4800 -39 138 0 79 -199 -95 -106 -135 69 54 1 -94 287 -11 -23 -34 -114 -208 78 -206 -161 62 199 33 -181
$$ packed form
4635F2L4Jn59K67L72N9l44R4j47j57L13m1N5J33j46J55l04n0K71q0K77n52K06
4658h1M24l42L09n42K82J82k32o7n5L31j64k62L07Jq5k49N36m57L33j82n8R9j32
4681a04Q6J63k6l12J65J38j23M5P8J73m42L51q9j06K0l24L99L5L2m04K46k21J47
4704g3k43J59L0j06K58qJ93j45l0O9Rk57J35L7o2M9Q2l94M28oj27m4M10m27J74
4729A11n0j04J35M2J0m7k02K53k39K25o9q0K56j06J83m26L25k68L30J10m76J87
4751A00j53J37j20L6kp8nJ45k94M40j29K5j34p7L2K06j02J22M5l00M03j58K61
4774D00m91mj7JK18p2J19Oj45n2J49qp1j01l2K44L4j91l17O2K98n8n4p4L72k55
4800c9J77j38P9k78J04j1k9K04j5n3r5L81k98j2j1q0r4K86k84M5K23J37j66k14
$$ plain form
4824 -181 20 -78 -91 2 -129 227 92 -299 145 -91 -144 -61 -135 -207 -9 -195 -19 -369 -175 -53 -315 170
4846 170 174 -39 -204 40 20 -45 288 221 -72 262 25 72 -123 103 13 -81 -114 130 118 -59 177 -72 67
4869 67 -31 49 85 90 -396 -300 -135 -89 69 57 -227 129 173 107 -186 -179 53 40 -21 -16 11 340 217 207 -205 110
4895 110 -18 -2 167 -94 -15 396 -65 78 48 -141 183 43 -157 94 -114 209 97 72 -35 -2 -36 90
4917 90 496 -97 314 -102 -304 -1 -177 59 -71 -178 -39 50 154 -105 -123 -223 237 -28 21 -130 214
4938 214 -63 -20 113 -169 -25 -433 200 69 -45 -169 97 -123 -68 200 218 36 231 -32 -188 265 -84
4959 -84 -159 -222 -44 -31 -14 60 6 -23 223 -94 114 -40 -123 -104 96 13 -148 96 15 -20 -18 -126 -68 160 -37
4984 -37 -14 171 107 2 82 6 101 -17 12 -82 153 212 -96 23 202 -215 -68 113 202 -87 255 -22 -13 72
$$ packed form
4824a81K01r8j3R3j31L56j35l91M44k36n3Q3p4p2J98j86J76l50J94J22k62M85
4846A70Mk13j65K44k0o5L33o7k93L34k37M7j95K26r0r4l3K44j2j77K36k49J39
4869F7r8Q0L6Nm86R6J65M6J58j2k84L56M4o6k93PK32j3o1NK7L29j23j0m12L15
4895A10j28J6J69k61P9M11m61J43l0j89L24j40k00K51k08L23j12k5j07L3l4J26
4917I0M06n93M11m16k02L03j76K36j30j07J39Q9J04k59j8j00M60k65M9j51L44
4938B14k77M3J33k82J44m08O33j31j14j24K66k20N5K68J8j82J95k63j56M53l49
4959h4p5o3J78J3J7P4n4k9K46l17K08j54q3J9K00q3j61K44q1l5Kj08N8K28j97
4984c7K3J85o4j05Q0p6R5j18K9r4K35N9l08J19J79m17J47J81Q9k89L42k77RQ5
$$ plain form
5008 72 -94 236 114 -151 -300 -327 -111 -325 171 -101 -100 -98 -252 -114 34 29 171 -78 112 -256 1 201 -148
5031 -148 155 134 34 15 129 -27 28 136 -95 -145 91 -50 -74 -139 5 30 -168 196 -172 -110 440 25 -89
5054 -89 77 22 108 -43 -132 80 -5 171 89 -80 -79 -382 42 -183 144 378 -27 113 217 73 330 -64 173
5077 173 -307 -129 -21 -272 -287 297 -10 32 235 -22 7 198 200 53 -120 -326 -24 172 -153 -458 56 109
5099 109 190 84 -121 296 -159 185 -64 315 0 165 -154 -190 39 176 -162 37 335 -10 77 124 355
5120 355 44 7 31 268 14 24 -37 -82 -213 180 -92 46 -16 -95 -46 -59 137 -17 143 -2 -250 -60 -31
5143 -31 131 -89 135 -84 131 -31 -64 -203 147 -47 -100 18 21 -51 -19 111 -205 -213 -152 -200 97 -20 70 185
5167 185 -133 133 160 -239 165 156 157 70 -183 97 106 125 81 106 80 -116 -104 232 -129 269 -24 160 349 14
$$ packed form
5008G2j66L30j22k65j49k7K16k14M96k72JKj54J38J48nJ42k49J90l68K57K00l49
5031a48L03k1j00j9J14j56N5J08k31n0K36j41k4o5J44K5j98L64l68O2N50m15j14
5054h9J66n5Q6j51q9K12q5J76q2j69Jl03M24k25L27K34m05J40J04j44K57l94K37
5077A73m80J78J08k51j5N84l07M2K03k57K9J91Kj47j73k06L02J96l25l05N14N3
5099A09Q1j06k05M17m55L44k49L79l15J65l19l6K29J37l38J99K98l45Q7M7K31
5120C55l11l7K4K37k54J0o1m5j31L93k72J38o2p9M9j3J96j54J60j45k48J90K9
5143c1J62k20K24k19K15j62l3j39L50j94n3J18Lp2L2J30l16qO1m8K97j17R0J15
5167A85l18K66K7l99M04rJq7k53K80RJ9m4K5k6j96J2L36l61L98k93J84J89l35
$$ plain form
5191 14 69 258 59 111 99 -70 137 -240 -237 -95 -44 342 236 115 -158 307 -127 50 -46 -35 -210 74 -148
5214 -148 66 222 182 -32 -65 -136 -119 135 -174 32 -7 169 34 -21 -183 18 131 -153 -121 -15 -218 -159 22
5237 22 -123 224 106 -154 118 282 0 119 -78 -149 -167 36 -64 82 -91 -109 194 -232 -31 42 -10 67
5259 67 128 -38 134 -14 152 244 -195 174 -76 131 -355 -306 -115 232 -88 -182 -175 126 110 -25 -203 127 251
5282 251 80 -77 19 -35 -263 93 48 34 113 -79 -18 89 -332 -158 13 119 62 -29 -73 201 114 -149 -57 -186
5306 -186 -31 30 30 -71 -100 -29 -97 116 -117 -76 -122 148 64 -369 109 -182 125 222 -294 -48 -242 -184 19 5
5330 5 126 -233 -74 -116 -20 219 -4 -29 -151 138 29 -58 59 294 17 157 13 233 361 167 -195 79
5352 79 3 -238 -189 215 -165 87 -106 27 -207 -54 -223 103 -75 -95 -77 -13 169 -150 92 15 -46 -257 -138
$$ packed form
5191A4N5J89j99N2j2j69K07l77LJ42N1L86j06j21k73M65m34J77r6J1j75K84k22
5214a48K14J56m0k14l3p1J7K54l09K06l9J76j35n5j62K01J13k84L2J06k03N9J81
5237B2j45L47j18k60K72J64k82J19j97p1j8K03j00J46j73j8L03m26K01P3n2P7
5259F7O1j66J72j48J66R2m39L69k50K07m86M9J91L47l20r4PL01j6j35j78L30J24
5282B51j71j57R6n4k28L56m5j4P9j92O1J07m21J74J71J06n7r1m4K74q7k63R2j29
5306a86J55O1%j01k9P1o8K13k33M1m6K70q4m33M78k91L07R7n16K46j94N8K03j4
5330EJ21l59J59m2R6K39k23k5j22K89j09q7J17K35k77J40j44K20J28j94l62K74
5352G9p6k41M9M04l80K52j93J33k34J53j69L26j78k0J8O4J82l19K42p7o1k11J19
$$ plain form
5375 -138 154 -29 -70 107 173 -111 -4 -67 -12 300 -65 482 -8 -86 223 -51 183 16 359 160 56 222
5397 222 -120 -134 65 -10 3 34 395 -31 50 86 -11 45 -255 223 -171 21 8 57 131 22 -165 58 18 128
5421 128 -53 137 33 -88 217 174 184 210 -121 63 -9 -56 3 -47 154 104 -50 -111 -121 92 352 187 124 215
5445 215 -148 119 -187 133 -246 -181 48 342 -36 84 -305 101 23 -32 133 -222 -83 391 -11 65 -119
5466 -119 -157 41 60 -17 -20 152 285 120 263 -273 -95 234 -46 225 7 115 -189 82 -112 17 251 -345
5488 -345 -130 216 197 -431 127 256 222 -11 -18 116 103 -11 -10 88 182 -43 -112 260 60 66 -107 -327 61 152
5512 152 101 149 -100 80 -265 59 23 -77 -194 30 37 -80 99 -12 -247 5 61 -286 90 -66 33 221
5534 221 291 33 169 -62 33 -70 116 139 255 118 49 34 199 64 -306 241 -75 -183 63 194 -57 -20
$$ packed form
5375a38K92j83m1J77O6k84J07o3N5L12l65N47m90p8L09k74K34j67L43j99j04J66
5397B22l42j4J99p5J3L1L61m26Q1L6r7N6l00M78l94J92j3M9P4j09j87K23m0J10
5421A28j81J90j04j21L05m3J0K6l31J84p2m7N9n0K01n0j54o1j0K13K60j65o3R1
5445B15l63K67l06L20l79O5K29K94l78J20l89M06p8n5J65l55J39M74m02P6j84
5466a19l8J98J9p7lJ72J33j65J43n36J78L29k80K71k18J08l04K71j94J29K34n96
5488c45K15L46j9o28N58J29l4k33pJ34j3j14JR8R4k25o9L72k00Oj73k20L88R1
5512A52n1M8k49J80l45L24l6j00j17K24Pj17J79j11k35K52N6l47L76j56R9J88
5534B21P0k58J36k31R5j03J86K3J16j37o9j5J65j35l70N47l16j08K46J31k51L7
$$ plain form
5556 -20 30 -440 169 -153 152 148 -138 -189 43 303 -100 158 78 -154 -40 180 -44 -18 -93 186 85 -165 -25
5579 -25 236 -192 3 -102 -78 259 -72 181 174 -17 103 171 -76 130 -184 150 100 217 174 177 -171 -215 -136 -137
5603 -137 -11 16 145 -295 323 67 -85 -76 -100 -296 143 -231 30 -191 -60 99 20 -38 20 -186 -170 -35 -208
5626 -208 -211 -150 -156 -165 64 55 116 -8 -21 168 222 73 45 292 122 90 -140 -139 -43 -124 149 122 -81 -216 154 -26
5652 -26 247 6 -10 160 -57 205 -91 84 -161 162 33 39 179 317 -247 8 57 45 -83 0 -302 -25
5674 -25 -229 -118 -41 -115 -32 -28 199 -58 -121 270 57 264 127 53 164 -79 52 57 -138 309 -63 -95 -38 -44 143
5699 143 -197 347 -200 -24 -309 -111 -309 199 65 17 -150 -14 85 51 1 -167 75 27 12 -180 -98 344
5721 344 -306 77 255 50 211 -148 146 -133 -37 185 -70 2 110 175 86 227 87 -164 -16 -176 55
$$ packed form
5556b0N0m70O09l22L05mk86n1K32K60m03K58q0k32J14K20k24K6p5K79j01k50J40
5579b5K61m28J95j05K4L37l31K53pj91J20O8k47K06l14L34n0J17m3Ll48m4P9j
5603a37J26K7J29m40O18k56j52Rk4j96M39l74K61k21J31J59p9n8N8k06J6J35j73
5626b08lO1orK29rO1j24j3J89N4j49k8K47j70l2k30JR6q1K73k7k03j35L70j80
5652b6K73k41j6J70k17K62k96J75k45L23j29OJ40J38n64K55M9j2j28Q3l02K77
5674b5k04J11P7p4Q3MK27k57o3L91k13K07j37p4J11k43J31Nj95M47l72l2N7oJ87
5699A43l40N44n47J76k85J98j98N08j34m8j67J36R9l4n0j68K42m8j5j92Q2M42
5721C44o50L83J78k05J61l59K94k79R6K22k55P2J08O5q9J41j40k51J48j60K31
$$ plain form
5742 55 15 397 201 50 -102 -185 -4 -262 -116 -94 27 219 272 90 12 254 -131 -153 -400 -142 -37 -64 238
$$ packed form
5742E5m0L82j96j51j52q3J81k58J46K2J21J92N3j82p8K42l85k2k47K58J05k7L02
$$ [...]
8191a38
##END NTUPLES=NMR FID
##END=
