##TITLE=1H_LR-679-C1
 CDCl3, 8 sc, 
 27.6.2019
##JCAMPDX= 6.0         $$ Bruker NMR JCAMP-DX V2.0
##DATA TYPE= NMR FID
##DATA CLASS= NTUPLES
##ORIGIN= UXNMR, Bruker Analytische Messtechnik GmbH
##OWNER= root
$$ XWIN-NMR		Version 3.5
$$ Thu Jun 27 16:52:16 2019 Russian Standard Time (UT+4h)  she@DPX200
##.OBSERVE FREQUENCY= 200.13155
##.OBSERVE NUCLEUS= ^1H
##.DELAY= (6, 6)
##.ACQUISITION MODE= SIMULTANEOUS
##.ACQUISITION SCHEME= undefined
##.AVERAGES= 8
##.DIGITISER RES= 18
##SPECTROMETER/DATA SYSTEM= spect
##.PULSE SEQUENCE= zg30
##.SOLVENT NAME= CDCl3
##.SHIFT REFERENCE= (INTERNAL, CDCl3, 0, 15.7039)
##AUDIT TRAIL= $$ (NUMBER, WHEN, WHO, WHERE, WHAT)
$$ ##TITLE= Audit trail, XWIN-NMR		Version 3.5
$$ ##JCAMPDX= 5.01
$$ ##ORIGIN= Bruker BioSpin GmbH
$$ ##OWNER= she
$$ F:/spectra/data/she/nmr/H-F/1/audita.txt
$$ ##AUDIT TRAIL=  $$ (NUMBER, WHEN, WHO, WHERE, WHAT)
(   1,<2019-06-27 16:51:17.68 +0400>,<she>,<DPX200>,
      <created by zg, POWCHK disabled, PULCHK disabled
       configuration hash MD5:
       00 E9 B6 7A A2 85 ED C7 34 08 36 98 17 FE 4E 26
       data hash MD5: 16K
       A2 7D A3 9E 05 BA 2E 79 17 EF 23 78 BC 57 1A C1>)
$$ ##END=
$$ 
$$ hash MD5
$$ A6 14 8B A9 4C 30 16 0A 26 48 0E 95 74 F9 91 B2
##$RELAX= 
##$RELAX= 
##$RELAX= 
##$RELAX= 
##$RELAX= 
##$RELAX= 
$$ Bruker specific parameters
$$ --------------------------
##$DU= <F:/spectra>
##$EXPNO= 1
##$NAME= <H-F>
##$PROCNO= 1
##$TYPE= <nmr>
##$USER= <she>
##$AMP= (0..31)
100 100 100 100 100 100 100 100 100 100 100 100 100 100 100 100 100 100 
100 100 100 100 100 100 100 100 100 100 100 100 100 100 
##$AQSEQ= 0
##$AQ_mod= 1
##$AUNM= <au_zg>
##$AUTOPOS= <>
##$BF1= 200.13
##$BF2= 200.13
##$BF3= 200.13
##$BF4= 200.13
##$BF5= 200.13
##$BF6= 200.13
##$BF7= 200.13
##$BF8= 200.13
##$BYTORDA= 1
##$CFDGTYP= 0
##$CFRGTYP= 5
##$CHEMSTR= <none>
##$CNST= (0..31)
1 1 145 1 1 1 1 1 1 1 1 1 1 1 1 1 1 1 1 1 1 1 1 1 1 1 1 1 1 1 1 1 
##$CPDPRG= <>
##$CPDPRG1= <>
##$CPDPRG2= <>
##$CPDPRG3= <>
##$CPDPRG4= <mlev>
##$CPDPRG5= <mlev>
##$CPDPRG6= <mlev>
##$CPDPRG7= <mlev>
##$CPDPRG8= <mlev>
##$CPDPRGB= <>
##$CPDPRGT= <>
##$D= (0..31)
0 1.2 0 0 0 0 0 0 0 0 0 0.03 0 0 0 0 0 0 0 0 0 0 0 0 0 0 0 0 0 0 0 0 
##$DATE= 1561639876
##$DBL= (0..7)
120 120 120 120 120 120 120 120 
##$DBP= (0..7)
150 150 150 150 150 150 150 150 
##$DBP07= 0
##$DBPNAM0= <>
##$DBPNAM1= <>
##$DBPNAM2= <>
##$DBPNAM3= <>
##$DBPNAM4= <>
##$DBPNAM5= <>
##$DBPNAM6= <>
##$DBPNAM7= <>
##$DBPOAL= (0..7)
0.5 0.5 0.5 0.5 0.5 0.5 0.5 0.5 
##$DBPOFFS= (0..7)
0 0 0 0 0 0 0 0 
##$DE= 6
##$DECBNUC= <off>
##$DECIM= 24
##$DECNUC= <off>
##$DECSTAT= 4
##$DIGMOD= 1
##$DIGTYP= 9
##$DL= (0..7)
0 120 120 120 120 120 120 120 
##$DP= (0..7)
150 150 150 150 150 150 150 150 
##$DP07= 0
##$DPNAME0= <>
##$DPNAME1= <>
##$DPNAME2= <>
##$DPNAME3= <>
##$DPNAME4= <>
##$DPNAME5= <>
##$DPNAME6= <>
##$DPNAME7= <>
##$DPOAL= (0..7)
0.5 0.5 0.5 0.5 0.5 0.5 0.5 0.5 
##$DPOFFS= (0..7)
0 0 0 0 0 0 0 0 
##$DQDMODE= 0
##$DR= 18
##$DS= 0
##$DSLIST= <SSSSSSSSSSSSSSS>
##$DSPFIRM= 0
$$ [...]
##$SUBNAM2= <"">
##$SUBNAM3= <"">
##$SUBNAM4= <"">
##$SUBNAM5= <"">
##$SUBNAM6= <"">
##$SUBNAM7= <"">
##$SUBNAM8= <"">
##$SUBNAM9= <"">
##$SW= 24.9336996594482
##$SWIBOX= (0..15)
0 0 2 0 0 0 0 0 0 0 0 0 0 0 0 0 
##$SW_h= 4990.01996007984
##$TD= 16384
##$TD0= 1
##$TE= 0
##$TE2= 300
##$TE3= 300
##$TEG= 300
##$TL= (0..7)
0 120 120 120 120 120 120 120 
##$TP= (0..7)
150 150 150 150 150 150 150 150 
##$TP07= 0
##$TPNAME0= <>
##$TPNAME1= <>
##$TPNAME2= <>
##$TPNAME3= <>
##$TPNAME4= <>
##$TPNAME5= <>
##$TPNAME6= <>
##$TPNAME7= <>
##$TPOAL= (0..7)
0.5 0.5 0.5 0.5 0.5 0.5 0.5 0.5 
##$TPOFFS= (0..7)
0 0 0 0 0 0 0 0 
##$TUNHIN= 0
##$TUNHOUT= 0
##$TUNXOUT= 0
##$USERA1= <user>
##$USERA2= <user>
##$USERA3= <user>
##$USERA4= <user>
##$USERA5= <user>
##$V9= 5
##$VALIST= <valist>
##$VCLIST= <CCCCCCCCCCCCCCC>
##$VD= 0
##$VDLIST= <DDDDDDDDDDDDDDD>
##$VPLIST= <PPPPPPPPPPPPPPP>
##$VTLIST= <TTTTTTTTTTTTTTT>
##$WBST= 1024
##$WBSW= 4
##$XGAIN= (0..3)
0 0 0 0 
##$XL= 0
##$YL= 0
##$YMAX_a= 5103
##$YMIN_a= -5751
##$ZGOPTNS= <>
##$ZL1= 120
##$ZL2= 120
##$ZL3= 120
##$ZL4= 120
##$ABSF1= 10
##$ABSF2= 0
##$ABSG= 5
##$ABSL= 3
##$ALPHA= 0
##$AQORDER= 0
##$ASSFAC= 0
##$ASSFACI= 0
##$ASSFACX= 0
##$ASSWID= 0
##$AUNMP= <proc_1d>
##$AZFE= 0.1
##$AZFW= 0.1
##$BCFW= 1
##$BC_mod= 2
##$BYTORDP= 1
##$COROFFS= 0
##$CY= 11.3945322036743
##$DATMOD= 1
##$DC= 2
##$DFILT= <>
##$DTYPP= 0
##$F1P= 18.9103706918063
##$F2P= -1.10871071338519
##$FCOR= 0.5
##$FTSIZE= 0
##$FT_mod= 4
##$GAMMA= 1
##$GB= 0.15
##$INTBC= 1
##$INTSCL= 1
##$ISEN= 128
##$LB= 0.24
##$LEV0= 0
##$LPBIN= 0
##$MAXI= 10000
##$MC2= 0
##$MEAN= 0
##$ME_mod= 0
##$MI= 1.114404
##$NCOEF= 0
##$NC_proc= 0
##$NLEV= 6
##$NOISF1= 3.799351
##$NOISF2= 2.8
##$NSP= 1
##$NTH_PI= 0
##$NZP= 0
##$OFFSET= 15.70392
##$PC= 1
##$PHC0= -8581.563
##$PHC1= 17.20098
##$PH_mod= 1
##$PKNL= yes
##$PPARMOD= 0
##$PSCAL= 0
##$PSIGN= 0
##$REVERSE= no
##$SF= 200.130013532006
##$SI= 16384
##$SIGF1= 3
##$SIGF2= 2
##$SINO= 400
##$SIOLD= 16384
##$SREGLST= <1H.CDCl3>
##$SSB= 0
##$STSI= 0
##$STSR= 0
##$SW_p= 3612.71676300578
##$SYMM= 0
##$S_DEV= 0
##$TDeff= 0
##$TDoff= 0
##$TI= <>
##$TILT= no
##$TM1= 0
##$TM2= 0
##$TOPLEV= 0
##$USERP1= <user>
##$USERP2= <user>
##$USERP3= <user>
##$USERP4= <user>
##$USERP5= <user>
##$WDW= 1
##$XDIM= 8192
##$YMAX_p= 0
##$YMIN_p= 0
$$ End of Bruker specific parameters
$$ ---------------------------------
##NTUPLES= NMR FID
##VAR_NAME=  TIME,          FID/REAL,        FID/IMAG
##SYMBOL=    X,             R,               I
##VAR_TYPE=  INDEPENDENT,   DEPENDENT,       DEPENDENT
##VAR_FORM=  AFFN,          ASDF,            ASDF
##VAR_DIM=   8192,          8192,            8192
##UNITS=     SECONDS,       ARBITRARY UNITS, ARBITRARY UNITS
##FACTOR=    0.0002004,     1,               1
##FIRST=     0,             0,               0
##LAST=      1.6414764,     0,               0
##MIN=       0,             -5751,           0
##MAX=       1.6414764,     5103,            0
$$ Real data points
##PAGE= N=1
##DATA TABLE= (X++(R..R)), XYDATA
$$ plain form
0 0 0 0 0 0 0 0 0 0 0 0 0 0 0 0 0 0 0 0 0 0 0 0 0 0 0 0 0 0 0 0 0 0 -1 4 -4 4 -6 8 -8 8 -8 8 -8 12 -12 12 -12 16 -20 20
50 20 -20 27 -29 34 -40 53 -68 96 -152 303 -1565 -5751 -208 3139 -2299 -5542 375 3800 -1741 -5074
70 -5074 395 3265 -2502 -5665 -159 2730 -2713 -5337 356 3072 -2430 -4951 555 2923 -2593
85 -2593 -4696 1081 3505 -1872 -3742 1895 3767 -1914 -3812 1763 3537 -1998 -3403 2469 4245
100 4245 -1156 -2417 3282 4593 -1121 -2495 3021 4065 -1579 -2601 3142 4180 -1360 -2218 3402
115 3402 4125 -1559 -2309 3272 3788 -1892 -2494 3071 3363 -2374 -2833 2690 2830 -2849 -3076 2539 2657
132 2657 -2880 -2906 2651 2503 -3148 -3180 2163 1831 -3694 -3428 1984 1697 -3579 -3051 2310 1843 -3369 -2764
150 -2764 2392 1648 -3510 -2729 2358 1503 -3502 -2448 2601 1614 -3287 -2040 2916 1775 -3021 -1663
$$ packed form
0@%%%%%%%%%%%%%%%%%%%%%%%%%%%%%%%%jNqQj0J4j6J6j6J6j6K0k4K4k4K8l6M0
50B0m0M7n6O3p4R3j21J64k48M55j868m186N543L347n438l243N917L425n541l333
70e074N469K870n767l163N506K889n443k624N693K716n502k521N506K368n516
85b593k103N777K424n377j870N637J872n681j898N575J774n535j405N872J776
100D245n401j261N699J311n714j374N516J044n644j022N743J038n540q58N620
115C402P23n684p50N581N16n680o02N565K92n737m59N523J40n679k27N615J18
132B657n537k6N557j48n651l2N343l32n525K66N412k87n276N28N361m67n212O05
150b764N156p44n158P81N087q55n005J054N049r87m901J247M956j141m796J358
$$ plain form
166 -1663 3210 1853 -2930 -1502 3227 1723 -2971 -1395 3315 1751 -2793 -1000 3607 1913 -2561
181 -2561 -766 3644 1716 -2755 -851 3437 1438 -2852 -781 3492 1399 -2782 -602 3550 1301
196 1301 -2850 -601 3408 1018 -3056 -716 3210 719 -3212 -712 3123 566 -3222 -613 3143
211 3143 478 -3208 -568 2999 209 -3395 -663 2780 -55 -3466 -584 2784 -73 -3316 -363
226 -363 2836 -164 -3306 -302 2746 -345 -3338 -238 2704 -405 -3251 -46 2798 -361 -3070
241 -3070 180 2880 -319 -2923 322 2865 -373 -2853 429 2855 -403 -2721 624 2941 -346
256 -346 -2499 851 2988 -364 -2437 934 2916 -496 -2411 994 2870 -569 -2364 1117 2842
271 2842 -651 -2331 1178 2760 -776 -2366 1158 2623 -945 -2412 1111 2479 -1099 -2420 1114
$$ packed form
166a663M873j357m783J428M729j504m694J576M710j564m544J793M607j694m474
181b561J795M410j928m471J904M288j999m290K071M273k093m181K180M152k249
196A301m151K249M009k390m074K340L926k491l931K500L835k557l788K609L756
211C143k665l686K640L567k790l604K732L443k835l411K882L368k857l243K953
226c63L199l000l142L004L048l091k993L100K942l109k846L205K844l159k709
241c070L250K700l199k604L245K543l238k480L282K426l258k318L345K317l287
256c46k153L350K137l352k073L371J982l412j915L405J876l439j795L481J725
271B842l493j680L509J582l536j590L524J465l568j467L523J368l578j321L534
$$ plain form
286 1114 2372 -1219 -2404 1137 2235 -1359 -2444 1109 2065 -1513 -2443 1138 1970 -1604 -2378 1198
302 1198 1915 -1656 -2281 1279 1851 -1705 -2220 1343 1826 -1716 -2122 1433 1812 -1682 -1976 1522 1808
319 1808 -1643 -1832 1635 1796 -1631 -1713 1705 1760 -1607 -1596 1786 1725 -1592 -1462 1854 1683 -1597 -1374
337 -1374 1901 1599 -1661 -1309 1945 1540 -1699 -1241 1967 1470 -1746 -1209 1987 1372 -1804 -1179 1977
354 1977 1273 -1872 -1151 1970 1170 -1925 -1097 1944 1077 -1944 -1062 1939 968 -2021 -1005 1923 862
371 862 -2067 -946 1946 774 -2101 -889 1928 679 -2137 -841 1923 615 -2131 -778 1937
386 1937 545 -2128 -711 1934 484 -2120 -629 1934 433 -2082 -545 1938 381 -2035 -458
401 -458 1962 337 -2010 -334 1973 307 -1958 -228 1998 266 -1913 -123 2042 238 -1866
$$ packed form
286A114J258l591j185L541J098l594j085L553R56l578r30L581Q32l574p74L576
302A198P17l571o25L560N72l556n15L563M83l542m06L555L79l494k94L498K86
319A808l451j89L467J61l427q2L418N5l367J1L382o1l317J30L316j71l280K23
337a374L275l02l260L52L254m05l239M58L208m97l216N37L196o15l176O25L156
354A977p04l145P21L121q00l095Q28L041q67l021Q82L001r71k989J016K928j061
371H62k929J121K892j172k875J212K817j249k816J296K764j308k746J353K715
386A937j392k673J417K645j450k604J491K563j501k515J537K483j557k416J577
401d58K420j625k347J676K307j666k265J730K226j732k179J790K165j804k104
$$ plain form
416 -1866 -23 2076 200 -1843 59 2083 148 -1825 119 2076 106 -1818 176 2064 39
431 39 -1815 219 2003 -47 -1837 225 1940 -158 -1852 239 1882 -276 -1873 282 1816 -374
447 -374 -1896 297 1744 -495 -1942 304 1682 -601 -1962 326 1639 -650 -1922 394 1629
462 1629 -681 -1877 441 1593 -725 -1827 500 1564 -740 -1734 601 1599 -716 -1619 733 1618
478 1618 -716 -1527 808 1613 -714 -1457 876 1604 -726 -1385 976 1611 -730 -1298 1048 1603 -759
495 -759 -1285 1068 1523 -845 -1296 1046 1442 -916 -1273 1070 1391 -943 -1252 1076 1323 -1033 -1266 1037
513 1037 1202 -1152 -1299 1018 1111 -1217 -1273 1057 1077 -1230 -1200 1092 1039 -1270 -1198 1095 961 -1348 -1186
532 -1186 1113 945 -1319 -1077 1209 968 -1259 -984 1257 941 -1285 -942 1262 877 -1300 -872 1296
$$ packed form
416a866J843K099j876k043J902K024j935j973J944J957j970j924J994J888k025
431C9j854K034J784k050j790K062J715k098j694K091J643k158j597K155J534k190
447c74j522K193J447k239j447K246J378k283j361K288J313k289j272K316J235
462A629k310j196K318J152k318j102K327J064k304r94K335R98k315r03K352Q85
478A618k334q11K335Q05k327p43K333P28k330o59K361O35k341n68K346N55k362
495g59n26K353M55k368m51K342L96k358l57K343L21k334l09K328K47k356k33K303
513A037J65k354j47K317R3k328n6K330K0k307L0K292n3k309P2K293j34k309J62
532a186K299j68k264K42K286k41k227K75K241l16k226L43K204l85k177M28K168
$$ plain form
549 1296 864 -1272 -753 1379 877 -1231 -672 1399 818 -1269 -669 1358 706 -1337 -674 1350 678
566 678 -1314 -576 1412 678 -1293 -534 1373 578 -1357 -563 1320 481 -1402 -536 1335 452 -1368
583 -1368 -424 1404 452 -1338 -363 1410 379 -1382 -370 1363 287 -1423 -324 1398 301 -1355
599 -1355 -199 1470 316 -1329 -146 1439 216 -1398 -182 1372 132 -1409 -138 1396 125
614 125 -1346 -50 1408 105 -1340 -35 1345 -21 -1409 -70 1261 -135 -1423 -20 1263
629 1263 -128 -1361 63 1296 -144 -1342 85 1246 -243 -1404 52 1187 -276 -1361 141
644 141 1237 -226 -1249 266 1279 -212 -1218 291 1225 -295 -1215 312 1219 -317 -1161 426
660 426 1270 -270 -1050 545 1321 -274 -1040 547 1242 -395 -1101 523 1178 -423 -1071 591 1223 -412
$$ packed form
549A296m32k136N19K132n02k108N59K071n81k087O00K027o52k043O63K024o72
566F78j992P38J988p34j971P59J907p95j935P94J883q39j883Q66J871q83j820
583a368R44J828r52j790R75J773j031j761J012J733j076j710J099J722j097j656
599a355J156J669j154j645J183J585j223j614J216J554j240j541J271J534j271
614A25j471J296J458j303j445J305J380j366j388J339J331j396j288J403J283
629A263j391j233J424J233j440j198J427J161j489j161J456J135j463j085J502
644A41J096j463j023J515J013j491j006J509R34j520r20J527R07j536q44J587
660D26Q44j540p80J595P76j595p66J587O95j637p06J624O55j601o48J662O32j635
$$ plain form
678 -412 -999 625 1185 -497 -1059 566 1072 -617 -1126 520 971 -666 -1086 576 965 -677 -1029 600
696 600 916 -736 -1057 535 813 -844 -1088 561 777 -835 -1010 648 845 -783 -918 709 827 -828
714 -828 -919 699 751 -852 -882 732 763 -804 -780 834 845 -723 -669 895 816 -748 -642 890 755 -792
734 -792 -626 923 745 -754 -518 1011 771 -732 -477 1016 723 -804 -505 978 640 -862 -513 983
752 983 616 -870 -464 1013 581 -872 -451 973 483 -969 -507 899 373 -1025 -506 873 342 -1014
770 -1014 -438 903 305 -1042 -436 875 223 -1100 -453 829 150 -1108 -412 869 171 -1063 -316
787 -316 919 180 -1027 -271 921 158 -1020 -251 930 144 -983 -168 979 186 -914 -45 1051
804 1051 205 -858 13 1052 167 -856 37 1048 139 -846 94 1078 146 -813 148 1084 112 -836 152
$$ packed form
678d12n87J624N60j682n62J625N06j689n09J646M51j637m20J662L89j642l52J629
696F00L16j652l21J592K78j657k44J649K16j612j75J658J97j628j35J627J18j655
714h28r1J618N2j603l0J614L1j567K4J614J1j568N4J564p9j564J06J532j35j547
734g92J66J549j78j499K36J529k40j503K55J493k93j527K99J483l38j502L49J496
752I83l67j486M06J477m32j453M21J424m90j452M62J406n26j398N19J379n31j356
770a014N76J341n98j347O06J311o52j323O47J282o79j258O96J281o98j234P47
787c16J235p39j207P56J192p63j178P69J181p86j127Q15J147p93j100Q69J096
804A051q46j063Q71J039q85j023Q93J011r09r85R40R84r32r59R61R36r72r48R88
$$ plain form
823 152 1039 36 -864 113 980 -35 -890 122 951 -80 -913 126 913 -153 -950 95 829 -248
841 -248 -1004 81 797 -326 -1011 106 776 -337 -1003 133 766 -367 -996 146 735 -397 -984 182
859 182 752 -403 -921 242 768 -363 -841 334 814 -338 -772 373 815 -333 -731 430 830 -306
877 -306 -671 501 853 -296 -619 550 849 -318 -602 560 826 -360 -602 568 792 -395 -613 583
895 583 745 -422 -634 560 700 -503 -639 514 626 -550 -661 481 571 -602 -662 499 532 -635
913 -635 -657 500 481 -686 -657 502 440 -714 -618 537 447 -697 -581 564 450 -686 -554 610 445
932 445 -688 -494 616 454 -662 -452 667 461 -636 -383 698 447 -612 -343 716 442 -608
949 -608 -312 729 410 -610 -284 740 394 -632 -259 732 364 -647 -261 729 326 -668 -249 717 292
$$ packed form
823A52Q87j003r00R77Q67j015q55J012Q29j031q33J039P87j066p97J045P34j077
841b48p56J085P16j123o85J117O70j113o66J136O33j133o29J142N89j132n87J166
859A82N70j155n18J163N26j131m78J175M80j152m34J145M42j148l98J161M00j136
877c06l65J172L52j149l23J169K99j167k84J162K66j186k42J170K24j187k18J196
895E83J62j167k12J194J40j203j36J153J12j176j11J142R0j173o0J161L3j167
913f35k2J157j9j167K9J159o2j154R6J155r0j144J16J145j14j136J32J164j65
932D45j133J94J110j62j116K10J119k06j097K53J081k51j059K69J059k74j050
949f08K96J041l19j020L26J024l46j026L73R91l68j011L86R90m03r94M19R66m25
$$ plain form
968 292 -689 -253 708 252 -720 -237 700 210 -730 -217 696 176 -728 -208 683 142 -720 -183 693 120
988 120 -734 -148 691 84 -764 -131 692 76 -741 -101 696 53 -748 -72 696 28 -741 -47 692 3
1008 3 -735 -38 701 -1 -734 -18 702 -29 -720 13 689 -48 -701 37 685 -64 -686 83 687 -76 -663
1029 -663 118 697 -86 -658 146 708 -90 -635 177 704 -101 -613 208 709 -111 -595 220 694 -130 -584
1049 -584 235 679 -152 -602 233 658 -196 -599 236 614 -246 -605 247 583 -282 -621 249 556 -327 -625
1069 -625 257 537 -370 -628 251 496 -396 -641 248 489 -404 -628 283 479 -410 -598 310 476 -399 -557
1089 -557 339 492 -408 -511 389 495 -379 -458 438 501 -374 -411 485 508 -342 -366 500 517 -356 -361 510 509 -365
1112 -365 -344 533 481 -365 -327 521 461 -419 -345 490 404 -445 -353 467 354 -470 -370 443 304 -517 -369 435
$$ packed form
968B92r81M36R61m56r72M83R37m90r40N13R13n20r04N20Q91n41q62N37Q76n73
988A20q54N86Q39o07q48O33Q23o16q17O40P97o43q01O76P68o68p69O94P39o89
1008Cp38O97P39p02p33P16P20p31o91P33O76p37o53P38O48p49o22P69O04p63n87
1029f63P81N79p83n72Q04N62p98n45Q12N27q05n12Q21N01q20m84Q15M74q24m54
1049e84Q19M44q31m50Q35M25q54m03Q35L78q60l59Q52L36q65l39Q70L07q83k98
1069f25Q82K80r07k58Q79K45q92k45Q89K41q93k24R11J96q89j88R08J66q75j58
1089e57Q96J53r00j03R00J06q74p9Q96O3q75l7Q96K3q50k4Q66J7q73nQ71jq74
1112c65K1Q77n2q46L8Q48o0q80P4Q35q6q49R2Q20j13q24J00Q13j39q21J48Q04
$$ plain form
1134 435 256 -568 -392 415 211 -585 -371 425 196 -600 -351 438 200 -594 -313 460 191 -579 -283 475
1154 475 195 -560 -235 514 212 -516 -175 573 228 -491 -136 591 238 -482 -99 599 207 -479 -89 606
1174 606 211 -452 -46 622 181 -465 -38 612 151 -500 -53 556 92 -526 -80 545 86 -528 -42 531
1194 531 29 -556 -71 494 -28 -585 -86 460 -57 -588 -51 462 -69 -580 -22 473 -60 -559 -3 483
1214 483 -97 -575 15 490 -109 -550 58 514 -60 -502 110 527 -89 -493 119 501 -111 -492 135 516
1234 516 -108 -457 166 520 -113 -442 211 522 -135 -444 207 490 -175 -465 188 474 -197 -466 218 478
1254 478 -189 -434 241 467 -206 -445 222 432 -244 -445 228 417 -256 -428 249 426 -251 -407 259 393
1274 393 -278 -411 259 376 -306 -402 278 365 -311 -369 310 365 -313 -363 325 364 -343 -376 311 327 -375 -378 306
$$ packed form
1134D35j79q24J76Q07k04p96K14P96k29p96K49P89k38p94K81P73k69p70K96P58
1154D75k80p55L25P49l02p28L41P48l45p19L55P27l53p20L83O98l92o86L90O95
1174F06l95o63M06O68m41o46M27O50m61o51M47O09m64o18M46O25m59o14M86N73
1194E31n02n85M85N65n22n57M99N46n17n31N37N13n31n11N58M95n33m99N56M86
1214D83n80m78N90M75n99m41O08M56n74m42O12M17o16m04O12L82o12l81O27L81
1234E16o24l49O23L54o33l29O53L11o57l09O51K83o65k90O53K86o71k69O84K60
1254D78o67k45O75K26o73k39O67K10o76k01O73J89o73j72O77J77o77j56O66J34
1274C93o71j33O70J17o82r6O80Q7o76n8O79N5o78n0O88L9p07l3O87J6p02lO84
$$ plain form
1297 306 309 -364 -347 330 317 -357 -322 326 290 -370 -314 346 276 -380 -303 366 273 -387 -262 391 272 -370 -225
1320 -225 425 278 -383 -221 422 254 -392 -201 458 265 -376 -163 464 262 -366 -165 447 243 -393 -175
1340 -175 428 202 -401 -164 435 193 -400 -143 441 153 -420 -144 409 109 -448 -162 388 69 -477 -153
1360 -153 391 60 -465 -135 411 67 -477 -119 395 26 -489 -124 387 14 -479 -87 409 44 -447 -59
1380 -59 438 45 -421 -14 446 29 -413 -1 449 21 -402 41 478 32 -385 83 489 24 -392 80
1400 80 474 -7 -413 74 462 -22 -398 89 459 -43 -391 104 432 -68 -400 92 407 -108 -421 82
1420 82 390 -126 -427 102 387 -142 -413 107 377 -150 -417 109 362 -182 -408 129 368 -176 -402 161
1440 161 374 -163 -377 176 371 -170 -363 189 376 -180 -352 196 365 -196 -336 229 365 -191 -325 253
$$ packed form
1297C06Lo73J7O77j3o74L5O48l6o60N6O60p0o56P7O69r3o60J25O53j19o42J45
1320b25O50j47o61J62O43j68o46J91O59j93o41K13O27k02o28K01O12k04o36K18
1340a75O03k26o03K37N99k42n93K57N84k88n73K76N53l00n57K86N50l19n46L24
1360a53N44l31n25L30N46l44n44L58N14l69n15L65N11l73m93L92M96l65m91L88
1380e9M97l93m66M07M60m17m42M12M50m28m23M43M37m46m17M68M06m65m16M72
1400H0L94m81m06M87L88m84l76M87L70n02l48M95L28n00l32M92L15n15l13N03
1420H2L08n16l01N29K85n29k71N20K70n27k67N26K53n44k26N37K39n44k26N63
1440A61K13n37k14N53J95n41j93N52J87n56j72N48J69n61j40N65J36n56j34N78
$$ plain form
1460 253 348 -222 -328 234 335 -241 -324 249 334 -244 -312 266 320 -251 -305 266 305 -283 -306 261 295 -285 -295
1483 -295 282 287 -286 -273 282 271 -288 -251 305 260 -299 -262 298 238 -309 -238 317 240 -303 -214 331 236 -314 -209
1507 -209 344 236 -315 -204 332 203 -333 -202 334 195 -338 -189 336 184 -339 -177 335 172 -349 -180
1527 -180 316 144 -350 -164 327 128 -359 -144 355 116 -365 -129 364 105 -375 -126 359 107 -367 -94
1547 -94 378 110 -351 -74 380 92 -357 -61 395 84 -343 -58 376 83 -343 -31 381 57 -345 -14
1567 -14 392 46 -358 -17 369 26 -362 0 380 13 -384 -12 364 -1 -381 -8 354 -22 -374 6
1587 6 348 -35 -377 12 331 -41 -363 19 349 -56 -363 31 341 -61 -347 60 352 -63 -340 87 353
1608 353 -66 -325 105 364 -74 -319 114 353 -89 -323 120 364 -97 -323 127 344 -114 -314 129 328
$$ packed form
1460B53R5n70j06N62J01n76q3N73Q5n78o8N78N4n71n4N71L9n88k3N67L4n80j0
1483b95N77Nn73J3N55j1n59L7N56m5n59L7N60o0n47P1N55p7n43Q9N45r5n50J05
1507b09N53j08n51J11N36j29n36J31N36j39n33J49N25j52n23J62N12j63n21J69
1527a80M96j72m94J86M91j99m87K15M99k39m81K36M93k59m80K49M85k52m74K73
1547i4M72k68m61K77M54k88m49K96M56l11m27K85M34k93m26L12M12l24m02L31
1567a4M06l46m04L41L86l43l88L62L80l67l97L72L76l65l80L73L62l76l52L80
1587FL42l83l42L89L19l72l22L82L30m05l07L94L10m02k86M07K92m15k77M27K66
1608C53m19k59M30K59m38k45M33K39m42k34M43K44m61k26M50K17m58k00M43J99
$$ plain form
1628 328 -135 -324 126 320 -138 -324 133 289 -166 -318 143 289 -178 -306 137 281 -186 -311 172 270
1648 270 -198 -316 163 275 -209 -300 174 279 -199 -272 198 277 -194 -259 219 275 -194 -235 237 285 -200 -227 238
1671 238 262 -180 -220 257 262 -203 -201 267 257 -221 -198 269 228 -235 -195 268 209 -259 -214 254 198 -281 -217 250 168
1696 168 -290 -217 247 153 -305 -215 235 146 -302 -205 239 129 -306 -185 267 119 -310 -162 278 116 -307 -136
1718 -136 289 127 -292 -119 297 135 -279 -95 329 150 -274 -87 325 131 -267 -71 332 131 -263 -49
1738 -49 332 118 -267 -47 325 99 -275 -65 317 71 -295 -39 309 49 -303 -37 307 32 -320 -45
1758 -45 303 0 -338 -58 279 -1 -336 -57 265 -15 -339 -39 283 -16 -331 -19 287 -33 -318 -4
1778 -4 296 -34 -311 23 295 -32 -293 35 298 -34 -288 53 309 -45 -278 66 311 -41 -288 83 305
$$ packed form
1628C28m63j89M50J94m58j86M57J56m55j52M61J46m67j28M43J44m67j25M83R8
1648B70m68j18M79J12m84r1M74J05m78p3M70P9m71o5M78N6m69m1M72M8m85k7M65
1671B38K4m42m0M77Nm65KM68j0m78K3M67m1m63M0M63n9m68M5M68n6m79O4M67q2
1696A68m58P3M64r4m58R0M50q9m48R7M44j10m35J21M52j48m29J48M40j62m23J71
1718a36M25j62m19J73M16j62m14J84M24j79m24J87M12j94l98J96M03k01l94K14
1738d9L81k14l85K20L72k26l74K10L82k46l66K56L48k60l52K66L44k75l52K75
1758d5L48l03l38K80L37k80l35K79L22k80l24L00L22k99l15L12L06l20k85L14
1778dL00l30k77L34K72l27k61L28K63l32k54L41K56l54k33L44K45l52k47L71K22
$$ plain form
1799 305 -52 -277 90 316 -52 -275 106 292 -77 -279 92 294 -89 -277 87 268 -86 -273 111 277
1819 277 -111 -275 105 270 -134 -267 115 253 -128 -279 125 240 -137 -266 124 250 -149 -259 143 237
1839 237 -162 -243 149 245 -158 -250 164 236 -157 -240 155 227 -174 -231 159 215 -194 -226 165 213 -189 -215 189 208
1863 208 -205 -210 191 198 -204 -210 202 182 -218 -206 213 192 -208 -187 222 199 -196 -171 228 199 -204 -163 228 179 -212
1888 -212 -150 237 172 -210 -134 255 184 -213 -126 252 166 -226 -130 250 148 -238 -131 250 141 -239 -127 246
1910 246 130 -252 -128 237 102 -273 -148 227 78 -280 -131 222 83 -271 -115 217 60 -281 -109 231
1930 231 48 -284 -100 231 58 -281 -77 256 73 -262 -40 274 69 -238 -27 288 70 -240 -17 298
1950 298 72 -225 1 317 72 -213 12 297 60 -229 10 296 40 -234 20 288 26 -237 10 281
$$ packed form
1799C05l57k25L67K26l68k23L81J86l69k02L71K02l83j88L64J81l54j87L84J66
1819B77l88j64L80J65m04j33L82J38l81j51M04J15l77j29L90J26l99j10M02R4
1839B37l99q1L92R6m03r2M14P2l93q3L95P2m01n7L90N6m09l2L91M8m02k6M04J9
1863B08m13nM01Pm02oM12k0m00J2M19k1m00K1M09k3l95K5L99k9m03M1L91m9l91
1888b12O2L87o5l82P6L89p1l97Q7L78q6l92R6L80j02l86J07L81j09l80J12L73
1910B46j16l82J24L65j35l75J25L75j49l58J49L53j39l54J56L32j57l41J72L40
1930B31j83l32J84L31j73l39K04L33j83l35K22L14k05l07K11L15k18l10K23L15
1950B98k26k97K26L16k45k85K25K85k37k89K39K86k56k74K54K68k62k63K47K71
$$ plain form
1970 281 11 -264 7 264 -21 -264 -8 235 -48 -283 -13 238 -64 -305 -6 226 -69 -303 -1 220
1990 220 -74 -295 1 196 -84 -294 9 224 -91 -270 47 236 -62 -254 74 247 -64 -239 90 264
2010 264 -54 -214 103 275 -51 -202 143 272 -57 -193 140 277 -45 -188 130 272 -66 -188 128 258
2030 258 -84 -201 141 231 -102 -204 122 226 -132 -211 131 189 -155 -221 123 186 -163 -221 123 173 -176 -236 111
2053 111 162 -180 -229 125 158 -183 -218 125 160 -174 -200 145 162 -182 -184 155 152 -184 -171 175 158 -160 -154 191 160
2078 160 -160 -133 192 168 -167 -119 215 167 -164 -113 208 163 -184 -115 219 155 -181 -110 215 146 -188 -121 196 126
2102 126 -199 -107 212 126 -213 -110 208 97 -206 -108 198 95 -215 -98 193 83 -211 -97 198 64 -227
2123 -227 -89 201 71 -223 -88 206 64 -237 -75 207 51 -226 -70 214 55 -211 -45 219 50 -216
$$ packed form
1970B81k70k75K71K57k85k43K56K43k83k35K70K51l02k41K99K32k95k34L02K21
1990B20k94k21K96J95k80k10L03K15l15j79L17J89k98j92L28J73l11j75L29J74
2010B64l18j60L17J72l26j51L45J29l29j36L33J37l22j43L18J42l38j22L16J30
2030B58l42j17L42R0l33j02L26J04l58p9L42N8l44o6L44O3l49n8L44N0l49o0L47
2053A11N1l42m9L54L3l41l5L43L5l34k6L45J7l44kL39ll36J3L46j7l18OL45l1
2078A60l20K7L25k4l35M8L34m8l31N1L21m5l47O9L34o4l36P1L25o9l34O7L17p0
2102A26l25R2L19q6l39J03L18j11l03R8L06j03l10J17K91j10k94J14K95j34k91
2123b27J38K90j30k94J35K94j42l01J62K82j56k77J56K84j59k66J66K64j69k66
$$ plain form
2143 -216 -45 217 46 -207 -42 213 42 -208 -28 215 41 -217 -25 222 34 -203 -16 227 29 -221
2163 -221 -13 231 23 -213 -9 222 20 -206 -3 213 2 -213 7 221 0 -206 10 226 -13 -211
2183 -211 24 221 -22 -217 25 205 -38 -212 26 202 -51 -217 37 198 -49 -217 30 215 -43 -212
2203 -212 48 203 -55 -201 49 197 -54 -200 66 187 -67 -209 66 186 -68 -184 81 193 -68 -183
2223 -183 81 199 -81 -171 101 191 -85 -174 97 195 -83 -169 109 190 -89 -176 111 169 -105 -167 104 175 -109
2246 -109 -166 104 158 -129 -173 104 154 -131 -166 114 145 -134 -163 114 131 -135 -162 124 139 -137 -152 141 141 -139
2270 -139 -144 129 145 -135 -126 141 138 -137 -134 151 138 -149 -109 162 134 -135 -115 167 130 -142 -106 157 112 -155 -101 153
2296 153 118 -159 -98 173 107 -154 -103 160 89 -169 -103 160 96 -178 -100 159 75 -195 -104 159 66 -178 -98 151
$$ packed form
2143b16J71K62j71k53J65K55j71k50J80K43j74k58J92K47j88k37J87K43j98k50
2163b21K08K44k08k36K04K31k02k26K03K16k11k15K20K14k21k06K16K16k39j98
2183b11K35J97k43j95K42J80k43j74K38J76k53j66K54J61k47j68K47J85k58j69
2203b12K60J55k58j46K50J48k51j46K66J21k54j42K75J20k54j16K65J12k61j15
2223a83K64J18k80r0K72R0k76q9K71R8k78q6K78Q1k79q7K87N8k74o2K71P1k84
2246a09n7K70N4k87m4K77N0k85l5K80L1k79k9K77J7k66k7K86J5k76j5K93%k80
2270a39nK73J6k80RK67lk75LK85j3k87M0K71k8k69K0K82l7k72L6K63m5k67N4K54
2296A53l5k77O1K71o6k61N1K63p1k58O6K63o4k74P8K59q4k70R1K63r3k44Q0K49
$$ plain form
2320 151 61 -178 -89 158 66 -173 -70 180 71 -174 -61 163 43 -171 -59 179 62 -164 -30 188 54
2341 54 -165 -27 201 55 -170 -12 195 33 -177 -25 182 37 -170 -18 193 30 -181 -22 168 15
2361 15 -187 -23 174 0 -184 -12 163 -12 -200 -23 158 -13 -200 -23 170 -29 -198 -4 163 -17
2381 -17 -188 -4 176 -20 -165 14 174 -8 -171 20 170 -18 -170 46 184 -15 -149 48 184 -19
2401 -19 -150 58 180 -23 -151 69 188 -27 -147 61 181 -41 -157 60 168 -59 -160 63 151 -65 -176
2422 -176 54 145 -67 -176 50 140 -82 -165 44 132 -94 -164 46 133 -98 -161 65 128 -88 -156 86 132 -97
2445 -97 -149 101 139 -77 -132 105 125 -74 -120 110 156 -82 -107 113 144 -80 -115 126 159 -77 -98 123 155 -109
2469 -109 -104 121 122 -100 -101 123 114 -113 -131 112 94 -116 -112 94 85 -131 -124 94 73 -144 -128 89 73 -156 -127 97 75
$$ packed form
2320A51r0k39Q9K47r2k39J03K50j09k45J13K24j20k14J12K38j17k26J34K18j34
2341E4k19J38K28j46k25J58K07j62k10J52K07j45k07J52K11j63k11J59J90j53
2361A5k02J64J97j74j84J72J75j75j88J77J81j71j87J77J93j99j69J94J67j80
2381a7j71J84J80j96j45J79J60j82j63J91J50j88j52K16J38j99j34J97J36k03
2401a9j31K08J22k03j28K20J19k15j20K08J20k22j16K17J08k27j01K23Q8k16j11
2422a76K30R1k12j09K26R0k22q3K09Q8k26p0K10Q7k31o3K26O3k16o8K42M6k29
2445i7n2K50L8k16n5K37K0j99m6K30M6k38k5K20L1k24l5K41L3k36k1K21L2k64
2469a09NK25Jk22jK24rk27j8K43j8k10MK06rk16PK18k1k17J6K17j6k29K9K24k2
$$ plain form
2496 75 -159 -111 103 66 -138 -98 123 78 -142 -87 128 76 -127 -74 134 86 -114 -46 157 87 -99 -28 151 104
2520 104 -94 -34 177 100 -114 -38 169 80 -120 -31 163 64 -125 -47 159 59 -150 -45 130 45 -142 -57 130
2543 130 28 -144 -51 128 11 -167 -55 117 2 -158 -50 128 5 -166 -40 118 -1 -163 -32 125
2563 125 10 -146 -14 137 12 -132 2 148 19 -125 14 141 21 -119 33 162 26 -112 40 163
2583 163 15 -109 34 147 9 -116 26 147 6 -133 28 144 -14 -134 33 134 -36 -142 27 114
2603 114 -40 -151 15 112 -47 -133 13 114 -56 -152 16 98 -60 -145 15 117 -55 -138 29 112 -51 -134 34
2626 34 113 -46 -122 55 124 -55 -112 65 136 -39 -105 82 128 -40 -86 71 125 -46 -88 71 125 -53 -96 78
2650 78 111 -69 -85 81 111 -78 -103 72 97 -87 -104 78 97 -85 -93 70 76 -103 -102 61 81 -97 -92 77 76 -97
$$ packed form
2496G5k34M8K14l7k04M0K21m5k20N5K15n2k03N3K08m8k00O8K03p0j86P1J79m7
2520A04j98O0K11p7k14P6K07q9k00Q9J94r9j89P8K06j00k09J05J75q5j87Q5J87
2543A30j02j72R3J79j17j78J12J72j15j60J08J78j23j71J26J58j19j62J31J57
2563A25j15j56J32J51j25j44J34J46j29j44J39J27j20j40J52J29j36j38J52J23
2583A63j48j24J43J13j38j25J42J21j41j39J61J16j58j20J67J01j70j06J69Q7
2603A14j54j11J66R7j59q6J46J01j70r6J68Q2j58q5J60J02j72q3J67Q3j63q3J68
2626C4P9j59p6J77O9j79n7J77P1j75o6J87M6j68m6J57N4j71m2J59N4j78m3J74
2650G8L3j80j6J66L0j89k5J75K5j84j7J82J9j82qJ63Oj79JJ63K0j78NJ69jj73
$$ plain form
2676 -97 -101 78 80 -86 -92 80 78 -79 -80 83 69 -79 -76 103 68 -92 -72 100 74 -90 -65 107 65 -95 -55 111 70
2703 70 -95 -63 107 67 -102 -68 93 55 -110 -65 104 59 -100 -62 98 55 -107 -48 100 38 -106 -51 97 41
2727 41 -97 -39 101 38 -118 -35 100 21 -108 -38 103 37 -109 -23 117 29 -107 -24 106 36 -96 -24 117 26
2751 26 -101 -16 106 29 -94 -16 99 23 -108 -10 103 7 -103 -20 91 12 -122 -23 104 -20 -117 -20 90 -15
2775 -15 -112 -10 95 -22 -123 -9 86 -30 -119 -9 94 -13 -124 1 91 -14 -112 2 104 -28 -103 14
2797 14 97 -22 -89 6 110 -11 -102 29 106 -24 -92 32 92 -37 -88 37 97 -21 -102 35 93 -12 -102 28
2821 28 99 -28 -90 37 92 -44 -95 40 89 -30 -90 22 81 -47 -87 29 70 -39 -93 48 84 -50 -88 51
2845 51 80 -47 -85 41 73 -50 -88 59 84 -66 -85 64 77 -60 -76 50 76 -53 -77 59 76 -58 -76 63
$$ packed form
2676i7mJ79Kj66oJ72kj57jJ63j4j48LJ79l5j60K0J72k6j64K5J72m2j60M0J66m1
2703G0j65L2J70m0j69L4J61l8j65M5J69m5j59L8J60m3j62N9J48o2j44N5J48n6
2727D1j38N8J40o3j56Q3J35p9j29P0J41o6j46Q6J40q8j36Q3J30p0j32P2J41r1
2751B6j27Q5J22p7j23P8J15p6j31R8J13r6j10Q3J11p9j34R9J27j24r7R7J10j05
2775a5r7J02J05j17j01J14R5j16q9J10J03j07j11J25R0j05r8J14J02j32p5J17
2797A4Q3j19o7R5J04j21r1J31P7j30o8J24O0j29n1J25O0j18q1J37N8j05r0J30
2821B8P1j27o2J27N5j36n1J35M9j19o0J12N9j28m0J16M1j09n4J41L6j34l8J39
2845E1K9j27l8J26L2j23l8J47K5j50j9J49J3j37j6J26K6j29k4J36J7j34j8J39
$$ plain form
2869 63 68 -58 -64 57 71 -54 -72 63 70 -64 -69 60 61 -66 -56 72 55 -64 -60 72 51 -72 -55 59 57 -73 -49
2896 -49 72 48 -76 -40 84 61 -73 -44 74 44 -72 -45 88 41 -74 -39 71 35 -78 -35 74 35 -78 -28
2920 -28 75 26 -81 -42 73 27 -92 -50 62 17 -85 -42 62 22 -87 -31 64 15 -85 -28 75 30 -81 -25 74
2945 74 26 -81 -28 85 13 -86 -12 83 14 -72 -10 83 13 -80 -2 97 21 -78 -4 85 2 -72 -2 84 20 -71 2 77 6
2974 6 -77 -6 71 0 -73 -9 55 -11 -90 7 56 -16 -82 2 60 -10 -77 -1 67 -28 -93 0 67 -19 -99 16 66 -14 -86 10
3004 10 67 -18 -77 15 78 -16 -68 18 74 -7 -58 23 78 -13 -55 39 81 -4 -47 27 70 -16 -56 37 69 -25 -63 32 58 -32
3034 -32 -62 18 61 -33 -57 35 52 -24 -60 28 52 -37 -72 16 54 -50 -56 23 37 -43 -55 33 50 -51 -49 38 39 -51 -62 50
3064 50 48 -36 -45 54 47 -49 -38 58 49 -28 -45 54 52 -31 -39 56 43 -44 -34 46 39 -19 -44 34 33 -64 -40 43 30 -71 -50 36 8 -73
$$ packed form
2869F3Nj26oJ21J4j25j8J35Pj34nJ29Jj27J0J28j7j19MJ32k1j23J7J14kj30K4
2896d9J21k4j24L6J24k3j34K9J18l0j16K7J33m7j15L5J10l6j13M3J09l9j13N0
2920b8J03m9j07L9J15m6j19M2J12m5j02M3J04m0j09N6R5m9j00N7J03m5j11N6R9
2945G4m8j07N3J13p2r9P4R5o9q6O2R3p0r3P8R9p6r9P4Q9q3p4P0Q6o4r1P3P5p1
2974Fq3P1P7p1p3O4O4o6p9R7M9p2o6Q4N8p0o7P6O8r5o5R3O7q6q0J15N0q0p2R6
3004A0N7q5n9R2O3r4n2Q6N6q1n1Q1N5r1m2R4M2q5m3P4M3q6m0R3L2r4l8R5K6r0
3034c2l0Q0M3r4k4R2J7p6l6Q8K4q9l5Q8L8j04oP9J4q0j2Q8J7j01KQ7Jr0j1J12
3064E0kq4rR9pr6J1R6rp7j7R9kq3qR5j3q7J0Q0pn8k5P8jr7K4Q3j3j01K1Q6k8q1
$$ plain form
3098 -73 -50 31 13 -70 -57 30 10 -65 -49 44 15 -67 -50 35 11 -69 -42 40 16 -58 -23 48 28 -51 -26 51 38 -45 -13 79
3128 79 38 -45 -6 68 42 -36 8 68 42 -39 11 68 28 -36 -1 72 25 -41 -4 63 17 -58 -12 51 -11 -70 -14 49 -8 -71
3158 -71 -32 31 -20 -77 -29 20 -21 -83 -28 27 -24 -86 -22 22 -32 -70 -18 32 -26 -69 -9 46 -17 -60 18 63 -5 -32 19 56
3188 56 -1 -47 18 69 8 -20 33 64 12 -28 34 68 7 -27 40 65 1 -32 39 62 -5 -46 30 44 -17 -47 11 51 -35 -47
3218 -47 5 35 -41 -64 -8 28 -49 -65 7 19 -45 -70 7 17 -51 -47 10 12 -45 -54 17 20 -27 -40 33 42 -21 -26 35 48 -30 -26 42 42
3252 42 -14 -14 53 65 -28 -25 39 45 -18 -26 59 30 -21 -16 44 34 -19 -35 29 21 -36 -22 44 23 -62 -46 25 15 -59 -30 30 14 -65
3285 -65 -28 26 -4 -62 -46 22 -7 -58 -32 22 8 -55 -29 29 13 -43 -15 39 12 -38 -4 53 19 -29 -5 54 8 -27 -7 44
3315 44 18 -42 1 56 13 -36 -5 58 15 -35 1 50 12 -50 -10 33 -6 -40 -5 35 3 -43 -10 30 -7 -41 -6 31 -17 -57
$$ packed form
3098g3K3Q1j8q3J3Q7k0p5J6R3k9q2J7Q5k4q0K7Q2k4p4L5P1k0p9K5P7j3q3L2R2
3128G9m1q3L9P4k6p8M4O0k6q1N0N7m0o4L5P3m7o6L7O7m6p5M6O3o2n9N6O3n7o3
3158g1L9O3n1n7M8M9m1o2N5N5n1o2O4M4n4l8N2N0n8m3O0N5o3m3P8M5o8k7N1L7
3188E6n7m6O5N1o1k8N3L1n2m0O2L4o1l4O7K5o4l3P1K3o7m1P6J4o1l0N8M0q6j2
3218d7N2L0p6k3N6L6p7j6P2J2o4k5P7J0o8MN7Kn7rP1Lm7j3P3Ro3nO1J3p8MO8%
3252D2n6%O7J2r3LO4Oo3qQ5k9n1NO0j0n3j6O4qn7J4O6k1q5J6P1j0p4K9O0j6p9
3285f5L7N4l0n8J6O8k9n1K6N4j4o3K6N8j6n6K8N4k7n0L4N7l4m8K4N9m6l5K0N1
3315D4k6o0M3N5m3m9L1O3m3n0L6M9l8o2M0M3l9l4L5M0l2m6L3M0l7l4L5L7m8m0
$$ plain form
3345 -57 -3 41 -16 -56 1 30 -13 -54 -9 30 -12 -50 -1 41 -15 -55 13 39 1 -40 16 40 -5 -35 5 48 4 -39 23 41
3375 41 -4 -31 18 56 -4 -26 17 35 -9 -36 24 30 -23 -37 14 32 -32 -31 8 32 -30 -42 9 19 -34 -43 2 11 -15 -44 -6 21
3407 21 -30 -45 13 27 -24 -40 8 24 -23 -29 23 23 -23 -26 16 29 -17 -23 37 38 -14 -26 33 29 -29 -16 36 22 -25 -11 32 29 -27 -17
3441 -17 32 20 -24 -21 31 22 -25 -28 28 19 -37 -17 26 16 -45 -23 13 2 -41 -33 21 7 -41 -34 23 6 -50 -19 28 8 -39 -29 34
3474 34 7 -36 -18 29 9 -30 -1 31 10 -32 -11 31 5 -28 -9 36 10 -29 -6 29 17 -40 -2 37 16 -26 0 29 14 -40
3504 -40 1 36 4 -30 2 31 4 -18 -8 35 -10 -44 4 33 5 -27 7 32 -11 -44 1 29 -10 -35 3 38 -3 -33 -6 32
3534 32 -2 -20 3 31 1 -29 17 33 3 -32 13 16 -14 -38 3 30 -8 -40 16 30 -9 -31 9 25 -15 -21 7 24 -16 -29 7
3565 7 21 -19 -24 8 37 -20 -33 25 36 -20 -24 14 35 -13 -18 19 22 -3 -11 18 17 -14 -27 18 27 -14 -19 13 11 -24 -28 13 20 -34 -21 -8
$$ packed form
3345e7N4M4n7m0N7K9m3m1M5L9m2l8M9M2n6m0O8K6l8m1N6K4m5l0M0M3m4m3O2J8
3375D1m5k7M9L8o0k2M3J8m4k7O0On3j4N1J8o4JL9K4o2j2N1J0n3rM5Rk6k9L8K7
3407B1n1j5N8J4n1j6M8J6m7oN2%m6lM2J3m6oO0Jn2j2N9mn8J3N2j4m7J4M3ln6J0
3441a7M9j2m4LN2rm7lN6rn6K0M3j0o1K2L6j1m3QN4j4m8PN7j7n6L1M7k0m7J0O3
3474C4k7m3J8M7k0l9K9L2k1m2K1M2k6l3J9M5k6l9K3L5j2n7L8L9k1m2K6K9j5n4
3504d0M1L5l2l4L2K9k7k2J0M3m5l4M8K9k8l2L4K5m3l3M5K8l9k5L8L5m1l0K7L8
3534C2l4j8K3K8l0l0M6J6l0l5M5Ll0k4M1K7l8l2N6J4l9k2M0J6m0oK8J7m0j3L6
3565GJ4m0nL2K9n7j3N8J1n6mL8K1m8nL7Lk5qK9jl1j3M5Rm1nL2kl5mM1Pn4J3J3
$$ plain form
3601 -8 14 -24 -35 25 15 -30 -20 16 9 -23 -21 16 8 -29 -28 25 18 -29 -21 16 22 -31 -13 26 13 -20 -8 27 11 -19 -4 25 15 -27
3635 -27 -26 24 17 -16 -6 31 18 -22 -14 38 22 -29 -9 31 9 -22 -2 25 1 -36 -9 23 -9 -40 -20 29 4 -26 -19 23 4 -36
3667 -36 0 21 -5 -37 -8 36 0 -30 0 39 11 -32 -3 36 -1 -26 3 40 13 -25 1 42 10 -30 3 39 8 -14 13 39
3697 39 13 -24 3 27 1 -35 15 24 1 -24 7 39 -21 -34 2 34 -20 -41 -2 28 -7 -36 11 24 -14 -39 17 24 -11 -27 0
3728 0 31 -19 -32 7 33 -8 -27 16 21 -6 -15 19 30 -18 -10 28 44 -4 -26 25 38 -5 -18 37 35 -12 -15 22 33 -8 -21 23 36
3761 36 -23 -10 22 26 -23 -21 8 21 -22 -26 8 16 -28 -31 15 9 -36 -25 16 16 -29 -27 11 2 -34 -29 8 25 -23 -17 22 12 -21 -26 19 23 -38
3798 -38 -8 29 21 -30 -11 26 25 -17 -1 42 27 -18 -6 27 21 -14 -3 40 26 -14 7 24 15 -15 -7 19 15 -30 -18 18 11 -45 -24 9
3832 9 4 -38 -13 20 -1 -33 -26 14 1 -39 -31 17 0 -40 -17 21 -6 -46 -8 18 4 -33 -7 24 4 -28 7 36 9 -33 1 46
$$ packed form
3601hK2l8j1O0j0m5J0L6pl2KL7ql7JN3pm7QL7On3J8L9j3l3J2L5j6l0J5K9j0m2
3635b7JN0pl3J0L7j3m0QN2j6n1K0M0k2l1K0K7k4l7K7L2l2l1K0M9k5l0PM2j9m0
3667c6L6K1k6l2K9M4l6l0L0L9k8m3K9L9l7k5K9L7k7l8K6M1l2m0L3L6l1k2K7K6
3697C9k6l7K7K4k6l6N0Rk3k5L1L2o0j3L6L2n4k1L9L0l5k9M7J3l8k5N6Pl5j6K7
3728@L1n0j3L9K6m1j9M3Nk7rL4J1m8QL8J6m8k2N1J3m3j3N5km7lL7J1m1j3M4J3
3761C6n9J3L2Mm9KK9J3m3mL4Qm4lM6om5J1M1%m5KL8rl6NL7J7m8OL9j0l3nM5Mo1
3798c8L0L7qn1J9L7jm2J6M3j5m5J2L3ol5J1M3j4m0K1J7rl0QK6mm5J2L6pn6K1L3
3832Inm2K5L3k1l2PM0j3m0QM8j7m0K3L8k7m0L8K6j4l7K6L1k0l2L5K9k7m2L4M5
$$ plain form
3864 46 15 -28 -3 43 8 -22 10 40 7 -10 -4 33 -1 -32 6 36 1 -20 4 25 -6 -31 -1 28 -15 -43 -10 17 -23 -46 -3
3895 -3 20 -17 -46 -5 19 -22 -39 -12 17 -4 -45 3 32 -25 -31 2 38 -6 -34 5 35 -3 -28 12 26 -3 -15 17 32 -1 -14
3926 -14 25 30 -4 -25 14 32 -5 -30 20 35 -14 -20 31 25 -11 -33 22 29 -20 -22 9 13 -29 -33 10 12 -31 -35 -1 5 -39 -46 0 14 -34 -41
3962 -41 14 8 -16 -34 15 13 -22 -28 15 30 -18 -31 18 20 -11 -20 41 28 -1 -15 29 39 -13 -10 31 31 -7 -8 38 32 -15 -11 29 30 -15 -13
3998 -13 30 25 -15 1 27 9 -22 -21 29 11 -24 -17 16 -1 -45 -31 8 -3 -42 -19 10 2 -42 -33 12 2 -29 -15 15 2 -40 -13 23
4031 23 7 -27 -6 26 13 -16 6 35 16 -24 10 37 18 -12 18 42 21 -23 8 35 26 -4 8 47 15 -10 -5 42 15 -24 -2
4062 -2 26 -1 -28 -10 28 -3 -39 -21 7 -13 -36 -13 1 -11 -49 -15 15 -18 -51 -7 21 -12 -45 -14 13 -12 -27 -10 22 -12 -33
4093 -33 -2 25 -7 -21 -2 37 -2 -3 23 30 3 -19 25 47 1 -18 14 47 1 4 20 36 -4 -24 23 31 6 -18 13 31 -8 -21
$$ packed form
3864D6l1m3K5M6l5l0L2L0l3j7OL7l4l1L8L0l5k1K4K1l1k5L0K9m3k8L3K7m0k3M3
3895cK3l7k9M1K4m1j7K7K9k1m1M8K9n7oL3L6m4k8L9L0l8k5M0J4k9j2L2J5l3j3
3926a4L9Nl4k1L9J8l7k5N0J5m9oN1ol6k2N5Pm9kL1Mm2mM3Km3mL4Om4pM6J4m8p
3962d1N5ok4j8M9kl5oM3J5m8j3M9Kl1rO1j3k9j4M4J0n2LM1%l8jM6om7MM0Jm5K
3998a3M3nm0J6K6j8l1JN0j8l5PL3j7m4J4L9j1l9K3K9qm4RM5j0l1J4L0j3m2K7L6
4031B3j6l4K1L2j3k9K2K9j9m0L4K7j9l0L0K4k1m4L1K7rl0J2L9l2k5NM7k7l9K2
4062bK8k7k7J8L8l1l6J8K8k0k3K3J4j2l8L4L0l3l3M4K8l3l3L1K7k5j5J7L2l4k1
4093c3L1K7l2j4J9L9l9jK6Pk7k2M4K2m6j9L2L3m6LJ6J6m0k0M7Qk5k4L1J8l9j3
$$ plain form
4125 -21 19 28 -18 -27 17 18 -25 -24 7 14 -21 -33 9 21 -15 -37 4 11 -25 -29 1 1 -32 -34 17 10 -18 -30 11 30 -29 -22 15 19 -13 -27
4161 -27 17 24 -27 -18 20 30 -10 -5 19 29 -9 -17 37 34 -4 -10 40 17 -19 -8 24 30 -5 -18 23 9 -17 -18 29 18 -19 -12 28 22 -20
4196 -20 -18 23 11 -27 -6 29 14 -13 -15 21 13 -28 -7 31 8 -23 -4 31 22 -25 -6 23 10 -22 -10 25 15 -25 -11 30 9 -28
4228 -28 4 32 10 -18 0 32 22 -19 0 36 11 -25 -9 40 9 -3 -6 25 9 -29 -3 39 4 -12 11 23 11 -32 -4 32 7
4259 7 -25 -12 31 6 -18 1 28 -3 -25 0 34 -7 -34 10 34 13 -14 -8 39 -1 -34 5 19 -7 -35 12 32 3 -14 14 22 -3
4291 -3 -24 -2 19 -10 -28 9 26 0 -19 9 26 -9 -19 6 20 0 -28 9 26 -12 -25 10 24 -7 -15 5 23 4 -21 12 23
4322 23 -6 -25 4 28 0 -31 10 21 -16 -35 -1 18 -12 -15 14 36 -7 -19 17 25 -13 -20 8 31 -5 -21 15 30 5 -12 18 24
4354 24 -7 -15 14 26 -10 -9 18 30 -12 -6 17 36 -7 -10 7 29 -8 -19 18 17 -5 -17 15 24 -20 -23 20 26 -20 -12 22 16 -24 -25 11 18
$$ packed form
4125b1M0Rm6rM4Jm3JL1Pl5j2M2J2l6k2M1Pl6mL0%l3kN1pk8j2M1J9n9PL7Ml2j4
4161b7M4Pn1RL8J0m0NK4J0l8qN4ll8oN0k3l6J1L2Ol5j3M1j4k6jM7j1l7PM0om2
4196b0KM1j2l8K1L5j5k7kL6qm1K1L8k3l1J9L5rm7J9K9j3l2J2L5j0m0J4M1k1l7
4228b8L2K8k2k8J8L2j0m1J9L6k5l6J6M9l1j2lL1j6l8K6M2l5j6K3J2j2m3K8L6k5
4259Gl2J3M3k5k4J9K7l1k2K5L4m1k7M4K4k1k7OM7m0l3L9J4k6k8M7K0k9j7K8Qk5
4291ck1K2K1k9j8L7J7k6j9K8J7l5j0K5J4k0k8L7J7l8j3L5J4l1qK0J8j9k5L3J1
4322B3k9j9K9K4k8l1M1J1l7j9L4J9l0lK9K2m3j2L6Ql8pK8K3l6j6L6J5k5j7L0O
4354B4l1qK9J2l6JK7J2m2OK3J9m3lJ7K2l7j1L7jk2j2L2Rm4lM3Om6QL4om0jL6P
$$ plain form
4390 18 -19 -20 20 12 -6 -17 17 26 -16 3 18 10 -20 -23 23 18 -11 -7 32 21 -12 -13 21 20 -15 6 36 38 -3 8 52 16 -7 2 40 20
4426 20 -8 -4 29 25 -10 -8 19 8 -26 -13 23 7 -27 -2 20 9 -27 1 18 7 -29 -19 16 -9 -36 -24 12 -3 -39 -25 13 -6
4458 -6 -34 -2 17 1 -20 -7 21 4 -16 -3 29 2 -7 1 36 18 -12 8 35 26 0 7 34 16 -7 21 40 23 -4 16 25 20 -23 16
4492 16 20 12 -16 1 26 0 -21 3 22 3 -17 -3 22 -7 -25 -3 15 -18 -37 -17 20 -6 -33 -13 7 -22 -35 -9 23 -19 -42
4523 -42 -14 5 2 -30 3 12 0 -22 4 24 -7 -15 29 27 6 -12 19 26 3 0 17 37 0 -9 18 35 -1 0 20 24 10 -20 15 14 -6
4558 -6 -14 17 20 -5 -21 -4 15 -16 -35 -7 -2 -10 -22 1 19 -18 -26 1 13 -22 -25 -1 10 -14 -19 14 10 -21 -14 10 12 -21 -18 19 15 -17 -10
4595 -10 9 26 2 7 28 19 1 -5 13 28 2 -1 24 26 -8 -2 11 13 -1 -11 20 10 -15 -4 22 19 -14 -2 9 16 -20 -8 11 -1 -24
4630 -24 -23 1 -2 -27 -26 1 6 -23 -19 13 -4 -16 -14 22 6 -9 -10 14 16 -14 7 20 18 -24 3 24 15 -12 5 28 18 -3 10 29 10
$$ packed form
4390A8l7jM0qj8j1L4Rm2J9J5ql0lM6nk9ML9j1l3jL4jl5K1L0Km1J1M4l6k3RL8k0
4426B0k8ML3ml5KK7j1l4J3L6j6l4K5K2j1l6K8J7j1l6J0L5k5k7J2L6j5l6J4L8j9
4458fk8L2J9j6k1J3K8j7k0J3L2k7rQL5j8l0K0K7rk6PK7j8k3K8J9j7k7K0Rnm3L9
4492A6Mqk8J7K5k6k1K4J9j9k0J4K5k9j8K2J8l3j9K0L7k6k7K0K0k9j3K6L2m2k3
4523d2K8J9ll2L3Rj2k2K6K0l1qM4kk1j8L1Pk3lJ7K0l7rK7J7l6JK0Mj4l0L5jk0
4558fqL1Lk5j6J7J9l1j9K8Nqj2K3J8l7qK7J2l5lK4J1k4nL3ml1PK4Kl3LL7ml2P
4595a0J9J7k4NK1rj8oJ8J5k6lK5Kl4OJ3Kj4j0L1j0k5J1K6ll3J2J1Pl6J2J9j2k3
4630b4JK4lk5JK7Nk9ML2j7j2KL6j6j5jK4Kl0K1J3km2K7K1rk7J7K3j0k1J3J9j9
$$ plain form
4665 10 -7 -10 18 10 -10 -5 21 10 -13 3 23 17 -21 2 13 6 -25 -2 20 -4 -32 -12 7 -7 -26 0 16 -11 -25 -6 5 -6 -16
4698 -16 8 18 -7 -11 -6 17 1 -1 11 26 3 -9 17 28 7 -4 16 27 18 4 12 28 10 -2 21 22 17 -2 7 23 11 -16 17 14 -6
4733 -6 -8 19 22 3 -26 13 17 -11 -11 -3 11 1 -28 0 6 -9 -23 0 6 -23 -35 -9 5 -11 -16 5 6 -12 -13 3 19 -9 -20 3 13 -3
4769 -3 -15 16 13 6 -2 11 6 7 7 14 27 -6 -3 16 20 3 -14 15 18 0 -12 8 13 -8 -7 8 13 -9 -14 13 5 -5 -5 5 17 -11 -16 2 -6 -8
4809 -8 -12 5 -2 -13 -24 10 14 -25 -25 2 8 -10 -9 -1 12 -4 -6 29 9 -5 -9 10 13 0 -7 26 8 -14 8 19 17 -4 -3 23 12 -12 -1
4846 -1 18 18 8 7 12 13 -11 -9 2 14 -10 -14 3 15 -20 -15 11 9 -23 -17 2 -3 -25 -4 -6 -8 -20 -6 7 -6 -18 -18 3 -2 -23 -11 11 -3
4884 -3 -13 -14 10 8 -11 -16 25 2 -4 -9 30 14 8 11 23 11 -5 2 33 12 -2 11 12 13 -6 8 25 -3 -11 4 11 -1 -10 -1 17 5 -8 7
4922 7 12 -10 -18 2 1 -11 -21 -5 13 -12 -19 -12 -9 -1 -18 -10 -3 -5 -18 -1 12 -10 -24 -4 5 -8 -12 4 14 -2 5 4 11 3 -8 -1 18 -5 -24
$$ packed form
4665A0j7lK8qk0NK6j1k3J6K0ol8K3J1pl1K3K2k4k8K0J9j4j9K6J6k7j4J9J1j1j0
4698a6K4J0k5mNK3j6kJ2J5k3j2K6J1k1j1K0J1rj4QJ6j8j2K3Jnj9RJ6j2k7L3lk0
4733fkK7Lj9k9L9Mk8%QJ4j0k9K8Oj5j4K3Ok9j2K6J4j6nK1Jj8jJ6J6k8j1K3J0j6
4769cj2L1lpqJ3nJ%PJ3l3LJ9Mj7j7K9Lj8j2K0Nk1JJ5Nk2nK7qj0%J0J2k8nJ8qk
4809hmJ7pj1j1L4Ml9%K7Oj8JQJ3j6kL5k0j4mJ9Lj3pL3j8k2K2J1kk1JK6j1k4J1
4846aJ9%j0jNJk4KJ1J2k4mJ7J2l5NK6kl2OJ9nk2K1kkj2J4J3j3j2%K1nk1J2K2j4
4884cj0jK4kj9nM1k3onL9j6oLJ2j2j6PL1k1j4J3JJj9J4J7k8qJ5Pj2rRJ8j2j3J5
4922GNk2qK0jj2j0J6J8k5pPLQj7QPkj3J7J3k2j4K0Rj3mJ6J0j6PjPqj1PJ9k3j9
$$ plain form
4961 -24 5 23 -12 -2 7 27 12 -6 9 18 1 -11 9 16 14 -1 12 6 3 1 7 19 -9 2 -3 -2 -11 -5 1 7 -9 -10 5 15 1 -26 -8 10
4999 10 -14 -21 -6 9 -14 -10 3 2 -3 -19 1 4 -5 -10 -11 -2 -11 3 9 7 -10 -6 4 13 -6 4 8 18 4 0 11 6 6 1 23 11 1 5 23 21 6
5040 6 3 23 18 10 3 12 12 -5 -1 24 6 0 -7 7 5 -15 -10 -4 7 -7 -4 3 5 -15 -6 0 0 -9 -13 -3 1 -7 -9 10 10 -10 -4 -4 -5 -3 -1 4 4 0 3 11 6 3 9
5089 9 15 8 -14 19 18 11 12 7 23 15 1 2 15 18 1 -4 5 1 3 9 10 0 -9 9 -1 -4 1 -2 3 -5 -8 -2 3 -6 -17 -9 -1 -8 -4 0 8 -4 2 -1 4 -2 -9 -9 18
5138 18 5 -2 7 17 0 6 9 10 2 9 16 4 10 3 13 8 8 7 13 9 11 -14 10 7 3 7 0 13 -4 2 14 26 -7 -10 -3 7 -5 -1 -7 7 -5 -3 7
5181 7 12 -8 -12 -14 -1 3 -17 0 0 -16 -6 1 -8 -10 -1 0 2 9 -3 2 24 0 2 13 11 9 1 31 6 11 -3 11 16 12 18 6 13 5 5 16 15 15 5 10
5225 10 22 -4 -3 3 -5 -8 -9 -4 0 -9 -12 4 -3 -9 2 -4 6 -5 -13 -5 -7 -16 -14 -2 -3 1 -18 7 2 -5 -18 2 11 2 8 -6 13 3 -7 14 17 1 19
5268 19 3 6 2 3 19 15 8 18 17 10 10 11 18 6 -2 0 6 20 -8 -3 15 3 6 -10 1 -4 -11 -19 3 -8 -20 -11 2 1 -13 -9 -5 2 -17 -11 -17 -7 -2
$$ packed form
4961b4K9J8l5J0RK0j5j8J5Rj7j2K0Pkj5J3olkOJ2k8J1nJrOOOj6jJ5J0j4k7J8J8
4999A0k4pJ5J5k3MJ3jnj6K0LrnjRrJ4Okj7MJ0Rj9J0MJ0j4mJ1n%nK2j2j0MJ8kj5
5040FlK0nqpR%j7MK5j8opJ4kk0NOJ1j4LPKk0RO%rmJ0MqkJ9%k0O%jKKN%mLQnlO
5089IOpk2L3jpJnJ6qj4JJ3Lj7nRmKOJj0rJ8j0lNlNqlONrj1QQpMMQj2OlNop%K7
5138A8j3pRJ0j7OLJqPPj2OpJ0n%jOmKk5K4lmMpJ3j7OJ2J2l3lPJ0j2MoJ4j2KJ0
5181GNk0mkJ3Mk0J7%j6J0PrkRJKPj2NK2k4KJ1kkqL0k5Nj4J4NmOj2Pq%J1j%j0N
5225A0J2k6JOqljNMrlJ6poJ1oJ0j1qQkrKJ2jMj9K5npj3K0RrOj4J9j0j0K1Lj6J8
5268A9j6LmJJ6mpJ0jp%JPj2qKOJ4k8NJ8j2Lj6J1npqK2j1j2RJ3jj4MMPj9OoJ0N
$$ plain form
5311 -2 -7 -12 3 -11 1 8 12 -3 -1 1 4 -8 6 10 6 12 9 7 10 2 16 23 18 12 16 29 23 2 13 13 9 2 7 13 0 9 5 15 -8 3 -11 14 -17 -11
5355 -11 0 -7 -9 -4 -14 -3 -16 -11 -12 -20 -2 -18 -3 -10 5 -12 -5 5 -18 -14 0 -9 10 5 4 -1 2 -7 4 18 2 2 17 15 17 4 8 13 9 14 5 12
5397 12 17 9 -1 18 11 13 20 15 3 6 9 -1 0 0 -4 8 -1 0 12 4 -1 1 8 -13 -11 -15 8 -6 -20 -6 -17 -1 -13 -2 -4 5 8 6 1 -1 6 -2 -2 9
5441 9 4 6 11 14 3 4 11 12 7 11 5 26 20 11 10 7 15 11 12 17 -2 6 12 14 8 6 12 -4 2 6 -1 7 -3 0 6 -13 -7 -6 -1 1 7 -6 -1 1 -1 -2 4 -6 -5 -11 -2 -13
5493 -13 -8 0 3 12 10 7 -3 3 -1 14 0 8 1 14 16 6 7 16 15 12 19 14 14 12 18 19 12 10 15 8 14 8 13 6 12 2 0 -4 14 -6 4 13 5 2 3 0 -2 -1 -8 1 0
5544 0 -11 -7 -9 -10 -4 -9 -7 -14 3 -19 -8 3 -1 3 -1 10 -1 -1 2 -7 -1 -1 2 7 3 6 14 14 -3 14 4 11 10 6 3 0 4 7 0 -3 6 16 -6 9 4 5 -3 4
5592 4 -3 0 -5 2 0 -10 -6 -19 -2 -9 -5 3 -7 -6 -12 -7 -4 -10 0 -11 -10 -6 4 1 -16 7 0 -4 -10 5 -9 7 5 -2 2 0 0 6 3 8 5 10 7 7 0 4 7 11 4
5641 4 5 11 -1 10 4 -3 -1 13 -2 9 0 -6 5 0 -6 -4 4 -7 -4 -11 0 -7 -1 -8 -8 -12 -6 0 -1 -1 -4 -8 8 -1 -2 -1 -6 0 -9 4 9 3 -6 -4 -12 2 0 -1 5 -1
$$ packed form
5311bnnJ5j4J2PMj5KKLj2J4MmOlkLqJ4PnoMJ3ok1J1%mpNOj3RmJ0k3J1j4K5l1O
5355a1J1pkNj0J1j3NjqJ8j6J5pJ5j7PJ0k3MJ4rJ9njnLrJ1J4j6%J5kKj3MNmNrP
5397A2Nqj0J9pKPnj2LLj0J%mJ2rJJ2qnKPk1KmK3j4j4J4j1J6j2J1kRLknkPq%J1
5441InKNLj1JPJnMoK1orjlQmJNj9QOKokOj6OMpQj0LOj9OJNKOj3NKkjOj0JoRj1
5493a3NQLRklj0OmJ5j4QpJ3Kj0JRjlPn%kOJpkNpOoNpOj0kmJ8k0J0RqlJlkJpRj
5544@j1MkjOnKpJ7k2J1J1mMmJ1j1%LrO%LNmLQ%j7J7j0PjmllMLplRJ0k2J5nJqP
5592DpLnPkj0Mj3J7pMQj0JoNLoJ0j1JMJ0lj7K3pmoJ5j4J6kpMk%OlNlNl%pMLMp
5641DJOj2J1opKJ4j5J1roJ1noKQj1LpJ1pOp%mOOj%lmJ6rjJnOrJ3NorKqJ4kjOo
$$ plain form
5691 -1 -5 -1 2 9 13 14 6 13 0 5 14 5 -2 3 13 11 5 13 21 9 0 18 -1 9 6 11 10 1 -6 2 0 -8 1 -6 9 3 1 -3 -2 -7 -10 6 -13 -14 -23 -7 1 -7 -14 3
5741 3 -1 -3 -5 7 8 -3 -6 6 0 -3 -3 -3 -9 10 -7 13 -2 1 9 2 19 7 3 3 8 -2 1 8 7 2 3 8 8 6 1 8 6 -17 7 -10 4 -9 -1 -2 -5 -11
5787 -11 -8 -3 -5 -12 0 -11 -8 -7 -17 -4 1 -3 -9 -14 -5 -5 -19 -3 -1 -3 -8 0 -1 -7 -2 6 2 7 9 12 15 7 17 6 8 8 4 2 16 5 11 5 16 6 1 18 11
5834 11 15 9 14 5 -5 -3 8 1 -9 6 2 4 -12 -5 -4 -5 -7 -16 0 -10 -10 -8 1 -5 -18 -7 -6 -8 -6 -2 -4 -6 -14 -9 -6 -8 -10 -6 11 2 5 8 8 4 8 2 5 8 -1 7
5884 7 6 11 8 12 12 3 6 8 14 11 5 15 28 7 7 5 13 9 9 13 5 -2 -13 -11 -3 3 -8 -2 6 -7 3 -2 0 -1 2 -12 -16 -10 -13 -3 -9 -10 -9 -3 -11 -13 -8 -4 5 5 -6
5935 -6 9 5 8 8 18 10 1 5 2 1 6 1 11 13 20 11 6 18 11 -4 5 14 10 16 17 2 2 6 -7 5 -4 9 -6 9 2 -8 -6 -8 -8 4 -6 1 -10 -15 -4
5980 -4 1 -7 6 -11 -11 -3 -10 -8 8 -7 -8 -3 2 3 3 5 -6 0 -12 -2 8 4 8 10 0 11 3 11 13 1 -4 11 12 3 9 10 8 -9 10 -4 10 10 7 6 -2
6025 -2 -8 -2 0 -4 -12 -19 -8 -8 -11 -7 -4 -8 0 -7 1 -8 -22 1 2 -5 -9 -16 0 -6 -8 -3 -12 3 -12 10 -1 -7 1 8 9 6 6 10 16 1 9 21 4 14 -4 0 16
$$ packed form
5691amMLPMJqPj3NRrpNJ0koQQj2rJ8j9J0lNjrpQkqRpJ5okmJnlJ6j9jrJ6QqpJ7
5741CmkkJ2Jj1lJ2ol%%oJ9j7K0j5LQpJ7j2m%Nj0LPjnJN%knPkk3K4j7J4j3Qjlo
5787a1LNkpJ2j1LJj0J3NmonR%j4J6KknQjoNQmNKLLqJ0j1K%mkJ4j1OoJ1j0nJ7p
5834A1MoNrj0KJ1pj0J5mKj6PJjkrJ6j0%KRoj3J1JkKMkkqNLkkMJ7rLL%mMoLLrQ
5884GjNlM%rLKOloJ0J3k1%kQm%Mqpj1KQOj1OQj3J0nKjLj4mOlJ0ojJOqkNMR%j1
5935fJ5mL%J0qrMljNnJ0KPrnJ2pj5RRmOJj5%Mj3J2rJ3j5J5pj0Kk%J2j0Pj1nJ1
5980dNqJ3j7%QpKJ6j5jNNJ%Kj1Oj2J0J0mMKj0J1qQKj2nJ5JrOJkj7J9j4J4%ljq
6025boOKmqpJ1%lMLmQpQrj4K3JpmpJ6okNrJ5j5K2j1oQPJl%MOj5QJ2j7J0j8MJ6
$$ plain form
6072 16 4 11 20 10 10 -10 -3 8 2 -12 -10 4 0 -5 -6 6 -12 -13 -12 2 -9 -10 -6 -9 -4 -9 -6 4 -8 -5 -7 1 -4 -19 -14 -16 -12 -7 0 -1 8 13 5 13 4 4 4
6119 4 22 -3 6 7 17 4 13 17 9 13 5 15 22 12 9 3 12 4 1 13 9 -5 -2 4 5 3 -3 8 -4 -5 2 -3 -7 -18 -14 -5 -5 -18 -11 -14 2 4 -10 4 -10
6164 -10 -11 -7 5 -2 -20 -1 -2 4 -3 6 3 -7 -5 3 16 13 4 4 16 16 4 1 18 8 19 5 13 6 15 1 10 10 6 -6 -1 4 3 2 -6 -4 -1 -9 3 -8 -15
6209 -15 -2 -2 -5 -10 0 -13 8 -22 -12 -11 -9 -9 -17 1 -5 -16 -10 0 -6 -5 -15 1 12 -5 -3 11 5 5 3 6 7 -2 -5 2 -4 6 8 6 18 7 9 1 9
6252 9 3 -4 13 10 -1 2 7 0 -7 3 -4 -1 -3 3 13 1 -1 4 1 1 1 -1 -3 -6 -8 -5 1 -1 -9 -16 6 -5 -14 -10 2 2 -11 -2 -2 -2 -8 -3 5 5 -12 -1 3 -2 1 -1
6302 -1 3 11 5 4 25 11 3 1 9 23 -5 -2 3 4 12 0 21 -2 -5 4 6 -7 3 -5 6 9 -2 -12 10 8 -6 -4 -2 -1 -14 -4 5 -10 -5 -10 -14 -5 -15
6345 -15 -8 -5 7 -18 -9 -2 -19 -16 -5 -6 -14 -4 3 6 10 -1 6 14 4 -3 6 8 16 7 6 9 1 15 9 9 3 -2 3 6 3 1 3 15 9 2 11 -6 3 -1 -8 -7 -4 -13 2
6394 2 2 0 0 3 9 -8 -1 8 2 -14 -7 3 -1 -10 -15 -5 -7 -13 -11 1 -2 8 2 6 -6 6 0 7 14 -8 -1 5 -3 -5 -11 4 5 7 5 9 11 -7 -1 2 8 7 -1 3 8 3
$$ packed form
6072A6j2PRj0%k0PJ1oj4KJ4mnjJ2j8jJJ4j1jMlNnLJ0j2LkQnj5NkMNPjRNqQr%%
6119DJ8k5RJJ0j3RMqMqJ0Pj0loRqlJ2mj4LOJkoJ1j2jPnmj1MR%j3PlJ6Kj4J4j4
6164a0jMJ2pj8J9jOpRlj0KQJ3lr%J2%j2lJ7j0J1j4QpRj4R%mj2NNjjqKLqJ2j1p
6209a5J3%lnJ0j3K1l0J0JK%qJ8oj1OJ0oJj0J6J1j7KJ4o%kLJrlPoJ0KkJ2j1KqQ
6252IopJ7lj1LNppJ0pLkOJ0j2kNl%%kklkLOkqpK2j1rMJ2%j3R%%oNQ%j7J1MnLk
6302aMQojK1j4qkQJ4k8LNJQj2K1k3lRKj3J0qJ1Lj1j0K2kj4KKJj3J0Rj5NnmRj0
6345a5PLJ2k5RPj7LJ1jqJ0PLMj1PQj0pRKQrjLqJ4o%onNLlkKJ2opRj7RmpJLrJ5
6394B%k%LOj7PRoj6PJ0mrnJ0koKJ2lJ0oMj2J2oPPk2POqkoJ5JKkMKj8OLOjqMNn
$$ plain form
6444 3 -2 3 2 3 4 3 -4 1 -15 0 -9 -10 -9 -6 0 -5 -11 -14 -6 -23 -8 -13 -7 -6 -8 1 -5 -14 1 -7 -2 -15 -9 -2 -6 -17 -20 -1 1 -6 -11 -8 6 -8 9 2 2 0 4 6
6494 6 9 -4 -17 -2 -7 -10 7 19 12 0 9 16 3 2 13 4 3 -2 -4 -1 -2 -5 -10 4 0 -16 -3 -9 -7 -17 -16 -3 -4 -14 -8 -2 -5 -8 -13 2 0 -12 -4 1 1
6539 1 2 -8 -6 -7 -17 -16 4 -8 0 0 1 -4 -8 -6 -12 5 0 -1 16 -2 -4 10 5 6 -2 -2 3 -8 -11 -3 6 -5 1 4 4 -2 -19 5 7 10 1 -6 -3 -8 -26 -20 -3
6586 -3 -5 -14 -14 -1 -11 -25 -14 0 -3 -11 -18 9 4 -8 -8 1 -16 -9 -1 5 6 -1 1 -3 0 -6 14 -4 1 0 10 18 3 -12 14 15 8 1 5 16 -1 6 5 8 5
6631 5 -3 14 16 1 -5 -1 6 2 -9 5 -7 -14 -12 -4 -11 -16 -15 2 -10 -23 -21 -25 -14 -24 0 2 -7 -7 -16 -7 -9 -7 3 -5 -4 3 -3 3 -3 0 3 -2 12 2 0 8 11
6678 11 10 6 10 16 3 4 8 14 13 2 11 5 7 9 10 16 9 -4 11 4 -14 -6 -4 1 1 -7 -7 -5 -13 2 2 1 -17 -15 -11 -17 -22 -5 -8 -7 -10 -16 2 5 -1 -12 0 1 -3
6727 -3 10 -4 0 4 -2 13 15 7 6 13 19 7 19 23 2 4 -1 4 1 8 -4 12 9 5 0 17 9 -3 -2 -2 5 -9 -20 -10 -3 -14 -14 -14 -13 0 -10 -11 -15 -13 -9
6772 -9 -15 -13 -11 -13 -17 -10 -8 -15 -14 -4 -6 -9 -11 -13 -12 3 3 7 -7 2 5 -2 -4 -3 3 -2 1 11 11 14 5 11 15 -1 -6 17 4 9 9 12 9 8 6 5 -2 6 -3 7 6 -6 -20
$$ packed form
6444CnNjJJjpNj6J5rjJLOnolQj7J5nOJkRorJ5qNj3OPmj1lJ9KpnLJ4j4J7p%kMK
6494FLj3j3J5nlJ7J2pj2RPj3jJ1rjnkLjlnJ4mj6J3oKj0JJ3jj0OOllnJ5kj2QN%
6539AJj0Kjj0JK0j2Q%JnmKoJ7njJ7j8kJ4nJq%Nj1lQRj1OL%oj7K4KLrpLnj8OJ7
6586ckr%J3j0j4J1J4lqpK7nj2%Rj7PQOJpKmLoK0j8NjJ0Qj5j5K6JppMJ1j7PjLl
6631EqJ7Kj5oMPmj1J4j2pKQpnJJ7j2j3KmJ1j0K4Kr%rRkKJ0qJPoOoLLnJ4j0kQL
6678A1jmMOj3JMOjj1RoKKJOpj3J5pj8QKN%q%KqJ5%jj8KMonJ7lJloJ8Loj1J2Jm
6727cJ3j4MMoJ5KqjPOj2J2Mk1KnNlPj2J6lmnJ7qj2J%Pj4j1J0Pj1%%JJ3j0jmKM
6772ioKKkmPKpJJ0klkkJJ5%Mj4RLpkJOnLJ0%LrOMj6nK3j3N%LljkjpQrJ0jj2j4
$$ plain form
6823 -20 -5 -3 3 -4 -9 -5 -14 0 -2 -6 -9 -15 -10 -7 2 -7 -5 -8 -10 -10 -13 -8 -4 -13 5 6 -4 -2 3 -1 5 4 9 4 -1 16 20 2 8 1 15 4 3 7 14 7 2 0 14 13 -6
6874 -6 6 -2 6 -3 -1 -1 -4 -4 -10 -10 -5 -9 -10 5 5 -2 -11 4 3 -2 -10 4 -6 -12 -3 -5 0 -13 -3 -3 -3 10 -8 -1 0 4 1 16 -2 3 -9 15 9 5 4 1 18
6921 18 14 5 1 5 16 4 -2 2 13 7 3 4 5 1 -4 6 -6 -3 1 10 -2 -9 -9 5 -15 -10 2 2 -13 -11 -6 -5 -1 0 4 1 -14 -2 11 8 -3 -5 -2 2 -3 -8
6967 -8 1 -2 0 -1 4 1 1 4 8 7 3 -3 7 8 5 8 -4 11 3 1 4 19 3 10 7 5 -1 8 7 9 -3 3 7 5 9 6 -5 -5 -13 -11 2 9 -14 -7 -2 -7 -13 -8 -2 -2 -11 2
7019 2 4 5 2 5 -5 -2 -4 6 2 -8 -8 2 7 4 -3 8 7 7 1 3 4 -4 1 3 3 5 9 10 19 -3 9 8 -6 -4 3 2 8 5 -4 -6 14 3 -13 -5 8 -2 -1 -3
7067 -3 -12 1 2 -7 8 7 -14 -11 -4 -2 -8 -21 -10 -3 -7 -16 -14 -20 -12 -8 -16 -6 -5 -4 4 6 5 4 4 0 -10 12 9 2 -9 12 10 12 13 1 14 7 1 17 11 -2 6
7114 6 15 1 8 -9 9 12 9 -11 -16 2 -3 -1 -1 8 -7 -5 -4 3 1 6 0 0 -7 2 -11 -3 -9 -8 6 -5 16 4 -9 9 -7 1 -5 -1 -9 -9 3 8 -16 -6
7158 -6 -3 5 8 2 0 10 -1 5 14 5 12 14 7 4 14 -4 13 14 2 4 -4 8 9 1 2 2 9 1 6 0 -8 2 14 9 -7 -10 -12 -9 -7 -16 1 2 -9 -19 -3 -18
$$ packed form
6823b0J5KOpnMrJ4kmloNLRrKlk%lNMrJ8Jj0KNmOjNnnJ7Mj8OpJ4j1jMPpnkJ4jj9
6874fJ2qQrK%l%o%NmjJ5%prJ5jnqJ4j0oRkNj3J0%%J3j8PJMlJ5j8Nj2K4omjlJ7
6921A8mrmMJ1j2oMJ1omJJmnJ0j2LMRj2p%J4k0NJ2%j5KNJMJMlj5J2J3lj1kLMnn
6967hRlKjNl%LMjmoJ0JlLj2J5qkLJ5j6PlkoRjKj2OMkMlj1%qKJ3Pk3PNnoNO%rJ3
7019BKJlLj0LkJ0mj0%J0NlpJ1j%oKJqNK%KMJRk2J2jj4KPjOlrkK0j1j6QJ3j0Jk
7067crJ3JrJ5jk1LPKoj3J1PmrKoQMqJ0JJQKjj%mj0K2lpj1K1kKJj2J3poJ6oj3Q
7114FRj4Pj7J8Llk0nJ8nK%Rj5KJPkNo%pRj3QoJJ4j1K1j2j3J8j6QoMq%J2Nk4J0
7158fLQLokJ0j1ORrPKplJ0j8J7Jj2KqJ2JqJ%PqNoqJ0J2nj6lkLKrJ7Jj1j0J6j5
$$ plain form
7204 -18 -12 -13 -6 -1 -15 3 5 5 2 -5 3 0 1 6 -1 4 2 -7 7 0 1 7 4 -7 5 3 23 10 6 10 9 3 11 13 2 4 0 -2 -3 0 -3 -6 1 -1 -10 3 -11 -2 2 -2
7254 -2 0 -10 -5 -9 -7 -6 -6 -14 -12 -13 -17 -13 -11 -14 -7 -15 -12 -9 -6 -4 5 4 -3 0 -4 -1 4 -3 11 12 7 -8 -3 13 5 6 12 3 12 16 11 10 3 14 14 13 12 8 16 6 2 13 8 8
7308 8 1 2 4 6 -2 -10 -2 -2 -16 -8 0 -5 -3 -7 -8 -12 -11 -3 -6 1 -4 -7 3 -5 -4 -1 2 -7 0 7 -3 -2 7 5 -11 5 8 9 8 5 -1 -2 -2 -2 -1 3 8 7 13 6 10 11 0 -2 12
7363 12 11 5 -3 6 13 10 1 -11 8 -4 4 2 -1 1 -6 5 -9 -13 -8 -3 -2 -6 -12 0 -10 -21 -11 -2 -5 -11 -2 -3 1 -7 0 -1 3 0 2 -2 4 10 11 15 12 8 7 6 23 21
7413 21 6 16 7 4 2 7 8 13 9 2 4 -4 -5 8 3 -10 -6 4 2 0 5 4 -5 5 -7 -2 -4 -5 -20 -10 -17 -12 -3 -5 -9 -3 -7 -5 -8 -13 5 -9 4 6 13 5 -3 8
7461 8 1 1 -3 4 5 -5 8 9 3 6 10 5 5 7 7 15 11 11 8 10 12 3 12 12 12 3 7 7 5 0 10 10 -1 6 -4 -13 -4 -3 2 -6 -4 -3 1 -5 -17 -10 -9 -7 -8 0 -12 -6 -5 -2
7515 -2 0 6 1 -4 -8 2 -3 -2 0 -1 -1 0 1 1 11 14 8 19 16 18 14 16 7 8 21 -7 4 6 14 6 -1 13 7 1 1 6 -1 9 -10 -1 9 -8 -5 -13 -7 -7 -11 -6 -15 -9
7565 -9 -11 -16 -21 -13 -14 -4 -4 7 -2 -6 -3 -5 -4 -4 -6 -4 0 -3 -5 6 0 7 -4 5 -4 2 14 5 11 -5 7 16 15 9 -2 2 7 12 5 -1 6 1 6 16 -6 8 -4 -2 -3
$$ packed form
7204a8OjPNj4J8K%lpQlJNpNkrJ4pJOlj1J2kK0j3mMjoQKj1KmkjLllPkrJ3j4RMm
7254bKj0NmKJ%qKjmMKlPqLLLKRjpLmLNpJ4Jnj5NJ6qJOrRMnjpJ1%jjmQj0mJ1n%
7308HpJKKqqQ%j4QQnKmjmJQlPnlJ0qJLLrPPj0JRkj6J6LJjloj%%JMNjOpMJj1kJ4
7363A2joqRPlrj2J9j2QklKpJ1j4mNNJmoJ2j0j1J0RloRjMqPjMlKmOOJMlmjjJ7k
7413B1j5J0rlkNJNmpKqjJ3nj3MJ0kkNjrJ0j2Nkjj5J0pNRkmOmKlnJ8j4J3KPqqJ1
7461Hp%mPJj0J3JoLMn%K%Qm%lKKrR%%rM%knJ0%j1Pj0rRJNqKJMoj2PJKjQj2OJL
7515bKOnnmJ0nJKj%JJ%J0LoJ1lKmKrJJ3k8J1KQqpJ4oo%NpJ0j9RJ0j7LqO%mNrO
7565iknnQjJ0%J1rmLkJ%kKMlkJ1oPj1RrOJ2rOj6J2Rjoj1MNNpoPnNJ0k2J4j2Kj
$$ plain form
7614 -3 6 5 2 -1 17 7 -5 -5 -19 -7 -1 2 -14 -13 0 2 -6 -6 -10 -17 -13 0 -6 0 -5 0 -16 -7 -7 1 0 -6 13 -4 15 7 9 4 2 4 1 0 3 6 6 -1 6 0 11
7663 11 6 11 6 -1 1 3 10 2 10 4 9 4 -15 -10 -6 5 -4 -1 -20 -6 -8 -25 -10 -11 -1 -10 4 -5 1 -13 -9 3 6 -1 -10 3 -7 4 1 1 1 0 2 10 -8 -4
7709 -4 -4 -4 7 2 8 -4 0 20 3 1 -2 2 3 8 0 -2 6 3 2 5 0 5 -2 7 14 2 1 2 -2 -7 -9 9 -9 -14 3 -13 -12 4 0 -13 -1 0 -13 1 -12 4
7755 4 -6 0 -1 -1 1 -9 -2 0 2 -7 -3 1 -8 2 12 1 -3 12 0 10 5 -3 6 -6 24 4 6 16 -4 9 14 -1 3 1 4 6 1 0 1 -2 11 10 5 -11
7799 -11 7 -1 3 12 1 -4 -2 4 -2 -12 -1 -16 -9 -7 1 -11 7 -2 -4 -13 0 -1 0 -12 -6 -3 -9 -2 -2 -6 -9 4 6 -3 3 10 17 8 3 10 5 6 11 8 11 10 6 9 1 15
7849 15 -1 0 6 4 12 7 5 6 10 0 -6 1 -9 -1 -3 6 -3 -12 -6 -2 -2 0 4 4 -12 -3 -10 -2 -5 -17 -9 -5 0 -1 -7 -7 3 -7 1 -17 4 -1 4 8 -2 7 2 5 7 12
7899 12 6 16 5 4 12 2 11 -1 5 6 6 6 2 8 6 -3 -1 19 8 -2 4 8 -8 -7 5 1 -8 -6 -11 -15 1 -3 0 1 -2 -8 -2 -13 2 -17 -11 -7 -13 -6 -6 -9 -3
7946 -3 -12 -7 -9 -3 -8 1 -4 -7 -3 -2 2 0 5 12 6 2 10 6 8 12 8 13 19 4 8 9 10 2 7 -4 -1 8 10 6 4 -16 -18 7 6 -2 -17 -9 -14 -3 -8 -13 1 -9 -3 0 -13 -9
$$ packed form
7614cRjllJ8j0j2%j4J2OLj6JJ3Kq%mpMJ3oOnNj6R%QjoJ9j7J9qKnkKljLL%pPoJ1
7663A1nNnpKKPqQoNnj9NMJ1rLj9J4kj7J5jJ0rJ4rOj4MJ2LprJ3j0J1l%%jKQj8M
7709d%%J1nOj2MK0j7klMJNqkQljLnNpRPj2jJmnkJ8j8nJ7j6JJ6mj3J2Jj3J4j3J6
7755Dj0Oj%Kj0PKKrMMrJ0J0j1mJ5j2J0nqRj2L0k0KJ0k0J3Nj5MkLKnjJlJ3jnj6
7799a1J8qMRj1nKOoj0J1j5PKQj2J8rkrJ3jJj2OLoP%mlJ3KrOPPrnPnJNlLjmLqJ4
7849A5j6JOkQnkJMj0oPj0QkRrrOM%KM%j6RpQlj2QMNjo%J0j0Qj8K1nNMj0RnLKN
7899A2oJ0j1jQj0Rj2OJ%%mOkrKK0j1j0OMj6JJ2mrKnmJ6mLJloOj1J5j9OMoP%lO
7946crNkOnRnlMJMkNPomQmKMmNOj5MJJqNj1LRKmkk0kK5jqj5QnJ1nnJ4j0OLj3M
$$ plain form
7998 -9 -2 2 -1 4 -1 -1 -10 -12 -8 7 4 7 2 3 1 -3 -3 9 6 0 -6 9 5 11 0 -6 0 3 -3 -3 16 -1 -1 0 7 9 11 10 10 2 1 -10 14 5 6 1 7 2 -10 -1 -5 -9
8050 -9 1 -1 -10 1 -2 -4 -8 -12 -18 -13 -7 -15 1 -9 -2 -12 -11 -5 3 -5 -4 3 6 -4 10 9 1 2 9 20 -1 2 0 8 -1 1 5 6 7 6 12 18 12 24 1 8 9 6 10 5
8100 5 -2 1 -6 -9 3 -6 -8 -10 -10 3 6 2 -9 -11 -18 -15 -9 4 -6 -5 -8 -7 -8 -7 -1 -6 1 0 -1 -1 3 -2 3 -7 -2 5 6 3 -1 1 -3 4 -12 16 8 20 6 10 24 5
8150 5 2 12 7 11 7 -4 6 2 3 6 -3 0 0 6 6 -3 -7 -3 -3 -1 -3 5 -2 0 0 -6 -6 0 -9 -7 1 -13 -10 -14 -6 -9 -16 -13 -2 -8 0
$$ packed form
7998iPMlNn%rkMJ5lLnJkm%J2looJ5mOj1oOLo%J9j7%JPKKj%qjj1K4rJnOnj2Rmm
8050iJ0krJ1lkmmoNOqJ6j0Pj0JOQqJPLj0J4jqJPJ1k1LkQrKMJJjOOoJ2k3PJlMn
8100EpLplJ2rkk%J3Lmj1kpLOJ3j0JlJjJOnPjj%MnNj0NPJlmKmPj6K8qJ2j4MJ4j9
8150ElJ0nMmj1J0mJLrL%O%rmM%KkQpK%o%OrKQj4LmQlpLJ1oQ
8191@
$$ Imaginary data points
##PAGE= N=2
##DATA TABLE= (X++(I..I)), XYDATA
$$ plain form
0 0 0 0 0 0 0 0 0 0 0 0 0 0 0 0 0 0 0 0 0 0 0 0 0 0 -4 8 -8 8 -8 8 -8 8 -8 12 -16 16 -16 17 -20 24 -24 28 -32 35 -39
45 -39 44 -47 52 -60 68 -76 84 -99 112 -133 161 -201 264 -380 662 -2886 -1436 3677 -2249 -4843
65 -4843 606 4303 -1668 -4846 427 3686 -2069 -4854 818 4109 -1310 -3820 1795 4608 -992
80 -992 -3507 2026 4556 -886 -2972 2766 5103 -434 -2577 2831 4631 -1091 -2995 2657 4537 -929
96 -929 -2449 3282 4889 -790 -2432 2991 4102 -1765 -3250 2294 3443 -2156 -3202 2496 3480 -2203
112 -2203 -3235 2286 2947 -2798 -3630 1947 2512 -3191 -3790 1781 2181 -3499 -3894 1730 2051 -3512 -3631
129 -3631 2055 2263 -3284 -3339 2176 2090 -3526 -3461 2030 1944 -3411 -2991 2577 2434 -2850 -2367 3000 2522
147 2522 -2751 -2199 3002 2348 -2791 -1988 3181 2427 -2568 -1564 3501 2515 -2431 -1271 3658 2474
$$ packed form
0@%%%%%%%%%%%%%%%%%%%%%%%%mJ2j6J6j6J6j6J6j6K0k8L2l2L3l7M4m8N2o0O7p4
45c9Q3r1R9j12J28j44J60j83K11k45K94l62M65o44J042l548J450N113n926k594
65d843N449L697n971l178N273L259n755k785N672L291n419k510N615K813n600
80i92k515N533K530n442k086N738K337n537k143N408J800n722j904N652J880n466
96i29j520N731J607n679j642N423J111n867j485N544J149n599j046N698R84n683
112b203j032N521O61n745q32N577N65n703n99N571M00n680l95N624L21n563j19
129c631N686K08n547n5N515q6n616O5N491q6n355M20N568j43n284M83N367m78
147B522n273N52N201o54n139Q03N169p54m995J004N065r86m946J160M929j184
$$ plain form
163 2474 -2404 -1173 3608 2215 -2647 -1279 3457 1970 -2722 -1154 3532 1954 -2651 -1006 3522
178 3522 1740 -2866 -1196 3187 1262 -3208 -1337 3031 1088 -3237 -1187 3093 986 -3258 -1150
193 -1150 3000 741 -3433 -1216 2829 461 -3592 -1216 2775 350 -3533 -1032 2875 382 -3422
208 -3422 -852 2914 268 -3470 -829 2802 83 -3474 -703 2862 115 -3280 -397 3034 191
223 191 -3085 -150 3075 107 -3058 -60 3017 10 -2985 144 3136 68 -2789 378 3263
238 3263 99 -2660 531 3234 10 -2656 577 3144 -100 -2604 659 3125 -124 -2516 786
253 786 3090 -222 -2482 820 2951 -430 -2557 772 2765 -628 -2618 788 2660 -776 -2613
268 -2613 842 2601 -916 -2634 811 2422 -1110 -2742 771 2286 -1245 -2721 818 2254 -1311
$$ packed form
163B474m878J231M781j393m862J368M736j487m692J568M686j578m605J645M528
178C522j782m606J670M383j925m470J871M368j943m325K050M280k107m244K108
193a150M150k259m174K217M045k368m053K376L991k425l883K501L907k493l804
208c422K570L766k646l738K641L631k719l557K771L565k747l395K883L431k843
223A91l276K935L225k968l165K998L077l007k995L129K992l068k857L167K885
238C263l164k759L191K703l224k666L233K567l244k504L263K466l249k392L302
253G86K304l312k260L302K131l381k127L329J993l393j990L406J872l436j837
268b613L455J759l517j718L445J611l532j632L513J515l531j476L539J436l565
$$ plain form
283 -1311 -2653 908 2192 -1369 -2594 966 2128 -1449 -2519 1058 2096 -1465 -2385 1204 2107 -1448
299 -1448 -2224 1368 2116 -1431 -2098 1484 2096 -1446 -1978 1588 2122 -1432 -1856 1706 2121 -1400 -1737
316 -1737 1786 2061 -1427 -1656 1797 1999 -1463 -1585 1817 1910 -1501 -1531 1830 1786 -1565 -1488 1843 1673
334 1673 -1645 -1443 1814 1527 -1753 -1426 1809 1416 -1827 -1404 1835 1327 -1905 -1383 1818 1228 -1979
351 -1979 -1373 1809 1131 -2010 -1294 1821 1064 -2032 -1236 1832 983 -2042 -1159 1854 925 -2066 -1060
368 -1060 1906 854 -2068 -971 1936 803 -2075 -867 1969 752 -2046 -775 2018 706 -2030
383 -2030 -682 2046 679 -2008 -592 2076 639 -1975 -502 2089 592 -1940 -407 2095 559
398 559 -1898 -320 2113 486 -1875 -234 2096 435 -1867 -165 2090 352 -1850 -97 2075
$$ packed form
283a311j342L561J284l561j225L560J162l577j070L577J038l561r20L589R03l555
299a448p76L592P48l547o67L582O12l542n32L566N34l554m24L562M15l521l37
316a737L523K75l488k29L453K02l462j22L402R3l411l0L361m4l351P7L331j70
334A673l318K02L257k87l280L27L235l93l243M23L239n08l232N22L201n90l207
351a979O06L182o78l141P16L115p57l096P96L068q49l025Q83L013r29k991J006
368a060K966j052k922J097K907j133k878J208K836j217k798J271K793j312k736
383b030J348K728j367k687J416K668j437k614J473K591j497k532J533K502j536
398E59k457J578K433j627k361J641K330j661k302J702K255j738k202J753K172
$$ plain form
413 2075 266 -1860 -46 2048 180 -1898 -34 1998 87 -1934 -5 1940 -19 -1965 -3
428 -3 1893 -108 -1992 23 1838 -217 -2007 42 1767 -310 -2008 96 1751 -369 -1976 167
444 167 1730 -445 -1961 233 1716 -498 -1945 322 1735 -507 -1851 446 1775 -508 -1774
459 -1774 527 1794 -509 -1714 617 1800 -519 -1643 701 1791 -517 -1542 799 1817 -524
474 -524 -1468 863 1755 -582 -1453 874 1680 -658 -1431 903 1630 -723 -1403 943 1570 -788 -1414 911
492 911 1462 -905 -1448 878 1361 -995 -1456 882 1312 -1056 -1440 911 1252 -1093 -1410 917 1185 -1171
510 -1171 -1414 918 1112 -1207 -1362 992 1130 -1175 -1243 1096 1127 -1190 -1186 1138 1085 -1232 -1140 1164 1076
529 1076 -1218 -1051 1253 1098 -1160 -924 1344 1110 -1158 -908 1328 1006 -1211 -887 1310 947 -1246
$$ packed form
413B075j809k126J814K094j868k078J864K032j911k021J929J945j959j946J962
428cJ896k001j884K015J815k055j790K049J725k077j698K104J655k120j607K143
444A67J563k175j516K194J483k214j447K267J413k242j344K297J329k283j266
459a774K301J267k303j205K331J183k319j124K344J090k308j025K341J018k341
474e24r44K331Q92k337q71K327Q06k338p73K334P27k353o80K346O27k358o26K325
492I11N51k367n43K326M83k356m61K338M30k368l84K351L41k345l17K327K68k356
510a171k43K332J94k319j55K354J38k305o8K339L1k317MK324n3k317R2K304q8
529A076k294J67K304j55k258K36K268k34k268K50K236l22k217L24K197l63k193
$$ plain form
546 -1246 -807 1352 942 -1203 -735 1396 889 -1257 -728 1335 741 -1332 -743 1301 694 -1347 -685
563 -685 1358 680 -1311 -612 1370 631 -1360 -614 1317 519 -1400 -612 1301 497 -1380 -497 1381
580 1381 514 -1317 -414 1415 468 -1356 -410 1375 360 -1406 -392 1358 343 -1369 -269 1445
596 1445 342 -1337 -212 1436 272 -1396 -249 1360 162 -1453 -250 1341 118 -1417 -153
611 -153 1392 134 -1367 -99 1367 34 -1416 -134 1261 -72 -1440 -64 1274 -57 -1358
626 -1358 55 1355 -53 -1305 123 1332 -113 -1336 116 1302 -159 -1315 175 1334 -127
641 -127 -1210 295 1407 -86 -1146 347 1350 -167 -1168 303 1268 -252 -1180 355 1280 -238
657 -238 -1102 458 1282 -270 -1107 441 1194 -415 -1181 396 1106 -499 -1215 404 1100 -509 -1162 475
$$ packed form
546a246M39K159m10k145M68K131n07k146N29K063n94k073N89K044o07k041O62
563f85K043o78j991O99J982p39j991P46J931p98j919P88J913q04j877Q83J878
580A381q67j831R03J829r47j824R46J785j015j766J014J750j015j712J100J714
596A445j103j679J125J648j164j668J147J609j198j615J203J591j223j535J264
611a53J545j258j501J268J466j333j450J282J395j333j368J376J338j331j301
626a358J413J300j408j252J428J209j445j223J452J186j461j156J490J159j461
641a27j083J505J112j493j060J493J003j517j001J471R65j520r28J535R25j518
657b38q64J560Q24j552q37J548P53j609p66J577P10j605p16J619O96j609o53J637
$$ plain form
675 475 1103 -544 -1177 452 1010 -654 -1239 406 934 -720 -1202 485 970 -658 -1086 555 980 -670
693 -670 -1052 566 920 -734 -1051 600 888 -734 -966 703 954 -664 -844 808 975 -643 -796 820
711 820 932 -712 -804 815 912 -694 -740 889 958 -626 -626 944 935 -673 -644 904 813 -761 -678 874 766
732 766 -784 -617 936 755 -770 -579 936 683 -842 -613 865 575 -954 -663 833 516 -982
749 -982 -635 870 493 -961 -583 877 446 -1021 -609 826 366 -1086 -596 814 345 -1050 -512 885
767 885 365 -998 -441 916 327 -1022 -421 912 272 -1022 -367 945 302 -956 -256 1028 339 -896
785 -896 -179 1060 333 -902 -158 1042 275 -905 -111 1068 299 -847 -38 1109 299 -821 0 1075
803 1075 229 -870 -33 1025 146 -888 -17 999 93 -907 2 982 33 -929 -4 931 -51 -1014
$$ packed form
675D75O28j647o33J629N58j664n85J645N28j654m82J687M85j628m28J641M25j650
693f70l82J618L54j654l17J651K88j622k32J669K51j618j80J652J67j618j53J616
711H20J12j644r2J619R7j606m6J629O9j584%J570rj608K9J548r1j574Q3J552j08
732G66j550J67J553j81j525J91J515k53j525K29J478k90j529K91J496l17j498
749i82L47J505l77j454L78J460m31j467M12J435m60j452M90J410m69j395N38J397
767H85n20j363N57J357n89j349O01J333o40j294O55J312o43j258P00J284o89j235
785h96P17J239p27j235P44J200p67j180P94J179p69j146Q09J147q10j120Q21J075
803A075q46j099Q37J058q79j034Q71J016r06j000R09R80r49r62R25R35r82r63
$$ plain form
821 -1014 -51 854 -146 -1045 -44 833 -169 -1036 -33 834 -197 -1040 -3 797 -249 -1052 -2
838 -2 779 -285 -1015 76 806 -271 -961 152 852 -249 -912 230 870 -249 -864 281 905 -232
856 -232 -802 360 944 -179 -735 433 974 -189 -689 457 929 -208 -678 468 921 -239 -667 500
874 500 896 -272 -647 505 845 -322 -683 473 781 -409 -718 439 711 -458 -738 434 666 -521
892 -521 -745 418 612 -579 -758 403 568 -615 -776 410 538 -636 -739 426 532 -638 -696 468
910 468 533 -624 -640 518 534 -617 -590 571 542 -616 -538 638 565 -565 -464 678 569 -569 -439 704
930 704 579 -563 -400 736 558 -552 -373 742 537 -568 -341 725 488 -595 -343 711 437 -626
948 -626 -340 695 391 -654 -349 687 340 -699 -334 671 289 -710 -329 665 238 -733 -318 661 236
$$ packed form
821a014R63R05j000q99J001Q77j002q67J003Q67j031q43J037Q00j046q03J050
838bP81j064p30J091P30j077o90J113P00j101o63J142O40j119o15J145O24j137
856b32n70J162N84j123n56J168N41j163n00J146M72j137m70J146M53j160m28J167
874E00L96j168l75J152L40j167l61J156L08j190l09J157K72j169k80J172K32j187
892e21k24J163J94j191j79J161J65j183j61J186J28j174j03J165J06j170n8J164
910D68O5j157j6J158J6j151K7J161k9j158P8J176p3j130J01J142j09j138J30J143
930G04j25j142J63J136j78j110J79J115k05j105K27J066k37j083K52J054k74j063
948f26K86J035l04j045L05J036l47j039L65J005l82r99L81R94m27r71M15R79m25
$$ plain form
967 236 -751 -300 668 210 -756 -285 654 193 -749 -262 677 183 -743 -215 685 142 -728 -182 692 140
987 140 -718 -138 712 119 -709 -101 727 101 -721 -79 726 91 -720 -51 741 66 -713 -29 727 43
1007 43 -705 8 745 42 -697 9 741 18 -673 45 721 -11 -657 82 726 -22 -652 104 722 -52
1027 -52 -656 132 708 -68 -636 145 712 -90 -641 154 692 -118 -650 158 657 -144 -663 158 635 -188
1047 -188 -670 162 607 -234 -667 165 586 -258 -660 183 551 -282 -665 189 543 -319 -655 224 540 -331
1067 -331 -622 262 547 -325 -602 280 562 -319 -569 342 578 -300 -525 380 585 -301 -479 406 583 -313
1087 -313 -458 434 588 -304 -424 468 581 -294 -397 485 560 -322 -389 468 522 -370 -407 464 470 -406 -416 446
1109 446 437 -451 -431 440 390 -477 -443 398 346 -508 -453 385 311 -533 -448 390 274 -555 -416 395 276 -538 -395
$$ packed form
967B36r87M51R68m58r66M71R39m61r42M87R39m94r26N28R00n43q70N46Q74n52
987A40q58N80Q50n93q28O08Q28o26q22O42Q05o35q11O69P92o75p79O84P56o84
1007D3p48P13P37p03p39P06P32p23o91P18O76p32o46P39O44p48o30P56O18p74
1027e2o04P88N76p76n68P81N67q02n51P95N38q10n32Q08M99q01n19Q21M77q23
1047a88m82Q32M45q41m33Q32M21q44m02Q43L68q33l83Q54L54q62l36Q79L16q71
1067c31k91Q84K85q72k77Q82K82q81k50R11K36q78k25R05K05q86j78Q85J77q96
1087c13j45Q92J54q92j20Q92J13q75j03Q82P5q82o7Q57N4q92l7Q71Oq76j0Q62
1109D46rq88K0Q71n0q67L4Q41n2q54N5Q38p4q44Q5Q38j16q29J39Q11j19q14J43
$$ plain form
1132 -395 437 269 -543 -366 458 268 -530 -289 521 303 -478 -252 551 305 -482 -221 576 303 -474 -180
1152 -180 592 310 -446 -140 618 296 -440 -117 624 284 -451 -103 597 233 -478 -112 579 187 -497 -102
1172 -102 576 170 -537 -110 539 106 -559 -124 515 50 -610 -136 493 30 -594 -129 485 19 -602 -112
1192 -112 480 -2 -593 -105 467 -25 -581 -71 476 -15 -555 -14 533 -5 -501 29 536 -21 -521 50
1212 50 531 -36 -510 81 566 -19 -474 119 580 -19 -462 136 565 -42 -484 141 546 -78 -481 144
1232 144 536 -83 -461 167 515 -123 -457 176 496 -171 -486 158 473 -198 -494 188 468 -212 -461 214
1252 214 462 -219 -466 209 436 -246 -481 197 424 -259 -464 221 424 -250 -428 244 418 -255 -420 249
1272 249 376 -295 -432 246 368 -295 -396 277 381 -302 -380 313 364 -315 -373 303 352 -335 -375 327 348 -329
$$ packed form
1132c95Q32j68q12J77Q24j90p98K41Q10k18p81K26Q03k46p87K61P97k73p77K94
1152a80P72k82p56L06P58l22p36L23P41l40p35L48P00l64p11L66O91l92o84L95
1172a02O78m06p07M27O49m33o65M35O39m65o60M74O29m63o24M65O14m66o21M90
1192a12N92m82n91M88N72m92n56N10N47m91n40N41N47n38m96N30N07n57n00N71
1212E0M81n67m74N91M85n85m55N93M61n99m43N98M29o07m42O25M05o24m03O25
1232A44L92o19l78O28L48o38l34O33L20o67l15O44L15o71k96O82K80o80k49O75
1252B14K48o81k47O75K27o82k35O78K27o83k05O85K03o74j78O72J74o73j65O69
1272B49J27o71j37O78J22o63j01O73J04o83p8O93N1o79n8O76M9o87m0P02K1o77
$$ plain form
1294 -329 -339 355 357 -324 -311 362 363 -324 -296 358 331 -351 -288 377 313 -333 -258 402 335 -317 -226 436 312 -353
1318 -353 -217 405 277 -374 -229 422 261 -385 -214 430 251 -400 -208 425 229 -418 -223 399 182 -446
1338 -446 -234 384 156 -429 -214 395 163 -433 -180 393 127 -469 -190 382 96 -462 -169 400 98 -444
1358 -444 -135 429 108 -443 -103 451 96 -424 -75 450 97 -423 -63 481 113 -399 -15 489 116 -383
1378 -383 -3 491 83 -387 10 472 48 -402 30 463 48 -393 43 463 25 -411 44 442 -22 -440
1398 -440 32 430 -55 -455 30 422 -73 -440 36 407 -90 -449 51 386 -105 -460 46 383 -117 -440
1418 -440 77 395 -115 -424 113 391 -113 -403 123 391 -139 -394 142 409 -122 -374 173 416 -133 -344
1438 -344 198 418 -134 -353 202 401 -154 -352 205 388 -174 -334 229 383 -176 -338 232 374 -197 -336
$$ packed form
1294c29j0O94Ko81J3O73Jo87K8O54k7o82O3O65o4o46P5O60o7o52R1O62j24o65
1318c53J36O22j28o51J45O51j61o46J71O44j79o51J92O33j96o47J95O22k17o28
1338d46K12O18k28n85K15O09k32n96K53N73k66n96K79N72k86n58K93N69l02n42
1358d44L09N64l21n51L40N54l55n20L49N25l53n20L60N44l68n12L84N04l73m99
1378c83L80M94m08m70L97M62m24m50M32M33m15m41M36M20m38m36M55L98m64m18
1398d40M72L98m85m00M85L92m95l67M76L71m97l59N00L35m91l55N06L37n00l23
1418d40N17L18n10l09N37K78n04k90N26K68n30k55N36K67n31k52N47K43n49k11
1438c44N42K20n52k19N55J99n55j98N57J83n62j60N63J54n59j62N70J42n71j39
$$ plain form
1458 -336 230 337 -225 -326 225 327 -239 -320 250 333 -242 -320 248 321 -261 -300 260 307 -263 -308 263 291 -271
1481 -271 -290 276 299 -270 -266 301 285 -276 -274 291 264 -301 -241 309 262 -290 -234 330 244 -311 -223 324 230 -314 -227
1506 -227 311 217 -343 -223 321 202 -334 -225 320 189 -345 -209 316 185 -351 -191 321 160 -352 -184
1526 -184 337 152 -344 -145 362 161 -342 -134 371 146 -343 -106 387 139 -344 -81 388 133 -345 -77
1546 -77 384 126 -346 -76 398 119 -352 -60 382 91 -351 -63 375 80 -357 -59 368 64 -354 -48
1566 -48 364 36 -372 -43 370 10 -379 -23 343 -1 -378 -18 346 -18 -386 -10 357 -15 -370 3
1586 3 359 -25 -377 20 357 -29 -353 38 369 -18 -334 54 370 -25 -328 73 368 -48 -325 93 359
1607 359 -58 -331 112 356 -76 -336 116 350 -90 -339 99 344 -100 -344 100 333 -124 -352 118 310
$$ packed form
1458c36N66J07n62j01N51J02n66q1N70Q3n75p8N68P3n82l9N60M7n70m5N71K8n62
1481b71j9N66K3n69MN67j6n61KN65k7n65O0N50m7n52N6N64q6n55Q8N47r4n44Q7
1506b27N38r4n60J20N44j19n36J09N45j31n34J36N25j31n36J60N12j61n12J68
1526a84N21j85m96J99N07k01n03K08N05k25m89K37M93k48m83K63M69k55m78K68
1546g7M61k58m72K70M74k79m71K92M42k91m42K88M38k95m37K98M27l04m18L06
1566d8M12l28m08L29M13l60l89L56L66l44l77L60L64l64l68L76L67l72l55L73
1586CL56l84l52L97L37l86l24L91L31l87l16L88L16l95l03M01K95m16k77M18K66
1607C59m17k73M43K44m32k60M52K34m40k49M38K45m44k44M44K33m57k28M70J92
$$ plain form
1627 310 -153 -325 104 310 -147 -326 127 290 -159 -307 138 295 -165 -295 154 301 -161 -299 185 302
1647 302 -161 -274 209 314 -168 -253 219 309 -157 -240 232 306 -177 -246 234 301 -164 -238 236 276 -193 -220 227
1670 227 266 -216 -246 216 235 -226 -236 220 221 -244 -247 222 192 -282 -250 216 175 -295 -241 227 183 -282 -222 243 154
1695 154 -302 -215 244 171 -274 -200 257 173 -268 -169 280 180 -271 -145 307 168 -255 -128 313 178 -253 -101
1717 -101 324 169 -253 -91 341 158 -257 -89 328 138 -273 -83 325 140 -286 -78 314 112 -297 -88
1737 -88 305 95 -306 -100 286 60 -324 -100 289 40 -330 -82 275 23 -319 -77 268 22 -327 -53
1757 -53 279 2 -317 -51 302 25 -310 -23 316 15 -297 0 323 10 -302 10 324 22 -279 29
1777 29 332 15 -271 63 337 1 -273 62 337 -15 -266 65 322 -24 -279 77 309 -40 -281 69
$$ packed form
1627C10m63j72M29K06m57j79M53J63m49j48M45J57m60j30M49J47m62j38M84J17
1647C02m63j13M83J05m82q5M72R0m66q3M72P4m83o9M80O7m65p4M74M0m69k7M47
1670B27L9m82l0M62J9m61j0M56Jm65lM69l0m74L2M66m1m70N4M68m4m65O0M65q9
1695A54m56Q7M59p3m45P4M57q4m41R9M49j00m51J26M52j39m23J27M41j35m31J52
1717a01M25j55m22J62M32j83m15J68M17j90m11J90M08j85m26K08L92k02m09K09
1737h8L93k10m01K06L86k26l84K24L89k49l70K48L57k52l42K42L45k46l49K74
1757e3L32k77l19K66L53k77l35K87L39l01l12K97L23l13l12L12L14l02l01L08
1777B9L03l17k86L34K74l36k74L35K75l52k51L31K57l46k55L56K32l49k41L50
$$ plain form
1797 69 305 -46 -282 71 299 -78 -295 76 287 -99 -299 65 272 -93 -298 89 271 -119 -288 78
1817 78 255 -119 -283 109 260 -132 -285 114 259 -119 -259 139 262 -130 -251 143 257 -131 -261 154
1837 154 263 -149 -248 154 255 -148 -249 160 249 -150 -230 164 244 -151 -212 168 232 -164 -212 197 230 -172 -195
1860 -195 197 225 -179 -193 209 211 -192 -202 215 212 -196 -182 220 228 -190 -181 230 213 -194 -175 221 191 -210 -164 224
1885 224 184 -221 -167 223 171 -210 -149 229 156 -236 -163 224 134 -256 -158 225 128 -251 -153 229 109 -264 -142
1908 -142 232 103 -276 -149 238 94 -264 -135 243 97 -254 -112 259 108 -250 -82 251 113 -244 -77
1928 -77 271 100 -215 -59 289 107 -228 -28 302 103 -215 -17 302 91 -228 -17 297 89 -238 -30
1948 -30 286 73 -250 -20 284 48 -256 -34 251 25 -271 -30 246 -3 -287 -31 230 -13 -278 -32
$$ packed form
1797F9K36l51k36L53K28l77k17L71K11l86k00L64K07l65k05L87J82l90j69L66
1817G8J77l74j64L92J51l92j53L99J45l78j40L98J23l92j21L94J14l88j30M15
1837A54J09m12r9M02J01m03j01M09Q9l99q0L94Q0l95o1L80O4l96m8M09L3m02k3
1860a95L92K8m04j4M02Km03j0M17lm08J4M02Qm18RM11j7m07J9L96l0m01M6L88
1885B24m0m05N4L90n2l81O1L78p3l92P3L87r0l90R8L83r7l79R8L82j20l73J22
1908a42L74j29l79J27L87j44l58J29L78j46l51J42L71j51l58J68L33j38l57J67
1928g7L48j71l15J56L48j82l35K00L30j99l18J98L19k11l19K11L14k08l27K08
1948c0L16k13l23K30L04k36l04K22K85k26k96K41K76k49k84K56K61k43k65K46
$$ plain form
1968 -32 233 -38 -296 -33 226 -40 -305 -11 234 -47 -291 -8 237 -44 -280 7 249 -41 -252 43
1988 43 254 -28 -248 52 263 -27 -232 72 286 -13 -206 104 291 -25 -196 102 292 -29 -191 111
2008 111 278 -46 -202 121 290 -41 -205 126 272 -71 -227 108 241 -101 -228 93 211 -116 -234 89
2028 89 216 -111 -243 100 204 -135 -251 92 184 -157 -235 97 175 -163 -236 112 188 -153 -215 126 186 -159 -200
2051 -200 149 196 -151 -189 157 203 -140 -175 178 203 -134 -160 180 208 -134 -162 189 199 -149 -140 186 191 -149 -123 193
2076 193 176 -156 -140 198 166 -178 -132 203 153 -176 -147 186 142 -188 -148 181 141 -188 -136 181 130 -208 -140 190
2100 190 113 -215 -119 188 96 -209 -121 187 106 -233 -115 188 80 -222 -100 198 79 -209 -103 209 75 -219
2122 -219 -87 218 79 -224 -97 222 75 -212 -78 222 79 -215 -60 227 74 -196 -55 229 79 -194
$$ packed form
1968c2K65k71k58K63K59k66k65K94K45k81k44K83K45k81k36K87K42k90k11K95
1988D3K11k82k20L00K11k90k05L04K14k99j93L10J87l16j71K98J90l21j62L02
2008A11J67l24j56L23J69l31j64L31J46l43j56L35J33l42j27L21J18l27j18L23
2028H9J27l27j32L43J04l39j16L43R2l41p8L32P8l38p3L48P6l41o2L41O0l45m1
2051b00L49M7l47l8L46M6l43l5L53K5l37k6L40K8l42k8L51J0l48RL26Nl40K6L16
2076A93j7l32J6L38l2l44M6L35n0l29K9L33m4l30M0L29m0l29N2L17n1l38O8L30
2100A90p7l28R6L07r2l05Q8L08q1l39J18L03j08l02J22K98j19k88J06L12j34k94
2122b19J32L05j39l03J27L19j47k87J34L00j43k94J55K87j53k70J41K84j50k73
$$ plain form
2142 -194 -46 234 65 -201 -43 231 54 -209 -11 224 47 -218 -11 234 34 -200 -1 242 34 -194
2162 -194 -7 233 21 -223 -4 234 5 -224 1 223 2 -213 2 206 -3 -212 -1 210 -11 -219
2182 -219 18 202 -29 -212 15 211 -46 -218 36 208 -38 -208 27 211 -43 -215 48 214 -42 -197
2202 -197 58 212 -49 -202 73 215 -39 -190 53 207 -45 -190 82 213 -53 -170 90 214 -53 -174
2222 -174 100 214 -73 -168 107 201 -68 -155 96 194 -83 -177 102 177 -104 -179 91 175 -109 -181 105 154 -115
2245 -115 -179 105 153 -122 -169 100 161 -125 -159 116 152 -118 -155 135 159 -122 -141 141 153 -126 -136 145 171 -119
2269 -119 -132 163 153 -127 -117 161 163 -118 -114 160 144 -132 -111 152 150 -122 -115 157 121 -139 -104 155 119 -161 -110 155
2295 155 108 -159 -113 160 100 -181 -110 159 88 -167 -105 153 87 -171 -96 166 82 -175 -87 167 76 -178 -76 188
$$ packed form
2142a94J48K80j69k66J58K74j77k63J98K35j77k65K07K45k00k34J99K43k08k28
2162a94J87K40k12k44K19K38k29k29K25K22k21k15K15K04k09k09K11K11k21k08
2182b19K37J84k31j83K27J96k57j72K54J72k46j70K35J84k54j72K63J66k56j55
2202a97K55J54k61j53K75J42k54j51K43J54k52j45K72J31k66j17K60J24k67j21
2222a74K74J14k87r5K75R4k69q7K51R8k77r4K79P5k81p5K70Q4k84p2K86M9k69
2245a15o4K84M8k75m7K69O1k86l4K75L6k70l7K90K4k81j9K82J2k79j0K81K6k90
2269a19j3K95j0k80J0K78Kk81MK74j6k76K1K63kk72PK72l6k60L5K59l6k80N1K65
2295A55m7k67M6K73o0k81P1K69p1k55O2K58o6k58P5K62q4k57Q8K54r1k54J02K64
$$ plain form
2319 188 88 -159 -56 190 77 -156 -55 185 90 -154 -42 201 75 -148 -39 202 67 -159 -18 194
2339 194 64 -164 -30 196 43 -169 -30 182 47 -179 -35 178 29 -187 -29 183 18 -182 -27 177
2359 177 13 -200 -28 164 -6 -191 -23 160 -2 -185 -14 171 2 -183 8 183 -3 -171 11 186
2379 186 -1 -155 22 197 3 -154 23 213 3 -155 46 200 -10 -146 51 196 -1 -150 39 181
2399 181 -29 -155 40 176 -27 -155 50 167 -41 -170 41 152 -67 -176 28 149 -78 -184 34 147
2419 147 -84 -177 41 134 -68 -172 53 140 -74 -155 74 147 -73 -143 80 159 -67 -132 83 165 -73 -126 108
2442 108 162 -64 -123 115 160 -58 -106 110 162 -60 -115 124 166 -87 -119 106 149 -86 -111 106 144 -89 -129 104
2466 104 111 -107 -129 92 99 -123 -125 103 100 -131 -134 85 87 -139 -129 97 81 -140 -125 104 76 -135 -102 117 91 -124
$$ packed form
2319A88j00k47J03K46j13k33J01K40r5k44J12K43j26k23J09K41j35k26J41K12
2339A94j30k28J34K26j53k12J39K12j35k26J44K13j49k16J58K12j65k00J55K04
2359A77j64k13J72J92j70j85J68J83j62j83J71J85j69j85J91J75j86j68J82J75
2379A86j87j54J77J75j94j57J77J90k10j58K01J54k10j36J97J45j97j49J89J42
2399A81k10j26J95J36k03j28K05J17k08j29K11J11k19j09K04J21k27j06K18J13
2419A47k31r3K18R3k02j04K25Q7k14q1K29P3k20p0K23P9k26o5K15Q2k38n3K34
2442A08N4k26n9K38M5k18m8K16N2k22n5K39M2k53l2K25M3k35k5K17L8k33m0K33
2466A04Pk18k2K21Pk22kK28lk31lK19Kk26J0K26j6k21J5K29k8k11L3K19k6k15
$$ plain form
2492 -124 -83 124 108 -121 -85 139 108 -116 -65 156 103 -108 -56 159 108 -100 -57 159 98 -102 -50 154 109 -106
2516 -106 -46 154 84 -120 -47 146 70 -132 -62 142 57 -142 -53 123 40 -147 -56 123 30 -168 -73 127 30 -162
2540 -162 -51 116 27 -158 -56 119 24 -162 -43 133 25 -142 -18 158 25 -137 -13 158 40 -122 6
2561 6 163 28 -115 15 169 44 -113 14 168 42 -126 30 179 32 -128 19 151 14 -130 13 149
2582 149 8 -125 14 133 -5 -136 0 126 -23 -143 13 122 -22 -146 5 119 -48 -155 9 116
2602 116 -45 -150 21 125 -32 -143 31 126 -20 -118 36 137 -33 -121 40 126 -46 -112 72 146 -23 -95
2624 -95 66 149 -19 -99 79 152 -25 -94 89 119 -24 -102 79 135 -56 -93 78 130 -49 -106 65 118 -59 -107
2648 -107 78 107 -70 -109 72 109 -68 -106 67 104 -87 -107 65 94 -92 -95 62 105 -83 -97 82 85 -82 -96 92
$$ packed form
2492a24M1K07j6k29L6K24l1k24N1K21n3k11N2K15n1k08M3K16o1k00N2K04m5k15
2516a06O0K00p0k04P3J93p6k02P0K04q5j99Q9J76q3j87R1J79r3j98R5K00r7j92
2540a62J11J67q9j85J02J75r5j86J19J76j08j67J24J76j33j62J24J71j18j62J28
2561FJ57j35j43J30J54j25j57J27J54j26j68J56J49j47j60J47J32j37j44J43J36
2582A49j41j33J39J19j38j31J36J26j49j20J56J09j44j24J51J14j67j07J64J07
2602A16j61j05J71J04j57j11J74R5j46r8J54J01j70q8J61Q6j72o6J84P4j69p2
2624i5J61Q3j68q0J78P3j77o9J83L0j43p8J81N6j91l7J71N2j79n7J71N3j77m8
2648a07J85K9j77l9J81L7j77l8J73L7j91k0J72K9j86lJ57M3j88j4J79Lj67j4J88
$$ plain form
2673 92 92 -84 -82 95 94 -86 -84 92 88 -84 -84 97 86 -85 -67 106 67 -80 -64 108 88 -80 -56 114 88 -76 -56
2700 -56 102 71 -82 -57 101 68 -98 -53 95 73 -110 -52 105 57 -98 -52 100 57 -101 -59 108 57 -87 -46
2724 -46 111 40 -103 -44 105 44 -96 -32 115 40 -103 -17 108 35 -101 -24 122 44 -109 -22 117 39 -97 -9
2748 -9 112 24 -101 -11 108 25 -110 -12 97 20 -104 -19 103 9 -111 -10 94 11 -100 -16 120 1 -109 -5
2772 -5 116 9 -97 -2 106 6 -100 21 107 4 -103 1 117 10 -106 15 120 -6 -94 33 115 -2
2794 -2 -85 24 118 -11 -98 32 99 -23 -91 22 94 -28 -93 27 82 -25 -86 28 96 -31 -90 30 98 -27 -89
2819 -89 36 92 -40 -97 40 97 -35 -87 35 94 -36 -89 33 88 -41 -84 63 94 -35 -66 52 94 -45 -79
2843 -79 52 85 -37 -82 55 85 -41 -76 62 80 -45 -70 60 76 -56 -87 62 77 -59 -74 59 78 -65 -66 62
$$ packed form
2673I2%j76KJ77jj80KJ76mj72%J81j1j71J8J73l9j47J6J72k0j68K4J70k6j64K0
2700e6J58l1j53K5J58l3j66M5J48k2j83N8J57m8j55M6J52m3j58M2J67n1j44M1
2724d6J57p1j43N9J49o1j40O4J47p5j43Q6J25p3j36P7J46p8j53Q7J39p8j36Q8
2748iJ21q8j25R0J19q3j35R8J09p7j24Q5J22r4j20J01J04q3j11Q4J36j19j10J04
2772eJ21j07j06R5J08j00j06J21Q6j03j07J04J16j07j16J21J05j26q8J27Q2j17
2794bq3J09R4j29q7J30O7j22o8J13P2j22o5J20N5j07o1J14O8j27n9J20O8j25o2
2819h9J25N6j32n7J37N7j32n2J22N9j30n3J22N5j29m3J47L1j29l1J18M2j39l4
2843g9J31L3j22m5J37L0j26l5J38J8j25k5J30J6j32l1J49J5j36j5J33J9j43jJ28
$$ plain form
2868 62 68 -58 -70 61 79 -54 -68 76 63 -53 -53 74 60 -67 -58 73 71 -67 -61 80 79 -68 -43 82 54 -59 -38
2895 -38 77 62 -68 -58 64 57 -72 -41 89 46 -67 -52 58 46 -75 -55 70 40 -84 -50 66 36 -85 -53 69
2920 69 19 -89 -33 62 21 -83 -32 85 30 -80 -26 85 30 -66 -19 80 42 -62 -7 81 29 -70 -8 95 27 -55 3
2947 3 94 45 -52 -5 91 37 -65 0 96 25 -66 12 99 19 -77 10 91 15 -74 1 87 10 -81 -10 65 4 -88 6 68 -15
2977 -15 -79 -4 76 -9 -84 -13 78 -11 -72 -1 61 -16 -81 8 79 -8 -65 5 78 -4 -69 26 84 4 -68 28 84 -3 -54 27
3007 27 86 -4 -42 34 81 1 -61 40 77 -5 -55 43 79 -25 -67 27 67 -26 -66 18 60 -23 -65 24 64 -34 -74 18 67
3036 67 -43 -62 47 62 -37 -69 22 51 -33 -59 28 54 -34 -46 39 66 -23 -42 43 70 -28 -34 47 61 -34 -34 65 66 -34 -27 67
3067 67 65 -34 -30 77 56 -26 -37 64 69 -35 -32 46 48 -38 -40 41 39 -45 -53 41 34 -57 -50 37 24 -48 -51 31 24 -60 -37 45 26 -64 -44
$$ packed form
2868F2Oj26j2J31J8j33j4J44j3j16%J27j4j27RJ31kj38OJ41jj47K5J25k8j13K1
2895c8J15j5j30J0J22pj29L1J30m3j13J5J10j2j21K0J25l0j24L4J16l0j21L2J22
2920F9n0j08N6R5m1j04N1J17n5j10N4J11n5r6M7R9l8j04N5Q8n2r9O2J03o8q2N8
2947CR1m9r7M7R6n4j02O5R6p1r1P8Q7q0r6Q7Q1p6q9P5Q6p7r1P1P5o1r2R4O2q3
2977a5o4P5Q0q5p5P1R1q9o1P1O2p7o5Q9P1q7n7P0P3q2o5R5N8q0p2R6N6q7n1Q1
3007B7N9r0l8P6M7q0o2J01L7q2n0R8L6j04m2R4M0r3m0Q4M2q3m2Q9M0r8m0R2M9
3036F7j10j9J09J5r9l2R1K9q4k6Q7K6q8j2Q5K7q9j9Q5K7r8oQ1J4r5%R9Jj00PR4
3067F7kr9MJ07k1q2j1J01Nj04LP8Kq6kQ1kq4qR4pr1PQ7j3p2lQ2pq4K3Q2j9r0K0
$$ plain form
3102 -44 42 28 -49 -31 53 30 -45 -24 61 28 -43 -11 69 38 -34 -5 75 47 -23 -2 78 34 -31 6 77 45 -36 4 69 29
3132 29 -51 -5 50 21 -53 0 61 8 -58 -13 47 9 -66 -23 40 -5 -59 -29 33 -15 -68 -21 31 -9 -81 -15 34 -11 -61 -16
3162 -16 39 -15 -56 7 60 1 -45 15 63 15 -44 31 72 10 -27 36 75 11 -16 36 82 20 -26 30 73 10 -21 42 67 11
3192 11 -34 29 72 -1 -47 20 45 -16 -34 20 44 -14 -50 17 50 -28 -64 15 25 -36 -62 8 28 -55 -65 4 33 -38 -59 8
3222 8 37 -42 -51 28 42 -28 -40 37 51 -12 -23 35 50 -18 -16 46 55 -12 -22 49 49 0 -16 49 46 -13 -10 60 57 -6 -15 46 53 -19 -22 40
3258 40 43 -36 -36 23 10 -43 -24 36 34 -48 -31 25 15 -57 -38 24 12 -51 -38 23 8 -53 -34 42 6 -38 -25 38 27 -37 -23 28
3290 28 23 -39 -12 46 9 -32 2 47 19 -30 -4 44 21 -19 6 54 22 -24 3 52 18 -39 -5 52 13 -40 -9 51 5 -33 -7
3321 -7 45 6 -43 -3 41 1 -45 -10 38 -1 -46 -7 42 2 -39 -7 35 -9 -41 -4 38 -10 -48 5 38 8 -43 7 39 -13 -32
$$ packed form
3102d4Q6j4p7J8Q4k3p5K1Q5l3p1L2Q0l1p2K9Q0k8p0K1Q0m4o5L7P1l2q1M0O5m0
3132B9q0M6N5k9p4N3O1n3o6M5O0l8p5M3O3m5n4L0O2m8n3M7N2m0p2O6M9m5n0M5
3162a6N5n4m1O3N3n9m6O0M8m8n9P5M1o2l7O3L9o4k7N2M6o2m6N6M3o3l1O3K5n6
3192A1m5O3M3p3m6O7K5o1j8N4K4n8l6O7L3p8l6P9J0o1k6P0K0q3j0O9K9p1k1O7
3222HK9p9rP9J4p0j2P7J4o3j1N8J5o8KO2Ro7j0P1%m9j6O5ln9LP0lo3rO1Pp2lO2
3258D0Lp9%N9j3n3J9O0kq2J7N6j0p2J9O2j2o3J3O1j5o1J9P6l6m4J3O3j1o4J4N1
3290B8no2K7N8l7m1L4M5k8m9K6M8k3m0K5M8l2m6K7M9l4n7L4N7l9n3L1O0m6l8K6
3321gN2l9m9M0M4m0m6L5M8l9m5L9M9m0m1L2M2m4l2L7M2m8l8N3L3l0n1N0L2n2j9
$$ plain form
3352 -32 10 48 5 -29 19 46 -3 -27 26 54 5 -31 12 54 15 -28 26 46 5 -34 28 47 3 -21 13 44 -7 -36 12 30
3382 30 -10 -44 10 23 -18 -46 19 39 -24 -36 20 33 -9 -25 21 31 -14 -32 22 39 -22 -30 13 33 -28 -28 33 40 -10 -20 27 35
3414 35 -23 -21 35 47 -18 -4 35 46 -12 -13 38 45 -13 -21 43 39 -5 -14 35 39 -24 -21 40 39 -20 -20 31 25 -19 -24 33 29 -24 -21 27 32 -35 -28
3452 -28 32 13 -38 -23 31 5 -26 -17 39 25 -41 -10 31 9 -23 -16 32 18 -17 -14 39 18 -25 -6 27 4 -43 -20 32 17 -29 -3
3484 -3 32 13 -34 -15 43 2 -25 -17 31 17 -27 -1 47 12 -36 -7 41 10 -40 -14 26 13 -23 -1 35 6 -38 -3 44 -3 -26
3515 -26 -4 46 -2 -26 2 39 3 -26 3 29 -6 -41 12 40 9 -26 2 28 -11 -33 11 35 -4 -35 11 37 0 -28 19 30
3545 30 -1 -23 21 34 3 -15 27 36 -1 -22 10 25 0 -22 23 41 -5 -21 25 47 -1 -19 33 43 -7 -25 31 41 -12 -27 19
3576 19 34 -29 -40 35 35 -22 -28 20 22 -12 -29 15 22 -17 -26 17 17 -29 -11 23 23 -28 -20 19 12 -14 -23 16 13 -24 -17 34 22 -25 -12 30
$$ packed form
3352c2M2L8m3l4M8K7m9k4N3K8m9l6M3M2l9m3N4K0m1l9O2J9m4k4L4L1n1k9M8J8
3382C0m0l4N4J3m1k8O5K0o3j2N6J3m2j6M6J0m5j8N4J7o1qM3K0o1%O1Pn0j0M7Q
3414C5n8KN6J2o5J4L9J1n8jN1Pn8qO4mm4rM9Mo3LO1jn9%N1om4nN7mn3LM8No7P
3452b8O0j9n1J5N4k6l1RN6j4o6L1M1k2l2PM8j4l5LN3k1m3J9L3k3m7K3N2j5m6K6
3484cL5j9m7J9N8m1k7QM8j4m4K6M8l5m8K9M8l1n0K6M0j3l6K2L6k9m4L5M7m7k3
3515b6K2N0m8k4K8L7l6k9K9K6l5l5N3K8l1l5K8K6l9k2M4K4l9l1M6K6l7k8M7J1
3545C0l1k2M4J3l1j8M2Rl7k1L2J5k5k2M5J8m6j6M6K2m8j8N2J0n0j8N6J0n3j5M6
3576A9J5o3j1P5%n7oM8Kl4j7M4Pl9rM3%m6J8L4%n1QL9pk6rL9ll7PN1j2m7J3M2
$$ plain form
3612 30 14 -21 -3 24 24 -20 -8 30 26 -15 -8 38 28 -18 8 38 24 -18 -5 33 22 -24 -14 30 10 -30 -9 32 7 -31 -17 20
3644 20 2 -48 -18 29 8 -30 -17 24 20 -36 -15 34 12 -28 -19 20 6 -31 -10 33 5 -29 5 34 10 -28 -7 32 11 -18 18
3675 18 41 33 -22 7 31 10 -21 20 43 10 -19 10 33 20 -20 7 46 5 -17 3 35 0 -28 11 28 -8 -29 -9 23 -16 -30
3706 -30 9 29 -6 -26 -10 21 -23 -44 9 23 -13 -35 9 34 -13 -29 12 18 -9 -30 21 41 2 -22 20 26 1 -14 25 42 17
3737 17 -7 46 41 2 -13 23 44 -4 -4 39 38 -4 -16 21 31 -8 -25 19 23 -11 -16 21 25 -25 -30 20 24 -20 -21 12 9 -30 -31 15 14 -35
3773 -35 -28 16 19 -37 -22 3 13 -29 -16 18 31 -20 -10 23 21 -7 -10 28 22 -9 -9 46 29 -12 -4 30 37 -6 -11 31 41 -19 -18 34 21
3808 21 -12 -3 35 11 -31 -15 25 4 -22 -17 20 9 -39 -24 16 3 -40 -25 24 3 -32 -15 24 7 -32 -21 25 -7 -24 0 21
3839 21 -1 -31 -1 43 9 -22 1 43 17 -20 8 31 19 -17 20 42 23 -14 21 44 16 -28 2 45 14 -27 -5 36 18 -22
$$ packed form
3612C0j6l5J8K7%m4J2L8mm1PM6j0m6K6L0j4m2J3L8j1m6J0M4k0m0K1M1k5l8J4L7
3644B0j8n0L0M7k1l8J3M1mn6K1M9k2m0RL9j4l7K1M3k8l4L4K9k4l8K1L9k1k9L6
3675A8K3qn5K9K4k1l1M1K3l3k9K9K3j3m0K7L9m1k2K0L2l5k8L9J7l6k1K0L2l9j4
3706c0L9K0l5k0J6L1m4k1N3J4l6k2M4K5m7j6M1Ok7k1N1K0l9k4M2Ok5j5L9J7k5
3737A7k4N3nl9j5L6K1m8%M3jm2j2L7J0l9j7M4Ml4nL7Mn0nN0Mm4jL3ll9jM6jm9
3773c5PM4Ln6J5K5J0m2J3L4J3n1J0L3kk8lL8ol1%N5j7m1QL4Pm3nM2J0o0JN2j3
3808B1l3RL8k4m2J6M0k1k6NL7j1m8J5M0j3m3J5M9k1l5J7L9j7l9J1M6l2j7K4K1
3839B1k2l0L0M4l4l1K3M2k6l7K8K3j2l6L7K2j9l7L5K3k8m4L0M3l1m1K2M1j8m0
$$ plain form
3869 -22 -2 45 5 -34 4 29 -9 -35 -5 29 -14 -35 -11 11 -17 -43 -5 16 -12 -43 -5 27 -7 -42 8 37 -7 -38 10 23
3899 23 6 -22 6 25 1 -21 15 37 0 -11 23 44 7 -27 28 42 10 -17 19 35 -5 -6 21 39 -6 -18 15 32 -8 -21 19
3930 19 30 -13 -24 16 15 -32 -43 18 25 -24 -39 8 21 -28 -30 9 14 -28 -35 7 4 -23 -35 15 26 -14 -23 9 16 -21 -23 20 33 -1 0
3965 0 26 40 -9 -5 35 35 -7 -9 35 50 -8 -12 27 33 -11 -6 31 42 -8 -12 19 21 -14 -12 30 15 -32 -30 14 3 -31 -34 15 2 -37 -20
4001 -20 4 0 -46 -32 1 -2 -37 -20 15 -1 -29 -18 21 -1 -29 -14 17 18 -27 -8 34 13 -8 -9 29 25 -16 -12 53 21 -14 21 37
4034 37 28 -11 10 39 30 -17 2 37 23 -18 4 39 18 -25 -6 34 10 -28 -4 26 0 -24 -20 23 -7 -32 -16 20 -9 -38 -7 14
4066 14 -17 -40 -5 18 1 -43 -8 17 -7 -41 -1 16 -3 -33 2 41 6 -29 10 37 11 -29 14 55 9 -18 16 41 9 -17
4096 -17 8 43 6 -12 16 30 5 -2 10 40 8 -21 22 31 -2 -29 4 24 -14 -28 10 34 -9 -35 -3 16 -14 -33 0 16 -22
$$ packed form
3869b2K0M7m0l9L8K5l8k6L0L4m3k1K4K2k8k6L8K1k8l1L8L2l4l5N0K9m4l1M8J3
3899B3j7k8K8J9k4k2L6K2l7j1L4K1l7l4N5J4l2k7L6J6m0jK7J8m5j2L3J7m0j3M0
3930A9J1m3j1M0jm7j1O1Pm9j5M7J3m9kL9Nm2pM2lk7j2N0J1m0rL2Pl7kM3J3l4J
3965@K6J4m9MM0%m2kM4J5n8mL9Om4NL7J1n0mL1Kl5KM2j5m7KM4j1l4lM9j3l9J7
4001b0K4mm6J4L3ll5J7L5j6k8J1L9k2k8J5L1Jm5J9M2k1k1jL8mm1MO5l2l5L5J6
4034C7rl9K1K9rm7J9L5j4m1K2L5k1m3J9M0k4l8K4L0k6k4MM3l0k5J6L6k9k9L1K1
4066A4l1k3L5K3j7m4L5K5k4l4M0J7j9l0L5L9l5l5L9K7k6m0M3M1m6k7L4K5l2k6
4096a7K5L5l7j8K8J4k5pJ2L0l2k9M3Rl3k7L3K0l8j4L8K4m3k6L2J9l0j9L3J6l8
$$ plain form
4127 -22 -32 -1 12 -20 -38 2 16 -16 -18 10 15 -13 -36 10 14 -21 -22 21 34 -21 -24 26 28 1 -12 18 28 -1 -12 31 23 -9 -2 37
4161 37 33 2 -12 39 38 -9 -3 26 28 -5 -8 26 21 -13 -14 9 20 -29 -20 13 23 -20 -11 9 19 -21 -21 18 11 -19 -18 8 11 -26 -14 14 18
4198 18 -22 -13 18 10 -19 -21 17 10 -32 -12 31 11 -23 -26 30 8 -35 -16 23 18 -27 0 35 24 -23 -1 39 9 -10 7 27 17 -11
4231 -11 -3 26 13 -18 -15 25 10 -19 3 28 9 -21 8 40 5 -28 -2 32 10 -25 -2 30 9 -15 -3 34 4 -30 -7 32 1
4262 1 -36 -2 27 -7 -36 2 23 2 -16 10 33 -1 -21 -1 27 -1 -22 -12 16 8 -15 4 25 3 -26 5 31 18 -17 8 32
4293 32 0 -20 2 18 -6 -15 17 36 -4 -24 11 31 6 -26 9 43 -3 -12 5 28 -1 -23 9 30 4 -25 9 28 -8 -19 3
4324 3 28 -11 -29 13 30 -5 -21 -7 14 -11 -15 16 10 6 -14 13 26 -5 -16 23 29 -6 -14 19 17 -3 -17 28 29 -6 -19 11 27 -10
4358 -10 -23 16 22 -14 -15 22 14 -10 -8 22 32 -16 -24 17 17 -11 -24 -4 7 -17 -23 2 21 -20 -25 1 16 -24 -18 19 14 -6 -14 17 30 -12
$$ packed form
4127b2j0L1J3l2j8M0J4l2kK8Nk8k3M6Ml5jM3J3n5lN0Kk7j3L0J0k9j1M3ql2PL9
4161C7ml1j4N1jm7OK9Kl3lL4nl4jK3J1m9RL3J0m3RK0J0m0%L9pl0JK6Ll7J2K8M
4198A8m0RL1qk9kL8pm2K0M3k0l4lN6k2m3J9L9nm5K7L5j1m7K2M0l0j9J7K0j0k8
4231a1QK9j3l1LM0j5k9K2K5j9l0K9L2l5l3K6L4k2l5K3L2k1k4J2L7l0l4K3L9l1
4262Al7L4K9l4k9L8K1k1j8K6K3l4k0K0K8k8k1J0K8qk3J9K1k2k9L1K6j3l5K5K4
4293C2l2k0K2J6k4rL2J9m0k0L5K0k5l2L5L4m6rJ7K3k9k2L2K1k6k9L4J9l6j1K2
4324CK5l9j8M2J7l5j6J4K1k5mL1omk0K7J3l1j1L9Ol5qL3kk0j4M5Jl5j3L0J6l7
4358a0j3L9Ol6jL7qk4KL0J0m8qM1%k8j3K0J1k4oK5J9m1nK6J5m0OL7nk0qL1J3m2
$$ plain form
4394 -12 -8 25 23 -6 -13 20 22 -3 -18 36 11 -16 -5 31 22 -9 -1 28 21 -12 -8 32 17 -9 -4 32 22 -18 -14 23 12 -23 -21 17 15 -19
4430 -19 -15 13 8 -26 -14 0 -6 -21 0 15 9 -20 -14 18 5 -20 -6 24 -1 -24 -9 24 17 -17 0 39 24 -15 -3 28 28 -2 11 45
4464 45 33 -2 11 45 10 -11 14 43 13 4 5 34 24 -16 23 42 15 -21 15 25 -2 -24 -6 17 -5 -23 -12 14 2 -35 -15
4495 -15 12 -12 -34 -15 8 -12 -35 -11 8 -14 -36 -17 23 -18 -24 -7 23 -18 -33 10 11 10 -14 2 32 -4 -13 21 37 15 -2 16
4527 16 46 17 -13 31 36 9 1 15 45 6 -7 27 34 5 -9 17 17 -2 -10 11 19 -9 -19 12 17 4 -18 9 13 -10 -27 -5 1 -6 -34
4562 -34 2 12 -18 -24 1 15 -17 -17 8 3 -25 -21 1 13 -17 -14 4 30 -3 5 14 21 -8 -5 17 23 -2 10 17 25 -2 1 33 21 -8 -11 39
4599 39 14 -5 -14 16 10 -3 -17 20 9 -7 8 5 14 -18 -21 9 0 -29 -30 11 0 -11 -27 7 1 -14 -10 22 1 -32 -12 11 -1 -20 -8
4634 -8 19 14 -9 -2 14 11 -18 -7 22 22 1 1 22 20 -11 5 27 13 -7 13 27 14 -8 -5 33 17 -8 0 22 9 -19 1 10 9 -12 0
$$ packed form
4394a2ML3kk9pL3Kk5j5N4k5k7J1L6rl1QK9pl3MM0j5k6NL6j0m0ML7j1l5KL8kl4
4430a9MK8nl4J2J4oj5K1J5ok9OL2j3k5J4L0k5k3J5L3pl4J7L9j5l9J2L1%l0J3L4
4464D5j2l5J3L4l5k1K5K9l0rJK9j0m0L9J9k7l6L6J0k7k2J8K3k2j8J1K6j2l7K0
4495a5K7k4k2J9K3k0k3K4J9k2k2J9M0m1oJ7L0m1j5M3Jjk4J6L0l6rL4J6k2j7J8
4527A6L0k9l0M4Nk7qJ4L0l9j3L4Pk9j4K6%j9qK1Qk8j0L1Nj3k2K7Mk3j7K2Opk8
4562c4L6J0l0oK5J4l2%K5nk8MK2J2l0LJ8K6l3QRPk9LK2Ok5J2PQk7LL2j2k9lN0
4599C9k5j9rL0oj3j4L7j1j6J5lRl2lL0rk9jM1j1j1j6L4oj5ML2k1l3K0K3j2j9J2
4634hK7nk3PJ6lk9J1K9%k1%K1kl1J6K2j4k0K0J4j3k2LL8j6k5QK2j3k8K0Rjk1J2
$$ plain form
4670 0 -2 -9 -16 -10 8 -3 -22 -9 1 -2 -37 -4 14 -12 -24 -15 14 0 -21 -7 14 5 -7 0 15 5 -12 13 21 15 -27 17 23 11 -9 11
4706 11 24 16 -7 20 27 -1 -14 3 18 8 -8 9 20 7 -14 7 22 1 -13 1 31 0 -14 -7 9 -11 -25 -4 3 -13 -25 1
4738 1 4 -5 -19 -7 11 -21 -26 -7 19 -10 -23 -1 22 -1 -17 10 20 4 -10 14 24 -6 -8 15 30 9 -3 18 30 3 -9 11 22
4771 22 7 -11 15 19 -21 -14 10 26 -12 -13 6 11 -13 -19 7 19 -10 -7 6 9 -8 -15 -3 3 -23 -26 12 2 -11 -26 3 15 -12 -22 2
4806 2 14 -13 -17 4 19 -11 1 6 24 -3 -7 11 12 -1 -9 11 14 1 2 18 28 -6 -9 25 31 -2 -8 30 15 4 1 24 16 -12 -8 13 7 -12
4844 -12 -13 14 18 -11 -13 13 2 -14 -8 17 1 -14 -4 4 1 -18 -13 16 10 -10 -12 0 -8 -20 -7 12 4 -22 -7 5 5 -8 5 9 2 -5 -5 18
4882 18 5 -6 9 27 8 -4 0 25 17 -5 8 21 18 -7 3 14 6 -4 1 10 12 -2 0 6 -2 -10 11 9 -5 -17 -3 12 -9 -11 16 17 -10
4919 -10 -19 5 8 -8 -15 -1 4 -2 -5 2 19 -4 -10 -5 15 2 -1 10 12 2 -9 6 6 5 -9 17 25 7 1 9 21 7 3 12 12 5 5 20 22 11 10 11
$$ packed form
4670@kppOJ8j1j9J3J0ll5L3J8k6j2RK9j4k1J4K1rj2PJ5j0j7K5Qom2M4Oj2k0K0
4706A1J3qk3K7Pk8j3J7J5j0j6J7J1j3k1K1J5k1j4J4L0l1j4PJ6k0j4K1Pj6j2K6
4738ALrj4J2J8l2nJ9K6k9j3K2K3k3j6K7J0j6j4K4J0l0kK3J5k1j2K1J2k7j2K0J1
4771B2j5j8K6Mm0PK4J6l8jJ9Nk4oK6J2k9LJ3Lj7pJ2Ok6lL8j0j3j5K9J2k7j0K4
4806BJ2k7mK1J5l0J2NJ8k7mJ8Jj3qK0Lj3JJ6J0l4lL4Ol3oL8j5j1lK3qk8MK1oj9
4844a2jK7Mk9kK6j1j6OK5j6j5J0Qlj9NK9ok0kJ2qj2J3J9qk6J5J2%j3J3Mpp%K3
4882A8j3j1J5J8j9j2MK5qk2J3J3lk5J0J1qj0NRKj4KOqqK1kj4j2J4J5k1kK7Jk7
4919a0rK4Lj6pJ4NolPJ7k3oNK0j3lJ1Kj0j1J5%jj4K6Qj8oQJ2j4mR%p%J5Kj1jJ
$$ plain form
4961 11 18 -1 -4 6 19 2 -4 23 20 -3 -1 4 4 -4 -24 -2 14 -16 -17 9 11 -14 -18 9 0 -12 -15 -1 -2 -7 -8 0 11 -17 -9 -5 8 -18 -11 9
5001 9 9 11 -22 15 13 5 -8 8 12 8 1 12 23 -5 -6 19 17 -1 10 14 10 9 4 23 30 7 3 22 26 4 -2 10 13 9 -4 5 8 1 -10 9 -4 -12
5043 -12 1 9 10 -15 -7 -2 6 -15 -9 13 6 -5 -8 3 10 -12 -14 17 14 -8 -10 16 8 -9 -11 14 4 -14 7 15 7 2 -5 19 20 -2 7 13 6 7 7 21
5085 21 17 -9 2 17 15 -9 -6 25 17 1 -1 11 8 -12 -5 19 2 -4 -5 10 -9 -13 -2 -3 -7 -23 -12 -9 -5 -12 -9 12 -1 -8 -3 7 -4 -4 3 13
5125 13 8 4 2 0 1 2 18 22 5 7 14 10 14 -1 11 18 9 11 9 21 12 6 16 22 5 1 1 27 14 8 11 -2 -1 2 7 3 3 -5 0 5 -2 -11 -2 -8 -7 -7 -1 3 -2 -19
5175 -19 -1 1 -6 -9 3 1 -12 -30 0 -6 -13 -10 3 10 -6 -8 11 19 5 17 5 25 2 -6 9 10 6 11 10 12 5 3 19 23 7 1 7 7 -3 -8 1 12
5217 12 2 -11 0 6 -9 -9 0 13 -4 -2 1 -5 -18 -8 2 10 -2 -13 -6 3 -8 -8 -5 -2 3 -14 10 7 -2 8 14 15 7 13 18 7 1 5 17 10 -2 13
5259 13 26 4 13 3 17 13 8 11 24 19 13 13 15 13 11 -3 5 -2 -2 9 3 1 0 -19 5 1 -12 -7 -5 -3 -14 -12 0 -9 -7 -9 -3 -4 -13 -4 2 2 -6 -3 0 2 0 -1
$$ packed form
4961A1Pj9lJ0J3j7oK7lk3KN%qk0K2J6l0jK6Kk5mK7rj2lJ4jnjQJ1k8QMJ3k6PK0
5001I%Kl3L7kqj3J6MmpJ1J1k8jK5kj8J1MmjnJ9Pk3mJ9Mk2oJ2Lmj3RLpj1J9j3q
5043a2J3QJk5QNQk1OK2pj1lJ1Pk2kL1lk2kK6qj7kK5j0j8K1QqnpK4Jk2ROpJ%J4
5085B1mk6J1J5kk4LL1qj6kJ2lk0PK4j7ojJ5j9mJ1jmj6J1LMpLK1j3pNJ0j1%PJ0
5125A3nmkkJJJ6Mj7KPmMj5J2PrKkJ2roJ0Oj7m%K6j3oLj3JLNm%qNNprRoJ%OMnj7
5175a9J8KplJ2kj3j8L0opLJ3Pj6kJ9Qj4J2j2K0k3qJ5JmNjKpkJ6Mj6oO%j0nRJ1
5217A2j0j3J1Oj5%RJ3j7KLoj3J0J0Qj2j1PRj1%LLNj7K4lrJ0OJqONj1oMJ2pj2J5
5259A3J3k2Rj0J4mnLJ3no%Kkkj4Qp%J1okjj9K4mj3NKKj1KJ2rKkOjrRO%qLLKkj
$$ plain form
5307 -1 7 4 4 -12 2 5 -1 9 30 -2 -4 19 27 7 8 20 20 21 17 11 19 11 6 13 5 16 12 7 9 3 -7 -1 17 3 -8 5 -8 -6 -9 -13 -10 0 -10 -2
5351 -2 -6 -16 -3 -3 7 -13 -14 -5 -7 -1 -8 4 4 3 -16 4 1 9 1 9 6 11 4 3 11 6 10 6 22 31 14 8 9 0 10 16 24 9 18 10 11 -6 3 8 1 2 18 1
5399 1 -4 -7 -2 2 2 -10 2 -11 -13 -9 -6 2 -16 -14 -10 -1 -3 -2 -4 -6 -9 1 -15 5 5 4 -1 14 -3 -12 1 4 12 13 13 28 23 6 1 15 15 13 14 19 16 0 13
5446 13 11 11 12 12 12 12 14 11 20 8 0 -2 9 13 3 2 9 -2 -2 -7 5 -10 -2 -6 -5 -5 -13 1 -8 -11 -9 -7 -2 -23 1 -10 -4 1 -4 3 4 10 3 -3 10 5 8 17 4
5495 4 10 15 16 17 17 5 9 11 15 11 7 9 -4 12 6 5 6 -8 10 13 11 4 8 -7 7 -2 8 5 3 0 -2 -3 -3 -2 -8 -4 9 4 -7 0 4 -13 0 -9 -2 1 -2 3 -2
5544 -2 -6 15 5 5 2 4 6 -2 2 8 6 3 13 10 8 18 18 11 6 0 9 6 20 14 5 18 13 24 9 8 3 1 6 13 2 6 9 12 7 -1 9 3 -3 -3 -6 -3 -5 2 0 -1 -2
5595 -2 -1 2 -6 -4 4 0 0 6 -9 -4 0 8 1 -10 -3 9 0 6 -1 5 -4 5 10 10 12 10 11 6 15 14 7 8 22 16 17 12 10 12 12 22 0 21 18 9 -3 12 4 -5 3 2 4 -10
5647 -10 2 4 10 11 0 9 0 3 -4 -15 -7 6 -6 -6 13 -3 6 -10 4 -3 0 10 6 0 4 0 -4 4 6 5 4 -5 5 9 13 4 8 6 5 13 -6 21 4 2 16
$$ packed form
5307aQl%j6J4LoJ0K1l2kK3Qk0JJ2%JmoQqnPqJ1mnKoj0OJ8j4j1J3j3KlmLJ0j0Q
5351bmj0J3%J0k0jRkOpJ2%jj9K0lQqQlNpjQnMmJ6Rj7oJrJ0OQj5RqJj7RNpJJ6j7
5399AnlNM%j2J2j3kMLQj8KMRkJkklJ0j6K0%jnJ5j7rJ3LQJ%J5nj7nJ4%kJNlj6J3
5446A3k%J%%%KlRj2qkJ1Mj0jPj1%nJ2j5QmJ%qJ4rlKKNk1K4j1ONnPJOpoJ3nLRj3
5495DONJJ%j2MKMmmKj3J6ojJj4J8LkpMj5J4rJ0lklkj%JoMJ3nj1PMj7J3rPLlNn
5544bmK1j0%lKKqMOklJ0lkJ0%pnoRlJ4orJ3nJ1j5jnkNPj1MLLnqJ0oo%lLkPkjj
5595bJLqKQm%Oj5NMQpj1PJ2rOpOrRN%KkJnRjpJJ4oJnkK%J0k2K1lrj2J5qrQjKj4
5647a0J2KOJj1RrLpj1QJ3j2%J9j6Rj6J4pLJ0moMmmQKjjrJ0MMrMkjQj9K7j7kJ4
$$ plain form
5692 16 6 23 12 9 13 4 -1 5 6 2 9 5 4 10 5 14 4 7 -3 5 -9 -5 -3 14 -4 -1 12 -6 13 6 0 -7 13 7 2 8 -3 2 11 7 7 7 10 9 6 1 10
5739 10 11 10 3 1 -2 14 14 0 5 13 14 2 2 6 3 18 14 15 20 13 5 14 18 4 0 13 4 5 0 8 2 -11 -7 -1 -3 -3 -3 -4 2 -18 -2 -1 -12 -6 -2 -1 -11 -2 -5
5788 -5 0 -10 -1 17 -1 9 -3 10 4 0 4 8 14 14 10 2 25 3 12 8 12 6 15 7 -2 4 18 13 24 -1 24 14 9 4 10 27 -5 20 4 16 1 8
5830 8 2 7 1 -6 1 3 -1 -4 -6 0 -7 -8 -8 -4 1 -5 -4 9 9 0 5 0 -9 -1 3 6 -7 -3 5 3 7 8 5 25 12 15 13 30 21 26 21 13 19 24 10 22 17 2 15 24 11
5881 11 15 7 10 -3 13 7 9 14 4 4 18 11 -1 -5 1 -4 -7 -5 -1 1 -13 -1 3 -12 -9 2 -16 0 -8 -10 -2 3 -16 -10 -8 -7 -3 6 -4 -1 4 9 21 0 16
5926 16 15 10 14 4 9 9 22 6 4 14 13 3 9 23 6 10 17 14 -1 15 17 12 1 0 17 0 -6 3 3 8 -19 -10 0 1 1 -11 -11 -7 -9 -9 -11 -13 -2 -9
5970 -9 -12 -1 -5 -12 -2 -3 -6 -4 -8 -6 -8 -9 5 4 3 8 12 10 -5 -5 12 6 6 2 11 5 8 14 8 7 8 9 8 3 7 1 16 9 2 14 4 -5 -2 -10 -6 2 4 -8 3 4 -13
6021 -13 -7 11 2 -7 -4 -8 -6 -12 -4 5 -1 -11 -11 -4 -3 -3 3 12 2 -3 1 19 15 8 12 21 14 12 11 9 10 13 -7 19 8 15 13 25 14 -1 10 4 9 2 12 10 5 2
$$ packed form
5692A6j0J7j1lMrnOJmPmjOnRj0Lj0Qj4MKJ7j8LJ3j8J9popK0onOj1NRm%%LjlnR
5739A0JjpklJ6%j4NQJj2%MlJ5mJNpqRMj4mJ3rJnQoj3MOk%%jOk0J6Jj1OMJj0Rl
5788eNj0RJ8j8J0j2J3omMMO%mqK3k2RmMoRqrOJ4nJ1k5K5j0nnOJ7l2K5j6J2j5P
5830HoNopPKmlkOpj%MNoJJ3%rNnrQMLj3MQkMJlK0j3LkJ7rNnqONj4J2nj5J3Rj3
5881A1MqLj3J6oKNj0%J4pj2mOnlKMKj4J2Mj5LJ1j8J6qkQNj9OKJMRj0LNNJ2k1J6
5926A6jnMj0N%J3j6kJ0jj0OJ4j7MPlj5J6Knj1jJ7j7oR%Nk7RJ0J%j2%Mk%kkJ1p
5970ilJ1mpJ0jlKmKkjJ4jjNMkj5%J7o%mRoLOojJJjnMoJ5ppJ2j0rLqMQKj2J1Jj7
6021a3OJ8rrLmKoQRoj0%PJ%ORj0nMJ8mpMRpkjkJLk0K6j1PkJ2j1j5J1oNpJ0knl
$$ plain form
6069 2 5 12 1 -3 4 2 2 -7 -15 3 -8 -23 -12 0 -11 -17 -17 -3 -3 -19 -11 -7 -4 -11 -7 -5 -2 -17 -3 -6 -6 4 -4 -6 2 -7 13 10 2 -1 10 14 5 6 8 16 4
6116 4 5 5 16 6 -4 13 4 13 14 2 7 8 9 9 8 2 -5 -1 -11 0 -16 3 -5 -3 -12 -9 -3 -12 -8 -1 -4 -17 -9 -8 -7 -8 -16 1 -6 -20 -9 -6 6 6 -12 -1
6162 -1 -5 -6 -1 11 11 -22 -3 5 2 -7 5 16 14 15 11 11 20 14 6 7 11 -4 7 7 3 1 -5 -2 -2 -3 1 -13 -2 2 -10 0 -1 -4 -4 1 -6 -6 -1 -1 3 -4 -4 -3 1 -4
6212 -4 -11 -7 -9 -11 -3 6 3 -7 -7 6 5 -6 6 13 20 5 1 16 1 -1 14 11 31 2 2 16 8 8 -3 18 9 -1 5 10 1 0 0 7 1 4 -15 10 5 0 -8
6257 -8 -3 5 -7 -2 -5 -5 -14 -7 -7 -10 -14 -2 8 -2 -20 -8 3 -9 -7 -8 -1 0 -12 -10 3 -6 2 -7 20 5 8 24 0 15 5 4 13 15 1 4 0 5 0 6
6301 6 8 5 4 0 8 1 -8 -3 0 3 -14 -3 11 1 -5 4 2 -5 -1 -3 -4 -4 8 -4 -7 -8 -6 -17 -1 -2 -7 -2 5 2 -5 -2 6 1 0 -12 -12 9 3 -2 4 -6 -6 0 13
6350 13 -1 -2 10 8 7 -2 9 4 -1 15 8 17 4 -2 9 18 9 -2 10 18 4 2 2 4 5 15 6 7 4 -6 9 3 8 -12 -14 -6 -4 -6 -3 4 -6 -1 -19 -6
6394 -6 -14 4 4 -4 -11 -8 8 3 14 1 7 5 13 6 -6 6 -1 -7 15 4 1 0 14 13 10 -9 8 18 10 17 17 20 4 12 13 8 22 13 16 18 3 12 13 10 8 13
$$ packed form
6069BLPj1mPk%rqJ8j1j5J1J2j1o%J4%j6QMLpMKLj5J4l%J0qkQrK0lqlJ1MrJKQj2
6116DJ%J1j0j0J7rRJj2NJJ%jopMj0J1j6J9qKrLOrMPlj3QJJjqJ7pj4J1LJ2%j8J1
6162amjNJ2%l3J9QlrJ2J1kJm%RoqJMj5J1%mkoL%jMj4J1Mj2J0jl%Np%N%Mp%JMn
6212dpMkkQRlj0%J3jj1J2PPj5mJ5j5kJ5lK0k9%J4q%j1K1rj0ONrj%PoLj9K5nnq
6257hNQj2Nl%rP%lmJ2J0j0j8J2J1j2KjPJj2KJ3rQrK7j5LJ6k4J5j0jRKj4LmNnO
6301FKljmQprNLLj7J1J4j0oRkpMkj%J2j2ljKj1J6jnNPlpLQnjj2%K1onOj0%OJ3
6350A3j4jJ2kjrJ1nnJ6pRj3oJ1Rrj1J2Qj4k%KJJ0rJlj0J5oNk0kQKkLPj0Nj8J3
6394fqJ8%qpLJ6nJ1j3OkQpj2J2poK2j1ljJ4jlj9J7J0qP%Lj6QJnJ4rLKj5RJlkN
$$ plain form
6440 13 4 17 9 -3 1 7 -10 -4 -1 -5 -2 1 -1 -5 -9 -7 -10 -6 -6 -18 -3 6 -6 -3 -7 -1 -8 -3 9 7 5 -9 3 7 0 16 2 3 9 7 5 12 4 -2 20 15 1
6487 1 14 9 19 16 8 7 10 -7 1 12 12 5 -7 9 6 1 8 13 -7 0 -12 -4 -5 -13 -8 -6 -4 -18 1 1 -7 0 -7 4 -4 -7 -6 -3 -3 -1 -1 -9 1 4 3 12 6 -5
6535 -5 5 10 15 5 8 16 15 8 13 11 9 10 3 20 16 -1 15 17 5 1 2 9 18 4 -4 8 2 -9 -1 -5 4 -1 -10 6 11 -6 -1 -6 -16 -6 11 2 -16 -11 -11 1
6581 1 1 3 -1 6 -11 -2 1 -1 5 -2 1 5 7 -4 4 5 17 20 7 24 19 8 10 22 7 3 17 13 17 1 13 21 18 4 11 1 3 5 10 17 0 1 6 6 -1 2 5
6628 5 -4 -3 -9 3 0 -3 -17 8 -9 -15 -7 -2 8 14 -4 5 18 -6 1 6 7 1 1 7 0 8 0 8 18 10 4 22 21 8 7 2 12 -5 16 22 16 20 13 18 10 3 20
6675 20 8 14 11 4 9 15 13 0 2 -2 -1 -1 -1 7 -8 -5 -2 -2 -6 -9 -6 -6 -20 -10 -6 -2 -3 -9 0 1 -16 -18 -6 0 3 -9 5 13 5 -8 3 16 17 8 16 15 10 19
6723 19 20 12 12 10 15 21 11 18 19 15 7 15 20 9 12 4 7 9 11 -2 -2 10 -3 2 -1 10 3 3 1 0 -14 6 3 -7 -22 -4 -13 -2 -10 -4 3 -3 7 2 0 -10
6769 -10 -10 1 4 2 2 7 12 8 9 8 13 18 11 9 11 9 18 13 26 7 3 1 16 21 2 5 7 9 8 0 1 15 6 3 3 2 -4 9 1 4 -11 -5 9 -10 -4 -12 6 -5
$$ packed form
6440A3rJ3qj2MOj7OLmLLkmmKlM%j2J5Rj2LmOpNJ2kkj4J2MpJ6j4JOkkPqoK2nj4
6487AJ3nJ0lqjLj7QJ1%pj2J6lnPNk0Pj2QjqNKKj4J9%qPpJ1qlJL%K%qJ0LjRoj1
6535eJ0NNj0LQjpNkkJpJ7mj7J6Kj2mJPRj4qJ2oj1QmRnrJ6Nj7Nnj0J0J7rj8N%J2
6581A%KmPj7RLkOpLMKj1QJJ2Lj3J7nj1KJ2j5mJ4mMj6J2Qlj4Pj0KKNPj7JN%pLL
6628ErJoJ2llj4K5j7oQNJ0Oj8RJ3k4PNJo%OpQqQJ0qoJ8jj3jnJ0j7K1OoMpNqpJ7
6675B0j2OlpNOkj3KmJ%%Qj5LL%mlL%j4J0MMjoRJj7kJ2OLj2J4Qqj3J1J3JrQjnR
6723A9Jq%kNOj0PJmqQNj1LqLKKj3%J2j3NlJ1p%kjj4K0lj0j5J8rJ1qOPoJ0nkj0
6769a0%J1Lk%NNmJjNNpkKkRnJ3j9mkJ5Nj9LKKjqJJ4rl%joJ3qLj5OJ4j9OqJ8j1
$$ plain form
6817 -5 -3 -12 -2 -8 -8 -2 -4 3 -9 -3 7 4 2 3 5 -5 -1 10 -1 2 -5 14 20 4 8 8 8 10 11 11 29 17 -1 17 19 2 8 16 19 5 3 21 -4 3 2
6862 2 4 6 -7 -2 0 -8 4 -11 -11 -4 -16 -8 8 -6 -2 -19 -14 -2 0 -17 -17 0 -1 -6 -14 4 -8 -2 -12 13 0 -5 3 -10 12 -1 2 13 10 9 17 4
6904 4 11 -3 14 22 10 1 16 29 16 12 14 13 13 8 23 12 11 0 13 21 6 7 1 13 10 7 -2 0 0 -6 5 8 -6 -1 1 7 -5 -14 2 -8 3 4 -1
6947 -1 -2 -2 4 -9 7 2 8 11 5 6 5 1 6 3 5 0 0 8 1 6 5 1 14 17 8 -4 4 15 7 -1 -1 21 15 -7 -4 6 -2 -3 3 6 -1 -4 -2 11 0 -11 -3 -4 3 -2
6997 -2 -4 1 -12 -13 -20 -8 6 -13 -1 -7 -3 -5 -13 5 -17 5 -6 -4 10 -4 -5 2 1 3 -2 5 6 -1 5 13 18 4 9 1 7 8 4 16 12 -3 10 10 5 9 -2
7042 -2 6 7 -2 8 3 19 -2 9 -5 4 5 -5 2 -16 -7 0 -11 -10 -8 2 2 -10 -3 -4 6 -7 -7 -8 -1 -1 -19 -2 1 -4 -8 -11 -10 4 -8 11 6 14 1
7085 1 -7 0 -6 1 -5 -4 12 -3 -1 15 9 4 13 4 19 3 12 13 -9 8 1 10 4 1 6 1 -10 -4 4 0 -1 -5 -19 -9 -3 -1 7 1 -15 -10 -11 2 -1 -10 2 -9 -9
7132 -9 -7 -3 4 -4 -18 -3 -4 -4 -1 1 3 9 13 11 13 1 20 4 10 3 4 1 21 11 7 10 6 6 16 10 4 -6 9 12 3 3 8 7 6 2 -10 -4 1 2 -2 0 9 -7 -3
$$ packed form
6817eKrJ0o%OkPj2OJ0lkJKj0MJ1j1LpJ9Oj6M%%KJ%J8j2j8J8Kj7OQLj4kJ8k5Pj
6862BKKj3NKqJ2j5%Pj2QJ6j4Mj7NJ2Kj7%J7jnqJ8j2Oj0K5j3nQj3K2j3LJ1ljQj3
6904DPj4J7Qj2rJ5J3j3mKj%nJ5j1jj1J3Qj5JoJ2llrK%oJ1Lj4NKOj2rJ6j0J1Jn
6947aj%Oj3J6nOLoJjmNlKn%QpNjmJ3Lrj2QJ1qq%K2ok2LJ0qjOLplKJ3j1j1QjPn
6997bkNj3jpJ2J4j9J2oMkqJ8k2K2j1KJ4j4jPjKnPJpOQNj4NqOJmJ2mj5J3%nMj1
7042bQJrJ0nJ6k1J1j4RJj0Pj8RPj1JKJ0%j2PjJ0j3%jP%j8J7LnmlJJ4j2J9nQj3
7085AqPoPoJJ6j5KJ6onRrJ5j6RJk2J7pRolNnj1OQmjmj4J0OKQoj6NjJ3lrJ2j1%
7132iKMPqj4J5j%LKKOMkKj2J9j6OpJlK0j0mLm%J0ooj0J5Lr%Njjmj2ONJmKRj6M
$$ [...]
8191A6
##END NTUPLES=NMR FID
##END=
