##TITLE=1H_LR-678-CR2-2
 CDCl3, 8 sc, 
 24.11.2020
##JCAMPDX= 6.0         $$ Bruker NMR JCAMP-DX V2.0
##DATA TYPE= NMR FID
##DATA CLASS= NTUPLES
##ORIGIN= UXNMR, Bruker Analytische Messtechnik GmbH
##OWNER= root
$$ XWIN-NMR		Version 3.5
$$ Tue Nov 24 10:22:02 2020 Russian Standard Time (UT+4h)  she@DPX200
##.OBSERVE FREQUENCY= 200.1315066352
##.OBSERVE NUCLEUS= ^1H
##.DELAY= (6, 6)
##.ACQUISITION MODE= SIMULTANEOUS
##.ACQUISITION SCHEME= undefined
##.AVERAGES= 8
##.DIGITISER RES= 18
##SPECTROMETER/DATA SYSTEM= spect
##.PULSE SEQUENCE= zg30
##.SOLVENT NAME= CDCl3
##.SHIFT REFERENCE= (INTERNAL, CDCl3, 0, 15.7039)
##AUDIT TRAIL= $$ (NUMBER, WHEN, WHO, WHERE, WHAT)
$$ ##TITLE= Audit trail, XWIN-NMR		Version 3.5
$$ ##JCAMPDX= 5.01
$$ ##ORIGIN= Bruker BioSpin GmbH
$$ ##OWNER= she
$$ F:/spectra/data/she/nmr/H-F/1/audita.txt
$$ ##AUDIT TRAIL=  $$ (NUMBER, WHEN, WHO, WHERE, WHAT)
(   1,<2020-11-24 10:20:47.21 +0400>,<she>,<DPX200>,
      <created by zg, POWCHK disabled, PULCHK disabled
       configuration hash MD5:
       00 E9 B6 7A A2 85 ED C7 34 08 36 98 17 FE 4E 26
       data hash MD5: 16K
       AE 2B 85 A1 1A 3C 85 29 58 91 AD C7 58 20 D4 4B>)
$$ ##END=
$$ 
$$ hash MD5
$$ 33 D1 CC 59 DD 19 D6 8B 46 69 37 D4 DE 92 96 A4
##$RELAX= 
##$RELAX= 
##$RELAX= 
##$RELAX= 
##$RELAX= 
##$RELAX= 
$$ Bruker specific parameters
$$ --------------------------
##$DU= <F:/spectra>
##$EXPNO= 1
##$NAME= <H-F>
##$PROCNO= 1
##$TYPE= <nmr>
##$USER= <she>
##$AMP= (0..31)
100 100 100 100 100 100 100 100 100 100 100 100 100 100 100 100 100 100 
100 100 100 100 100 100 100 100 100 100 100 100 100 100 
##$AQSEQ= 0
##$AQ_mod= 1
##$AUNM= <au_zg>
##$AUTOPOS= <>
##$BF1= 200.13
##$BF2= 200.13
##$BF3= 200.13
##$BF4= 200.13
##$BF5= 200.13
##$BF6= 200.13
##$BF7= 200.13
##$BF8= 200.13
##$BYTORDA= 1
##$CFDGTYP= 0
##$CFRGTYP= 5
##$CHEMSTR= <none>
##$CNST= (0..31)
1 1 145 1 1 1 1 1 1 1 1 1 1 1 1 1 1 1 1 1 1 1 1 1 1 1 1 1 1 1 1 1 
##$CPDPRG= <>
##$CPDPRG1= <>
##$CPDPRG2= <>
##$CPDPRG3= <>
##$CPDPRG4= <mlev>
##$CPDPRG5= <mlev>
##$CPDPRG6= <mlev>
##$CPDPRG7= <mlev>
##$CPDPRG8= <mlev>
##$CPDPRGB= <>
##$CPDPRGT= <>
##$D= (0..31)
0 1.2 0 0 0 0 0 0 0 0.06 0 0.03 0 0 0 0 0.0002 0 0 0 0 0 0 0 0 0 0 0 0 
0 0 0 
##$DATE= 1606198846
##$DBL= (0..7)
120 120 120 120 120 120 120 120 
##$DBP= (0..7)
150 150 150 150 150 150 150 150 
##$DBP07= 0
##$DBPNAM0= <>
##$DBPNAM1= <>
##$DBPNAM2= <>
##$DBPNAM3= <>
##$DBPNAM4= <>
##$DBPNAM5= <>
##$DBPNAM6= <>
##$DBPNAM7= <>
##$DBPOAL= (0..7)
0.5 0.5 0.5 0.5 0.5 0.5 0.5 0.5 
##$DBPOFFS= (0..7)
0 0 0 0 0 0 0 0 
##$DE= 6
##$DECBNUC= <off>
##$DECIM= 32
##$DECNUC= <off>
##$DECSTAT= 4
##$DIGMOD= 1
##$DIGTYP= 9
##$DL= (0..7)
0 120 120 120 120 120 120 120 
##$DP= (0..7)
150 150 150 150 150 150 150 150 
##$DP07= 0
##$DPNAME0= <>
##$DPNAME1= <>
##$DPNAME2= <>
##$DPNAME3= <>
##$DPNAME4= <>
##$DPNAME5= <>
##$DPNAME6= <>
##$DPNAME7= <>
##$DPOAL= (0..7)
0.5 0.5 0.5 0.5 0.5 0.5 0.5 0.5 
##$DPOFFS= (0..7)
0 0 0 0 0 0 0 0 
##$DQDMODE= 0
##$DR= 18
##$DS= 0
$$ [...]
##$SUBNAM2= <"">
##$SUBNAM3= <"">
##$SUBNAM4= <"">
##$SUBNAM5= <"">
##$SUBNAM6= <"">
##$SUBNAM7= <"">
##$SUBNAM8= <"">
##$SUBNAM9= <"">
##$SW= 16.9725356469052
##$SWIBOX= (0..15)
0 0 2 0 0 0 0 0 0 0 0 0 0 0 0 0 
##$SW_h= 3396.73913043478
##$TD= 16384
##$TD0= 1
##$TE= 0
##$TE2= 300
##$TE3= 300
##$TEG= 300
##$TL= (0..7)
0 120 120 120 120 120 120 120 
##$TP= (0..7)
150 150 150 150 150 150 150 150 
##$TP07= 0
##$TPNAME0= <>
##$TPNAME1= <>
##$TPNAME2= <>
##$TPNAME3= <>
##$TPNAME4= <>
##$TPNAME5= <>
##$TPNAME6= <>
##$TPNAME7= <>
##$TPOAL= (0..7)
0.5 0.5 0.5 0.5 0.5 0.5 0.5 0.5 
##$TPOFFS= (0..7)
0 0 0 0 0 0 0 0 
##$TUNHIN= 0
##$TUNHOUT= 0
##$TUNXOUT= 0
##$USERA1= <user>
##$USERA2= <user>
##$USERA3= <user>
##$USERA4= <user>
##$USERA5= <user>
##$V9= 5
##$VALIST= <valist>
##$VCLIST= <CCCCCCCCCCCCCCC>
##$VD= 0
##$VDLIST= <DDDDDDDDDDDDDDD>
##$VPLIST= <PPPPPPPPPPPPPPP>
##$VTLIST= <TTTTTTTTTTTTTTT>
##$WBST= 1024
##$WBSW= 4
##$XGAIN= (0..3)
0 0 0 0 
##$XL= 0
##$YL= 0
##$YMAX_a= 249845
##$YMIN_a= -158588
##$ZGOPTNS= <>
##$ZL1= 120
##$ZL2= 120
##$ZL3= 120
##$ZL4= 120
##$ABSF1= 10
##$ABSF2= 0
##$ABSG= 5
##$ABSL= 3
##$ALPHA= 0
##$AQORDER= 0
##$ASSFAC= 0
##$ASSFACI= 0
##$ASSFACX= 0
##$ASSWID= 0
##$AUNMP= <proc_1d>
##$AZFE= 0.1
##$AZFW= 0.1
##$BCFW= 1
##$BC_mod= 2
##$BYTORDP= 1
##$COROFFS= 0
##$CY= 11.3945322036743
##$DATMOD= 1
##$DC= 2
##$DFILT= <>
##$DTYPP= 0
##$F1P= 15.9154993809931
##$F2P= -4.1035820241983
##$FCOR= 0.5
##$FTSIZE= 0
##$FT_mod= 4
##$GAMMA= 1
##$GB= 0.15
##$INTBC= 1
##$INTSCL= 1
##$ISEN= 128
##$LB= 0.24
##$LEV0= 0
##$LPBIN= 0
##$MAXI= 10000
##$MC2= 0
##$MEAN= 0
##$ME_mod= 0
##$MI= 1.114404
##$NCOEF= 0
##$NC_proc= 0
##$NLEV= 6
##$NOISF1= 3.799351
##$NOISF2= 2.8
##$NSP= 1
##$NTH_PI= 0
##$NZP= 0
##$OFFSET= 15.70392
##$PC= 1
##$PHC0= -11047.81
##$PHC1= 13.00089
##$PH_mod= 1
##$PKNL= yes
##$PPARMOD= 0
##$PSCAL= 0
##$PSIGN= 0
##$REVERSE= no
##$SF= 200.130013532006
##$SI= 16384
##$SIGF1= 3
##$SIGF2= 2
##$SINO= 400
##$SIOLD= 16384
##$SREGLST= <1H.CDCl3>
##$SSB= 0
##$STSI= 0
##$STSR= 0
##$SW_p= 3612.71676300578
##$SYMM= 0
##$S_DEV= 0
##$TDeff= 0
##$TDoff= 0
##$TI= <>
##$TILT= no
##$TM1= 0
##$TM2= 0
##$TOPLEV= 0
##$USERP1= <user>
##$USERP2= <user>
##$USERP3= <user>
##$USERP4= <user>
##$USERP5= <user>
##$WDW= 1
##$XDIM= 8192
##$YMAX_p= 0
##$YMIN_p= 0
$$ End of Bruker specific parameters
$$ ---------------------------------
##NTUPLES= NMR FID
##VAR_NAME=  TIME,          FID/REAL,        FID/IMAG
##SYMBOL=    X,             R,               I
##VAR_TYPE=  INDEPENDENT,   DEPENDENT,       DEPENDENT
##VAR_FORM=  AFFN,          ASDF,            ASDF
##VAR_DIM=   8192,          8192,            8192
##UNITS=     SECONDS,       ARBITRARY UNITS, ARBITRARY UNITS
##FACTOR=    0.0002944,     1,               1
##FIRST=     0,             0,               0
##LAST=      2.4114304,     0,               0
##MIN=       0,             -158588,         0
##MAX=       2.4114304,     249845,          0
$$ Real data points
##PAGE= N=1
##DATA TABLE= (X++(R..R)), XYDATA
$$ [...]
$$ plain form
1800 204 272 52 336 252 458 287 336 381 306 414 260 270 707 384 259 623 54 301 570 110 650 265
1822 265 -70 394 310 164 660 158 281 153 -234 323 -18 -111 131 -230 5 157 -352 39 61 -207 167
1843 167 -109 -138 46 -409 -268 -168 -613 -187 -169 -596 -284 -428 -356 104 -692 -189 -84 -509 49 -572 -379
1864 -379 146 -302 -245 -276 -271 69 -25 -242 203 -393 -70 266 -501 33 -93 -321 351 -20 -4 343 28 187
1886 187 264 -47 243 407 -110 496 -107 -57 625 -96 163 362 90 449 275 -13 407 172 111 678 -38
1907 -38 377 255 -285 424 -182 55 504 -153 -192 316 -211 202 -25 -178 171 -411 -70 188 -361 60 80
1928 80 -334 357 -74 -210 114 -526 -65 191 -527 409 -16 -341 255 -321 -111 471 -330 -53 126 -569
1948 -569 290 15 -22 363 -304 61 552 -82 272 -15 -217 506 -51 235 395 -171 211 447 -163 307
$$ packed form
1800B04O8k20K84q4K06j71M9M5p5J08j54J0M37l23j25L64n69K47K69m60N40l85
1822B65l35M64q4j46M96n02J23j28l87N57l41r3K42l61K35J52n09L91K2k68L74
1843A67k76k9J84m55J41J00m45M26J8m27L12j44P2M60p96N03J05m25N58o21J93
1864c79N25m48N7l1NL40r4k17M45n96L23L36p67N34j26k28O72l71J6L47l15J59
1886A87P7l11K90J64n17O06o03N0O82p21K59J99k72L59j74k88M20k35o1N67p16
1907c8M15j22n40P09o06K37M49o57l9N08n27M13k27j53L49n82L41K58n49M21K0
1928H0m14O91m31j36L24o40M61K56p18R36m25l25N96n76K10N82q01K77J79o95
1948e69Q59k75l7L85o67L65M91o34L54k87k02P23n57K86J60n66L82K36o10M70
$$ plain form
1968 307 70 -54 398 -352 -44 416 -254 395 234 -279 475 -142 -209 327 -480 -82 265 -442 -85 -109 -323
1989 -323 345 -326 -348 -3 -591 170 -298 -357 136 -307 -533 154 -374 -62 106 -576 33 -166 -676 356
2009 356 -594 -180 243 -364 -21 -147 -620 31 -53 -72 223 -319 117 401 -208 381 428 207 532 -73 166
2030 166 722 -135 323 466 49 636 88 185 482 177 364 536 -45 535 554 -123 531 298 177 263 2
2051 2 277 223 -61 175 137 -234 194 -284 24 438 -276 -47 -38 -205 150 26 -483 236 -423 -388 -88 -410
2073 -410 -256 -156 -420 -238 -345 -291 111 -405 -289 -125 -392 -388 -25 -70 -105 -218 -166 -122 -364 -270 58 -288 70
2096 70 -36 -164 221 -314 -25 137 -207 16 74 -224 302 -28 -49 445 -58 206 175 -17 342 70 350
2117 350 347 163 392 81 208 241 323 19 251 277 -22 167 299 37 263 -103 214 -26 -143 369 207 -240
$$ packed form
1968C07k37j24M52p50L08M60o70O49j61n13P54o17o7N36q07L98L47p07L57k4k14
1989c23O68o71k2L45n88P61m68n9M93m43k26O87n28L12J68o82O09j99n10J032
2009C56r50M14M23o07L43j26m73O51q4j9K95n42M36K84o09N89M7k21L25o05K39
2030A66N56q57M58J43m17N87n48R7K97l05J87J72n81N80J9o77O54k33j21Q6k61
2051BK75n4k84K36l8l71M28m78L08M14p14K29Rj67L55j24n09P19o59L5L00l22
2073d10J54J00k64J82j07N4M02n16J16J64k67ML63m5l5j13N2M4k42R4L28l46L58
2096G0j06j28L85n35K89J62l44K23N8k98N26l30k1M94n03K64l1j92L59k72K80
2117C50lj84K29l11J27L3Q2l04K32K6k99J89J32k62K26l66L17k40j17N12j62m47
$$ plain form
2139 -240 76 -189 16 83 -65 90 -22 12 -127 -316 82 -123 -172 -54 -28 101 -115 -317 161 18 -288
2160 -288 103 -228 -267 -61 43 8 71 53 -88 -44 80 130 166 153 -5 34 220 6 -252 238 111 -89 122
2183 122 -23 242 338 76 386 152 357 185 238 27 214 249 156 71 71 -258 -147 17 130 -180 82 342
2205 342 -82 57 -70 -121 -55 -97 -2 -106 104 50 -262 -259 47 -46 68 -286 -154 -77 -76 86 -327 54 -228 87
2229 87 -350 -107 -84 2 -18 -382 -120 -160 -33 10 -54 -52 -103 -106 24 -101 -247 -155 201 181 -61 173 30 40 247
2254 247 -40 141 196 237 284 152 333 85 34 79 257 244 115 251 115 387 149 323 319 -74 135 293 -111
2277 -111 249 -49 -114 318 -183 53 324 -22 -1 -198 3 155 -216 -245 135 -238 37 63 -240 123 -142
2298 -142 -276 -59 -346 -196 53 -278 -125 -340 -343 -27 -150 -217 246 -154 -184 0 37 107 -245 -114 252 -59
$$ packed form
2139b40L16k65K05O7j48J55j12L4j39j89L98k05m9J18K6J29k16k02M78j43l06
2160b88L91l31l9K06J04l5O3j8j41M4J24N0L6j3j58L9J86k14k58M90j27k00K11
2183A22j45K65R6k62L10k34K05j72N3k11J87L5r3q5%l29J11J64J13l10K62K60
2205C42m24J39j27n1O6m2R5j04K10n4l12LL06r3J14l54J32P7JJ62m13L81k82L15
2229H7m37K43K3Q6k0l64K62m0J27M3o4Kn1lJ30j25j46R2L56k0k42K34j43J0K07
2254B47k87J81N5M1M7j32J81k48n1M5J78j3j29J36j36K72k38J74ml93K09J58m04
2277a11L60k98o5M32n01K36K71l46K1j97K01J52l71k9L80l73K75K6l03L63k65
2298a42j34K17k87J50K49l31J53k15lL16j23o7M63m00l0J84L7P0l52J31L66l11
$$ plain form
2320 -59 -228 195 -231 227 68 -107 13 27 320 158 -170 61 126 153 234 125 -95 366 134 97 312 22
2342 22 514 89 4 290 59 -152 278 -220 109 297 122 152 88 -52 292 -229 9 288 -131 8 121
2363 121 -115 -114 24 -126 324 -292 263 87 -180 -92 -178 -98 -3 -147 -96 151 -644 -147 54 -179 -130 -113 -330
2386 -330 -4 -327 -435 -205 -280 -109 77 -366 87 -120 -103 124 -36 424 185 -71 139 185 -79 140 -119
2407 -119 421 267 -13 126 178 -115 374 149 -39 288 82 -103 35 -142 239 145 -65 263 -13 51 300
2428 300 -62 175 197 -131 127 -152 121 -32 -224 -36 -126 -258 164 -32 -247 181 -124 -13 127 -320 -133
2449 -133 40 -196 -79 -73 -291 56 -501 -626 -114 -361 302 -24 -133 -10 -238 -367 299 -168 -307 140 -146
2470 -146 171 -28 -94 101 -120 123 357 152 207 74 -80 177 247 101 394 112 18 383 -174 130 107 -25
$$ packed form
2320e9j69M23m26M58j59j75J20J4K93j62l28K31O5K7Q1j09k20M61k32l7K15k90
2342B2M92m25q5K86k31k11M30m98L29J88j75L0o4j40L44n21K38K79m19J39J13
2363A21k36JJ38j50M50o16N55j76k67Q8q6Q0R5j44N1K47p95M97K01k33M9J7k17
2386c30L26l23j08K30p5J71J86m43M53k07J7K27j60M60k39k56K10M6k64K19k59
2407a19N40j54k80J39N2k93M89k25j88L27k06j85J38j77L81r4k10L28k76O4K49
2428C00l62K37K2l28K58k79K73j53j92J88r0j32M22j96k15M28l05J11J40m47J87
2449a33J73k36J17Ok18L47n57j25N12k47O63l26j09J23k28j29O66m67j39M47k86
2470a46L17j99o6J95k21K43K34k05N5j33j54K57P0j46K93k82r4L65n57L04k3j32
$$ plain form
2492 -25 160 185 87 354 190 435 187 9 218 -53 27 192 -216 53 76 -138 102 -57 -211 69 -246 -154
2514 -154 82 -230 -141 -98 -153 -433 132 -68 -38 -223 -97 -41 -446 -236 -121 -183 -187 95 -105 -36 -356 -189 83
2537 83 -304 -196 -57 -102 -352 -18 124 -23 -121 118 -315 -248 -62 -151 97 89 67 347 390 -161 67 70 93 305
2561 305 371 96 117 64 -28 152 -23 289 281 -73 208 161 37 166 144 76 365 110 -51 89 -140 -142 -237 26
2585 26 -131 -136 -46 -195 -2 79 -142 -76 -206 -213 -18 -85 -276 -59 -142 -170 -53 -53 -315 11 -134 -179 -153 -199 -141 78
2611 78 23 165 -12 -22 -122 50 -42 -17 22 118 41 91 100 166 20 -23 -49 341 -37 117 148 23 -78 70 51
2636 51 197 34 85 238 243 -64 78 52 38 132 -146 -31 218 -41 47 -9 102 161 134 -112 -162 71 -167 -165 -113
2661 -113 -174 -140 92 -312 -10 -109 -304 -93 -51 -177 42 -209 -180 212 -238 -212 -161 37 -219 -61 -253 -198 -257
$$ packed form
2492b5J85K5r8K67j64K45k48j78K09k71Q0J65m08K69K3k14K40j59j54K80l15R2
2514a54K36l12Q9M3n5k80N65k00L0j85J26N6m05K10J15o2mK82k00O9l20J67K72
2537H3l87J08J39m5k50L34J42j47r8K39m33O7J86q9K48qk2K80M3n51K28LK3K12
2561C05O6k75K1n3r2J80j75L12ql54K81m7j24J29k2o8K89k55j61J40k29kr5K63
2585B6j57nR0j49J93Q1k21O6j30pJ95o7j91K17q3k8J17%k62L26j45m5K6m6N8K19
2611G8n5J42j77j0j00J72r2K5L9R6p7N0RO6j46m3k6L90l78J54L1j25j01J48j9
2636E1J46j63N1J53Nl07J42k6j4R4k78J15K49k59Q8n6J11N9k7k46n0K33k38KN2
2661a13o1L4K32m04L02r9j95K11M2j26K19k51K9L92m50K6N1J98k56J58j92N5n9
$$ plain form
2684 -257 -145 62 -34 -146 -136 -143 -130 182 -206 8 222 23 -21 -165 -52 -127 -98 143 -34 -17 365 298 206 406
2708 406 66 491 358 -97 206 88 64 105 348 176 87 -254 60 153 -45 -16 20 102 174 176 -116 -62 154 309
2732 309 -26 5 -102 191 -111 -192 -186 45 -127 -114 3 -214 -68 -111 -79 -20 -1 -256 -210 -322 -449 -13 -204
2755 -204 -100 -256 -87 40 -166 -210 -5 19 -296 -98 -137 87 35 -67 -152 -231 32 130 292 -194 167 107 -49
2778 -49 321 65 270 184 251 233 -175 170 -36 82 -27 157 197 331 213 349 225 352 304 176 -289 144
2800 144 139 101 162 12 -180 249 -47 -9 -184 -131 37 -66 -105 32 -122 -67 -95 176 -150 -14 -224 -157 -124 4
2824 4 -153 -236 -116 -20 -157 -198 -182 -302 94 -222 -25 -4 72 -40 -111 -181 -106 -147 -23 122 18 -104 98 46
2848 46 25 103 104 110 26 146 -187 -161 25 85 -13 282 307 59 212 327 52 106 21 33 -120 141 -96 -34 289
$$ packed form
2684b57J12K07r6j12J0pJ3L12l88K14K14j99m4j44J13p5K9K41j77J7L82o7r2K00
2708D06l40M25j33m55L03j18k4M1K43j72q9l41L14R3j98K9L6Q2P2Kk92N4K16J55
2732C09l35L1j07K93l02q1OK31j72J3J17k17J46m3L2N9J9k55M6j12j27M36j91
2755b04J04j56J69J27k06m4K05K4l15J98l9K24n2j02q5p9K63R8J62m86L61o0j56
2778d9L70k56K05q6O7j8m08L45k06J18j09J84M0J34j18J36j24J27m8j28m65M33
2800A44nl8O1j50j92M29k96L8j75N3J68j03l9J37j54N5k8K71l26J36k10O7L3J28
2824Dj57q3J20R6j37m1J6j20L96l16J97K1P6j12p1p0P5m1J24J45j04j22K02n2
2848D6k1P8JOq4J20l33K6J86O0r8K95K5k48J53J15k75N4q5J2j53K61k37O2L23
$$ plain form
2873 289 25 36 -69 -1 -49 -107 -20 45 103 -111 111 -17 -102 -81 -190 -170 37 -175 -229 -102 -219 -414 -129 -253
2897 -253 -192 -57 -75 3 -247 -12 -206 153 -29 -89 -148 -146 -25 -149 63 -152 25 10 -38 66 -15 -212 9
2920 9 -52 18 123 -19 134 -113 76 25 141 62 -80 180 222 216 -139 20 39 50 344 36 113 291 274 133
2944 133 229 186 -49 -47 -79 175 183 197 -17 -163 149 249 -78 94 55 -41 86 -177 -104 136 -47 -42 -111 -286 -82
2969 -82 -55 -98 -213 23 -88 -176 60 -161 -236 -262 -104 -207 -124 90 -9 -174 -202 -200 -121 -64 221 -82 -257 118
2993 118 -24 -188 24 -186 134 132 -26 81 261 207 64 139 319 -119 197 -14 39 42 230 67 47 118 25
3016 25 -108 1 82 -66 152 -21 63 11 -35 -85 -45 224 54 -196 -32 -129 17 263 -96 -78 -245 -51 59
3039 59 -13 -93 149 -47 33 -295 -147 -92 -64 -418 47 -165 -49 -149 -32 -26 -110 -43 -398 -131 -265 103 -160
$$ packed form
2873B89k64J1j05O8m8n8Q7O5N8k14K22j28q5K1j09K0K07k12n4J27j17j95K85j24
2897b53O1J35j8P8k50K35j94L59j82o0n9KJ21j24K12k15J77j5m8J04q1j97K21
2920Io1P0J05j42J53k47J89n1J16p9j42K60M2ol55J59J9J1K94l08P7J78j7j41
2944A33R6m3k35Kl2K54QJ4k14j46L12J00l27J72l9r6J27k63P3K40j83No9j75K04
2969h2K7m3j15K36j11q8K36k21p5k6J58j03Q3K14r9j65k8KP9N7K85l03j75L75
2993A18j42j64K12k10L20kj58J07J80n4j43P5J80m38L16k11N3LJ88j63k0P1r3
3016B5j33J09Q1j48K18j73Q4n2m6n0M0K69j70k50J64r7J46K46l59J8j67J94J10
3039E9p2q0K42j96Q0l28J48N5K8l54M65k12J16j00J17Oq4O7l55K67j34L68k63
$$ plain form
3062 -160 -10 -111 -30 85 135 -21 -117 -15 20 98 140 -95 -96 -41 -8 121 113 213 240 96 102 75 5 -80 -134 44
3088 44 14 69 196 -145 25 124 -195 -250 -1 215 19 76 -141 33 23 248 182 -45 -100 177 -47 -117 -74 -142
3112 -142 -186 -84 59 73 11 -208 -322 -272 -52 -206 -77 -271 -13 -93 -153 102 8 73 -111 -367 -292 -143 -149 -78
3136 -78 -265 -100 -192 -192 102 -245 -180 -32 69 39 -47 -84 122 189 83 -73 175 120 131 234 -27 246 151 -224
3160 -224 -70 359 12 207 200 -42 64 96 -67 -166 78 -15 20 189 162 -125 -22 -195 -144 215 45 -154 -62
3183 -62 29 -66 43 171 -292 99 -50 -92 29 -88 106 -141 52 -186 -82 -83 -195 -193 -166 14 23 -68 162 -51
3207 -51 103 -22 81 -16 -92 141 -119 -37 114 -103 -24 -8 17 56 -24 -131 158 -135 33 150 59 -10 -207 11
3231 11 72 77 119 254 128 92 131 182 67 -23 -137 -255 276 -11 -15 -94 104 100 43 -125 -2 114 -55 127 68
$$ packed form
3062a60J50j01Q1J15N0j56r6J02L5P8M2k35jN5L3J29qJ00K7j44Ok7p0q5n4J78
3088D4l0N5J27l41J70R9l19n5K49K16j96N7k17J74j0K25o6k27n5K77k24p0M3o8
3112a42m4J02J43J4o2k19j14N0K20j54J29j94K58q0o0K55r4O5j84k56P5J49oP1
3136g8j87J65r2%K94l47O5J48J01l0q6l7K06O7j06j56K48n5J1J03k61K73r5l75
3160b24J54M29l47J95pk42J06L2j63r9K44r3L5J69k7k87J03j73N1L59j70j99R2
3183f2R1r5J09J28m63L91j49m2J21j17J94k47J93k38J04jj12KK7J80Rr1K30k13
3207e1J54j25J03r7p6K33k60Q2J51k17P9J6K5L9q0j07K89k93J68J17r1o9j97K18
3231A1O1NM2J35j26l6L9N1j15r0j14j18N31k87mp9J98mn7j68J23J16j69J82n9
$$ plain form
3256 68 176 -171 125 26 12 -103 -75 -132 -202 -106 -243 -47 80 -120 -133 -45 -108 -102 38 57 -163 161 124 -100 38
3281 38 -30 20 -144 -147 -167 23 -49 109 -263 -63 -108 -56 -172 -28 4 127 66 28 -35 -34 75 -49 306 231 62
3306 62 -52 46 60 64 48 -273 -110 65 -6 -59 237 62 233 -82 125 -30 48 51 163 111 164 261 107 84 -186
3331 -186 300 -26 -121 -120 -201 21 132 -98 13 -40 -110 -155 154 -225 79 -41 -171 51 -101 -187 -140 84 -179
3354 -179 159 60 -116 -339 149 77 -108 -135 96 115 61 405 -42 26 258 -37 264 50 -216 114 -198 -4
3376 -4 223 -11 185 134 61 -58 90 38 205 202 186 -208 -13 0 178 267 100 55 61 318 176 92 312 -142 86
3401 86 274 102 -164 200 222 44 -130 -21 32 -135 36 -32 -82 -130 -119 -177 -75 -281 -67 -160 70 20 -226
3424 -226 9 -102 -101 97 14 -37 -146 -292 136 -17 26 -139 14 98 69 13 -110 58 -113 -32 -39 -25 29 -61 -248
$$ packed form
3256F8J08l47K96r9j4j15K8n7p0R6j37J96J27k00j3Q8o3OJ40J9k20L24l7k24J38
3281C8o8N0j64lk0J90p2J58l72K00m5N2j16J44L2J23o1l8o3JJ09j24L55p5j69
3306F2j14R8J4Mj6l21J63J75p1n3K96j75J71l15K07j55P8LJ12n2N3R7j54k3k70
3331a86M86l26r5Jq1K22J11k30J11n3p0m5L09l79L04j20j30K22j52q6M7K24k63
3354a79L38r9j76k23M88p2j85k7K31J9n4L44m47O8K32k95L01k14k66L30l12J94
3376dK27k34J96n1p3j19J48n2J67lj6l94J95J3J78Q9j67m5OK57j42q4K20m54K28
3401H6J88j72k66L64K2j78j74J09N3j67J71o8n0m8J1n8J02k06K14r3K30n0k46
3424b26K35j11JJ98q3n1j09j46M28j53M3j65J53Q4k9n6j23J68j71Q1pJ4N4r0j87
$$ plain form
3449 -248 -39 -202 -24 247 -124 161 230 246 164 -218 -135 6 75 29 -78 154 27 38 53 287 59 -9 180
3472 180 179 431 -34 149 -53 -59 13 -23 107 364 -68 106 110 -114 -63 64 59 51 -175 -185 -35 -219 -27 -97 -46
3497 -46 -57 -74 -167 30 -68 206 -288 122 -75 219 134 -160 -203 14 32 -209 137 70 62 94 44 47 -11 48 298 -162
3523 -162 21 -27 269 117 349 24 69 112 -60 22 58 269 -85 47 77 244 164 -48 131 190 -83 -36 242
3546 242 77 56 -17 193 117 34 34 -15 -109 199 -411 -55 -161 87 209 194 -134 -123 8 203 43 1 -122 -302
3570 -302 -151 -177 93 -43 -32 -103 36 -75 -83 31 -149 -35 -60 -313 -127 -113 -13 -146 22 -206 -161 -172 41
3593 41 -101 -192 87 300 -146 12 49 -163 16 138 293 25 287 192 107 184 103 143 55 38 71 -82 -2 419
3617 419 182 223 211 233 225 -60 185 -120 -74 -43 113 135 -96 -164 -188 143 -116 49 -61 175 162 26 -10 -29
$$ packed form
3449b48K09j63J78K71l71K85O9J6q2l82Q3J41O9m6j07K32j27J1J5K34k28o8J89
3472A80jK52m65J83k02oP2l6J30K57m32J74Mk24N1J27nqk26j0J50j84J92p0N1
3497d6j1j7r3J97r8K74m94M10j97K94q5k94m3K17J8k41L46o7qL2n0Ln8N9K50m60
3523a62J83m8K96j52K32l25M5M3j72Q2L6K11l54J32L0J67q0k12J79N9k73M7K78
3546B42j65k1p3K10p6q3%m9r4L08o10L56j06K48J22j5l28J1J31J95j60m2j23j80
3570c02J51k6K70j36J1p1J39j11qJ14j80J14k5k53J86J4J00j33J68k28M5j1K13
3593D1j42r1K79K13m46J58L7k12J79J22J55k68K62r5q5P7q1M0q8j7L3j53Q0M21
3617D19k37M1j2K2qk85K45l05M6L1J56K2k31o8k4L31k59J65j10K36j3j36l6j9
$$ plain form
3641 -29 -53 99 -188 -100 -344 -260 -127 -20 135 -194 -10 -224 -127 -318 -8 72 -219 -188 -151 98 -169 91 -128
3664 -128 -61 -51 -30 39 -15 17 30 -197 -68 135 2 5 165 234 -117 -64 136 202 153 -64 149 18 19 211 -148
3689 -148 122 37 166 149 139 91 345 18 -298 154 -29 40 123 -83 -45 -108 5 -3 4 7 106 -25 66 81 129 192
3715 192 -169 -82 135 -167 109 -115 -105 -199 173 116 -9 -104 -101 -14 -22 42 -84 -65 121 -337 -351 38 -210 104
3739 104 -69 123 -227 -100 -59 325 -30 12 -66 -219 136 61 -17 75 -37 31 248 175 -45 57 -99 -64 17
3762 17 241 280 20 92 5 215 -138 -59 -98 293 167 -69 -127 -54 179 -129 -146 -302 -124 -2 -171 143 77
3785 77 -168 111 -61 16 22 -106 -124 -118 -138 -43 -344 26 -114 -318 -255 -32 -21 -248 10 -64 -41 -386 -94 90
3809 90 -197 -193 -123 121 -8 -125 249 -69 -62 -24 -55 -139 -40 -13 294 -101 108 187 -67 78 249 65 -157 133
$$ packed form
3641b9k4J52k87Q8k44Q4J33J07J55l29J84k14R7j91L10Q0k91L1L7K49k67K60k19
3664a28O7J0K1O9n4L2J3k27J29K03j33LJ60O9l51N3K00O6m9k17K13j31JJ92l59
3689a48K70q5J29j7j0m8K54l27l16M52j83O9Q3k06L8o3J13qPLR9j31R1J5M8O3
3715A92l61Q7K17l02K76k24J0r4L72n7j25r5LQ7qO4j26J9J86m58j4L89k48L14
3739A04j73J92l50J27M1L84l55M2p8j53L55p5p8R2j12O8K17p3k20J02j56L5Q1
3762A7K24L9k60P2q7K10l53P9l9L91j26k36n8P3K33l08j7j56J78J22j69L14o6
3785G7k45K79j72P7Oj28j8Ok0R5l01L70j40k04O3K23J1k27K58p4K3l45K92J84
3809I0k87MP0K44j29j17L74l18PL8l1q4R9K7L07l95K09P9k54J45J71j84k22K90
$$ plain form
3833 133 79 -41 189 28 158 343 -7 20 -69 138 -9 -40 -57 143 167 114 -79 -131 -93 -77 15 -103 32 45
3857 45 6 56 -26 -3 -166 326 83 -189 121 -104 -49 -136 -133 73 56 -264 -27 -147 38 -2 114 -15 30 44
3881 44 -17 32 -35 315 84 -13 -89 56 23 84 207 -324 68 221 -6 -27 188 -204 185 176 -57 301 110 -113
3905 -113 56 20 6 216 -6 97 -68 -103 349 -86 -232 260 -48 -63 109 224 251 -196 138 42 67 -4 146
3928 146 -84 -21 133 -197 -84 145 -70 118 -101 -312 -17 10 86 -27 -3 61 -75 -275 -113 -8 -102 -4
3950 -4 64 -106 6 49 -56 -212 -168 -74 74 -222 -157 20 187 34 -258 -216 -319 -112 62 -33 27 112 -214 -15
3974 -15 -6 -126 58 38 120 -2 87 -202 -101 128 206 61 -148 78 -107 93 -35 -19 -44 403 38 -440 -168
3997 -168 37 215 -118 73 -112 47 -227 -49 45 95 155 117 184 50 175 -176 18 -44 -117 -234 -43 -91 -38
$$ packed form
3833A33n4j20K30j61J30J85l50K7q9K07j47l1j7K00K4n3j93n2L8J6R2j18J35J3
3857D5l9N0q2K3j63M92k43k72L10k25N5q7LK06j7l20K37j20J85m0J16j29M5J4
3881D4o1M9o7L50k31r7p6J45l3O1J23n31L92J53k27k1K15l92L89rk33L58j91k23
3905a13J69l6j4K10k22J03j65l5M52m35j46M92l08j5J72J15K7m47L34r6K5p1J50
3928A46k30O3J54l30J13K29k15J88k19k11K95K7P6j13K4O4j36k00J62J05r4R8
3950dO8j70J12M3j05j56M4R4J48k96O5J77J67j53k92M2j03K07J74r5O0Q5l26J99
3974a5Rj20J84k0Q2j22Q9k89J01K29P8j45k09K26j85K00j28J6k5M47l65m78K72
3997a68K05J78l33J91j85J59k74J78R4N0O0l8O7j34J25l51J94o2p3j17J91m8N3
$$ plain form
4020 -38 -84 -97 -216 -54 48 -248 -1 -99 0 121 -147 -197 167 162 -295 233 -13 63 332 162 -182 -137 -69 267
4044 267 113 120 197 -180 -73 80 173 -307 -34 249 19 109 90 192 47 -69 172 -32 -1 50 107 -70 49
4067 49 121 46 272 -46 -281 -52 -6 -195 65 -50 -46 190 232 160 203 -22 66 30 -184 165 -95 -245 -94 30
4091 30 -329 -127 -19 84 -82 -77 -144 -20 -73 -14 -403 -99 61 -54 -13 -148 44 -21 209 -60 -182 100 -21
4114 -21 23 -230 -154 40 189 207 -93 49 17 -82 19 158 34 252 95 -93 17 122 111 -31 193 302
4136 302 176 -81 47 -80 -7 -164 -29 -11 47 98 -138 17 -62 144 -287 -38 22 94 -69 -7 -25 -23 -18 -65 143
4161 143 -27 45 241 54 -62 -196 -152 -160 26 88 30 210 -179 -1 -82 -124 52 6 166 -165 -138 -33 -47 35
4185 35 -234 26 153 -233 -11 50 181 61 11 61 196 -17 -69 151 266 98 146 95 135 203 120 6 47 63
$$ packed form
4020c8m6j3j19J62J02k96K47r8R9J21k68n0L64nm57N28k46P6K69j70l44M5O8L36
4044B67j54PP7l77J07J53R3m80K73K83k30R0j9J02j45j16K41k04L1N1N7j77J19
4067D9P2p5K26l18k35K29M6j89K60j15MK36M2p2M3k25Q8l6k14L49k60j50J51J24
4091C0l59K02J08J03j66No7J24n3N9l89L04J60j15M1j35J92o5K30k69j22K82j21
4114b1M4k53P6J94J49J8l00J42l2r9J01J39j24K18j57j88J10J05j1j42K24J09
4136C02j26k57J28j27P3j57J35J8N8N1k36J55p9K06m31K49O0P2j63O2j8KNm7K08
4161A43j70P2J96j87j16j34M4qJ86O2n8J80l89J78q1m2J76m6J60l31K7J05j4Q2
4185C5k69K60J27l86K22O1J31j20n0N0J35k13n2K20J15j68M8n1M0O8q3j14M1J6
$$ plain form
4209 63 -18 -213 -51 -35 -16 165 -71 299 91 -95 -21 27 -112 51 191 -124 186 -138 108 35 26 -24 24 39
4233 39 -95 -101 -98 -208 -252 105 8 2 -189 -145 -279 -306 137 -348 -22 -128 61 -59 -161 26 -194 -42 72 226
4257 226 -101 255 -19 20 -5 -54 28 -122 21 26 -25 151 97 -16 42 122 25 79 -62 84 -20 244 233 63
4281 63 248 71 -235 -62 150 4 -181 -72 33 109 -135 31 158 11 -142 63 40 -93 -59 -158 203 -152
4303 -152 -115 97 -1 -96 -127 -258 146 100 -87 37 -31 42 -292 -183 -107 -124 46 -98 90 -31 -287 -88 -124
4326 -124 -47 -11 -247 82 -187 38 -245 -233 -89 136 -143 40 -73 -23 128 -200 18 1 -123 -215 -186 -5
4348 -5 68 113 -129 170 128 19 156 191 -218 48 12 -43 186 -114 1 298 152 307 64 25 -9 45 41 -118
4372 -118 -198 45 -121 -53 -47 96 -113 40 -129 19 -180 -9 -113 147 -41 41 -71 -389 162 -71 -100 -97 -248
$$ packed form
4209F3q1j95J62J6J9J81k36L70k08j86P4M8j39J63J40l15L10l24K46p3rn0M8J5
4233C9j34oLj10m4L57r7oj91M4j34k7M43m85L26j06J89j20j02J87k20J52J14J54
4257B26l27L56k74L9k5m9Q2j50J43Nn1J76n4j13N8Q0r7N4j41J46j04K64j1j70
4281F3J85j77l06J73K12j46j85J09J05P6k44J66J27j47j53K05k3j33L4r9L61l55
4303a52L7K12r8r5l1j31M04m6j87J24o8P3l34J09P6j7J70j44J88j21k56J99l6
4326a24P7L6k36L29k69K25k83J2J44K25k79J83j13N0J51l28K18j7j24r2K9J81
4348eP3M5k42K99m2j09J37L5m09K66l6n5K29l00J15K97j46J55k43l9l4N4mj59
4372a18q0K43j66O8OJ43k09J53j69J48j99J71j04K60j88Q2j12l18N51k33k9Lj51
$$ plain form
4395 -248 -195 -55 -51 222 -14 -161 -178 -33 -226 -117 52 -138 -159 34 -317 34 63 -72 -232 22 41 -36 -10
4418 -10 -106 4 -101 -18 -31 -115 59 144 -67 168 162 136 139 119 38 66 -75 -92 119 238 -51 -46 175 253 -53 128
4444 128 179 123 191 -282 -34 -180 -159 -162 214 -26 -33 46 -244 -306 -612 -710 -161 200 -153 -164 40 4 161 10
4468 10 17 158 81 78 -92 -129 115 114 49 -149 -247 -167 -123 -98 -108 157 173 100 -109 34 -158 -33 191 33 -206 84
4494 84 23 -63 -157 270 291 218 10 155 156 84 178 372 124 11 -21 209 -38 -27 145 -36 329 197 160 87 50
4519 50 34 236 239 106 56 -48 -93 -116 -50 -89 -44 -176 240 -34 -11 -74 119 -16 -16 -2 -320 -200 104 74 59 11
4545 11 -83 -153 123 1 -81 -132 -301 -100 4 -229 67 24 90 27 -80 132 208 -27 3 -32 92 30 176 242
4569 242 92 41 46 -30 -162 -444 75 9 48 -33 -39 -4 4 82 -129 -72 43 -154 141 -75 281 -177 -2 102 -27
$$ packed form
4395b48N3J40MK73k36j47j7J45j93J09J69j90k1J93l51L51K9j35j60K54J9p7K6
4418a0r6J10j05Q3j3q4J74Q5k11K35ok6Lk0q1K8j41j7K11J19k89NK21P8l06J81
4444A28N1n6O8m73K48j46K1lL76k40pP9k90o2l06r8N49L61l53j1K04l6J57j51
4468A0PJ41p7lj70l7K44jo5j98r8Q0M4K5j0K65J6p3k09J43j92J25K24j58k39K90
4494H4o1q6r4M27K1p3k08J45Jp2R4J94k48j13l2K30k47J1J72j81L65j32l7p3l7
4519E0j6K02Lj33n0j04m5k3O6l9M5j32M16k74K3o3J93j35%J4l18J20L04l0j5m8
4545A1r4p0K76j22q2n1j69K01J04k33K96m3O6o3j07K12P6k35L0l5J24o2J46O6
4569B42j50n1Np6j32k82N19o6L9q1oL5QP8k11N7J15j97K95k16L56m58J75J04j29
$$ plain form
4594 -27 115 -147 195 -37 -92 -18 -130 -12 7 199 27 -46 -42 -137 56 116 -74 -38 119 -60 7 -203 72 -1
4618 -1 -56 93 -39 -15 -107 -81 132 -39 72 -135 -59 -171 -85 -12 84 64 -8 43 38 -87 59 180 -76 225 83
4643 83 -159 -68 2 -40 -113 248 -226 -69 -52 151 15 -72 43 -76 219 -19 133 8 -195 202 171 -108 186
4666 186 -40 -68 28 -53 215 65 130 -36 -129 -144 16 -156 93 8 96 171 130 138 103 93 19 -401 -84 -321 -31
4691 -31 -53 37 -53 -152 -179 216 51 -167 -140 -203 -26 3 63 -3 10 210 -29 -36 -88 59 -64 100 163 -248 -37
4716 -37 15 -22 -71 121 223 -207 -87 -175 -1 -72 175 205 -139 -39 63 71 96 3 118 105 -20 -166 92 -104
4740 -104 18 -114 -140 58 126 65 -41 12 3 -108 -91 -77 201 -172 231 -93 166 122 -166 -17 -2 -125 144
4763 144 155 14 76 -382 -196 -11 141 -87 207 -297 -207 -241 -64 -75 -166 -97 -57 217 -147 5 -154 107 12
$$ packed form
4594b7J42k62L42k32n5P4j12J18J9J92j72p3Mr5J93O0j90L6J57j79O7k10K75p3
4618an5J49j32K4r2K6K13j71J11k07P6j12Q6P3R6k0p2N1nj25J46J21k56L01j42
4643H3k42R1P0m2p3L61m74J57J7K03j36q7J15j19K95k38J52j25k03L97l1k79K94
4666A86k26k8R6q1K68j50O5j66r3j5J60j72K49q5Q8P5m1Ql5j0p4m20L17k37K90
4691c1k2R0r0r9k7L95j65k18K7o3J77K9O0o6J3K00k39pn2J47j23J64O3m11K11
4716c7N2l7m9J92J02m30J20q8J74p1K47L0l44J00J02QK5r3J15j3j25j46K58j96
4740a04J22j32k6J98O8o1j06N3rj11J7J4K78l73M03l24K59m4k88J49J5j23K69
4763A44J1j41O2m58J86J85J52k28K94n04R0l4J77j1r1O9M0K74l64J52j59K61r5
$$ plain form
4786 12 -166 -192 -129 -117 16 -7 119 -284 -27 106 24 216 -67 119 -194 15 -170 -69 -53 148 92 31 26 -124
4810 -124 88 -195 -218 65 -54 268 36 -33 49 71 -52 -105 434 248 71 178 -12 -162 -156 -263 -37 -116 -33
4833 -33 119 -32 41 -222 167 -225 -26 -55 -162 -71 -80 15 -185 -45 37 -85 -205 96 48 276 -130 -70 -23 -259
4857 -259 -242 318 14 -98 -75 53 159 -39 -95 -51 -103 29 184 71 -54 -95 277 56 -136 -139 83 -41 48
4880 48 57 93 -31 -99 36 -88 -67 -8 -31 -159 368 125 8 -46 -35 164 -30 26 210 -101 74 120 -267 147
4904 147 -145 103 45 -181 -108 -114 -311 -11 148 157 -155 113 -59 94 -109 11 152 267 283 -155 162 111 4
4927 4 45 -217 8 14 21 -39 -140 -97 -427 232 39 59 37 41 -13 64 -76 45 -90 139 39 -3 -48 27 -48 -83 -36
4954 -36 116 164 -115 -37 5 -88 91 87 12 -54 -160 -36 281 37 -132 -41 54 28 -94 61 140 276 87 128 -115
$$ packed form
4786A2j78k6O3J2J33k3J26m03K57J33q2J92k83J86l13K09j85J01J6K01n6o1nj50
4810a24K12k83k3K83j19L22k32o9Q2K2j23n3N39j86j77J07j90j50Oj07K26p9Q3
4833c3J52j51P3k63L89l92J99k9j07R1rR5k00J40Q2j22j20L01m8K28m06O0M7k36
4857b59J7N60l04j12K3J28J06j98n6M4n2J32J55j13j25m1L72k21j92lK22j24Q9
4880D8RL6j24o8J35j24K1N9k3j28N27k43j17n4J1J99j94N6J84l11J75M6l87M14
4904A47k92K48n8k26P3oj97L00J59Rl12K68j72J53k03J20J41J15J6m38L17n1j07
4927DM1k62K25OPo0j01M3l30O59j93K0k2Mn4P7j40J21j35K29j00m2m5P5p5l5M7
4954c6J52M8k79P8M2r3J79mp5o6j06J24L17k44j69R1R5k6j22J55P9J36j89M1k43
$$ plain form
4979 -115 -115 -23 -67 -7 -189 57 141 -143 220 99 -245 -6 196 -121 16 8 -199 -223 39 -125 9 -205 38
5002 38 -86 -39 -117 -103 76 -95 100 -113 91 -33 -73 21 -4 -108 47 -146 -9 -20 23 361 -51 -113 -22 66
5026 66 -139 68 -16 134 112 43 5 -43 158 -116 35 -111 99 -31 25 37 -15 57 -86 152 -129 -110 -43 150
5050 150 159 -36 87 0 -106 -8 -45 -183 -370 -40 316 -39 -188 169 -48 -81 -100 89 2 -14 162 -126 41
5073 41 -257 -1 106 -169 -64 -40 -18 -243 -74 -172 90 2 -19 -48 7 57 110 -299 -97 -12 -350 -81 -187 157
5097 157 -121 106 240 136 -74 170 -66 -25 200 123 97 30 36 -137 29 -111 15 -74 158 41 107 236 49
5120 49 87 -75 -28 112 28 96 16 -38 -94 76 4 71 9 -106 -113 -146 175 198 -164 -7 -96 76 -65 35 -95
5145 -95 -50 85 2 -99 -52 2 -108 -49 -162 -85 -227 150 -247 -222 -88 45 -19 -61 -99 -19 -46 58 15 34 192
$$ packed form
4979a15%R2m4O0j82K46Q4k84L63j21l44K39K02l17J37qk07k4K62j64J34k14K43
5002C8j24M7p8J4J79j71J95k13K04j24m0R4k5j04J55j93J37j1M3L38m12o2R1Q8
5026F6k05K07q4J50k2o9l8m8K01k74J51j46K10j30N6J2n2P2j43K38k81J9O7J93
5050A50Rj95J23q7j06R8l7j38j87L30L56l55j49L57k17l3j9J89q7j6J76k88J67
5073D1k98K56J07k75J05K4K2k25J69r8K62q8k1k9N5N0N3m09K02Q5l38K69j06L44
5097A57k78K27J34j04k10K44k36M1K25p7k6o7Oj73J66j40J26q9K32j17O6J29j87
5120D9L8j62M7J40q4O8q0n4n6J70p2O7o2j15pl3L21K3l62J57q9J72j41J00j30
5145i5M5J35q3j01M7N4j10N9j13P7j42L77l97K5J34J33o4m2l8Q0k7J04m3J9J58
$$ plain form
5170 192 -218 -116 -40 -91 -52 -110 -131 -188 301 -55 166 -50 -185 -111 -168 -30 91 113 38 91 201 102 -206 -114
5194 -114 236 118 -141 242 366 60 -165 -8 -58 -138 -66 49 -39 5 347 38 98 -163 -151 -106 4 30 9
5217 9 -23 -178 108 -214 21 97 -373 -79 -189 -150 139 88 -360 -3 -101 375 -25 -130 31 197 -53 81
5239 81 -126 264 30 -257 73 -4 254 109 -224 129 27 -65 67 -72 158 -63 -47 -139 117 -47 98 14
5261 14 -85 -55 -121 306 -59 -151 -130 184 126 241 -29 27 21 -235 110 -269 32 73 -138 -155 -214 -41 -256 24
5285 24 -13 15 103 -135 -181 80 -7 -217 -84 45 -179 -99 -67 40 16 -126 8 -151 -26 -125 -118 171 -49 -324
5309 -324 133 38 54 105 153 60 -41 -184 -2 30 -173 69 -58 -103 269 -61 -30 -6 70 107 -156 27 -26 -146
5333 -146 -68 -81 -149 0 306 83 -128 224 14 86 52 18 28 346 346 -1 10 236 -362 -57 -114 -276 76 370
$$ packed form
5170A92m10J02P6n1L9n8k1n7M89l56K21k16j35P4n7J38J21K2p5N3J10r9l08R2
5194a14L50j18k59L83J24l06k25J57n0q0P2J15q8M4L42l09O0k61J2M5J10K6k1
5217Il2j55K86l22K35P6m70K94j10L9K89n1m48L57r8M76m00j05J61J66k50J34
5239H1k07L90k34k87L30p7K58j45l33L53j02r2J32j39K30k21J6r2K56j64J45q4
5261A4r9L0o6M27l65r2K1L14n8J15k70N6ok56L45l79L01M1k11j7n9J73k15K80
5285B4l7K8Q8k38m6K61q7k10J33J29k24Q0L2J07k4j42J34j59J25r9PK89k20k75
5309c24M57r5J6N1M8r3j01j43J82L2k03K42j27m5L72l30L1K4P6L7k63J83n3j20
5333a46P8j3o8J49L06k23k11L52k10P2l4l4J0L18%l47J1K26n98L05n7j62L52K94
$$ plain form
5357 370 87 115 139 -146 -81 250 332 56 -80 48 -80 164 103 41 111 -86 20 -176 65 99 -283 -33 107
5380 107 -43 -102 -144 142 147 9 -129 236 214 -152 -145 -36 30 -104 -181 -115 -137 -3 61 -13 138 57 48 -28 -55 194
5406 194 121 11 -271 241 86 -48 26 332 64 -7 96 33 257 -371 223 103 175 -159 106 -195 163 32
5428 32 44 173 80 -45 -115 -213 245 -74 3 -72 -199 -106 -39 -8 59 50 208 -79 -152 -28 85 -3 -12 -117 -416 334
5454 334 280 10 -325 10 -145 239 350 506 -22 -199 215 -159 -13 -148 -115 86 -33 175 62 -19 161
5475 161 -2 -193 -162 223 -87 -68 22 -113 -268 8 -200 -36 -153 -89 224 -168 150 -22 -229 77 101 107
5497 107 257 -115 -71 177 191 -238 13 -255 149 -53 -207 198 26 86 -43 -10 -17 -95 -113 -171 -131 291 130
5520 130 147 176 -99 26 10 -27 -155 -178 35 119 -92 -166 -162 -64 96 298 -15 -247 -98 -35 -24 -137 -1 86
$$ packed form
5357C70k83K8K4k85O5L31Q2k76j36J28j28K44o1o2P0j97J06j96K41L4l82K50J40
5380A07j50n9m2K86Nj38j38L65k2l66PJ09O6j34p7O6k2J34O4p4J51q1rp6k7K49
5406A94p3j10k82N12j55j34P4L06k68p1J03o3K24o28N94j20P2l34K65l01L58j31
5428C2J2J29r3j25p0r8M58l19P7p5j27R3O7L1O7rJ58k87p3J24J13q8rj05k99P50
5454C34n4k70l35L35j55L84J11J56n28j77M14l74J46j35L3K01j19K08j13q1J80
5475A61j63j91L1L85l10J9R0j35j55K76k08J64j17O4L13l92L18j72k07L06K4O
5497A07J50l72M4K48J4m29K51k68M04k02j54M05j72O0j29L3pp8j8n8M0M22j61
5520A30J7K9k75J25j6l7j28k3K13Q4k11p4MR8J60K02l13k32J49O3J1j13J36Q7
$$ plain form
5544 86 -50 70 37 -245 105 240 54 105 -117 -2 53 -40 285 -150 128 194 283 -160 181 -110 -148 -120 47
5567 47 172 -33 -63 -88 116 43 8 43 33 -60 -34 54 199 9 3 -148 84 95 201 -44 55 -217 51 34 -23
5592 -23 65 -144 68 4 -116 -47 -27 41 -80 -97 -144 -256 146 -121 -10 257 -249 -12 -173 -250 -69 -131 23
5615 23 63 -46 73 -30 67 -294 -104 63 -8 278 170 -40 -42 -227 67 54 196 165 -6 73 16 4 -48 232
5639 232 66 -50 201 172 -61 -78 49 -70 212 163 -106 -24 40 52 151 -11 -280 -90 -194 28 -22 -126 75
5662 75 -19 -63 208 41 -43 -47 -10 111 -40 123 33 -199 63 69 -77 98 16 -218 -134 -110 -56 81 -94 -132 133
5687 133 -9 -73 -133 38 -218 -110 -119 -136 57 -89 -135 -202 82 -109 158 225 93 15 45 -73 218 47 203
5710 203 -102 109 80 110 -17 -41 -6 88 247 -155 186 -31 105 -27 -371 144 -13 253 -8 -182 -125 -255
$$ packed form
5544H6j36J20l3k82L50J35j86N1k22J15N5r3L25m35K78O6Q9m43L41k91l8K8J67
5567D7J25k05l0k5K04p3l5L5j0r3K6Q8J45j90oj51K32J1J06k45R9k72K68j7n7
5592b3Q8k09K12o4j20O9K0O8j21j7m7j12M02k67J11K67n06K37j61p7J81o2J54
5615B3M0j09J19j03R7l61J90J67p1K86j08k10kj85K94j3J42l1j71P9n7j2n2K80
5639B32j66j16K51k9k33j7J27j19K82m9k69Q2O4J2R9j62k69J90j04K22n0j04K01
5662G5r4m4K71j67q4mL7J21j51J63r0k32K62Oj46J75q2k34Q4K4N4J37j75l8K65
5687A33j42o4o0J71k56J08rj7J93j46m6o7K84j91K67O7j32p8L0j18K91j71J56
5710B03l05K11k9L0j27k4L5R4J59m02L41k17J36j32l44N15j57K66k61j74N7j30
$$ plain form
5732 -255 194 -226 48 -9 -100 26 165 -11 207 110 84 -56 127 -249 -147 178 -157 30 59 91 -111 -2
5754 -2 51 15 -62 205 79 -82 193 -81 -74 116 -100 92 43 111 78 -80 -24 9 -64 -91 226 95 116 -4 39
5779 39 -117 -190 213 52 111 -146 183 95 -113 164 -177 95 -147 -201 -174 -58 -84 81 24 -34 -205 224 61
5802 61 73 84 83 146 72 0 118 -326 81 94 37 160 -33 -94 -343 98 46 100 113 88 -211 -6 -132 41 -127
5827 -127 -64 26 -49 -21 -23 -115 -182 -45 186 -200 -131 -43 71 -128 77 -3 172 6 -126 -62 -87 14 170 338
5851 338 16 35 -19 136 311 -93 29 122 173 24 76 -62 46 120 -52 -126 -119 -97 -168 71 -127 138 -172 -99
5875 -99 -14 73 6 167 187 27 -28 -98 -6 249 -59 -148 3 -69 -194 -54 -68 -70 210 76 -165 194 25 119 -274
5900 -274 -318 41 10 56 0 36 25 37 -28 -243 -211 -128 28 -31 -55 162 -176 171 -137 88 -23 -10 116 -255
$$ packed form
5732b55M49m20K74n7r1J26J39j76K18r7k6j40J83l76J02L25l35J87K9L2k02J09
5754bN3l6p7K67j26j61K75k74PJ90k16J92m9O8l3j58N6L3p3k7L17j31K1j20M3
5779C9j56p3M03j61N9k57L29q8k08K77l41K72k42n4K7J16k6J65n7n8j71M29j63
5802F1J2J1jO3p4p2J18m44M07J3n7J23j93o1k49M41n2N4J3k5k99K05j26J73j68
5827a27O3R0p5K8kr2o7J37K31l86O9Q8J14j99K05q0J75j66j32O4k5J01J56J68
5851C38l22J9n4J55J75m04J22R3N1j49N2j38J08P4j72p4PK2p1K39j98K65l10P3
5875i9Q5Q7o7J61K0j60n5p0R2K55l08q9J51p2j25J40j4kK80j34k41L59j69R4l93
5900b74m4L59l1M6n6L6j1J2o5k15L2Q3J56n9k4K17l38L47l08K25j11J3J26l71
$$ plain form
5924 -255 203 66 17 -18 39 21 172 -214 142 108 136 56 -315 213 58 110 0 -3 50 34 -80 127 71 37 -89
5949 -89 -77 -6 147 -68 8 -37 -218 -42 -199 90 120 146 -218 -140 -164 135 28 -41 131 -320 100 144 19 -95
5973 -95 -133 46 54 -93 -71 16 -52 -176 -176 29 -1 -54 -102 -88 210 51 -205 -97 -194 -54 -14 150 -93 251 -15
5998 -15 -236 -107 -34 276 -200 -175 -148 -120 -112 65 68 -124 -87 -73 65 -167 -252 -82 -81 72 210 -134 -63 -21 -210
6023 -210 75 -37 -34 122 -152 -138 -87 136 77 -39 -271 159 245 97 6 -6 -133 -231 23 127 -40 -142 -14
6046 -14 -148 182 -91 -95 182 65 97 103 -157 -38 74 205 -283 -61 70 -175 -151 -105 -186 106 -107 124 81
6069 81 -19 -39 -36 -257 114 -20 -65 -177 -80 -101 -281 55 120 21 -112 -122 -182 -78 -145 197 -78 15 -36 -28 -39 130
6095 130 -193 -147 285 4 249 -104 129 78 1 -140 15 35 192 52 -4 9 9 116 -169 -64 72 123 10
$$ packed form
5924b55M58j37m9l5N7j8J51l86L56l4K8q0l71N28j55N2j10lN3j6j14K07n6l4j26
5949h9J2P1J53k15P6m5j81J76j57K89L0K6l64P8k4K99j07o9J72m51M20M4j25j14
5973i5l8J79Qj47K2Q7o8j24%K05l0n3m8J4K98j59k56J08r7J40M0J64k43L44k66
5998a5k21J29P3L10m76K5K7K8QJ77Lj92L7J4J38k32q5J70JJ53J38l44P1M2j89
6023b10K85j12LJ56k74J4N1K23n9j16k32M30Q6j48r1j2j27r8K54J04j67j02J28
6046a4j34L30k73mK77j17L2Ok60J19J12J31m88K22J31k45K4M6q1K92k13K31m3
6069H1j00k0Lk21L71j34m5j12R7k1j80L36O5r9j33j0o0J04o7L42k75R3n1Qj1J69
6095A30l23M6M32k81K45l53K33n1p7j41J55K0J57j40n6J3%J07k85J05J36N1j13
$$ plain form
6118 10 -59 28 -33 -155 -51 -125 4 58 -60 65 -59 -167 161 -53 -92 -200 117 -178 183 -157 -361 -105
6140 -105 -86 -18 117 64 -54 -235 -17 -55 -19 -296 114 -172 -49 -30 -75 185 47 13 -125 150 -4 -35 43
6163 43 96 52 200 136 -3 242 -66 104 25 6 -111 3 -83 -256 147 -227 -29 175 -113 108 106 47 -2 -63
6187 -63 63 -77 -100 -36 -89 87 173 293 -36 281 162 60 24 -34 137 16 -235 -122 -11 98 148 71 -184
6210 -184 -220 151 58 -227 -159 37 -76 -48 45 149 170 -29 -138 114 30 -224 93 -24 -98 -112 351 -88 45
6233 45 130 -10 265 138 61 159 56 -17 -22 131 90 -2 95 130 -195 50 -55 -47 43 -66 -246 -17 6 -30 61 -44
6259 -44 -146 62 -223 103 76 44 177 -296 71 -37 -259 99 -136 87 -51 11 106 86 20 -236 143 141 -48
6282 -48 -150 29 69 -186 14 -48 -59 -29 49 16 -133 -45 -38 190 144 42 -19 -167 46 -29 -21 -105 17 90 -145 118
$$ packed form
6118A0o9Q7o1j22J04p4J29N4j18J25j24j08L28k14l9j08L17k95L61l40k04K56
6140a05J9O8J35n3j18j81K18l8L6k77M10k86J23J9m5K60j38l4j38K75j54l1P8
6163D3N3m4J48o4j39K45l08J70p9j9j17J14q6j73M03l74J98K04k88K21kn9m9o1
6187f3J26j40k3O4n3J76Q6J20l29L17j19j02l6n8J71j21k51J13J11J09N0p7k55
6210a84l6L71r3k85O8J96j13K8R3J04K1j99j09K52q4k54L17j17p4j4M63m39J33
6233D5Q5j40K75j27p7R8j03p3nJ53m1r2R7L5l25K45j05QR0j09j80K29K3l6R1j05
6259d4j02K08k85L26k7l2J33m73L67j08k22L58k35K23j38O2R5k0o6k56L79kj89
6282d8j02J79M0k55K00o2j1L0P8l3j49Q8PK28m6j02o1j48K13p5Qq4J22P3k35K63
$$ plain form
6308 118 37 125 -51 -21 -25 -238 178 205 64 -23 -301 -7 215 35 -117 37 84 45 31 -99 5 14 152 -54
6332 -54 -86 -61 265 216 91 -7 -114 56 44 41 -52 2 -102 -2 -246 170 -261 68 -58 123 -116 -176 -111 -73
6356 -73 -145 122 31 28 44 -244 -150 99 -85 -162 -60 135 -66 35 -170 54 155 116 6 48 -138 -155 2 -192
6380 -192 -135 -76 -136 -41 -34 -93 223 -170 -33 121 -61 149 53 -28 183 91 92 -94 -67 -1 5 42 141 -7 92 110 3
6407 3 -236 135 66 18 64 -167 232 -250 16 -7 85 78 -36 93 -30 -1 94 -38 -116 91 -26 -73 206 72
6431 72 104 51 -135 -46 -264 -74 52 142 86 130 -297 -144 -240 -27 123 52 200 -2 145 -54 -153 -107 30 -188
6455 -188 181 73 91 -227 -19 -137 294 149 44 -234 -17 -42 -28 96 -48 40 288 26 78 180 146 -58
6477 -58 131 169 -103 141 -12 -18 -81 -193 -129 -109 128 236 -25 72 105 154 34 175 69 66 -129 36 253 -41
$$ packed form
6308A18q1Q8j76L0mk13M16K7j41q7k78K94K22j80j52J54M7l9j4j30J04RJ38k06
6332e4l2K5L26m9j25r8j07J70j2lr3N4j04J00k44M16m31L29j26J81k39o0O5L8
6356g3p2K67r1lJ6k88R4K49j84p7J02J95k01J01k05K24J01l9j10M2j86j7J57j94
6380a92N7N9o0R5Pn9L16l93J37J54j82K10r6q1K11r2Jj86K7O6OL7R9j48R9J8j07
6407Ck39L71o9m8M6k31L99m82K66k3R2pj14J29j23K9R5j32p8K07j17m7K79j34
6431G2L2n3j86Q9k18J90J26R0n6M4m27J53r6K13J50p1J48k02J47j99r9M6J37k18
6455a88L69j08J8l18K08j18M31j45j05k78K17k5J4J24j44Q8K48k62N2J02l4k04
6477e8J89L8k72K44j53oo3j12O4K0K37J08k61R7L3M9j20J41j06lj95J65K17k94
$$ plain form
6501 -41 25 44 49 92 157 65 50 -78 3 -18 143 -25 -67 28 51 -138 210 202 251 -73 55 271 84 -157 -190 92
6527 92 159 99 20 17 64 10 12 112 38 -2 -34 36 72 -151 20 168 44 -14 141 239 -190 97 30 -32 8 -27 39
6554 39 -39 -222 -51 -7 182 1 213 48 149 -130 62 -306 161 -89 -210 -216 -187 42 -108 -194 -23 38 115
6577 115 35 -257 285 49 -111 -47 -195 123 195 -162 105 -103 72 306 116 205 5 89 -123 146 94 -30
6599 -30 -6 -120 -118 108 125 -165 -33 -120 16 138 -53 9 -144 -10 61 329 34 -91 224 28 172 56 144
6622 144 217 -60 107 18 21 29 20 18 37 -22 249 -108 -87 -2 -229 -58 259 166 37 15 264 117 -3 -233 190
6647 190 25 -10 -87 257 69 16 -346 -190 146 -95 122 -141 110 -143 36 -87 -107 -7 252 -21 -190
6668 -190 -169 -8 -11 64 28 144 174 202 -46 123 -15 -102 116 177 -62 -98 422 -40 -84 -114 6 119 205 -84
$$ packed form
6501d1O6J9NM3O5r2j5j28Q1k1J61j68m2R5K3j89L48qM9l24J28K16j87k41l3K82
6527I2O7o0p9lM7n4KJ00p4m0l2P0L6k23J71J48j24n8J55R8m29K87o7o2M0l5O6
6554C9p8j83J71M4J89j81K12j65J01k79J92l68M67k50j21oK9K29j50q6J71O1P7
6577A15q0k92N42k36j60O4j48L18P2l57K67k08J75K34j90Q9k00Q4k12K69n2j24
6599c0K4j14KK26J7k90J32q7J36J22j91O2j53J34P1K68k95j25L15j96J44j16Q8
6622A44P3k77J67q9LQrkJ9n9K71l57K1Q5k27J71L17r3j29k2K49j47j20k30M23
6647A90j65l5p7L44j88n3l62J56L36k41K17k63K51k53J79j23k0J00K59k73j69
6668a90K1J61lP5l6J16L0K8k48J69j38q7K18O1k39l6N20m62m4l0J20J13Q6k89
$$ plain form
6692 -84 -129 94 -57 50 -10 139 -183 228 -117 104 -134 -18 -111 127 227 37 -71 105 -71 361 29
6713 29 90 -9 27 124 -134 -73 -140 -57 124 -141 34 -202 333 -241 -79 143 112 -298 -265 -585 92 -171 -844
6736 -844 -145 -141 89 -33 36 -41 17 24 343 94 -41 108 24 -81 -53 -169 88 42 -21 -153 -169 281 33 26 294
6761 294 -77 -12 240 60 116 102 117 156 175 258 -193 183 111 9 247 -176 -170 -123 -319 4 -90 -56 -70 -97 -81
6786 -81 83 -95 35 -81 2 4 -78 218 -36 2 -129 19 -114 26 -73 60 56 94 -187 -166 -125 13 -55 -46 -73
6811 -73 -31 -99 -236 -213 75 -174 -83 -17 13 201 74 123 28 98 151 -54 122 73 -263 -113 36 8 -207 110
6835 110 -11 1 67 -103 130 35 -26 -58 -59 -151 46 -5 200 -146 154 -60 82 119 -61 -155 59 145 240 49
6859 49 -253 -139 -192 -120 37 51 -78 117 -85 -164 140 -105 92 60 126 -254 -14 172 -86 167 15 -32 58
$$ packed form
6692h4m5K23j51J07o0J49l22M11l45K21k38J16r3K38J00j90j08J76j76M32l32
6713B9O1r9L6R7k58O1o7Q3J81k65J75k36N35n74J62K22l1m10L3l20O77k63o73
6736h44O99MK30j22O9p7N8PL19k49j35J49q4j05K8j16K57m6o3j32j6M50k48pK68
6761B94l71O5K52j80N6j4J5L9J9Q3m51L76p2j02K38m23OM7j96L23r4L4j4k7J6
6786h1J64j78J30j16Q3Kq2K96k54L8j31J48j33J40r9J33mL8k81K1M1J38o8Rk7
6811g3M2o8j37K3K88k49R1O6L0J88j27M9r5P0N3k05J76m9l36J50J49k8k15L17
6835A10j21J2O6j70K33r5o1l2jr2J97n1K05l46L00k14J42L7j80r4K14Q6R5j91
6859D9l02J14n3P2J57J4j29J95k02p9L04k45J97l2O6l80K40J86k58K53j52m7R0
$$ plain form
6882 58 -212 -139 29 -41 27 71 -57 -123 99 -86 100 -394 -215 -220 27 90 -30 138 37 182 -119 258 -56
6905 -56 251 159 6 11 -4 140 -128 116 28 -176 117 157 -156 15 -164 252 243 263 -17 -47 -89 113 109 65 25
6930 25 -73 -21 44 50 -69 73 83 -149 97 -416 -100 -178 -144 -6 -311 37 -34 194 -17 -230 -52 -54 118 31
6954 31 -17 93 39 62 -194 119 23 -87 -159 -254 -68 -302 -173 -32 111 55 29 -71 -215 40 -142 100 163
6977 163 14 -18 136 -139 41 196 -9 -75 -107 127 2 -28 -69 269 22 -154 36 121 122 258 -91 -235 25
7000 25 -221 -38 28 -227 263 59 26 9 -45 -425 -179 237 -79 102 79 145 186 58 -47 -3 150 199 -22
7023 -22 -22 25 -81 191 -29 -7 -145 -135 43 58 -61 -96 117 108 -13 37 -13 -158 56 146 180 -184 -66 -357 -6
7048 -6 -325 140 254 35 166 -141 64 74 249 -160 -326 237 -589 -92 126 -1051 -188 -401 -447 -72 348
$$ packed form
6882E8k70P3J68p0O8M4j28o6K22j85J86m94J79nK47O3j20J68j01J45l01L77l14
6905e6L07r2j53Nj5J44k68K44q8k04K93M0l13J71j79M16rK0k80l0m2K02mm4m0
6930B5r8N2O5Oj19J42J0k32K46n13L16p8L4J38l05L48p1K28k11k13J78kJ72q7
6954C1m8J10n4K3k56L13r6j10p2r5J86k34J29J41J43n6k6j00j44K55j82K42O3
6977A63j49l2J54k75J80J55k05o6l2K34j25l0m1L38k47j76J90Q5JJ36l49j44K60
7000B5k46J83O6k55M90k04l3j7n4l80K46M16l16J81k3O6M1j28j05M4J53M9k21
7023b2%M7j06K72k20K2j38J0J78J5j19l5K13rj21N0n0j45K14R0L4l64J18k91L51
7048fl19M65J14k19J31l07K05J0J75m09j66N63q26M97K18j177Q63k13m6L75M20
$$ plain form
7069 348 264 35 -139 -141 -161 261 -51 14 -241 67 -8 46 193 82 68 67 123 -147 -230 -216 116 68 106 -93 -245
7094 -245 138 -12 -198 63 -120 397 -57 -144 -75 -2 -12 22 75 177 99 65 -224 -86 142 168 157 -94 -32 105
7118 105 192 98 -219 71 262 66 -51 -249 181 -61 141 -225 161 -39 125 221 -250 -75 -104 193 67
7139 67 87 -144 32 -151 -63 128 -146 -13 -35 153 107 -52 -52 98 263 88 50 183 -111 -174 -72 -76 128 55
7163 55 -178 108 5 -231 81 250 -31 97 -244 -110 187 -1 -75 98 94 -334 226 -134 -89 167 -174 -56
7185 -56 50 -125 -10 39 197 -207 152 30 -38 9 -24 12 -169 -122 -52 57 64 4 -106 -137 141 51 19 137 81
7210 81 -203 37 -241 -222 -13 171 332 155 -140 -270 -35 12 94 21 -71 208 -47 32 116 217 -128 -151 56
7233 56 27 -78 65 150 44 -32 -112 79 57 61 -83 -16 12 14 -10 -38 -81 -132 159 -248 -65 -201 76 63 -195 -53
$$ packed form
7069C48q4k29j74kk0M22l12O5k55L08p5N4J47j11j4jN6k70q3J4L32m8L8j99j52
7094b45L83j50j86K61j83N17m54q7O9P3j0L4N3J02p8l4k89J38K28K6j1k51O2J37
7118A05Q7r4l17K90J91j96j17j98M30k42K02l66L86k00J64R6m71J75k9K97j26
7139F7K0k31J76j83Q8J91k74J33k2J88m6j59%J50J65j75l8J33k94o3J02mK04p3
7163E5k33K86j03k36L12J69k81J28l41J34K97j88p4J73mm28N60l60M5K56l41J18
7185e6J06j75J15M9J58m04L59j22o8M7l3L6j81M7P0J09Po0j10l1K78r0l2J18n6
7210H1k84K40k78J9K09J84J61j77k95j30K35M7Q2p3r2K79k55P9Q4J01l45k3K07
7233E6k9j05J43Q5j06p6q0J91k2Mj44O7K8Kk4k8m3n1K91m07J83j36K77j3k58J42
$$ plain form
7259 -53 -63 51 -29 53 115 -106 -43 79 55 -74 106 68 108 100 -105 -140 -58 2 73 66 -93 -14 -151 -144 19 -116 -36
7286 -36 43 167 71 -155 76 -9 41 128 -91 86 -270 -142 18 100 -18 -158 325 253 188 -119 -168 19 -154
7309 -154 104 176 223 173 123 251 -7 -189 -39 17 44 -69 129 -237 18 143 -74 -43 -110 -27 -114 -117 -102 -236
7333 -236 73 -240 164 -88 59 -96 -103 -176 38 -22 17 17 -164 27 369 153 -50 71 -48 -69 88 86 -211
7356 -211 17 143 62 -58 -38 -169 219 41 -286 147 65 232 -92 110 72 50 -50 50 -24 -75 83 -199
7378 -199 -348 -15 27 -58 25 9 82 293 -65 -143 -341 -73 -65 111 -38 -136 -14 -77 19 53 -25 -103 -183 -2 -42
7403 -42 -190 -53 -184 -5 -117 81 109 -207 -143 77 -159 27 -79 -14 -90 -26 -13 -359 -75 -159 68 -66 238
7426 238 38 -324 31 125 -42 -293 24 73 -238 -148 77 -170 198 103 -203 -13 177 91 121 -119 -153 14
$$ packed form
7259e3j0J14q0Q2O2k21O3J22k4j29J80l8M0qk05l5Q2O0P1pj59P9j37PJ63j35Q0
7286c6P9J24r6k26K31q5N0Q7k19J77l56J28J60Q2j18j40M83p2o5l07m9J87j73
7309a54K58P2M7n0n0J28k58j82J50N6K7j13J98l66K55J25k17L1o7Q3q7lJ5j34
7333b36L09l13M04k52J47j55pp3K14o0L9%j81J91L42k16k03J21j19k1J57kk97
7356b11K28J26q1j20K0j31L88j78l27M33q2J67l24K02l8k2j00J00p4n1J58k82
7378a99j49L33M2q5Q3j6P3K11l58p8j98K68QJ76j49r8J22o3R6L4p8p8q0J81m0
7403d2j48J37j31J79j12J98K8l16O4K20k36J86j06O5p6O4J3l46K84q4K27j34L04
7426B38k00l62L55R4j67k51L17M9l11R0K25k47L68r5l06J90J90q6L0k40l4J67
$$ plain form
7448 14 -78 200 80 111 -155 -15 -28 -6 -34 126 -132 -139 -33 132 -97 40 101 156 -116 85 -74 43 -141
7471 -141 164 83 -234 -23 -102 -148 449 209 -193 339 -30 -194 57 118 -117 -69 -14 63 -11 -24 -47 -29 190 1
7495 1 -137 -192 -37 -8 -29 -43 -7 49 117 -230 71 -148 -46 18 81 66 178 -12 -35 93 115 -65 202 75 -7
7520 -7 30 -122 -27 -50 153 -65 -4 -11 52 -90 -20 -47 27 262 -19 -35 -234 27 -70 -84 138 13 79 -121 320
7545 320 7 -110 -47 119 -250 -87 -279 136 -66 83 83 69 152 -113 -29 168 86 -313 18 -43 -15 -51 44 137
7569 137 -77 83 -42 -32 204 -230 79 134 -150 3 99 -49 104 43 106 -170 -60 86 -27 -320 -98 289
7591 289 109 202 -178 298 188 498 62 13 -95 38 -240 -57 -1 20 222 -62 -101 -62 -250 -133 128 -198
7613 -198 77 -165 167 -147 -22 -86 -55 -167 -85 -114 -332 -25 -70 -27 -87 -127 96 93 -207 166 -9 -214 -95
$$ packed form
7448A4r2K78j20L1k66J40j3K2k8J60k58pJ06J65k29J37O1N5k72K01j59J17j84
7471a41L05q1l17K11p9m6N97k40m02N32l69j64K51O1k35M8N5P7p4j3k3J8K19j89
7495Aj38n5J55K9k1j4L6N6O8l47L01k19J02O4O3j5J12j90k3J28K2j80K67j27q2
7520gL7j52R5k3K03k18O1pO3j42P0k7P4K35k81j6j99K61r7j4K22j25O6k00M41
7545C20l13j17O3J66l69J63j92M15k02J49%j4Q3k65Q4J97q2l99L31o1K8l6R5R3
7569A37k14J60j25J0K36m34L09N5k84J53R6j48J53o1O3k76J10J46j13k93K22L87
7591B89j80R3l80M76j10L10m36m9j08J33k78J83N6K1K02k84l9L9j88J17K61l26
7613a98K75k42L32l14J25o4L1j12Q2k9k18L07m5M3o0m0K23ll00L73j75k05J19
$$ plain form
7636 -95 -144 79 -90 103 -47 77 36 134 -23 43 19 -156 -294 -38 120 -87 -61 -115 16 106 -136 -181 79
7659 79 21 161 21 -96 39 -139 19 -36 -97 -19 69 193 223 55 240 -129 -83 38 -60 -161 -73 31 -96
7682 -96 -93 -21 -336 -10 2 -58 -188 -223 -298 8 131 -77 75 -26 129 125 -306 -71 -135 -120 119 -25 -87 109
7706 109 -65 -186 -303 -83 -236 -73 -131 -185 132 41 66 131 -219 -135 -49 65 60 141 154 36 128 -57 21 -101
7730 -101 -74 -33 193 282 80 232 277 -4 62 48 292 -66 -338 -9 15 -65 -25 -82 -65 -321 -11 -178 258 -73
7754 -73 119 70 -85 255 28 -192 169 -67 199 238 18 -139 -266 -47 -141 -120 -39 221 -198 -52 -76 -1 250
7777 250 106 45 106 35 -40 221 -82 -154 46 120 -325 -13 57 47 -186 39 178 27 -145 -83 -228 12 52
7800 52 -39 124 -197 437 1 -82 7 25 -181 197 48 6 -16 84 147 -68 -84 -110 -245 -81 -6 132 -9 -36
$$ packed form
7636i5m9K23j69J93j50J24m1R8j57O6k4j75j38K56J58k07K6n4J31R0k42m5K60
7659G9n8J40j40j17J35j78J58n5o1P8Q8J24L0j68J85l69M6J21r8j01Q8J04j27
7682i6LP2l15L26J2o0j30l5p5L06J23k08J52j01J55mm31K35o4J5K39j44o2J96
7706A09j74j21j17K20j53J63n8n4L17r1K5O5l50Q4Q6J14nQ1J3j18R2j85P8j22
7730a01K7M1K26Q9k02J52M5k81O6j4K44l58k72L29K4q0M0n7J7k56L10j67M36l31
7754g3J92m9j55L40k27k20L61k36K66L9k20j57j27K19r4K1Q1K60m19J46k4P5K51
7777B50j44o1O1p1p5K61l03p2K00P4m45L12P0j0k33K25J39j51j72O2j45K40M0
7800E2r1J63l21O34m36q3Q9J8k06L78j49m2k2J00O3k15j6k6j35J64P5J38j41k7
$$ plain form
7824 -36 31 -184 15 261 25 -33 65 -35 -85 15 142 -70 63 74 236 -81 44 -28 -12 97 33 -23 60 114
7848 114 -231 69 93 -133 -37 -107 201 -194 119 55 90 -7 -281 -306 -67 -188 -225 92 20 -53 -101 -8 97 -98
7872 -98 46 16 34 -185 174 80 -199 -63 188 64 -165 -99 126 -29 -113 12 -31 4 -73 -66 125 -56 -226 -60
7896 -60 -61 145 -249 -327 -34 -125 103 107 -104 125 81 -6 126 55 79 178 -158 -136 250 -26 87 3 -32 80 -116
7921 -116 64 -35 7 66 -84 -13 56 -80 183 96 193 -117 -81 154 73 -52 25 57 -89 -60 56 -150 -97 165
7945 165 2 208 290 45 21 -72 87 94 79 -47 -44 88 -33 -107 -68 -265 129 -207 -248 127 -154 -5 119 36
7969 36 -224 76 -22 96 -105 -146 397 178 -79 61 29 -167 59 120 123 -19 200 -32 76 118 23 -28 -161
7992 -161 230 104 -36 5 -177 23 8 34 -133 -40 -68 -214 -18 -185 -121 -104 -66 -108 -24 -75 49 24 96 -98
$$ packed form
7824c6O7k15J99K46k36n8R8j00n0J00J27k12J33J1J62l17J25p2J6J09o4n6Q3N4
7848A14l45L00K4k26R6p0L08l95L13o4L5r7k74k5K39j21l7L17p2p3m8R3J05j95
7872i8J44l0J8k19L59r4k79J36K51j24k29O6K25j55q4J25m3L5p7PJ91j81j70J66
7896f0jK06l94p8K93r1K28Mk11K29m4q7J32p1K4R9l36K2L86k76J13q4l5J12j96
7921a16J80r9M2N9j50P1O9j36K63q7R7l10L6K35q1j25P7L2j46K9J16k06N3K62
7945A65j63K06Q2k45k4r3J59Pj5j26LJ32j21p4L9j97L94l36m1L75k81J49J24q3
7969C6k60L00r8J18k01m1N43k19k57J40l2j96K26O1Lj42K19k32J08M2r5n1j33
7992a61L91j26j40M1j82K00j5K6j67R3k8j46J96j67O4J7L8m2Q4n1J24k5P2j94
$$ plain form
8016 -98 146 -102 59 68 27 -228 87 105 146 -207 110 209 212 -125 -94 61 356 112 95 -158 -31 -128 120 199
8040 199 206 66 -146 193 -56 51 109 115 -63 66 130 42 51 102 181 5 160 84 -116 -95 115 173 33 42 51 -147
8066 -147 -7 14 8 106 90 111 -35 -139 -95 -99 135 -64 -116 86 10 34 -211 -132 -32 -3 21 -51 54 -27 -10 -214
8092 -214 160 -179 37 124 -18 19 178 17 -23 -19 -180 -42 -125 123 384 10 91 74 -2 17 189 -99 -148 -53
8116 -53 -165 76 102 84 -61 -40 -273 -193 -9 252 141 269 20 -11 115 -1 -253 -310 -126 3 -135 57
8138 57 -13 -77 -16 -362 231 78 29 40 -9 -391 73 48 53 50 49 -157 47 -184 -255 -26 -83 20 56 22 -84 95
8164 95 163 70 34 -50 73 146 -73 -216 -52 27 148 -141 48 27 5 -169 77 20 -69 21 -108 25 -120 -5
8188 -5 44 -21 12
$$ packed form
8016i8K44k48J61Rm1k55L15J8M1l53L17R9Ll37L1J55K95k44j7k53J27r7K48P9
8040A99Pj40k12L39k49J07N8Oj78J29O4q8RN1P9j76J55p6k00K1K10N8j40RRj98
8066a47J40K1oR8j6K1j46j04M4mK34j99n2K02p6K4k45P9J00K9K4p2J05q1J7k04
8092b14L74l39K16Q7j42L7J59j61m0Mj61J38q3K48K61l74Q1j7p6J9J72k88m9R5
8116e3j12K41K6j8j45K1k33Q0J84K61j11J28k49l1J26j16k52n7J84J29j38J92
8138E7p0o4O1l46N93j53m9J1m9l82M64k5Nljk06K04k31p1K29n7J03L6l4j06J79
8164I5O8r3l6q4J23P3k19j43J64P9J21k89J89k1k2j74K46n7q9R0j29J33j45J15
8188eM9o5L3
8191A2
$$ Imaginary data points
##PAGE= N=2
##DATA TABLE= (X++(I..I)), XYDATA
$$ plain form
0 0 0 0 0 0 0 0 0 0 0 0 -8 8 -8 8 -16 16 -23 24 -32 32 -40 48 -64 72 -84 96 -112 128 -152 174 -199 224 -255
33 -255 288 -326 366 -411 460 -513 573 -637 706 -784 867 -958 1059 -1168 1287 -1418 1563
50 1563 -1720 1896 -2090 2307 -2550 2825 -3139 3499 -3920 4418 -5017 5757 -6695 7930 -9625
65 -9625 12115 -16130 23652 -42528 190070 249845 -124527 88019 69490 14326 135379 115539
77 115539 50347 133872 158038 77806 -25532 84334 114478 41253 136304 112921 1612
88 1612 85282 54536 71991 168404 22392 -27875 81853 42777 44125 46331 31302 100046
100 100046 69966 11961 -23373 -73567 48922 90121 -12131 28949 8602 -42942 22295
111 22295 -16818 -36404 -4857 -29772 8421 -22658 -73956 -15073 -30358 -7003 16606 -97473
$$ packed form
0@%%%%%%%%%%qJ6j6J6k4L2l9M7n6O4p2Q8j12J36j56J80k08K40k80L26l73M23m79
33b55N43o14O92p77Q71r73J086j210J343j490J651j825K017k227K455k705K981
50A563l283L616l986M397m857N375n964O638p419Q338r435J0774j2452J4625j7555
65i625K1740k8245L9782o6180K32598N9775l74372K12546j8529n5164J21053j9840
77A15539o5192Q3525K4166q0232j03338J09866L0144p3225R5051k3383j11309
88A612Q3670l0746J7455R6413j46012n0267J09728l9076J348K206j5029O8744
100A00046l0080n8005l5334n0194J22489M1199j02252M1080k0347n1544O5237
111B2295l9113j9586L1547k4915L8193l1079n1298N8883j5285K3355K3609j14079
$$ plain form
123 -97473 -81725 -38107 -71349 -1706 -17521 -73626 -17265 -49049 -83654 -58051 -79130 -46940
135 -46940 -20194 -34157 -35571 -90453 -73469 -14758 -52684 -41813 -46803 -92265 -25010 -24178 -71064
148 -71064 -23234 -29190 -30841 -15495 -75216 -63373 -27384 -25970 10378 -14098 -35395 -12783 -44767
161 -44767 -24522 150 -31883 -186 6394 -14779 7260 -16657 -13742 21603 5529 12749 -4325
174 -4325 -27558 23121 25801 14425 36981 7303 10127 27646 -4722 10515 29101 29907 51395
187 51395 26744 10768 25055 13922 32461 39855 19620 36644 28472 20215 40533 26137 31449
200 31449 42666 19527 26501 23674 10762 36539 39103 34990 39028 12846 10825 22214 15633
213 15633 28719 25902 21045 31714 15009 7508 14108 8686 22465 20239 719 8151 6346 5538
$$ packed form
123i7473J5748M3618l3242O9643j5815n6105N6361l1784l4605K5603k1079L2190
135d6940K6746j3963j414n4882J6984N8711l7926J0871m990m5462O7255Q32m6886
148g1064M7830n956j651J5346n9721J1843L5989J414L6348k4476k1297K2612l1984
161d4767K0245K4672l2033L1697O580k1173K2039k3917K915L5345j6074P220j7074
174d325k3233N0679K680j1376K2556k9678K824J7519l2368J5237J8586Q06K1488
187E1395k4651j5976J4287j1133J8539P394k0235J7024q172q257K0318j4396N312
200C1449J1217k3139O974k827j2912K5777K564m113M038k6182k021J1389o581
213A5633J3086k817m857J0669j6705p501O600n422J3779k226j9520P432j805q08
$$ plain form
227 5538 16223 6013 6663 6560 -10883 -6993 -5414 -4635 9181 1362 -4604 -3646 -18196 -18462 -13088
242 -13088 -12434 -2035 -8665 -18151 -15339 -18982 -16626 -14848 -20776 -14814 -16932 -26323 -23281 -22203 -15701
257 -15701 -9462 -19198 -23483 -24227 -28324 -23756 -20674 -16762 -9691 -15515 -22324 -23174 -24094 -18562 -15461 -15772
273 -15772 -11417 -13514 -16799 -15370 -14976 -8775 -5941 -10994 -11994 -11829 -10606 -5899 -3638 -335 2224
288 2224 -2713 -6518 -7380 -4673 2873 6075 5708 6551 4501 1779 2007 3487 8387 11490 9493 8017
304 8017 6883 8974 12271 11794 12878 13672 10527 8745 8337 10967 16977 17997 15804 13395 10177 9787
320 9787 9883 11116 15906 17527 14911 11870 8465 9985 11682 10998 12239 11250 9279 8901 6556 7971
336 7971 12413 11005 8239 4768 2465 4420 4458 5494 9010 7058 5079 1243 -3345 196 2525 2237
$$ packed form
227E538J0685j0210O50j03j7443L890J579P79J3816p819n966R58j4550k66N374
242a3088O54J0399o630r486K812l643K356J778n928N962k118r391L042J078O502
257a5701O239r736m285p44m097M568L082L912P071n824o809q50r20N532L101l11
273a5772M355k097l285J429L94O201K834n053j000J65J223M707K261L303K559
288B224m937l805q62K707P546L202l67Q43k050k722K28J480M900L103j997j476
304H017j134K091L297m77J084P94l145j782m08K630O010J020k193k409l218l90
320I787R6J233M790J621k616l041l405J520J697o84J241r89j971l78k345J415
336G971M442j408k766l471k303J955L8J036L516j952j979l836m588L541K329k88
$$ plain form
352 2237 3590 28 -746 -364 -4662 -2490 505 -1643 -1606 -5870 -7475 -3345 -5038 -2949 -1491 -6000
368 -6000 -5284 -9637 -12210 -5435 -5152 -5066 -3725 -9382 -8231 -8680 -12826 -7421 -6852 -6591 -4863 -13130 -11052
385 -11052 -6627 -9906 -5679 -7925 -11577 -6154 -11093 -11452 -5335 -7808 -3731 -5087 -12107 -7589 -9793
400 -9793 -9263 -1362 -6146 -4321 -2278 -10606 -4720 -3490 -6608 360 -3695 -3323 968 -6885 -2124 1905
416 1905 -1778 5555 -168 -5461 3529 -299 3244 7591 -707 6521 6110 -1302 6262 1615 4395
431 4395 13801 4164 6098 7521 803 11671 9004 4279 13086 4452 6775 12414 2778 10943 11744
446 11744 4968 14187 5495 2301 11616 4422 11685 14074 420 8153 7278 3183 11671 1850 3930
461 3930 12851 2048 5733 3742 -3119 11006 5120 -831 5813 -4481 1448 6924 -4349 3579
$$ packed form
352B237J353l562p74L82m298K172K995k148L7m264j605M130j693K089J458m509
368f000P16m353k573O775K83Q6J341n657J151m49m146N405N69K61J728q267K078
385a1052M425l279M227k246l652N423m939l59O117k473M077j356p020M518k204
400i793N30P901m784J825K043q328N886J230l118O968m055L72M291p853M761M029
416A905l683P333n723n293Q990l828L543M347q298P228m11p412P564m647K780
431D395R406r637J934J423o718J0868k667m725Q807q634K323N639r636Q165Q01
446A1744o776R219q692l194R315p194P263K389j3654P733q75m095Q488r821K080
461C930Q921j0803L685j991o861J4125n886n951O644j0294N929N476j1273P928
$$ plain form
475 3579 788 -5495 5295 -5442 -6152 2823 -6913 1730 1539 -11832 -1984 -6261 -6799 3884 -10171
490 -10171 -8127 -1091 -10636 -1039 -5989 -13755 1176 -5839 -8043 -3140 -15186 -4605 369 -10119
504 -10119 -1935 -8638 -11496 1177 -9653 -7636 -920 -11155 -239 -2088 -12436 -1427 -6855
517 -6855 -5178 4620 -9105 -5149 -1072 -8516 4290 -1652 -8620 3500 -4741 -1876 3324 -9691
531 -9691 808 4866 -3178 4947 -4572 -4971 8053 -1962 2294 4083 -6234 6935 3638 -4205
545 -4205 6709 -1438 2094 9895 -3357 2712 4060 -1762 10805 3492 -1410 7555 -1725 4608
559 4608 9039 -2941 6619 6002 718 9811 -477 -424 9831 2009 7059 5518 -3881 7985 5140
574 5140 1206 8684 -887 3419 9440 -1406 4935 4024 -334 10334 2458 -442 6061 -1995 4751
$$ packed form
475C579k791o283J0790j0737p10Q975r736Q643j91j3371R848m277n38J0683j4055
490a0171K044P036r545R597m950p766J4931p015k204M903j2046J0581M974j0488
504a0119Q184o703k858J2673j0830K017O716j0235J0916j849j0348J1009n428
517f855J677R798j3725L956M077p444J2806n942o968J2120q241K865N200j3015
531i691J0499M058q044Q125r519l99J3024j0015M256J789j0317J3169l297p843
545d205J0914q147L532P801j3252O069J348n822J2567p313m902Q965r280O333
559D608M431j1980R560o17n284R093j0288N3J0255p822N050j541r399J1866k845
574E140l934P478r571M306O021j0846O341r11m358J0668p876k900O503q056O746
$$ plain form
589 4751 6793 -2032 5437 1430 -1150 6913 -1987 -436 5177 -2243 4172 1618 -5837 3246 -454
604 -454 -897 4118 -5809 -1856 2008 -4691 966 -2184 -5259 2867 -4100 -4968 -1143 -7336 -387 -593
620 -593 -7448 -1438 -5283 -6285 -188 -6673 -4380 -2197 -8082 -2107 -4430 -7978 -1570 -5681 -4369
635 -4369 -845 -8313 -4949 -2792 -6165 -584 -4338 -6489 -816 -5026 -3455 -1821 -6067 -228 -508
650 -508 -4429 -459 -3789 -2566 2230 -2952 -323 419 -2903 1844 111 -1250 3041 -170 1201 3144
666 3144 -1139 2394 2642 1021 5205 2122 1273 4156 1015 4013 3455 1171 4791 3566 2541 4888
682 4888 2190 3357 5857 2601 3698 3610 2028 5172 3468 2334 4863 2387 2945 3605 1340 3666
698 3666 3739 2054 3597 1560 1523 2708 716 2274 2536 776 1665 400 147 2132 225 596 1141
$$ packed form
589D751K042q825P469m007k580Q063q900J551N613p420O415k554p455R083l700
604d54m43N015r927L953L864o699N657l150l075Q126o967q68L825o193O949k06
620e93o855O010l845j002O097o485K293K183n885N975k323l548O408m111J312
635d369L524p468L364K157l373N581l754k151N673m210J571J634m246N839k80
650e08l921L970l330J223M796n182K629P42l322M747j733j361M291l211J371J943
666C144m283L533K48j621M184l083q49K883l141K998n58k284L620j225j025K347
682D888k698J167K500l256J097q8j582L144j704j134K529k476N58O60k265K326
698C666P3j685J543k037l7J185j992J558K62j760Q89j265k53J985j907L71N45
$$ plain form
715 1141 -391 331 -495 -1126 856 -3 -788 -563 -1715 -728 -856 -1759 -738 -1150 -1397 -873 -2518 -1711
733 -1711 -938 -1747 -1386 -1545 -2297 -1585 -2063 -2247 -1238 -1766 -1878 -1873 -2749 -1549 -1713 -1660 -1471 -1690 -1851 -1881 -2456
754 -2456 -2275 -1364 -1414 -1754 -2380 -1817 -1977 -1736 -1878 -1391 -1505 -565 -1732 -2145 -1071 -1530 -1822 -1407 -1151 -1767
774 -1767 -1008 -1509 -703 -233 -909 187 -658 -1393 -312 412 -122 -550 74 270 -171 -819 651 941 911
793 911 219 147 293 400 738 1135 960 1079 1293 693 1509 961 2412 2007 2300 2123 2664 1749 1843 2688 3055
814 3055 2756 2516 2519 2671 2602 2618 2411 3028 2805 1926 1765 1800 2133 1950 2125 1604 2111 1728 1175 1401 1279 1011
836 1011 1593 622 358 931 47 340 153 -334 319 -465 -881 -479 -1228 -726 -398 -1622 -1178 -1620 -1887 -1361
856 -1361 -2284 -1477 -1297 -2641 -1873 -2178 -2749 -1570 -2064 -2479 -1506 -2483 -2158 -1940 -2710 -1499 -2130 -2507 -1272
$$ packed form
715A141j532P22q26o31J982q59p85K25j152R87j28r03J021m12k47N24j645Q07
733a711P73q09L61j59p52P12m78j84J009n28j12Nq76J200j64N3J89k19j61l0n75
754b456J81R11n0l40o26N63j60K41j42M87j14R40j167m13J074m59k92M15K56o16
774a767P59n01Q06M70o76J096q45p35J081P24n34m28O24J96m41o48J470K90l0
793I11o92p2J46J07L38L97j75J19K14o00Q16n48J451m05K93j77N41r15R4Q45L67
814C055k99k40LJ52o9J6k07O17k23q79j61L5L33j83J75n21N07l83n53K26j22k68
836A011N82r71k64N73q84K93j87m87O53p84m16M02p49N02L28j224M44m42k67N26
856a361r23Q07J80j344P68l05n71J179m94m15R73r77L25K18p70J211o31l77J235
$$ plain form
875 -1272 -2432 -2032 -1486 -2601 -1156 -1253 -2062 -1182 -1706 -1470 -347 -1590 -963 -181 -1323 -166 -763 -1208
893 -1208 640 -449 -146 592 -1099 487 627 -427 1291 357 54 1585 123 807 1375 165 1713
910 1713 964 150 1888 226 1019 2367 380 1401 1422 182 2390 858 424 2127 225 1593 1769
927 1769 -415 1614 1427 426 2326 137 224 2173 72 1293 1496 -410 1843 592 -88 1884
943 1884 -1 754 1906 -94 1247 687 -387 1922 405 334 1357 -812 1029 1373 -1226 1176
959 1176 314 19 1884 -948 -39 1285 -732 1269 397 -1407 1231 -475 -662 1152 -1360 156
975 156 709 -1387 529 -1001 -1553 1031 -1477 -597 -163 -2300 295 -292 -1942 71 -1855 -1345 182
992 182 -2418 -1307 -493 -2339 -26 -1277 -2615 -29 -2256 -1404 -84 -2897 -1000 -1084 -2405 -208
$$ packed form
875a272j160M00N46j115J445r7q09Q80n24K36J123j243O27P82j142J157n97m45
893a208J848j089L03P38j691J586J40j054J718r34l03J531j462O84N68j210J548
910A713p49q14J738j662P93J348j987J021K1j240K208j532m34J703j902J368J76
927A769k184K029j87j001J900k189Q7J949k101J221K03j906K253j251o80J972
943A884j885P55J152k000J341n60j074K309j517p1J023k169J841L44k599K402
959A176q62k95J865k832R09J324k017K001q72j804K638j706j87J814k512J516
975A56N53k096J916j530n52K584k508Q80M34k137K595n87j650K013j926N10J527
992A82k600J111Q14j846K313j251j338K586k227Q52J320k813J897q4j321K197
$$ plain form
1008 -208 -1983 -2280 -244 -2224 -1056 -226 -2611 289 -677 -1603 551 -1714 -844 704 -1628 210
1024 210 -150 -1532 1125 -311 -715 1048 -869 864 1327 -1084 1226 666 22 2170 -216 607 2177
1041 2177 -1 1583 1555 118 2244 1472 888 2468 540 1514 2372 606 1965 1433 550 2342 1078
1058 1078 950 2368 454 1826 1830 444 1938 710 411 2358 82 402 1302 -283 1595 462 -410
1075 -410 1450 281 118 952 -1006 246 664 -824 828 -457 -898 779 -731 -506 109 -1415 -4
1092 -4 -301 -1356 -8 -1039 -848 466 -1384 -617 -338 -1440 101 -711 -1454 -291 -1221 -695 134 -1385
1110 -1385 -169 -210 -1274 116 -1020 -1177 -139 -858 -397 -226 -1400 -148 -451 -910 44 -767 -636 -88
1128 -88 -1187 -383 -305 -962 165 -645 -654 -95 -900 -338 13 -945 -239 -469 -700 20 -687 -775 1 -631 -30
$$ packed form
1008b08j775k97K036j980J168Q30k385K900r66r26K154k265Q70J548k332J838
1024B10l60j382K657j436m04J763j917J733M63k411K310n60o44K148k386Q23J570
1041B177k178J584k8j437K126p72n84J580j928R74Q58j766J359n32q83J792j264
1058A078j28J418j914J372Mj386J494j228k99J947k276L20R00j585J878j133q72
1075d10J860j169j63Q34j958J252M18j488J652j285m41J677j510K25O15j524J411
1092dk97j055J348j031J91J314j850P67K79j102J541q12p43J163r30N26Q29j519
1110a385J216m1j064J390j136j57J038p19M61J71j174J252l03m59R54q11J31N48
1128h8j099Q04P8o57J127q10rN59q05N62L51r58P06k30k31P20p07q8P76o32O01
$$ plain form
1149 -30 -79 -925 -189 -344 -517 342 -777 -191 80 -701 17 21 -110 444 6 48 563 -335 245 417 18
1170 18 515 581 15 1052 640 407 945 387 1015 1021 740 660 527 1011 992 822 870 1132 684 1073 892 761
1192 761 1454 1087 971 1280 847 1023 894 664 932 1039 970 1068 509 858 618 445 688 528 376 672 11
1213 11 217 167 -83 75 -267 -69 73 -335 -545 -171 -683 -565 -555 -677 -549 -549 -925 -763 -1012 -964 -817 -973
1235 -973 -1130 -1097 -793 -1078 -1150 -1080 -796 -1121 -834 -781 -964 -1134 -890 -971 -814 -625 -1215 -908 -601 -591 -576 -594 -328
1258 -328 -317 -489 -375 -236 -203 13 -68 -61 -98 -88 233 -33 172 230 108 6 170 229 403 368 312 449 316 346
1282 346 346 261 603 235 449 535 449 286 426 193 210 535 371 636 173 347 502 318 138 371 177 391
1304 391 389 182 324 477 349 225 169 79 495 -100 115 -188 67 171 35 428 141 129 526 372 -116 126
$$ packed form
1149c0m9q46P36j55j73Q59j119N86K71p81P18Mj31N54m38M2N15q98N80J72l99
1170A8M97O6n66J037m12k33N38n58O28Ok81q0j33M84j9j70M8K62m48L89j81j31
1192G61O93l67j16L09m33J76j29k30K68J07o9R8n59L49k40j73K43j60j52K96o61
1213A1K06n0k50J58l42J98J42m08k10L74n12J18J0j22J28%l76J62k49M8J47j56
1235i73j57L3L04k85p2P0K84l25K87N3j83j70K44q1J57J89n90L07L07J0J5j8K66
1258c28J1j72J14J39L3K16q1Pl7J0L21k66K05N8j22j02J64N9J74l5n6J37j33L0
1282C46%q5L42l68K14Q6q6j63J40k33J7L25j64K65m63J74J55j84j80K33j94K14
1304C91kk07J42J53j28j24n6r0M16n95K15l03K55J04j36L93k87j2L97j54m88K42
$$ plain form
1326 126 171 -47 468 163 407 406 95 394 213 166 593 221 381 405 -101 347 254 193 644 -47 -81 411 224
1349 224 248 379 -256 265 15 -232 -232 -235 -189 252 -339 -240 -258 -293 83 -932 -354 -279 -712 -322 -395 -1019 -13
1372 -13 -573 -745 -357 -634 -444 -377 -929 -214 -492 -830 -340 -686 -792 -208 -918 -399 -557 -678 3 -696 -499
1393 -499 -79 -586 -458 -7 -547 116 30 -753 341 -206 -387 545 -426 286 692 -261 533 269 88 867
1413 867 296 574 951 9 808 693 60 947 465 113 1314 24 593 832 35 1119 748 273 938
1432 938 7 518 962 -102 660 749 -56 837 104 167 625 -130 157 726 -657 459 212 -319 375 -470
1452 -470 -418 523 -183 -94 -84 -1150 139 -522 -523 82 -1014 -132 214 -944 -19 -216 -681 374 -477 -712
1472 -712 17 -633 55 46 -851 -48 -338 -536 396 -974 -74 554 -906 295 -20 -558 735 -233 -137 659
$$ packed form
1326A26M5k18N15l05K44jl11K99j81m7M27l72J60K4n06M48r3o1M51o91l4M92j87
1349B24K4J31o35N21k50k47%lM6M41n91R9j8l5L76j015N78P5m33L90p3o24J006
1372a3n60j72L88k77J90O7n52P15k78l38M90l46j06N84p10N19j58j21O81o99J97
1393d99M20n07J28M51n40O63q6p83J094n47j81R32r71P12M06r53P94k64j81P79
1413H67n71K78L77r42P99j15o33Q87m82l52J201j290N69K39p97J084l71m75O65
1432I38r31N11M44j064P62Q9q05Q93p33O3M58p55K87N69j383J116k47n31O94q45
1452d70N2R41p06Q9J0j066J289o61jO05j096Q82L46j158R25j97m65J055q51k35
1472g12P29o50O88rq97Q03k90j98R32j370R00O28j460J201l15n38J293r68R6P96
$$ plain form
1492 659 -606 103 516 -634 283 80 -375 542 -304 80 522 -945 583 256 -473 751 -319 -112
1510 -112 560 -734 146 164 -414 381 244 -711 525 -265 114 553 -703 100 315 -642 416 -463 -536
1529 -536 474 -711 174 148 -946 222 -72 -452 251 -808 -69 370 -426 115 329 -431 499 -7 -166
1548 -166 225 -72 242 263 -292 320 498 -94 717 83 397 529 -270 617 517 -295 822 6 87 951
1568 951 -226 588 600 -97 451 341 -268 510 38 132 631 -313 304 580 -176 529 -13 -154 303 -111
1588 -111 -25 502 -426 137 -167 -481 -84 -164 -426 148 -697 -417 -112 -858 194 -529 -600 -82 -995 -316 34
1609 34 -788 -384 -732 -589 -170 -301 -520 -219 -607 -340 -235 -775 -178 0 -498 -8 -122 -354 107 -289
1629 -289 394 116 -122 278 2 154 515 -162 297 323 25 304 193 21 607 332 349 402 289 538 507
$$ packed form
1492F59j265P09M13j150R17k03m55R17q46L84M42j467J528l27p29J224j070K07
1510a12O72j294Q80J8n78P95j37r55J236p90L79M39j256Q03K15r57J058q79p3
1529e36J010j185Q85k6j094J168k94l80P03j059P39M39p96N41K14p60R30n06j59
1548a66L91k97L14K1n55O12J78n92Q11o34L14J32p99Q87j00q12J117q16Q1Q64
1568I51j177Q14J2o97N48j10o09P78m72R4M99r44O17K76p56P05n42j41M57m14
1588a11Q6N27r28N63l04l14L97q0k62N74q45K80L05p46J052p23p1N18r13O79L50
1609C4q22M04l48J43M19j31k19L01l88K67J05n40N97J78m98M90j14k32M61l96
1629b89O83k78k38M00k76J52L61o77M59K6k98K79j11j72N86k75J7N3j13K49l1
$$ plain form
1650 507 74 580 113 279 620 411 396 307 330 338 468 238 581 135 27 300 -45 35 430 -193 298 172
1672 172 148 85 -250 -84 -69 -49 116 -58 -50 116 -211 -112 -77 -325 -55 -25 -395 -182 -71 -433 116 -263 -362
1695 -362 -2 54 -235 -300 -4 -155 157 -198 127 -203 -330 -331 -437 42 -2 80 140 165 95 82 95 19 106 -97
1719 -97 87 160 -117 39 -73 20 -2 -205 -79 168 -12 216 -356 -134 173 -10 185 -75 -108 -112 -81 -335 -146
1742 -146 -126 -290 -112 -263 -303 -12 -358 -361 -117 -156 -298 -203 -59 -71 -233 -73 22 -141 -135 -179 -362 -163 -382 -157
1766 -157 -189 -133 -104 201 -316 63 -160 90 -34 -286 517 -89 3 432 198 283 373 210 325 356 171 384
1788 384 326 342 301 183 362 516 98 247 278 177 228 261 216 290 73 221 179 -24 198 43 157 200 27
1811 27 -73 100 -252 -45 -32 -270 18 83 -222 -41 -262 26 -168 -337 -98 -400 -518 8 -567 -681 -330
$$ packed form
1650E07m33N06m67J66L41k09j5q9K3QJ30k30L43m46j08K73l45Q0L95o23M91j26
1672A72k4o3l35J66J5K0J65j74QJ66l27R9L5k48K70L0l70K13J11l62N49l79r9
1695c62L60N6k89o5K96j51L12l55L25l30j27jj06M79m4Q2O0K5p0j3J3p6Q7k03
1719i7J84P3k77J56j12R3k2k03J26K47j80K28n72K22L07j83J95k60l3mL1k54J89
1742a46K0j64J78j51m0K91l46lK44l9j42R5J44j2j62J60R5j63Om4j83J99k19K25
1766a57l2N6K9L05n17L79k23K50j24k52Q03o06R2M29k34Q5R0j63J15L1j85K13
1788C84n8J6m1j18J79J54m18J49L1j01N1L3m5P4k17J48m2k03K22j55J14M3j73
1811B7j00J73l52K07J3k38K88O5l05J81k21K88j94j69K39l02j18N26n75j14L51
$$ plain form
1832 -330 -532 -215 -252 -472 -258 -517 -586 -184 -434 -152 -179 -601 -127 -361 -529 -31 -341 -63 245 -334 -150
1853 -150 -283 -333 -58 -299 -37 414 -63 -32 162 -368 710 117 -112 506 49 204 241 -299 771 355
1873 355 -131 452 213 186 488 -82 121 466 188 512 527 -16 505 0 210 413 28 355 322 -378 565
1894 565 187 169 324 -159 32 -17 -304 91 10 -166 86 -494 -217 -84 -338 -42 140 -527 69 -159 -113
1915 -113 136 -280 -80 138 -484 139 -114 -255 147 -534 -454 144 -413 291 90 -336 79 -343 -189 824
1935 824 -334 -37 301 -217 172 -43 -285 469 246 -89 695 -172 224 95 -472 335 134 -276 550 -312
1955 -312 47 332 -186 304 162 -300 166 -365 -111 241 -526 -212 -49 -439 249 -78 -408 107 -243 -71
1975 -71 77 -388 64 -31 -443 477 -179 -595 123 -523 63 157 -503 -80 -172 -287 423 -434 -128 351 -364
$$ packed form
1832c30k02L17l7k20K14k59o9M02k50K82k7m22M74k34j68M98l10K78L08n79J84
1853a50j33n0K75k41K62M51m77L1J94n30J078n93k29O18m57J55L7n40J070m16
1873C55m86N83k39k7L02n70K03L45k78L24J5n43N21n05K10K03l85L27l3p00R43
1894E65l78j8J55m83J91m9k87L95q1j76K52n80K77J33k54K96J82o67N96k28M6
1915a13K49m16K00K18o22O23k53j41M02o81Q0N98n57P04k01m26M15m22J54J013
1935H24j158K97L38n18L89k15k42P54k23l35P84q67L96j29n67Q07k01m10Q26q62
1955c12L59K85n18M90j42m62M66n31K54L52p67L14J63l90O88l27l30N15l50J72
1975g1J48m65M52r5m12R20o56m16P18o46N86R4o60M23r2j15P10q57L06M79p15
$$ plain form
1996 -364 270 54 -144 361 -147 -116 172 -78 253 427 -88 466 306 -157 484 26 230 650 -1 498
2016 498 334 -195 595 300 95 357 -82 253 248 -168 500 204 -225 535 200 -63 509 45 162 301 -207
2037 -207 126 -57 -115 352 -586 -19 49 -377 -59 -366 -604 106 -94 -369 -10 -584 -275 -252 -675 -199 -21
2058 -21 -715 207 -515 -444 54 -398 50 -22 -415 138 -233 -310 73 -538 42 192 -248 -44 -183 -117 106 -63
2080 -63 47 198 -145 -89 197 -126 300 -20 -27 393 89 -70 441 -124 418 472 -20 424 39 196 221 126
2102 126 125 302 25 272 176 52 173 -59 116 253 -124 49 30 -220 348 -155 -88 278 -100 -37 -103 -206
2124 -206 34 30 -97 174 -289 -233 -237 -357 -53 -2 -59 -145 -99 -228 6 -161 -29 -212 -191 -345 -90 -31 170 -64
2148 -64 -64 -58 11 189 209 -31 74 -118 -277 -36 277 -54 195 -2 157 48 -201 71 51 207 -14 168 132
$$ packed form
1996c64O34k16j98N05n08L1K88k50L31J74n15N54j60m63O41m58K04M20o51M99
2016D98j64n29P90k95k05K62m39L35nm16O68k96m29P60l35k63N72m64J17J39n08
2037b07L33j83n8M67r38N67O8m26L18l07k38P10k00k75L59n74L09K3m23M76J78
2058b1o94R22p22P1M98m52M48p2l93N53l71p7L83o11N80J50m40K04j39O6K23j69
2080f3J10J51l43N6K86l23M26l20pM20l04j59N11n65N42N4m92M44l85J57K5r5
2102A26jJ77k77K47r6j24J21k32J75J37l77J73j9k50N68n03O7L66l78O3o6j03
2124b06K40mj27K71m63N6mj20L04N1n7q6M6j29K34j67J32j83K1j54K55N9K01k34
2148f4%OO9J78K0k40J05j92j59K41L13l31K49j97J59j09k49K72k0J56k21J82l6
$$ plain form
2171 132 216 -107 108 264 47 294 109 -21 256 127 -133 382 111 260 -30 -215 -264 290 -184 -129 62
2192 62 -89 -197 -218 -203 -194 -223 -27 -204 18 -64 -283 -247 -200 -297 -377 -10 -180 -247 -350 -10 -249 -463 -24 -43
2216 -43 -341 -208 69 -91 -59 37 -63 70 -163 -33 16 22 3 244 94 296 327 88 375 282 167 422 374
2239 374 115 114 126 201 165 132 135 283 146 202 75 138 349 91 147 -29 79 83 26 -183 201 289 81 -83 319
2264 319 -163 193 50 -82 -86 -31 -153 -31 -82 -263 42 -320 47 -14 -128 142 -51 99 -10 -465 -137 -52
2286 -52 -271 -42 20 -357 -161 -237 -94 -62 -93 135 -102 -157 -36 -93 -23 99 -81 -35 153 -95 -107 30 -72
2309 -72 142 153 -66 324 -47 198 208 0 222 165 125 21 226 310 356 -75 141 185 10 252 -16 -86 415
2332 415 224 104 -55 -74 182 188 28 -16 -26 -224 163 -10 -133 -43 -234 40 77 -101 329 -239 -194 118 -530
$$ packed form
2171A32Q4l23K15J56k17K47j85j30K77j29k60N15k71J49k90j85m9N54m74N5J91
2192F2j51j08k1J5Rk9J96j77K22q2k19L6M7r7q0L67j70o7j03L40k39k14M39j9
2216d3k98J33K77j60L2R6j00J33k33J30M9Oj9K41j50K02L1k39K87r3j15K55m8
2239C74k59jJ2P5l6l3LJ48j37N6j27O3K11k58N6j76J08Mn7k09L84Q8k08j64M02
2264C19m82L56j43j32mN5j22J22n1j81L05l62L67o1j14K70j93J50j09m55L28Q5
2286e2k19K29O2l77J96p6J43L2l1K28k37n5J21n7P0J22j80M6J88k48j2J37j02
2309g2K14J1k19L90l71K45J0k08K22n7m0j04K05Q4M6m31K16M4j75K42k68p0N01
2332D15j91j20j59j9K56Oj60m4j0j98L87j73j23R0j91K74L7j78M30n68M5L12o48
$$ plain form
2355 -530 14 -48 -336 60 -497 2 -87 -378 -89 -88 -536 130 -20 -244 170 -599 -375 9 118 26 47 -192
2377 -192 367 -179 144 145 76 9 387 34 30 -22 -141 331 40 -82 388 -145 299 178 -83 564 -69 161
2399 161 397 -54 318 566 -237 117 55 94 44 8 -171 150 37 -98 241 -294 150 -34 -318 20 -19 -219
2421 -219 -65 -269 174 -47 -628 -188 -317 -182 -67 -310 62 -161 -280 24 -182 -199 128 -446 -247 80
2441 80 -344 -91 -34 -243 70 -127 -373 116 -265 -67 48 -172 -49 -123 70 187 -65 51 125 -123 154
2462 154 172 -72 335 162 -28 286 -8 273 418 135 270 26 146 225 -138 -24 445 -158 123 46 -306
2483 -306 177 169 23 8 18 29 75 -215 -20 239 -122 99 -339 -124 99 23 -261 60 -376 166 -22 -305
2505 -305 184 -61 -171 44 -224 -265 -19 -395 52 -366 -183 -6 -242 -26 -44 -313 13 -300 -54 154 45
$$ packed form
2355e30N44o2k88L96n57M99q9k91K89Jm48O66j50k24M14p69K24L84J09r2K1k39
2377a92N59n46L23Jo9o7L78l53mn2j19M72k91j22M70n33M44j21k61O47o33K30
2399A61K36m51L72K48q03L54o2L9n0l6j79L21j13j35L39n35M44j84k84L38l9k00
2421b19J54k04M43k21n81M40j29J35J15k43L72k23j19L04k06j7L27n74J99L27
2441H0m24K53N7k09L13j97k46M89l81J98J15k20J23p4J93J17k52J16P4k48K77
2462A54J8k44M07j73j90L14k94K81J45k83J35k44J20P9l63J14M69o03K81p7l52
2483c06M83qj46j5J0J1M6k90J95K59l61K21m38K15K23p6k84L21m36N42j88k83
2505c05M89k45j10K15k68m1K46l76M47m18J83J77k36K16j8k69L26l13K46K08j09
$$ plain form
2526 45 -341 294 -235 -7 -164 -148 314 69 182 78 169 -11 180 57 112 257 234 235 -163 53 225 -99
2548 -99 301 269 181 225 117 70 214 8 -2 80 -42 259 277 -199 -29 -36 -82 -59 -174 -309 222 -163 15 103
2572 103 -107 -13 -147 -206 -182 10 186 -28 -49 -25 -179 -62 -218 -129 91 52 65 -21 -80 -286 -314 -113 -56 127
2596 127 78 99 195 -202 229 63 317 150 -70 171 -152 67 -264 294 -19 220 -43 7 36 81 134 103 70
2619 70 270 3 87 439 191 135 247 -146 101 238 144 -150 -79 45 123 41 -40 180 10 114 195 -196 -38
2642 -38 -98 -7 45 77 -314 106 -86 -217 38 -89 -4 -24 31 22 -11 9 202 -108 18 -372 -107 -150 31 -177
2666 -177 -15 52 352 -242 -9 -235 -23 90 32 -50 143 91 291 127 106 -9 285 134 35 116 66 184 200
2689 200 -10 106 185 18 -28 -44 256 312 214 253 160 265 140 230 -137 -103 209 202 125 138 209 243 55 64 -67 -190
$$ packed form
2526D5l86O35n29K28j57J6M62k45J13j04R1j80J91j23N5J45k3Jl98K16J72l24
2548i9M00l2q8M4j08m7J44k06j0Q2j22L01J8m76J70pm6K3j15j35N31l85J78Q8
2572A03k10R4j34n9K4J92J76k14k1K4j54J17j56Q9K20l9J3q6n9k06k8K01N7J83
2596A27m9K1R6l97M31j66K54j67k20K41l23K19l31N58l13K39k63N0K9M5N3l1l3
2619G0K00k67Q4L52k48n6J12l93K47J37r4k94P1J24P8q2q1K20j70J04Q1l91J58
2642c8o0R1N2L2l91M20j92j31K55j27Q5k0N5rl3K0J93l10J26l90K65m3J81k08
2666a77J62O7L00n94K33k26K12J13n8q2J93n2K00j64k1j15K94j51r9Q1n0J18J6
2689B00k10J16P9j67m6j6L00N6r8L9r3J05j25R0l67L4L12pp7J3P1L4j88Rj31j23
$$ plain form
2715 -190 60 -33 81 -99 56 11 -230 -46 84 -173 -129 -103 -93 -167 -119 -157 97 -19 -218 -141 -328 64 -286
2738 -286 29 -327 -392 -41 -135 -389 -156 -96 82 -83 -119 115 113 -44 29 57 169 216 -304 64 46 -89 265
2761 265 -157 -57 -85 -131 213 152 204 -20 164 40 -26 125 100 213 238 5 189 -75 -8 249 260 133 -122
2784 -122 -97 -126 -58 124 136 -122 -268 -154 -79 65 82 -147 -132 -132 -325 -127 -183 -33 -49 -4 -147 -114 -252 -388
2808 -388 -296 -349 61 -405 94 80 -25 -127 -279 10 -26 -62 -41 132 -330 38 -193 141 119 309 176 -4
2830 -4 -13 -75 1 -18 61 97 267 241 30 176 78 161 -9 234 -12 -187 146 74 22 -40 333 -1 69 363 62
2855 62 188 -64 58 191 30 49 -68 -189 -90 108 -64 -29 -130 64 -86 -19 -15 110 -189 -130 -73 10 -60 -246
2879 -246 -292 -73 -45 147 -244 -250 -105 50 -462 -83 -205 -145 7 -82 -271 -120 -165 -83 253 88 -88 -164 -397
$$ packed form
2715a90K50r3J14j80J55m5k41J84J30k57M4K6J0p4M8l8K54j16j99P7j87L92l50
2738b86L15l56o5L51r4k54K33O0J78j65l6K34kj57P3K8J12M7n20L68j8j35L54
2761B65m22J00k8m6L44o1N2k24J84j24o6J51k5J13K5k33J84k64O7K57J1j27k55
2784a22K5k9O8J82J2k58j46J14P5J44J7k29J5%j93J98n6J50j6M5j43L3j38j36
2808c88R2n3M10m66M99j4j05j02j52K89l6l6K1J73m62L68k31L34k2J90j33j80
2830dro2P6j9P9L6J70k6k11J46r8Q3j70K43k46j75L33p2n2o2L73l34P0K94l01
2855F2J26k52J22J33j61J9j17j21R9J98j72L5j01J94j50O7MJ25k99N9N7Q3p0j86
2879b46m6K19K8J92l91oJ45J55n12L79j22O0J52q9j89J51m5Q2L36j65j76p6k33
$$ plain form
2902 -397 59 65 154 215 63 1 87 -15 196 78 -33 29 -79 -75 236 304 43 139 128 300 -75 349 42 108
2926 108 131 250 88 107 -8 41 -1 -56 176 -184 -56 120 5 -77 138 -191 -9 55 -232 -61 -34 -111 -194
2949 -194 -81 -307 -39 112 -60 19 -118 37 -162 102 -83 1 0 -48 -151 42 -205 -292 -52 -237 -86 231
2971 231 -89 -101 155 -225 175 -103 -66 78 186 124 72 -64 -53 124 173 2 -141 241 -52 226 -21 203
2993 203 26 151 289 141 345 29 313 123 216 -121 243 57 4 131 42 -96 28 178 123 7 80 -8
3015 -8 24 -202 -168 96 51 19 -248 -117 -3 -104 -140 11 -35 -95 -15 35 -183 -178 -244 -74 -58 6 35 2 197 -69
3041 -69 -103 46 -43 -222 -42 -108 79 -17 -5 -15 -69 -310 119 -56 -58 -55 191 204 49 11 189 -1 -40 -62 126
3066 126 106 190 -33 273 24 40 304 87 40 139 212 77 111 129 143 144 26 -43 211 14 169 -41 -191 70
$$ packed form
2902c97M56OQ9O1j52o2Q6j02K11j18j11O2j08ML11O8k61R6j1J72l75M24l07O6
2926A08K3J19j62J9j15M9m2n5K32l60J28J76j15q2K15l29J82O4k87J71K7p7q3
2949a94J13k26K68J51j72P9j37J55j99K64j85Q4jm8j03J93k47q7K40j85J51L17
2971B31l20j2K56l80M00k78L7J44J08o2n2j36J1J77M9j71j43L82k93K78k47K24
2993B03j77J25J38j48K04l16K84j90R3l37L64j86n3J27q9j38J24J50n5j16P3q8
3015hL2k26L4K64m5l2k67J31J14j01l6J51m6o0Q0N0k18No6J70J6O4K9l3J95k66
3041f9l4J49q9j79J80o6J87r6J2j0n4k41M29j75kLK46J3j55l8J78j90l9k2J88
3066A26k0Q4k23L06k49J6K64k17m7R9P3j35L4J8J4Jj18o9K54j97J55k10j50K61
$$ plain form
3090 70 -38 -16 -41 -119 -11 105 -99 -50 -116 -372 -302 -89 -23 -72 -28 -101 -151 -229 44 54 82 11 -4 -176 -282 -331
3116 -331 -111 19 17 122 -46 -142 -147 93 -188 -107 -107 0 -61 201 130 94 -177 110 59 37 -126 -66 -164 -49 269
3141 269 264 163 49 9 67 178 176 142 186 28 -22 158 192 -116 28 97 -232 -35 -70 78 -152 287 -163 1
3165 1 16 -263 -126 -210 174 -66 7 -76 -159 145 -64 87 -73 -118 -245 -5 -73 -171 34 -157 -191 -95 -182 -97 -77
3190 -77 154 -225 -115 120 -180 137 -177 94 -47 95 26 -49 58 119 -203 280 83 118 125 -97 360 -15
3212 -15 272 -15 131 -37 22 1 117 -17 271 115 -14 43 -27 147 -45 195 -50 109 43 -168 -3 44
3234 44 -58 -146 -46 253 269 18 -114 -304 70 12 26 -104 -230 28 -135 -245 23 -321 -192 -200 -134 241 10
3257 10 4 -135 -45 49 -73 121 22 -43 -121 -89 -18 -48 187 -328 -427 130 -26 -93 -129 127 13 -23 118 94 98 13
$$ packed form
3090G0j08K2k5p8J08J16k04M9o6k56P0K13O6m9M4p3n0p8K73J0K8p1j5j72j06m9
3116c31K20J30kJ05j68r6nK40k81Q1%J07o1K62p1l6k71K87n1k2j63O0r8J15L18
3141B69nj01j14m0N8J11kl4M4j58n0J80L4l08J44O9l29J97l5J48k30M39m50J64
3165AJ5k79J37q4L84k40P3q3q3L04k09J51j60m5j27K40o8r8K05j91l4R6q7Q5K0
3190g7K31l79J10K35l00L17l14K71j41J42o9p5J07O1l22M83j97L5Pk22M57l75
3212a5K87k87J46j68N9k1J16j34K88j56j29N7p0J74j92K40k45J59o6k11J65M7
3234D4j02q8J00K99J6k51j32j90L74n8J4j30j26K58j63j10K68l44J29qO6L75k31
3257A0oj39R0R4j22J94r9o5p8L2P1l0K35n15r9N57j56o7l6K56j14l6J41k4Mq5
$$ plain form
3283 13 -46 -26 109 139 70 150 209 177 144 132 81 183 -63 27 33 360 59 -290 77 -89 -58 -19 64 15 -196 -129
3309 -129 -69 -131 -196 98 -164 21 133 220 98 -80 -212 -256 54 -181 -200 -84 308 -48 -181 -336 -155 98
3331 98 -221 -382 -175 -115 20 53 175 148 -87 -158 -147 -62 177 25 -17 -53 232 -189 -136 -74 206 112 -117 -63
3355 -63 43 153 -108 32 -1 -36 138 229 11 161 -51 325 -150 116 -162 102 138 -43 156 -79 3 67
3377 67 142 -174 -96 26 -51 170 -121 -129 -89 95 -12 134 -62 -52 -90 -156 43 -76 282 -170 121 -235 -7
3400 -7 -142 145 -357 -37 98 -12 186 -149 -21 72 -17 -60 132 -90 -269 106 94 14 -3 22 -21 186 -104
3423 -104 -61 239 46 -30 -26 -77 -114 82 235 21 -119 -65 -12 281 223 152 -42 -27 232 267 -100 54 362 -125
3447 -125 123 139 -169 32 130 62 -188 -31 106 125 22 173 -83 85 -61 -14 -183 4 27 -30 77 -37
$$ packed form
3283A3n9K0J35L0o9Q0N9l2l3j2n1J02k46R0OL27l01l49L67j66L1L9Q3m9k11O7
3309a29O0o2o5K94k62J85J12Q7j22j78j32m4L10k35j9J16L92l56j33j55J81K53
3331I8l19j61K07O0J35L3J22k7k35p1J1Q5K39j52m2l6K85m21N3O2K80r4k29N4
3355f3J06J10k61J40l3l5J74R1k18J50k12L76m75K66k78K64L6j81J99k35Q2O4
3377F7P5l16P8J22p7K21k91qM0J84j07J46j96J0l8o6J99j19L58m52K91l56K28
3400gj35K87n02L20J35j10J98l35J28R3q9m3J92k22j79L75j2q0j7K5m3K07k90
3423a04M3L00j93p6Mn1l7J96J53k14j40N4N3K93n8p1j94J5K59L5l67J54L08m87
3447a25K48J6l08K01R8o8k50J57J37J9j03J51k56J68j46M7j69J87K3n7J07j14
$$ plain form
3469 -37 31 -50 -18 -131 -63 -146 -195 -150 -78 -31 -11 -227 -46 -355 -182 -64 -74 -137 -179 -4 -19 -41 -179 -172 -75 4 -302
3496 -302 -62 299 47 4 78 87 11 144 -61 -51 40 179 279 -101 192 1 70 -8 143 -45 -118 217 -3
3519 -3 211 156 -96 274 197 -63 218 90 -85 3 -88 79 41 151 -5 7 24 10 265 114 -104 -309 64
3542 64 146 120 -48 -52 -260 -219 100 20 -117 112 -218 13 -60 -112 -85 -31 -130 -169 1 -53 -155 -37 103 133 96
3567 96 -249 -109 -99 87 -132 -28 -26 33 -104 32 53 290 141 -24 -67 94 -48 142 12 130 37 152 54
3590 54 7 225 51 -247 44 53 -22 175 -87 159 112 16 -14 88 -17 75 12 -14 35 25 25 19 -335 -2 95 -47
3616 -47 -159 115 -158 -158 93 186 6 -131 95 -253 -82 66 -92 -303 -193 5 -214 21 -252 56 -173
3637 -173 -301 9 -105 -41 -211 230 -170 -49 -32 -185 -2 -6 -54 142 218 69 5 186 73 50 22 159 -38
$$ packed form
3469c7O8q1L2j13O8q3m9M5P2M7K0k16J81l09J73J18j0o3m2J75j5k2j38PR7P9l06
3496c02K40L61k52m3P4Rp6J33k05J0R1J39J00l80K93j91O9p8J51j88p3L35k20
3519cK14n5k52L70p7k60K81j28j75Q8r1J67l8J10j56J2J7j4K55j51k18k05L73
3542F4Q2k6j68mk08M1L19q0j37K29l30K31p3n2K7N4r9l9J70n4j02J18J40L0l7
3567I6l45J40J0J86k19J04KN9j37J36K1K37j49j65m3J61j42J90j30J18r3J15r8
3590E4m7K18j74k98K91Rp5J97k62K46m7r6l0J02j05R2o3k6M9j0%ol54L33R7j42
3616d7j12K74k73%K51R3j80j37K26l48J71J48j58k11J10J98k19K35k73L08k29
3637a73j28L10j14O4j70M41m00J21J7j53J83mm8J96P6j49o4J81j13k3k8J37j97
$$ plain form
3660 -38 100 -118 200 277 121 319 42 21 -147 90 148 193 202 58 83 15 -46 -73 -222 176 -69 -76 7 -128 3
3685 3 196 -1 439 -29 -35 168 53 -130 380 -103 445 -164 91 -489 -284 -18 -177 32 -123 -181 22 19
3707 19 -98 -42 -139 120 -234 -17 139 -30 -43 -23 -61 -160 52 241 -222 61 160 88 14 -37 -160 50 54 -153
3731 -153 -109 -98 33 98 -18 79 117 -9 -43 44 87 -126 211 70 -224 97 326 54 150 67 -104 189 -64
3754 -64 -16 121 101 155 -56 -37 75 134 223 -17 231 -73 45 250 -204 -313 -1 -123 -12 -39 19 99 188 -54
3778 -54 -75 156 -100 -44 -98 -50 -66 101 -55 -11 -9 144 -165 -98 -240 98 215 13 -419 -140 -239 -181 80 257
3802 257 -159 -309 -252 81 151 85 -11 -32 -214 179 188 7 120 73 44 135 42 -21 -154 236 134 -43 56 51 300
3827 300 68 -103 100 14 -80 31 -27 39 88 41 -136 -29 -303 34 -30 59 -331 59 -122 200 27 -215 14
$$ packed form
3660c8J38k18L18P7j56J98k77k1j68K37N8M5Rj44K5o8o1k7j49L98k45pQ3j35J31
3685CJ93j97M40m68oK03j15j83N10m83N48o09K55n80K05K66j59K09j55n8K03l
3707A9j17N6r7K59l54K17J56j69j3K0l8r9K12J89m63K83R9p2p4n1j23K10Mk07
3731a53M4J1J31O5j16R7L8j26l4Q7M3k13L37j41k94L21K29k72R6q3j71K93k53
3754f4M8J37k0N4k11J9J12N9Q9k40K48l04J18K05m54j09L12j22J11k7N8Q0Q9k42
3778e4k1K31k56N6n4M8j6J67j56M4KJ53l09O7j42L38J17k02m32K79r9N8K61J77
3802B57m16j50N7L33P0o6r6k1j82L93Rj81J13m7k9R1r3o3j33L90j02j77R9nK49
3827C00k32j71K03q6r4J11n8O6M9m7j77J07k74L37o4Q9l90L90j81L22j73k42K29
$$ plain form
3850 14 -92 33 -110 -75 -28 -304 51 55 -116 -89 -178 -93 19 -52 28 -32 -9 -137 79 108 -197 80 11 116 -12
3875 -12 -37 110 -21 -259 232 89 188 2 -15 -62 53 191 -151 100 6 91 162 184 -118 23 -215 180 240
3898 240 -113 -80 132 228 53 111 259 96 -164 -244 46 7 249 -159 -333 -236 -64 109 -91 -198 -86 -33
3920 -33 -48 -236 -212 -57 -272 71 4 19 -38 -160 -123 -143 -17 -146 75 -159 149 5 153 -192 -97 143 -151
3943 -151 -191 -126 95 76 100 83 331 74 121 89 -8 -52 108 130 23 318 126 91 112 47 -119 -95 110 160 -127
3968 -127 190 53 62 149 -112 148 1 -30 -54 -70 -70 -182 49 33 -17 -28 -59 -2 -67 -118 90 46 99 -100 90 -182
3994 -182 105 -43 26 -392 -270 26 44 -124 -251 -154 -162 -125 -145 -206 -103 -15 -2 -161 -31 -127 -21 63 51 -143
4018 -143 -12 -83 -134 315 19 -133 12 73 188 449 152 124 -240 94 -154 -16 -174 -155 112 -321 -197 83
$$ packed form
3850A4j06J25j43L5M7k76L55Mj71K7q9Q5J12p1Q0o0K3j28K16K9l05K77o9J05j28
3875a2k5J47j31k38M91j43R9j86j7m7J15J38l42K51r4Q5P1K2l02J41k38L95O0
3898B40l53L3K12R6j75N8J48j63k60q0K90l9K42m08j74R7J72J73k00j07J12N3
3920c3j5j88K4J55k15L43o7J5n7j22L7k0J26j29K21k34L08j44J48l45R5K40k94
3943a51m0O5K21j9K4j7K48k57M7l2r7m4J60K2j07K95j92l5K1o5j66K4K05N0k87
3968a27L17j37RQ7k61K60j47l1k4j6%j12K31j6n0j1l1N7o5n1K08m4N3j99J90k72
3994a82K87j48O9m18J22K96J8j68j27R7qL7k0o1J03Q8J3j59J30r6J06Q4j2j94
4018a43J31p1n1M49k96j52J45O1J15K61k97k8l64L34k48J38j58J9K67m33J24K80
$$ plain form
4040 83 -164 215 192 193 133 149 -319 65 141 9 -253 -120 -4 68 -48 65 155 -180 90 -96 -99 56 134 166
4064 166 -167 95 -53 -320 -24 -143 -162 88 -17 -32 -125 -115 83 13 59 -126 -36 -68 172 71 -257 52 102
4087 102 -20 -266 8 47 -99 -165 22 204 27 102 61 -42 -153 134 1 100 -84 26 -95 -143 437 78
4109 78 20 -40 174 -56 25 28 19 -30 -74 -66 79 27 -317 -168 112 118 -38 -67 -31 229 -151 75 -15 138 205 63
4135 63 95 -10 47 110 -85 267 -216 -71 216 54 -85 -225 -106 85 79 -18 -152 -67 105 -66 89 -227 -202
4158 -202 258 -144 123 91 -78 -76 -202 -234 -158 -172 -36 -62 -5 143 8 66 93 70 163 -59 156 -166 39 154
4182 154 -26 146 25 -6 92 -11 142 -2 37 -34 21 -122 78 -267 71 97 16 74 -189 -65 -225 -131 94
4205 94 -153 18 60 173 -262 67 -96 -9 43 -149 -149 95 -1 7 186 46 -241 31 118 -89 73 -103 -20 93
$$ packed form
4040H3k47L79k3Jo0J6m68L84P6j32k62J33J16P2j16J13R0l35K70j86lJ55P8L2
4064A66l33K62j48k67K96j19j9K50j05j5r3J0J98p0M6j85R0l2K40j01l28L09N0
4087A02j22k46K74L9j46o6J87J82j77P5m1j03j11K87j33R9j84J10j21m8N80l59
4109G8n8o0K14k30Q1Lrm9m4QJ45n2l44J49K80Oj56k9L6K60l80K26r0J53O7j42
4135F3L2j05N7O3j95L52m83J45K87j62j39j40J19J91or7j34Q5J72j71J55l16K5
4158b02M60m02K67l2j69Kj26l2P6j4J36k6N7J48j35N8K7k3R3k22K15l22K05J15
4182A54j80J72j21l1R8j03J53j44L9p1N5j43K00l45L38K6q1N8k63J24j60R4K25
4205I4k47J71M2J13m35L29j63Q7N2j92%K44r6QJ79j40k87K72Q7k07J62j76Q3J13
$$ plain form
4229 93 -123 -133 99 -129 -70 -139 111 223 -115 38 -17 -220 51 -113 2 -139 149 13 -74 -44 -22 26 -13
4252 -13 33 232 161 -33 -19 73 -8 -268 -10 11 -49 157 315 47 39 253 -125 -25 74 101 174 46 -227 -20
4276 -20 -217 -123 -43 -170 -46 -387 81 -53 73 286 114 126 -8 -225 -97 62 -95 -39 37 -81 93 56
4298 56 -214 -51 193 50 -50 -168 -57 30 35 -3 -235 -199 -121 33 108 76 -259 178 108 -45 -99 -51 -88 153
4322 153 -134 -11 40 123 -183 -11 -31 -37 32 206 243 -154 -100 -8 -2 193 -192 148 199 193 38 188 52 48 129 107
4348 107 185 81 175 -19 -104 -17 28 171 -7 -4 -38 81 92 -226 29 -269 38 -36 -1 12 -14 126 -26 -72 -360
4373 -360 23 16 -242 -111 27 -82 -135 -154 -130 384 265 -35 -5 13 150 216 -95 87 89 -158 64 -46 -121 125
4397 125 -32 160 34 -151 -15 -16 62 -190 141 98 -118 160 9 -23 17 -18 -49 -13 147 200 325 100 251
$$ packed form
4229I3k16j0K32k28N9o9K50J12l38J53n5k03K71j64J15j41K88j36q7L0K2M8l9
4252a3M6J99p1j94J4R2q1k60K58K1o0K06J58k68qK14l78J00R9K7P3j28k73K07
4276b0j97R4Q0j27J24l41M68j34J26K13j72J2j34k17J28J59j57N6P6j18J74l7
4298E6k70J63K44j43j00j18J11Q7Nl8k32L6P8J54P5l2l35M37p0j53n4M8l7K41
4322A53k87J23N1Q3l06J72k0oO9J74L7l97N4R2OJ95l85L40N1oj55J50j36mQ1k2
4348A07P8j04R4j94q5Q7M5J43j78Ll4J19J1l18K55k98L07p4L5J3k6J40j52m6k88
4373c60L83pk58J31J38j09n3j9K4N14j19l00L0J8J37O6l11J82Kk47K22j10p5K46
4397A25j57J92j26j85J36jP8k52L31m3k16K78j51l2M0l5l1L6J60N3J25k25J51
$$ plain form
4420 251 -64 -12 111 50 111 242 62 -52 38 -195 76 -91 -17 22 118 -233 190 36 178 -110 11 143
4442 143 -112 88 -113 -97 152 90 44 -124 159 -99 21 -141 91 -66 207 -193 711 134 307 -105 -943
4463 -943 778 266 582 -57 3 8 104 -241 127 -118 129 131 55 15 119 183 167 35 112 -177 15 -6 -111 434
4487 434 50 53 128 -188 -50 -116 22 77 -4 -104 -62 278 56 -73 222 274 -115 168 -68 -149 4 236 -257
4510 -257 -94 17 -27 39 -10 -293 -42 -107 122 -9 212 -71 -153 114 -104 -241 58 -152 301 -4 -65 -106
4532 -106 61 -84 -277 73 -107 -124 -161 -8 -245 128 -21 -233 31 25 101 -126 -5 -59 -75 -20 -69 5 55 -40
4556 -40 -65 71 21 19 -80 97 -197 125 -8 352 75 95 142 -13 95 47 87 -2 -140 11 23 126 -69 5
4580 5 52 -156 38 64 -140 -91 -14 -19 135 -19 75 -108 132 -107 64 -31 -70 2 -32 154 9 -146 -14 201
$$ packed form
4420B51l15N2J23o1O1J31j80j14R0k33K71j67P4L9R6l51M23j54J42k88J21J32
4442A43k55K00k01J6K49o2m6j68K83k58J20j62K32j57K73m00R04n77J73m12q38
4463i43J721n12L16o39O0NR6l45L68k45K47Kp6m0J04O4j6j32P7k89J92k1j05N45
4487D34l84LP5l16J38o6J38N5q1j00M2L40k22j29K95N2l89K83k36q1J53K32m93
4510b57J63J11m4O6m9k83K51o5K29j31K21k83q2K67k18j37K99k10M53l05o1m1
4532a06J67j45j93L50j80j7l7J53k37L73j49k12K64oP6k27J21n4j6N5m9P4N0r5
4556d0k5J36n0kr9J77k94L22j33L60k77K0M7j55J08m8M0q9j38J51J2J03j95P4
4580EM7k08J94K6k04M9P7nJ54j54R4j83K40k39J71r5l9P2l4J86j45j55J32K15
$$ plain form
4604 201 -189 -127 -103 -142 -457 -52 99 -115 -55 -268 144 57 116 217 -77 -53 127 -91 -3 29 103 106 -100 82
4628 82 -110 -26 71 -60 -66 39 176 -198 85 163 -42 -218 34 -112 49 207 -21 -93 -133 40 76 18 -135
4651 -135 47 -75 -35 50 -34 69 175 40 -120 -46 58 -253 157 22 89 94 221 -194 9 -38 -35 -120 -148 50
4675 50 -66 70 -334 -167 -120 -91 -212 -64 22 -155 -58 -145 -55 54 30 133 49 104 -258 -84 58 67 52 -12 11
4700 11 -41 133 -209 81 16 96 58 4 -130 -122 18 140 106 -25 -61 237 -17 46 142 -89 217 326 -26 351
4724 351 -84 -65 1 104 -250 53 -135 -40 150 11 14 -30 172 -31 13 -150 43 70 -260 -73 -241 103 32
4747 32 -255 103 -76 86 -189 117 157 -21 -209 460 235 -114 -242 39 -9 -62 -22 88 -54 48 28 -155
4769 -155 -75 -159 3 99 -24 115 137 16 -98 200 189 17 54 165 137 132 -20 180 1 20 52 84 79 144 126
$$ packed form
4604B01l90O2K4l9l15M05J51k14O0k13M12q7N9J01k94K4J80k18Q8L2P4Lk06J82
4628H2j92Q4R7j31oJ05J37l74K83P8k05j76K52j46J61J58k28p2m0J73L6n8j53
4651a35J82j22M0Q5q4J03J06j35j60P4J04l11M10j35O7NJ27m15K03m7Lq5k8J98
4675E0j16J36m04J67M7K9j21J48Q6j77R7q7R0J09k4J03q4N5l62J74J42Rj5o4K3
4700A1n2J74l42K90o5Q0l8n4j34QJ40J22l4j31l6K98k54O3R6k31L06J09l52L77
4724C51m35J9O6J03l54L03j88R5J90j39Lm4K02k03M4j63J93K7l30J87j68L44p1
4747C2k87L58j79J62k75L06M0j78j88O69k25l49j28K81m8n3M0J10j42J02k0j83
4769a55Q0q4J62R6j23J39K2j21j14K98j1j72L7J11k8nj52K00j79J9L2L2nO5j8
$$ plain form
4794 126 81 -78 55 114 108 2 -207 131 166 -97 6 -105 -231 -213 46 -114 -255 332 63 -151 -190 98
4816 98 86 -3 66 151 -164 -260 -98 96 98 49 -26 -95 -120 -110 -284 54 -45 -66 -68 -178 -94 -4 235 -205 -47 187
4842 187 33 235 -29 14 69 47 161 -112 218 -114 76 71 -95 -21 78 175 139 -244 -32 245 -31 17 469
4865 469 302 49 -26 -124 -101 47 85 65 8 -280 32 23 -11 83 15 31 -151 157 -71 -51 28 0 -30 2 113 -94
4891 -94 -58 47 241 -101 -150 -169 58 -112 41 -118 -148 25 -107 -72 11 22 -141 -317 53 -266 -24 -102 -17
4914 -17 -117 87 64 -29 48 84 -116 39 -24 39 -54 9 -66 -65 253 -32 -5 -265 87 -194 -9 160 70 148 108
4939 108 170 44 160 -153 6 67 -102 -45 -77 -202 86 51 54 140 -42 -176 215 163 41 184 -11 93 51
4962 51 172 -88 -35 114 -103 -43 -77 -52 -78 -83 -199 -59 -136 41 19 -1 69 -44 -370 211 -44 -26 -34 -64 7 82
$$ packed form
4794A26m5j59J33N9oj06k09L38L5k63J03j11j26J8K59j60j41N87k69k14l9K88
4816I8j2q9O9Q5l15r6J62J94Km9p5o9k5J0j74L38r9k1kj10Q4R0K39m40J58K34
4842A87j54K02k64M3N5k2J14k73L30l32J90nj66P4R9R7l6l83K12K77k76M8M52
4865D69j67k53p5r8K3J48L8k0n7k88L12rl4R4o8J6j82L08k28K0P9k8l0L2J11k07
4891i4L6J05J94l42m9j9K27j70J53j59l0J73j32L5Q3J1j63j76L70l19K42p8Q5
4914a7j00K04k3r3P7L6k00J55o3O3r3O3p5JL18k85K7k60L52k81J85J69r0P8m0
4939A08O2j26J16l13J59O1j69N7l2j25K88l5LQ6j82j34L91n2j22J43j95J04m2
4962E1J21k60N3J49k17O0l4K5k6nj16J40p7J77k2k0P0j13l26N81k55J8ql0P1P5
$$ plain form
4988 82 141 -218 -71 -146 305 -185 -26 -36 267 66 158 159 184 -104 378 53 -152 113 22 98 -276 213 13
5011 13 -58 174 -103 175 -12 11 -102 -94 175 40 84 -21 5 -13 -123 -132 61 170 239 -171 116 -86 -12 -3 -32
5036 -32 -39 113 153 -56 -44 147 202 -99 -173 -113 167 37 185 173 -12 -139 -21 -376 -205 -22 -92 136 -150
5059 -150 116 -78 149 23 2 -85 166 16 45 -95 164 202 68 105 -38 -32 -24 -217 88 158 -17 -312 74
5082 74 12 40 51 309 -189 -281 18 -102 -245 -83 -93 -208 -33 151 102 -129 -27 -283 -4 1 -125 194 203 -14
5106 -14 35 256 114 -258 -116 219 -146 -241 -10 -123 -67 -82 -69 -201 137 -94 223 119 14 -128 147 182
5128 182 22 7 -205 -103 -77 -107 -76 56 195 -68 -203 -208 -80 7 52 14 240 -61 -257 92 53 18 -270 -152
5152 -152 -20 216 -76 2 -116 -11 115 -97 107 57 -224 -108 -48 117 8 -69 199 86 70 49 313 -142
$$ packed form
4988H2N9l59J47p5M51m90J59j0L03k01R2JK5k88M82l25k05K65r1P6l74M89k00
5011A3p1K32k77K78j87K3j13QK69j35M4j05K6j8j10rJ93J09O9m10K87k02P4Rk9
5036c2pJ52M0k09J2J91N5l01p4O0K80j30J48j2j85j27J18l55J71J83p0K28k86
5059a50K66j94K27j26k1q7K51j50K9j40K59L8j34L7j43OQj93L05P0j75k95L86
5082G4o2K8J1K58m98r2K99j20j43J62j0j15J75J84m9k31J02k56K79Nj26L19Rk17
5106a4M9K21j42l72J42L35l65r5K31j13N6j5J3j32L38k31L17j04j05j42K75L5
5128A82j60j5k12J02K6l0L1J32J39k63j35nJ28Q7M5l8K26l01j96L49l9l5k88J18
5152a52J32K36k92P8j18J05J26k12K04n0k81J16O0J65j09p7K68j13j6k1K64m55
$$ plain form
5174 -142 234 75 -149 -204 30 308 64 40 74 -38 -38 43 37 352 226 -41 34 40 -181 -171 195 22 -64 -107 76
5199 76 -93 27 33 17 -260 -32 137 -140 -174 -39 85 1 21 -227 -49 150 -14 29 -35 -54 -52 151 -32 -9
5223 -9 82 -153 -106 -150 -415 -15 -76 231 788 -47 306 304 -84 116 171 152 -60 137 -156 -252 187 -177 144 -199
5247 -199 7 -181 -19 -42 38 79 -40 2 -33 62 10 113 -88 13 281 -36 -21 -51 -106 -247 -234 -210 -172 97
5271 97 31 -113 -17 -246 -106 -99 237 -313 2 -51 27 -31 63 202 70 123 -147 -48 30 14 28 -185 -167 166 -193
5296 -193 -233 -43 67 7 257 -32 32 -121 82 266 -47 82 -189 127 97 51 -59 4 32 12 -200 95 -12
5319 -12 67 196 -131 -58 -32 80 -180 -113 -199 188 -21 29 -74 285 153 97 -8 339 184 135 29 -59 -40 -113
5343 -113 343 2 59 153 87 46 132 -157 -54 25 59 172 95 -74 112 -31 -31 -163 -246 56 66 -62 -80 -109 179
$$ packed form
5174a42L76j59k24n5K34K78k44k4L4j12%Q1oL15j26k67P5Ok21J0L66j73q6m3J83
5199G6j69J20Oj6k77K28J69k77l4J35J24q4K0k48J78J99j64M3o4j9KK03j83K3
5223iR1k35M7m4k65M00o1L07N57q35L53kl88K00N5j9k12J97k93r6M39l64L21l43
5247a99K06j88J62k3Q0M1j19M2l5R5n2J03k01J01K68l17J5l0n5j41J3K4L8K69
5271I7o6j44R6k29J40PL36n50L15n3P8n8R4J39j32N3k70R9P8j6J4k13J8L33l59
5296a93m0J90J10o0K50k89O4j53K03J84l13J29k71L16l0m6j10O3K8k0k12K95j07
5319a2P9J29l27P3K6J12k60O7q6L87k09N0j03L59j32n6j05L47j55m9j06q8J9p3
5343a13M56l41N7R4o6m1Q6k89J03P9L4J13p7j69J86j43%j32q3L02J0j28j8k9K88
$$ plain form
5368 179 -95 2 -82 -10 60 -270 46 -67 -27 -263 22 65 -236 -15 10 21 95 -63 -47 -72 40 135 -46 108
5392 108 240 -27 149 -77 -141 -188 160 43 -43 -124 38 89 112 -181 -25 20 -186 155 -66 144 -86 -46 69
5415 69 266 -150 231 57 11 102 -155 -142 54 -32 -220 -84 -172 -18 47 28 -174 122 -41 -164 -93 30 -114
5438 -114 186 -8 29 -104 17 -76 92 127 103 -76 -207 -24 64 -40 306 -152 -137 -162 101 -35 -210 -378
5460 -378 -4 -159 -246 176 -84 98 -130 246 96 -26 -39 -59 111 165 -83 13 -220 16 -42 255 -156 93
5482 93 -111 -295 157 -96 80 107 25 50 -144 164 107 -31 135 100 160 78 57 -274 -190 -118 -40 45 22 -59 -92
5507 -92 40 236 -70 -14 -210 131 -100 -220 -17 275 173 -61 -133 70 -33 -29 0 -210 -85 -272 -67 -135
5529 -135 -143 122 -115 104 -43 -15 -178 -192 137 9 -243 18 -155 144 -46 350 -108 -65 -135 -34 63 29 54
$$ packed form
5368A79k74R7q4P2P0l30L16j13M0k36K85M3l01K21K5J1P4j58J6k5J12R5j81J54
5392A08J32k67J76k26o4m7L48j17q6q1J62N1K3k93J56M5k06L41k21K10k30M0J15
5415F9J97m16L81j74m6R1k57J3J96q6j88J36q8J54O5j9k02K96j63j23P1J23j44
5438a14L00j94L7j33J21r3J68L5k4j79j31J83Q8j04L46m58J5k5K63j36j75j68
5460c78L74j55q7M22k60J82k28L76j50j22j3k0J70N4k48R6k33K36n8K97m11K49
5482I3k04j84M52k53J76K7q2K5j94L08n7j38J66l5O0q2k1l31Q4P2P8Q5k3q1l3
5507i2J32J96l06N6j96L41k31j20K03K92j02k34p2K03j03MK9k10J25j87K05o8
5529a35qK65k37K19j47K8j63j4L29j28k52K61j73K99j90L96m58M3p0J01R7l4K5
$$ plain form
5552 54 111 198 -167 169 103 -33 -181 124 93 49 -57 61 117 94 -33 36 69 124 -180 -104 -1 -58 24 160 83
5577 83 -12 13 19 93 -123 52 36 -40 82 -30 82 57 53 -294 -158 -177 -24 -58 -119 -63 202 71 -70 -6 114
5602 114 66 -249 -160 -53 -54 48 -107 88 303 79 49 -121 -138 86 -179 -23 -159 -150 -218 59 46 -17 42 -56
5626 -56 -116 58 126 -88 68 -42 -53 -170 144 155 120 85 -92 -112 -148 82 -47 -80 75 -169 -267 -380 2 -352
5650 -352 -31 157 87 198 -244 98 -74 265 206 -32 -38 243 -186 3 -154 48 12 286 156 89 44 33 80
5673 80 142 49 -185 -53 -170 14 86 -144 -42 15 -25 -44 14 137 -79 10 -12 149 -5 -54 -147 170 -68 -100
5697 -100 -117 -10 221 96 120 -17 156 14 -156 -191 -170 -23 -10 -97 -82 -9 185 11 -107 -63 -47 109 59 -132
5721 -132 -190 40 -68 -2 155 -60 -9 152 -101 13 19 -74 -9 -95 -141 342 -223 -254 49 -103 -35 -8 -8 -25 84
$$ packed form
5552E4N7Q7l65L36o6j36j48L05l1m4j06J18N6k3j27O9L3N5l04P6J03n7Q2J36p7
5577H3r5K5OP4k16J75j6p6J22j12J12k5ml47J36j9J53l4o1N6K65j31j41O4J20
5602A14m8l15Q9J07jJ02j55J95K15k24l0j70j7K24k65J56j36Ro8K77j3o3N9r8
5626e6o0J74O8k14J56j10j1j17L14J1l5l5j77k0l6K30j29l3J55k44r8j13L82l54
5650c52L21J88p0J11m42L42j72L39n9k38oK81m29J89j57K02l6K74j30o7m5j1M7
5673H0O2r3k34J32j17J84P2k30J02N7m0j9N8J23k16Q9k2J61j54m9r3L17k38l2
5697a00j7J07K31j25K4j37J73j42j70l5K1J47J3q7J5P3J94j74j18M4J6J56n0j91
5721a32n8K30j08O6J57k15N1J61k53J14Or3O5q6m6M83n65l1L03j52O8K7%j7J09
$$ plain form
5746 84 -66 -44 -56 -74 122 -4 -22 -108 -106 -93 114 -17 71 154 90 142 -182 -243 29 22 25 -38 162 122 66 -155 59
5773 59 -39 -151 48 -25 -74 -25 36 8 226 -74 -219 -36 43 -6 -2 -33 9 35 48 -181 7 -200 -131 -177 -166 -114
5799 -114 -107 101 140 -43 -229 -231 -34 -21 -151 -90 98 -257 -81 -176 -131 -65 190 4 0 -19 39 -86 13 223 15
5824 15 84 57 188 81 168 -48 118 -47 -286 36 -71 -207 -96 -24 -24 -86 -3 66 -332 -2 40 90 -89 94
5848 94 0 -251 74 228 -375 -32 69 -158 152 37 217 58 -87 37 167 137 31 298 -19 4 -32 56
5870 56 89 -304 212 237 -141 1 185 47 181 -111 41 -62 -130 -84 24 -44 -81 -13 -156 48 102 46 -128
5893 -128 -6 67 150 -178 -141 -43 -91 -68 -190 53 219 138 -74 84 -12 18 -113 -110 -14 89 110 63 227 10 -158
5918 -158 94 76 23 125 -122 -224 -12 126 -136 -15 16 18 65 -228 18 132 37 -7 -118 -192 63 126 28 -73
$$ packed form
5746H4j50K2j2j8J96j26j8q6KJ3K07j31Q8Q3o4N2l24o1K72pLo3K00m0n6k21K14
5773E9r8j12J99p3m9M9O1k8K18l00j45J83P9m9Ml1M2K6J3k29J88k07O9m6J1N2
5799a14PK08L9j83j86kJ97J3j30O1J88l55J76r5M5O6K55j86mj9N8j25R9K10k08
5824A5O9k7J31j07Q7k16J66j65k39L22j07j36J11P2%o2Q3O9l98L30M2N0j79J83
5848I4r4k51L25J54o03L43J01k27L10j15J80j59j45J24J30l0j06K67l17K3l6Q8
5870E6L3l93N16K5l78J42J84j38J34k92J52j03o8M6J08o8l7O8j43K04N4n6j74
5893a28J22P3Q3l28L7R8m8K3j22K43J66q1k12J58r6L0j31LR6J03K1m7J64k17j68
5918a58K52j8n3J02k47j02K12J38k62J21L1KM7k93K46J14r5m4j11p4K55O3r8j01
$$ plain form
5942 -73 -239 -98 -198 72 102 43 -52 39 -258 52 -79 -265 -303 104 34 -136 -121 173 26 41 16 -52 -126 -136
5966 -136 -297 -283 -331 66 -101 57 -108 41 163 -169 -293 147 23 54 -108 -139 54 -170 -14 -152 42
5987 42 75 18 307 -17 193 -32 145 -159 177 157 112 36 -36 33 -192 12 178 -96 87 59 -249 131 -39
6010 -39 -42 160 124 -5 85 21 -55 136 112 106 12 -88 -200 -48 -69 18 1 9 -61 -174 -213 133 131 -170 -102 -20 211
6037 211 -45 -149 80 -32 -25 -225 -94 -124 204 99 -88 209 35 35 62 -38 241 66 -119 261 77 67
$$ packed form
5942g3j66J41j00K70L0n9r5R1k97L10j31j86l8M07p0j70J5K94j47J5k5o8p4j0
5966a36j61J4m8L97j67J58j65J49J22l32j24M40j24L1j62l1J93k24J56j38J94
5987D2L3n7K89l24K10k25J77l04L36k0m5p6p2O9k25K04J66k74J83k8l08L80j70
6010c9lK02l6j29R0o4p6J91k4or4j00j12J52k1Q7j7Qp0j13l9L46kl01O8Q2K31
6037B11k56j04K29j12Pk00J31l0L28j05j87K97j74%K7j00K79j75j85L80j84j0
$$ [...]
8191H0
##END NTUPLES=NMR FID
##END=
