##TITLE=1H_LR-678_CR2
 CDCl3, 8 sc, 
 23.11.2020
##JCAMPDX= 6.0         $$ Bruker NMR JCAMP-DX V2.0
##DATA TYPE= NMR FID
##DATA CLASS= NTUPLES
##ORIGIN= UXNMR, Bruker Analytische Messtechnik GmbH
##OWNER= root
$$ XWIN-NMR		Version 3.5
$$ Mon Nov 23 13:49:43 2020 Russian Standard Time (UT+4h)  she@DPX200
##.OBSERVE FREQUENCY= 200.1315066352
##.OBSERVE NUCLEUS= ^1H
##.DELAY= (6, 6)
##.ACQUISITION MODE= SIMULTANEOUS
##.ACQUISITION SCHEME= undefined
##.AVERAGES= 8
##.DIGITISER RES= 18
##SPECTROMETER/DATA SYSTEM= spect
##.PULSE SEQUENCE= zg30
##.SOLVENT NAME= CDCl3
##.SHIFT REFERENCE= (INTERNAL, CDCl3, 0, 15.7039)
##AUDIT TRAIL= $$ (NUMBER, WHEN, WHO, WHERE, WHAT)
$$ ##TITLE= Audit trail, XWIN-NMR		Version 3.5
$$ ##JCAMPDX= 5.01
$$ ##ORIGIN= Bruker BioSpin GmbH
$$ ##OWNER= she
$$ F:/spectra/data/she/nmr/H-F/1/audita.txt
$$ ##AUDIT TRAIL=  $$ (NUMBER, WHEN, WHO, WHERE, WHAT)
(   1,<2020-11-23 13:44:43.98 +0400>,<she>,<DPX200>,
      <created by zg, POWCHK disabled, PULCHK disabled
       configuration hash MD5:
       00 E9 B6 7A A2 85 ED C7 34 08 36 98 17 FE 4E 26
       data hash MD5: 16K
       32 BB E7 22 34 E3 4D D3 F2 96 17 7C 52 14 62 21>)
$$ ##END=
$$ 
$$ hash MD5
$$ 20 2C 8B E6 C8 84 62 6D 60 AE D1 0A D5 7A DB 2B
##$RELAX= 
##$RELAX= 
##$RELAX= 
##$RELAX= 
##$RELAX= 
##$RELAX= 
$$ Bruker specific parameters
$$ --------------------------
##$DU= <F:/spectra>
##$EXPNO= 1
##$NAME= <H-F>
##$PROCNO= 1
##$TYPE= <nmr>
##$USER= <she>
##$AMP= (0..31)
100 100 100 100 100 100 100 100 100 100 100 100 100 100 100 100 100 100 
100 100 100 100 100 100 100 100 100 100 100 100 100 100 
##$AQSEQ= 0
##$AQ_mod= 1
##$AUNM= <au_zg>
##$AUTOPOS= <>
##$BF1= 200.13
##$BF2= 200.13
##$BF3= 200.13
##$BF4= 200.13
##$BF5= 200.13
##$BF6= 200.13
##$BF7= 200.13
##$BF8= 200.13
##$BYTORDA= 1
##$CFDGTYP= 0
##$CFRGTYP= 5
##$CHEMSTR= <none>
##$CNST= (0..31)
1 1 145 1 1 1 1 1 1 1 1 1 1 1 1 1 1 1 1 1 1 1 1 1 1 1 1 1 1 1 1 1 
##$CPDPRG= <>
##$CPDPRG1= <>
##$CPDPRG2= <>
##$CPDPRG3= <>
##$CPDPRG4= <mlev>
##$CPDPRG5= <mlev>
##$CPDPRG6= <mlev>
##$CPDPRG7= <mlev>
##$CPDPRG8= <mlev>
##$CPDPRGB= <>
##$CPDPRGT= <>
##$D= (0..31)
0 1.2 0 0 0 0 0 0 0 0.06 0 0.03 0 0 0 0 0.0002 0 0 0 0 0 0 0 0 0 0 0 0 
0 0 0 
##$DATE= 1606124683
##$DBL= (0..7)
120 120 120 120 120 120 120 120 
##$DBP= (0..7)
150 150 150 150 150 150 150 150 
##$DBP07= 0
##$DBPNAM0= <>
##$DBPNAM1= <>
##$DBPNAM2= <>
##$DBPNAM3= <>
##$DBPNAM4= <>
##$DBPNAM5= <>
##$DBPNAM6= <>
##$DBPNAM7= <>
##$DBPOAL= (0..7)
0.5 0.5 0.5 0.5 0.5 0.5 0.5 0.5 
##$DBPOFFS= (0..7)
0 0 0 0 0 0 0 0 
##$DE= 6
##$DECBNUC= <off>
##$DECIM= 32
##$DECNUC= <off>
##$DECSTAT= 4
##$DIGMOD= 1
##$DIGTYP= 9
##$DL= (0..7)
0 120 120 120 120 120 120 120 
##$DP= (0..7)
150 150 150 150 150 150 150 150 
##$DP07= 0
##$DPNAME0= <>
##$DPNAME1= <>
##$DPNAME2= <>
##$DPNAME3= <>
##$DPNAME4= <>
##$DPNAME5= <>
##$DPNAME6= <>
##$DPNAME7= <>
##$DPOAL= (0..7)
0.5 0.5 0.5 0.5 0.5 0.5 0.5 0.5 
##$DPOFFS= (0..7)
0 0 0 0 0 0 0 0 
##$DQDMODE= 0
##$DR= 18
##$DS= 0
##$DSLIST= <SSSSSSSSSSSSSSS>
$$ [...]
##$SUBNAM2= <"">
##$SUBNAM3= <"">
##$SUBNAM4= <"">
##$SUBNAM5= <"">
##$SUBNAM6= <"">
##$SUBNAM7= <"">
##$SUBNAM8= <"">
##$SUBNAM9= <"">
##$SW= 16.9725356469052
##$SWIBOX= (0..15)
0 0 2 0 0 0 0 0 0 0 0 0 0 0 0 0 
##$SW_h= 3396.73913043478
##$TD= 16384
##$TD0= 1
##$TE= 0
##$TE2= 300
##$TE3= 300
##$TEG= 300
##$TL= (0..7)
0 120 120 120 120 120 120 120 
##$TP= (0..7)
150 150 150 150 150 150 150 150 
##$TP07= 0
##$TPNAME0= <>
##$TPNAME1= <>
##$TPNAME2= <>
##$TPNAME3= <>
##$TPNAME4= <>
##$TPNAME5= <>
##$TPNAME6= <>
##$TPNAME7= <>
##$TPOAL= (0..7)
0.5 0.5 0.5 0.5 0.5 0.5 0.5 0.5 
##$TPOFFS= (0..7)
0 0 0 0 0 0 0 0 
##$TUNHIN= 0
##$TUNHOUT= 0
##$TUNXOUT= 0
##$USERA1= <user>
##$USERA2= <user>
##$USERA3= <user>
##$USERA4= <user>
##$USERA5= <user>
##$V9= 5
##$VALIST= <valist>
##$VCLIST= <CCCCCCCCCCCCCCC>
##$VD= 0
##$VDLIST= <DDDDDDDDDDDDDDD>
##$VPLIST= <PPPPPPPPPPPPPPP>
##$VTLIST= <TTTTTTTTTTTTTTT>
##$WBST= 1024
##$WBSW= 4
##$XGAIN= (0..3)
0 0 0 0 
##$XL= 0
##$YL= 0
##$YMAX_a= 129851
##$YMIN_a= -73057
##$ZGOPTNS= <>
##$ZL1= 120
##$ZL2= 120
##$ZL3= 120
##$ZL4= 120
##$ABSF1= 10
##$ABSF2= 0
##$ABSG= 5
##$ABSL= 3
##$ALPHA= 0
##$AQORDER= 0
##$ASSFAC= 0
##$ASSFACI= 0
##$ASSFACX= 0
##$ASSWID= 0
##$AUNMP= <proc_1d>
##$AZFE= 0.1
##$AZFW= 0.1
##$BCFW= 1
##$BC_mod= 2
##$BYTORDP= 1
##$COROFFS= 0
##$CY= 11.3945322036743
##$DATMOD= 1
##$DC= 2
##$DFILT= <>
##$DTYPP= 0
##$F1P= 15.9154993809931
##$F2P= -4.1035820241983
##$FCOR= 0.5
##$FTSIZE= 0
##$FT_mod= 4
##$GAMMA= 1
##$GB= 0.15
##$INTBC= 1
##$INTSCL= 1
##$ISEN= 128
##$LB= 0.24
##$LEV0= 0
##$LPBIN= 0
##$MAXI= 10000
##$MC2= 0
##$MEAN= 0
##$ME_mod= 0
##$MI= 1.114404
##$NCOEF= 0
##$NC_proc= 0
##$NLEV= 6
##$NOISF1= 3.799351
##$NOISF2= 2.8
##$NSP= 1
##$NTH_PI= 0
##$NZP= 0
##$OFFSET= 15.70392
##$PC= 1
##$PHC0= -11045.84
##$PHC1= 9.40089
##$PH_mod= 1
##$PKNL= yes
##$PPARMOD= 0
##$PSCAL= 0
##$PSIGN= 0
##$REVERSE= no
##$SF= 200.130013532006
##$SI= 16384
##$SIGF1= 3
##$SIGF2= 2
##$SINO= 400
##$SIOLD= 16384
##$SREGLST= <1H.CDCl3>
##$SSB= 0
##$STSI= 0
##$STSR= 0
##$SW_p= 3612.71676300578
##$SYMM= 0
##$S_DEV= 0
##$TDeff= 0
##$TDoff= 0
##$TI= <>
##$TILT= no
##$TM1= 0
##$TM2= 0
##$TOPLEV= 0
##$USERP1= <user>
##$USERP2= <user>
##$USERP3= <user>
##$USERP4= <user>
##$USERP5= <user>
##$WDW= 1
##$XDIM= 8192
##$YMAX_p= 0
##$YMIN_p= 0
$$ End of Bruker specific parameters
$$ ---------------------------------
##NTUPLES= NMR FID
##VAR_NAME=  TIME,          FID/REAL,        FID/IMAG
##SYMBOL=    X,             R,               I
##VAR_TYPE=  INDEPENDENT,   DEPENDENT,       DEPENDENT
##VAR_FORM=  AFFN,          ASDF,            ASDF
##VAR_DIM=   8192,          8192,            8192
##UNITS=     SECONDS,       ARBITRARY UNITS, ARBITRARY UNITS
##FACTOR=    0.0002944,     1,               1
##FIRST=     0,             0,               0
##LAST=      2.4114304,     0,               0
##MIN=       0,             -73057,          0
##MAX=       2.4114304,     129851,          0
$$ Real data points
##PAGE= N=1
##DATA TABLE= (X++(R..R)), XYDATA
$$ [...]
1874b2j33K49J01k92L98p4j10K14l80L24J13k26n1K10l13L09j34J18m4k30J09
1895A36p7J03m8L6k31J13J31q4j28kK29l70p1N10j38k51L38m50Q1R9j93J05n4
1918b16RJ90l2k39o2P6Mj02k08L08j26J36l2O4J4J21j21P4k3k5L02k78O2R9j38
1943a43M7K53m01K77J10k49L60l79L09J67l64J43L46l64J08k17Q4L21m08K57L00
1964E57l56K09J31l02J71l68n2M00k28J46J38l05l5J11j78K80ql70J19j36R5O5
1986H4j68M31j83k73K72k39k5J92l95K31J8k77M87k71j16J76j91K33M2l77L13
2007c6k30J17J89l28Q7L73l46J76k90J18L24m38J18K89k05RM77m25M08k72P9p7
2029A17j72J60J10k18J32J32k96K42j79l8J95j15MJ49l98O75o52J69l0J80m15
$$ plain form
1874 -22 -155 94 195 -97 301 227 117 331 -49 275 388 162 111 321 8 317 183 301 257 27 136
1895 136 59 162 114 150 -81 32 163 79 -49 -51 178 -192 -263 247 109 -142 196 -254 -173 -74 -267 -162 -216
1918 -216 -207 -17 -49 -288 -350 -274 -270 -372 -580 -272 -398 -262 -294 -230 -216 -95 -216 -142 -165 -190 112 -166 -104 -5 -143
1943 -143 -96 157 -244 33 143 -106 254 -125 184 351 -13 130 476 112 220 3 87 408 0 257 557
1964 557 201 410 541 239 410 42 -10 390 162 308 446 141 106 217 39 319 311 -59 60 -76 19 84
1986 84 -84 347 164 -109 163 -76 -101 91 -304 -73 -55 -332 155 -116 -232 -56 -247 -14 28 -349 -36
2007 -36 -266 -149 40 -288 -201 172 -174 2 -288 -170 154 -284 -166 123 -82 -73 404 -21 387 115 194 117
2029 117 -55 105 215 -3 129 261 -35 207 28 -10 185 70 74 223 -175 500 -152 17 -13 167 -248
2050b48N91l68m2L73m78N47m82J35J33n75L49k49J11K61J60l57kK95n49L45M4
2071fj4o1j2j41N9j33L26k34Q2m5O6j52j03M32j03k10Q8J23j59m6L38r6N7P9K5
2096A60K18j39J07l61K31l27K09K4L6Q3LK9j44l1J20K5L02l29p0J18j46j32L25
2119C11k62J19o4n7N5J15k8j16J05j99M6j17L57r1k16P4M8k02P0r6jL8p5J59m7
2144g4l59L71r4j57L00l88L30k06L79k16J0k23l8K35j42K12q7J20k42L76k07j14
2166b14K74m0j23J14J31k24K32j31j45K91J5j54k17M25j59jj07J14q1J29k2O0
2188A67j21L13m0j55K84l96P5J17K8k25J22J4j68l4J99p5j18J41k6l31Q4J88k44
2211b01Q9J79k50j1K5j43L74K9l83J75j5N0n1k45J30Q2o5Nj76M24lj57J18P3l36
$$ plain form
2050 -248 343 -25 -67 306 -172 375 -107 28 161 -414 -65 -314 -203 58 218 -139 -141 154 -395 -50 -6
2071 -6 -20 -81 -93 -234 -175 -308 18 -216 -134 -179 -113 -265 -368 64 -39 -249 -161 -38 -197 -243 95 -1 56 135 160
2096 160 378 239 346 -15 216 -111 98 122 158 241 244 273 129 98 218 243 545 216 146 264 118 -14 311
2119 311 49 168 104 47 102 217 189 73 178 -21 25 -92 265 174 -42 32 80 -122 -52 -148 -149 -111 -186 -27 -74
2144 -74 -433 -62 -156 -313 -13 -401 -71 -277 102 -114 -104 -327 -365 -130 -272 -60 -147 -27 -269 107 -100 -214
2166 -214 60 20 -103 11 142 -82 150 19 -126 165 180 26 -191 234 75 74 -33 81 0 129 107 167
2188 167 46 359 319 164 448 52 127 244 272 47 169 183 15 -19 180 105 -13 128 102 -229 -145 43 -201
2211 -201 -112 67 -183 -194 -169 -312 62 91 -292 -117 -132 -82 -133 -378 -248 -166 -231 -226 -402 22 19 -138 -20 53 -283
2236b83O9J9M66n31L07M2k96K69R5q4m6L19n89K49r1K63q9m3J00k19K67j09N2
2259A37L7j2o0K38k2k31P5Q6k0J1j66J30j41J08n9N3p2m7q1M9J54k96K60lk91
2284a63r4K07J28j67K65j32k35k1j55J87J43q0r2o2K20k14N5q4J79r4o2J61O7
2307d3j52l3J96j32j02J06R4P6m07L08J23j13J29q4N3q5J05n3J55j11K72k52J18
2330A68L7P6j00j64j4P0P0k84J94J11J06k29j9K28o8k0J60l70M3O5j59M2J21j16
2354e2K2J38k67R6j52J75K37k96Q7r2k16N88k31k5k4r0J11j46j81J51l8j15L46
2377B6j7L1%l56K07o4l3P9p0K06P3l17K55oK9R1j10J92n5j68m3J68o2P4L85m21
2403I4J3j91o0M33j42m7K13k27J45r9j28J51j66P7J47q5J07Qk56K82j38j20J30
$$ plain form
2236 -283 -214 -195 271 -260 47 89 -207 62 157 73 27 346 -243 6 -85 178 89 46 146 -73 194 85 137
2259 137 174 162 102 340 318 87 162 248 228 239 73 203 62 170 111 164 92 45 -36 13 167 -129 131 128 -163
2284 -163 -257 -50 78 -89 176 44 -191 -212 -367 -180 -37 -117 -209 -271 -51 -265 -210 -294 -115 -209 -271 -110 -43
2307 -43 -195 -228 -32 -164 -266 -160 -66 10 -397 -89 34 -79 50 -34 19 -66 39 -14 141 30 302 50 168
2330 168 205 281 181 17 3 73 143 -141 53 164 270 41 22 250 182 162 322 -48 -5 60 -99 -57 64 -52
2354 -52 -30 108 -159 -63 -215 -40 197 -99 -12 -104 -320 268 37 12 -12 -102 9 -137 -318 -167 -205 -320 26
2377 26 9 40 40 -316 -109 -173 -206 -127 -197 9 82 -235 20 14 43 134 24 216 161 -7 -50 118 56 130 515 94
2403 94 107 -84 -144 289 147 100 313 86 231 132 4 155 -11 66 213 128 235 243 -13 269 131 11 141
2426A41j87J48P6j09J0p1j42J20l4j6K73j38j51J63m41J47M4j37J28K09j88j57
2448c12K1N7K42l17K62J33m28L63j83k54J87J3J93P7j49j17J97p2K96m71L43K01
2470B82m00K32j49k23L82j32k2K62j69o0K30k23j03j60L32L01l96K47M4j96L20
2491C99j29m45M01P5p5J92n43J32L3o2j6K23k84L60j40P6k20j01J88j93N4j10
2513a85m3j13L14K1j40K9j22J35J28j43n0O7j36J46k80P4L63m66N46k41l5J24
2535gp8Q9m1O4R9J0r8Kk22J38n3j68R6K71Q9j33J08k31J53oM4Q5j01KP6k47O1
2562BJ60m5J2J04p9k7k44J60J53j71R2J2L3k15K84o6j20j07K75j10N8k11O9k99
2586b80L05K7j78J26N1k38m7K25M4k09P4J3k95K73j64M5K85l48J71K14j38k40
$$ plain form
2426 141 -46 102 178 69 79 8 -134 -14 -48 -64 209 71 -80 83 -358 -211 -167 -304 -176 33 -155 -312
2448 -312 -291 -234 8 -309 -47 86 -342 21 -162 -416 -229 -216 -23 54 -95 -212 -15 -87 209 -262 81 282
2470 282 -118 114 -35 -258 124 -8 -30 232 63 3 233 10 -93 -253 79 380 -16 231 275 79 399
2491 399 270 -175 226 301 226 418 -125 7 40 -22 -38 185 -99 261 121 197 -23 -124 64 -129 -75 -185
2513 -185 -228 -341 -27 -6 -146 -117 -239 -104 24 -119 -169 -102 -238 -92 -372 -298 65 -401 145 -96 -131 -7
2535 -7 -85 4 -37 27 126 136 38 40 -182 -44 -97 -265 -169 102 191 58 166 -65 88 82 126 211 110 112 188 -59 2
2562 2 162 117 129 233 154 127 -117 43 196 25 117 129 162 -53 231 165 45 -62 213 103 161 -50 19 -280
2586 -280 25 52 -126 0 51 -187 -234 -9 35 -174 -100 -87 -382 -109 -273 -228 57 -291 -120 94 -44 -284
2608b84J45K78j35k38P9K13p1J00k54J44r6m1J97LK21j60j07N3K69k86K31l34
2630g3j5L25k00J14p4J77qJ47l05L79k95OP9j0j35O4l3J02M9k05L8l22N0J88q8
2655d5MJ42j14j3J47k1p5j58Q8J3N2l43J40J71j40J83k5m4l22J62J89o6J18j23
2679h0Q6l30K33J32k06n4J25J05j1r1n8J12K20k09J50k0J31n13K65j9OJ73L7j41
2703D3Q1J19j42m0J2R9j12O0j25P9k8j04K01J87k05q9P8j96J07J06J40l04J34
2726A01j92J17J79j53j00J39k19L07j99J72k84J74k88K58k9L1J00r4l30l0L93
2747E3k87j09K55M9j82O2K0J27m5%n4N4r0o1K33J5j58M07j53j87L5NO2P2j56L3
2773@j42L88M0k34j42J49k6j33L18j54r2K18J47M2k22R8j25o8M17n00j33L80k13
$$ plain form
2608 -284 -139 139 4 -234 -155 58 -13 87 -167 -23 -119 -160 37 40 261 101 -6 47 316 30 261 -73
2630 -73 -88 237 37 151 77 254 246 393 88 467 172 178 257 247 112 176 143 245 294 89 127 -195 -145 43 -45
2655 -45 -41 101 -13 -26 121 100 25 -133 -45 -32 20 -323 -183 -12 -152 31 6 -38 -360 -198 -9 -75 43 -80
2679 -80 6 -324 -91 41 -165 -219 -94 11 0 -91 -149 -37 183 -26 124 104 235 -278 -13 -32 -26 147 184 43
2703 43 124 243 101 61 73 172 60 120 -5 74 46 -58 143 330 125 36 114 -82 25 131 271 -33 101
2726 101 -91 26 205 52 -48 91 -128 179 -20 152 -132 42 -246 12 -17 14 114 20 -310 -340 53
2747 53 -234 -343 -88 -39 -221 -159 -139 -12 -57 -57 -111 -57 -147 -208 25 40 -118 289 136 -51 -16 -11 51 123 -33 0
2773 0 -142 246 286 52 -90 59 33 -100 218 64 -28 190 337 379 157 255 130 62 479 -21 -154 226 13
2796A3K85k02j12l7K85l42m6j67K84L11l8l36j61K53r2j3J76n9j39K11j76O2m9
2819h9j38K34k01K24k40J2j26mL51l08J56K32j40o0j20j43M78k85j31J09R1Q0
2841a8R2l72J57N6P6N8o5J58N3k83K23O6p7K4J23J3q6k4k12N07m31k7j0K12l41
2866a28M06j48j87J77q8K91j87r2P6L4k42K68j12M8Q1k26K29j56o2P3j25L06k88
2889e2o0K87m83L66j11j51K83k29qJ4j03K08J47l02J36Nl8J26p4j43K71j58j42
2912b11R6J63j28J07m3m8K07r1R7N5j3j3k61O7K50k82j21L75r6M7j27M3J80k54
2936aJ69J5J4j44j82J47L01k60l3J14O8jj65O7j25L22l64K19j14j27J22l05K82
2959A9n2P2l02L87J9j47j89J71j1P0p4n6j55J18j77qL1L01j68K31k96o5J48J04
$$ plain form
2796 13 298 96 -16 -53 232 -110 -156 -323 -39 272 234 -102 -263 -10 -102 -115 61 2 -137 74 -102 -40 -89
2819 -89 -227 7 -194 30 -210 -198 -324 -328 23 -285 -129 103 -37 -97 -217 -360 118 -167 -298 -189 -98 -18
2841 -18 74 -298 -141 -85 -9 49 -16 142 195 -88 135 201 124 148 271 284 198 174 -38 469 38 11 1 213 -128
2866 -128 278 130 -57 120 32 323 136 44 120 154 -88 180 68 116 197 -29 200 44 -18 55 -70 236 -52
2889 -52 -112 175 -308 58 -53 -204 79 -150 -158 -144 -247 -39 108 -194 -58 -53 -91 35 -39 -182 89 -69 -211
2912 -211 -115 48 -80 27 -16 -64 143 52 149 204 191 178 -83 -16 234 -48 -169 206 110 157 30 73 253 -1
2936 -1 168 183 197 53 -129 18 319 59 26 140 208 207 42 109 -16 306 -58 161 47 -80 42 -263 19
2959 19 -33 39 -263 124 143 -4 -193 -22 -33 37 -37 -93 -248 -130 -307 -315 -284 17 -151 80 -216 -281 -133 -29
2983b9Q2j86K31k8j91R9m1j00J71J8J04p1Q3L1j05N8N8p1Ok3J37j2j94J30k11
3008e4K57j62J34J0j94O8j7%Q1K8j19L03j21j29j71qL72l16N6k18L50k64L62j14
3032A34m65N25j36K6k10l1Q7K86n49M8K44k15R2J67k16M84n68r6M56J67n4j93
3054a7qP6l65P14k73n78m04R48J76j24L3Pm2L7k74K82k61J93l04M80k73L38j32
3077B29n8l25N81l24j45Q2O3K77Q7on51K0o8O25j077O71n6J38k13K67m56O38k62
3100A37l87J15K04o3Q6o7r6P2Q8n0j80K01l4j14m4J01L3r7l02M04k44K5M9K15
3124E2o4pk41J48%J64J36j14k06k08L92j16K17q2j80j30K55L9L1j33J55k47J73
3147C4N9j0N1j14m1j73J70L6%j43J00J38nJ24k14J5J01m0k4J13j08L1J05j67Q8
$$ plain form
2983 -29 53 -133 98 70 -121 -22 -63 -163 8 26 130 59 142 173 68 126 184 113 119 96 233 221 27 157 -54
3008 -54 203 41 175 185 -9 59 42 42 123 151 32 335 214 85 -86 -94 278 -38 18 -200 150 -114 248 134
3032 134 -331 194 58 84 -126 -157 -70 216 -333 -285 -41 -256 -164 3 -213 271 -297 -393 63 230 176 -17
3054 -17 -25 51 -314 400 127 -451 -855 93 269 145 178 185 143 180 -94 188 -73 120 -184 296 23 361 229
3077 229 171 -154 427 103 -42 40 103 380 467 461 -90 -70 -138 487 -590 81 25 163 -50 217 -239 399 137
3100 137 -250 -135 69 6 92 25 -71 1 89 39 -141 60 26 -88 -132 -31 2 -95 -397 7 -237 -212 -163 52
3124 52 -12 -19 -260 -112 -112 52 188 74 -132 -340 52 -64 153 71 -109 -239 16 55 86 -47 108 -139 34
3147 34 93 83 134 20 -21 -194 -24 12 12 -131 -31 107 102 226 12 27 128 88 64 177 69 100 205 38 126
3172A26M3k76J48m6j54p9M56K6k54j59K09J37l17K01j63Q1M4j11j6l2j3J44j84
3195a89K79k26n7J80k15J3m7K45M8j71M2j44K40j08K09j38K33j63k15K06n1q0
3217a09Q2J75l23N18l66nJ68j13m4J42J0j48j05J45J90j44j33MO1J53j4j83k7
3240f6k11L77m0l01L00j75J93P6j42N8K0k24L2L12j18j44L6K12k86l0lrR6l39
3264c76K63J53J56l47J28Q9j76L0P2J08k57J62k47L34r9k55K15j57J06J81l3K3
3286G3r6J76j58j60J52J66r1p6OQ5l3q0K3j65L93j23K6k63J76P7j76O1J37j9J
3311A12k9Q8j34O7N9j87J08J70q8j55Q1k47N5k4L18l42K06l8k3K67o32O24n01
3334b45Q5o2L83m19K73l87K7Jk6J36K13n0j98P88q14N21j63k82J12P6j21p5K74
$$ plain form
3172 126 169 -107 41 -5 -159 -238 218 244 -10 -169 40 177 -140 61 -102 -21 23 -88 -104 -136 -149 -5 -189
3195 -189 90 -136 -193 -13 -228 -215 -262 -17 31 -140 -98 -242 -2 -110 99 -39 194 31 -184 22 -29 -109
3217 -109 -27 148 -175 343 -23 -28 140 27 -17 125 135 -13 -118 27 217 73 -60 -56 5 158 144 -39 -66
3240 -66 -277 100 60 -241 59 -116 77 153 11 69 89 -135 -103 209 91 -53 -17 195 -91 -121 -124 -133 -37 -376
3264 -376 -113 40 196 -151 -23 66 -110 -80 -8 100 -157 5 -242 92 -7 -262 -47 -204 -98 83 50 73
3286 73 -23 153 -5 -165 -13 153 62 -14 -8 77 44 -36 -13 -178 215 92 118 -145 31 108 -68 -7 130 111 112
3311 112 83 171 37 104 163 -24 84 254 166 11 92 -155 -100 -124 194 -148 58 20 -3 264 -368 256 -245
3334 -245 -160 -222 161 -258 15 -372 -345 -344 -370 -234 -21 -71 -269 519 -295 226 63 -219 -107 -31 -152 -227 47
3357D7jj68J61r4M4K36l32K71j69l81O76j52J45k8k80K04m4p9L2l05R0K11L8K9
3381A51Q1j72q0J17p0P9L29l66R2k19J34p4N7J46j02j32j5J74Q4j73J10j01l04
3404b54K71p6R9l3L3J27m1%O9k79L52l36J07j67k34L14k48K94j04n6K78j50j76
3427b10L62k36j40J88Q7J27k27K43k48J76j16O1j02k6j39K7J03J27J32k20J37
3448A06j47J97j70L03j88m12L24K19k80K66l0k14K21j51L3r5J06J78k37j86OJ83
3470C2j00Q7J49l64K88k62M55k77k51K90k61J97j46R7L24j92n7K5l03J99J26j86
3492a30J29j44OJ51l4j19K96l56K25q2L0l2r8mJ82r8j93K87j1j25J01J86j45J61
3516A83k38K72m21N49k12j97J36l01M16q5j37J63r2ml7L59j70j57K50p8q1o4Q
$$ plain form
3357 47 46 -122 39 -55 -11 225 -107 164 -5 -386 290 138 283 255 -25 179 135 56 88 -217 -127 84 122 151
3381 151 232 60 -20 97 27 106 435 69 161 -58 76 2 59 205 103 -29 -44 130 214 41 151 50 -254
3404 -254 17 -59 40 7 40 167 126 126 195 -84 268 -68 39 -128 -362 -48 -296 -2 -106 -162 116 -34 -210
3427 -210 152 -84 -224 -36 51 178 -49 194 -54 122 6 67 -35 -61 -200 -173 -70 57 189 -31 106
3448 106 -41 156 -14 289 101 -311 13 232 -48 218 188 -26 195 44 77 -18 88 266 29 -157 -151 32
3470 32 -68 19 168 -196 92 -170 285 8 -243 47 -214 -17 -163 -66 258 66 9 34 -269 -70 56 -130
3492 -130 -1 -145 -139 12 -22 -141 155 -201 24 -58 -28 -60 -158 -162 20 -78 -271 16 5 -120 -19 167 22 183
3516 183 -55 217 -204 345 133 -64 72 -229 187 102 -35 128 36 32 -5 354 184 27 277 199 118 54 62
3539F2P3n0J72l78L35p2l54L60l26R4J27J62j15k14J21j99M3J18N3o9L4q1J31
3562B7j59O4k43K67K2o6J52l40J77Q8n2j8K1m3J13k7K5k82o5L43j80K23j1j92
3586a56J74n9K1p7Q4L46k73j41N9J70q4O0R7k37J3K9J81j16J91k50M9J4q9K86
3610B92m21L22m7k92J79l6r3J93J82r7K9J15k98m1O7J15j67j73M10l63l7L20J
3633A60m7Qk47J35K7k03J62k5l1k3J09m4Jo5p6L21k7k59K7R4j30N3J98l02KQ5
3659i7K54j56j35J70j30K51j67J34m4N0k65J57o5rP6j22K02k79K54l0r9J04K81
3682C35l23j11K20o3Q2j43J13k32j69M36j88J10q1L8J3P0o4j7k72J78Q0j32J0
3705a10J05j03QN8j54j3N1qm1K88m40L02j75K44j31K50m21M71k16J74k16J08K2
$$ plain form
3539 62 135 85 257 -121 214 142 -212 148 -178 -84 43 205 90 -124 -3 -202 -159 -41 12 -57 -23 -104 27
3562 27 -132 -68 -311 -44 -22 -88 64 -276 -99 -11 -63 -81 -60 -103 10 -17 8 -274 -339 4 -176 47 36 -156
3586 -156 18 -41 -20 -97 -13 333 60 -81 -22 148 64 124 221 -16 -3 26 207 91 282 32 81 95 6 292
3610 292 -129 193 146 -146 33 -3 -96 97 279 182 211 326 28 -13 54 169 2 -171 239 -124 -161 159 160
3633 160 113 121 -126 9 36 -167 -5 -30 -61 -84 25 -19 -18 -83 -159 162 135 -124 -97 -3 -133 -80 118 -184 -182 -97
3659 -97 157 1 -134 36 -94 157 -10 124 80 130 -135 22 -43 -52 24 -98 104 -175 79 49 -50 54 335
3682 335 12 -99 121 58 140 -3 110 -122 -291 145 -43 67 -14 24 37 107 43 26 -246 -68 12 -120 -110
3705 -110 -5 -108 -100 -42 -196 -209 -158 -166 -207 81 -359 -57 -232 12 -119 131 -290 181 -35 139 -77 31 53
3728E3Pk74L9N6jK07j81P5K2j00p6O7J55k22K43k37J13N2O0j15J41j71Q9N6J17
3753A75j4r0j30K8J69j26q3k2K20N5K37l73K17l55K93k68p7J13m0J06N9j15J10
3776H9j50J52j7l08o8L89r1Rl1j62j3L9N7j22M60m70J11k85L44p7R7J1k04J67
3800g3K29l77L66l32J46K08k36j96M07J52n02K71j97o9K30L5k06J20P2j5j04J95
3822A24r9L0l93N60j36o1K51k09J42n5p1J02j72J75j2j59P5o8O6m2j46M9J92l39
3846a96J45j6p1J18J04k40L3J66L9k64k2K06o0J28q5J0Q2m5J7M9q1q8N2j29J67
3871A9n0k14K53N9k08L45k73m6J62k54K66l32L33K9j47n0R8ok04J85R9m6J57K12
3895C87k97lm4j55L21k18P2R2j62J38k36M3J72J0k57J14N8J34k18N7M0n4o3K8
$$ plain form
3728 53 60 -214 -175 -119 -120 87 -94 -19 3 -97 -173 -106 49 -173 70 -167 -54 -2 58 -57 84 -87 2 58 175
3753 175 161 71 -59 -31 138 12 -71 -93 127 182 419 46 263 -92 201 -67 -144 -31 -71 35 94 -21 89
3776 89 -61 91 74 -234 -302 87 -4 5 -26 -188 -201 -162 -105 -227 233 -237 -126 -411 -67 -144 -47 -36 -240 -73
3800 -73 156 -221 145 -187 -41 167 -69 -265 142 294 -208 63 -134 -203 27 62 -144 -24 48 33 -71 124
3822 124 25 55 -338 222 86 25 276 67 209 154 83 185 13 188 176 17 92 24 90 48 -98 -49 143 -196
3846 -196 -51 -67 -138 -20 84 -156 -123 43 82 -182 -204 2 -58 70 -15 -5 77 32 49 98 17 -71 -19 -148 19
3871 19 -31 -245 8 67 -141 204 -69 -115 47 -207 59 -273 60 89 -58 -108 -10 -16 -220 -35 64 18 175 387
3895 387 90 87 43 -112 209 -9 63 155 -7 131 -105 -62 110 120 -137 -23 35 169 -49 8 48 -6 -69 -41
3919d1LK43m17M35o20K55K19J5Nl01K23k01O51p02L22k64K72k28JK71j42M1k2
3942A8R5k38j56L66k52J13oJ03j42K38m00l6K59k8j72oK22K4J16l3K56m16O1o
3966b0J33R4j16qQKj96J42J92j59l0j79J96j65M89j17m30J74K4K63j86n7N5n5
3990E4%k39O9J60p5K11j14k01k05M56N1m39K32K59j38mj66K4r2J13k85K57J99
4013A27k51J62j79j78J32oQ8N0j37K31j51K16k94q1k4M34k7k38K35Jl19J87J94
4036A72l13K10k80K94k7j79Q2j40K17p6J16R1k67J10J85k17j76K52J20j90M2J85
4058B11k48L37l08j38P8l2K40p6n0J2QJ01l4o9Nr3K61j55K4J39l54K00o4K05m72
4083b72K42M9J97j70o6N3J46k21K1j08K9j59K75k24K32o1J50q9m0q4L05l21P8
$$ plain form
3919 -41 -38 205 -212 223 -397 -142 77 92 97 -204 19 -182 469 -233 89 -175 97 -131 -130 141 -1 40 18
3942 18 113 -125 -281 85 -167 -54 -60 43 -99 139 -261 -297 -38 -66 -238 -244 -22 2 118 85 341 -75 -14 -20
3966 -20 113 207 91 83 91 93 -103 39 231 72 42 -137 59 -106 383 266 -164 10 34 297 111 54 109 54
3990 54 54 -185 -116 44 -31 180 66 -135 -340 116 167 -272 -40 219 81 77 -89 -65 -157 -44 -329 -72 127
4013 127 -124 38 -141 -319 -187 -193 -105 -55 -192 39 -112 104 -190 -271 -295 139 112 -126 109 110 -209 -22 172
4036 172 -141 69 -211 83 56 -123 -41 -181 36 -40 76 167 -100 10 195 -22 -198 54 174 -16 26 211
4058 211 -37 300 -8 -146 -68 -100 140 64 14 26 34 135 101 32 37 -56 205 50 74 213 -141 59 -5 200 -272
4083 -272 -30 19 216 46 -20 33 179 -42 -21 -129 -100 -259 16 -208 24 -37 113 24 -16 -100 205 -116 -38
4106c8L01n06J27J21j50J1L15k89P9J97k47J7J7J80k97K32L41n82N0K79k8l8j19
4129b7R8K04k95N0q3o2K89j27j07J0J38J3j99L78k7k29J60k16n3Q4m9O7L79l44
4153E2K2k11J85N4j79l3K04rK8J17j50k24L55r3m8j85J7o9k0J13J68j62L1J57
4177A20q9J31l17O6q8J43oq1K33j43J51o9j65R7J64j27j12J90j11N1j14L22j53
4200I3l5M7j69J64L5m04L47J77m91K71k5J80k30Q1Jj49J05j48L16j89P3j52K77
4223A75j35m1J04l7m6j43K23j18LL03n15Q3L3K08j45k40M13m40K63J36k55P4J8
4246g9j7J31K37m80M03k05K05m05RJ33P5p2J73j07r1r2L30p4m2K96m20q2J53K08
4270A87l01K81j23Kj78K2J85J51j14j19j36J64k6l73N34R4l31k7M04k85k05K66
$$ plain form
4106 -38 263 -243 -116 5 -145 -134 181 -108 -29 168 -79 -62 -45 135 -162 70 411 -171 -121 158 130 92 -27
4129 -27 71 275 -20 30 -53 -115 174 47 -60 -50 88 101 -98 280 253 24 184 -32 -85 -1 -50 17 396 52
4153 52 74 -137 48 102 -77 -110 94 85 113 230 80 -144 211 118 70 -115 -98 -167 -187 -74 94 -68 -37 120
4177 120 31 162 -155 -89 -177 -34 -40 -121 112 -31 120 51 -114 -17 147 20 -92 98 -13 38 -76 246 93
4200 93 58 105 -64 100 135 -269 78 255 -236 35 10 190 -40 41 42 -107 -2 -150 166 -23 50 -102 175
4223 175 40 -1 103 66 20 -123 100 -18 -15 288 -227 -144 -111 97 -48 -288 125 -315 -52 84 -171 -97 -79
4246 -79 -96 35 272 -208 195 -10 195 -210 -201 -68 7 -65 108 1 -90 -182 148 74 32 328 -92 -174 -21 187
4270 187 -114 167 44 46 -132 -110 75 226 112 -7 -143 21 -5 -378 156 250 -81 -108 296 11 -194 72
4292G2j13J57j0k09K76j70n9k50J69R1l9J30J47j29j19r7L00k15l49N52j23N2
4314F4q7Q5p4j35K61j6l73K36J53k30l8K84k49L3KJ47j61J68j03p8M7l31K74O5
4338e6Q6L4O2m47M07K6l56M59M7rj68k28P7R3r6J23J4p5N9K5N3o4J9k00K75k41
4364h1K24k06K57l20J40r1K00M9k19J05k11O0J40j13o5L27n01M32Mk31j75M87
4386B12j00J15nm89L85p2N4j49J50m02K79j01p4N3l4L46Lk29J62j23k69L75j53
4409f6o9R7j74K54R5l14J33K22j00M2j69J88k25P2R7j07J23n2K13j65j26L24j34
4432A59l06K17R2k50J69J14k80K07k00O1k7Q7j01n6P0%J66l61K51nK3J64l70J15
4456f1n4l0K58p7j26J56Qj35n0o7M18k40R3K5R2m46M8J56l0j5n1J61J47q3Rl78
$$ plain form
4292 72 -41 116 106 -103 173 3 -56 -306 -137 -46 -85 45 192 63 -56 -153 147 -68 -417 135 12 64
4314 64 -23 62 -12 -147 114 98 -275 -39 114 -116 -154 130 -119 -86 -84 63 -98 70 -33 -111 -64 -395 -121 -56
4338 -56 30 64 126 -321 86 112 -244 215 262 253 85 -143 -66 27 -69 54 68 -7 52 77 130 66 85 -115 160 -81
4364 -81 143 -63 194 -126 14 -77 123 172 -47 58 -153 -93 47 -66 -131 196 -305 127 131 -100 -275 212
4386 212 112 227 222 -267 118 46 100 -49 101 -301 -22 -123 -197 -144 -178 168 171 -58 104 -19 -288 87 -66
4409 -66 -135 -38 -212 42 137 -177 -44 178 78 120 -49 139 -86 -14 83 -24 99 47 260 95 -31 293 159
4432 159 -147 70 162 -88 81 195 -85 122 -78 -17 -44 43 -58 -114 -44 -44 122 -239 12 7 30 194 -176 -61
4456 -61 -115 -145 113 36 -90 66 74 -61 -111 -178 240 0 93 118 210 -236 -188 -32 -62 -77 -128 33 180 97 106 -272
4482b72Q8J89j77K02j08P6m4j10J25j1K79k03J02N5j45k16M05k60j16J82k40J88
4504a1K05k9q5p4mj96N51n03J69L49k96q4k7K35n8l4l64P7K01n6m9J12l6K70k35
4529B8j52m2M9q3K15nnk6j57Q0J88l58M24k39J17N7J82k81p7O2J2Mm8l6J1K68
4555A88k87n5L55j08k72J11q5K94j61J19k00K11Op3k47L78j95o0K62R9j30j37
4577A3J09o4P6k11K63k47M9L4k6K19l19J32K42k69PK26j14kk15Nk9K97j39j49
4601a12N1O1l9jn3J4r9K07j66N2N4N8j08%R6k7Q2j17j90J89j35K74j0q4l2j30
4627a65r4K89m2l4K90l11J64jK2j67J5mj54J81k3Q4o9P5P9k06J93l23L20j22J63
4652A60J8j57m9J31q7K1j96J20M2q2L02j31Nj19o5J65j01K3J92k81J08m8j07Q5
$$ plain form
4482 -272 -184 5 -172 30 -78 -2 -46 -156 -31 -42 237 34 136 191 46 -170 235 -25 -141 41 -199 -11
4504 -11 194 165 80 6 2 -194 357 -146 23 372 76 -8 -35 200 142 108 -256 -179 22 -34 -83 29 -7 263 28
4529 28 -124 -166 -117 -200 15 10 5 -21 -178 -98 90 -268 156 -83 34 91 273 -8 -85 -23 -11 -7 -55 -91 -80 188
4555 188 -99 -154 201 93 -179 -68 -153 141 -20 99 -101 110 116 43 -204 174 -21 -81 181 280 150 13
4577 13 122 58 134 -77 186 -61 -12 22 -4 215 -104 28 270 1 8 234 120 118 -97 -92 -121 176 37 -112
4601 -112 -61 0 -39 -40 -93 -79 -178 29 -137 -85 -31 27 -81 -81 15 -12 70 -47 -237 -48 -183 91 81 -3 -35 -165
4627 -165 -259 30 -12 -46 244 -67 97 96 118 -49 -34 -38 -192 -11 -34 50 -19 56 135 -71 122 -201 119 -3 160
4652 160 178 21 -28 103 16 37 -159 -39 3 -79 223 92 97 -22 -87 78 -23 0 192 -89 19 -29 -136 -51
4676e1r8j8J08P6J48k40J26mj35J69j53j11M3l4K61L7l38K05R2j27l7l4J27l4
4700b2J06k99K34N6k03J36J80k67j91J66M9J72q1m2K03l48J8K8K0j92M84k63Q6
4723C0j5P2l3j2J23j74o1q7J80J8k3j20M5K4Mj5Q4n3j53J71l1jj11J88j23m6P9
4750d0m4O1P5L17k43k57K21j16J66M1k04j91L64p3j18p7n5J61m3O8j00J22n0j90
4774b05rJ82q9J64pQ7J13n06L53K9k21R5j89K34Lj26l8J39o3J79j68K2K05j63
4798B1k4M9q3J90k11lJ73k75M16n5j28Nk6P4j25mK6m2J56k81M9r9M6kK94k1p3
4825D7n5J08O2k68l5Q8J18k58J50J65k59j18J86m4o9R4R3O1Q6k80jL2PqJ68j50
4851h0q1K56j41o2K33k92K33j17P3r5jK42k48k5J66j05J80l25J43J35m2J84o2
$$ plain form
4676 -51 -149 -167 -59 17 165 -75 51 47 -88 81 -72 -183 -140 -174 87 124 -214 -9 83 -44 -81 -115 12 -22
4700 -22 84 -215 19 75 -128 8 188 -79 -270 -104 -55 117 36 -6 197 -151 -133 -105 -85 -277 207 -56 30
4723 30 15 87 54 42 165 -9 -70 -157 23 41 18 -102 -57 -33 -29 -44 40 -13 -166 5 -26 -27 -138 50 -73 -119 -40
4750 -40 -84 -23 52 369 126 -131 90 -26 140 181 -23 -214 150 77 -41 -118 -173 -12 -55 13 -87 35 -15 -205
4774 -205 -214 -32 -121 43 36 123 236 -270 83 112 -109 -14 -203 31 34 -92 -130 9 -54 125 -43 -21 184 21
4798 21 -3 46 -37 153 -58 -61 112 -163 253 198 70 75 49 123 -2 -6 20 -22 134 -147 -98 -197 -151 -153 141 120 47
4825 47 -8 100 162 -106 -141 -53 65 -193 -43 122 -137 -255 -69 -113 -182 -88 5 66 152 -128 -129 -97 -90 -98 70 -80
4851 -80 -161 95 -46 -108 125 -167 66 -51 22 -73 -74 168 -80 -105 61 -44 136 -189 -46 89 47 231 169
4874A69q2l0Q5Mk14M26j8L4m35R1m8o7L60k14J50k14J00j27J60j28R7j10J32j36
4898a5J5J28k27K08K5l7K3j35J09Q3k78j39K11J25J01k78p1J08j83o9J87J49j16
4921g6R1j14J2M9j78M7KK04M4M7p4j1k98K99J67N0n8m06R6K8K7K3j11K75k04J61
4947I2l25P3k37K44K97j9q2k31l8L53k64J1PJ50j30K14k60J71p5J61j26J73k39
4970h0j6M8L8J14l62L11J6o6j99M13m67L41q6j70K48Q8r6j40o8J62k2J8P8l9j9
4995D5k47L6K28K6L13l58j52J06j41K71l43J6K08j06J54j06R7j1K2k08J15l9R6
5018B2k21J13J34m6p1J27J21k36J72jj92K21k22J49J29l36J25k3J54J41j98m36
5040c74M41l41L02r3O4J84j57k22K76n4J00j22j6J85j45p4K17k10k4m6M6l8l5
$$ plain form
4874 169 87 57 142 146 -68 358 340 374 -61 30 -18 -85 275 61 211 -3 97 -30 130 2 99 -11 121 -15
4898 -15 0 128 -99 109 134 97 120 -15 94 177 -101 -240 -29 96 197 -81 -152 -44 -227 -296 -109 40 -76
4921 -76 15 -99 -87 -38 -216 -169 -167 37 81 128 54 43 -255 44 211 261 203 -203 -107 -79 -52 -29 -140 135 -69 92
4947 92 -233 -160 -397 -153 144 125 43 -188 -226 127 -137 -126 -119 31 -99 115 -145 26 -49 112 -14 159 -80
4970 -80 -96 -48 -10 104 -258 53 69 3 -196 217 -250 91 5 -165 83 171 75 -65 -133 29 7 25 103 64 45
4995 45 -202 -166 62 88 401 43 -109 -3 -144 127 -216 -200 8 -98 56 -50 47 36 58 -150 -35 -74 22
5018 22 -199 -86 48 2 -69 58 179 -57 115 114 -78 143 -79 70 199 -137 -12 -35 119 260 62 -374
5040 -374 67 -274 28 -65 -1 183 26 -196 80 26 126 4 -12 173 28 -46 171 -39 -63 -109 -63 -101 -136
5063a36K57J69l49J45k14L9J43k92M95l30K09l03K68j45k9o5m6J47Q0j95rJ35
5085b6J4L1J72j54p0J66j79j88L01j1p0K86j13j66j37K15j78ll5J11J56N5k97
5108a20j8Q3J00q1o0L5M5J30J46o8n06M82l23J51J86n8r0J34l05K04n6j2J58j05
5132E2k04J82N5j5k04Q5j86J01K07j03l4P2k1N2j84K72P7l53R9J3k56L06j50K42
5156A05k36J62j08j01QK37o4J02j49J66k23j22J81J41K04m00kl9K73n4p7j75J58
5179a3J23j59J21J2Pp3m10L90j4J93k38N0j3KlM6k94K66J4K08j31MO6j67J73k11
5205e1P0j85J58r9J98l3j3j49L34q7k82j42J62J85r7j56K96j91j01J25j31J13
5227g6K28j67j08K76j40o2J5o1K87j69j32M49k72j90J06M0J99l40j2K93J23k44
$$ plain form
5063 -136 121 290 -59 86 -128 -89 54 -238 257 -73 136 -167 101 -44 -73 -138 -184 -37 43 -152 -161 -26
5085 -26 -12 19 191 37 -33 133 -46 -234 67 56 -14 272 159 -7 -144 71 -107 -110 -145 -34 122 177 -120
5108 -120 -138 -55 45 -36 -96 -61 -16 114 260 192 -314 168 -155 -4 182 124 34 168 -137 67 11 -1 157 52
5132 52 -152 30 85 70 -134 -49 -235 -134 73 -30 -64 8 -13 39 -145 127 204 -149 -50 -37 -293 13 -137 105
5156 105 -131 31 -77 -178 -170 67 3 105 -44 122 -101 -223 -42 99 303 -97 -99 -138 135 81 4 -171 -13
5179 -13 110 -49 72 84 91 18 -392 -2 -16 177 -61 -11 -24 -22 -25 21 -273 -7 7 215 84 88 154 -13 160 -51
5205 -51 19 -166 -8 -107 91 58 45 -104 230 143 -139 -281 -119 66 -31 -187 109 -82 -183 -58 -189 -76
5227 -76 152 -15 -123 153 13 -49 -34 -95 192 23 -109 340 68 -122 -16 24 223 -117 -129 164 287 43
5249D3j5j02K12L3k57k59K01J14j00K49j04k29M07l2j90K25j94J90j27K3M4r5
5271C7l0j53N11k98j40p7O8P7j23J47J24Qk33O5o1J04q3k01L13j33r8P3p6K3r5
5296b51J32L09l46J60N8l55K04K9o1O2j2J45j28O9K6k11J42J22J36j93K9j55p6
5319a65J73j30Q9K67j63JR2l07K93J22k15N2k00J04j5k5N6j05P5J09o2k71M07
5342A82j44n0j76J31N9l95L14J76p3l68J13K85J38o8l36K28j14j68N24k61M1M9
5364H7l5k30J85r9L1J69Q8j69J62p3j18K11k12j34L81n32o4L74J10n7m2j1o0M4
5388FJ13L5j79L7l6K18l04J11K04o8k31j8P0qm6JL15j51j68J16K55q2n0j99K21
5413A62nl34P3K82k64k0K32n7j46J80l04J56J53J53l02R8L7O5q9j56L7r1oJ2p4
$$ plain form
5249 43 28 -74 138 171 -86 -345 -144 -30 -130 119 15 -214 193 161 -29 196 2 192 65 88 132 37
5271 37 7 -146 365 67 -73 -150 -82 -5 -128 19 143 151 -82 -17 -78 26 -57 -258 55 -78 -176 -103 -179 -156 -251
5296 -251 -119 190 -156 4 62 -293 -89 -60 -121 -59 -71 74 -54 15 41 -170 -28 94 230 37 66 -89 -165
5319 -165 8 -122 -33 234 71 72 164 -143 150 272 57 109 -91 13 -2 -27 29 -76 -1 108 46 -225 182
5342 182 38 -12 -188 -57 2 -393 -79 97 24 -344 -231 54 192 124 -212 16 -98 -266 258 -3 38 87
5364 87 52 -178 7 -92 -61 108 196 27 189 116 -2 209 -3 -137 244 -288 -352 22 132 75 33 22 -38 6
5388 6 119 154 -25 12 -24 194 -110 1 205 137 -94 -112 -42 -50 -96 -95 220 69 -99 17 272 190 140 -59 162
5413 162 157 -177 -104 178 -86 -106 126 69 -77 103 -201 -45 108 261 -41 57 94 159 70 -86 -49 -140 -146 -134 -208
5438b08k3J58j89J58K36j55N3p0J48n9Nj09J17j30M7r3n0J37J64j04j9k17J64
5461c9k9L2J34j04p5J52j3p3p4J81j95J18pj79J21j26P6M0J83j82k55K61L8J28
5485A13k98k3J34O3O7k0q0J51k99K9K29k64K79n9M3j00L7O1j0p3q0J11j34K09
5509H6j44K70j31k81J08k7J48j02Q9l0l0K03k19q3L60k70M7M4J0j17K28k60K58
5532A57k62K69k98J17J54k23Q4R0J40q9j98J2N5m6M7m9r7K13q6j60R9J90k28J95
5556H6q7m7J14j2L7j42%K33k01l7N9JP2j75K2j86RL45j96P8N3K16l18K61l28o5
5582b08J25K35k30K54k87J0J08%J8l6P8q8j97J38J5j62J94J25j88L30q0j83L15
5605B86m32L95m16L08K0k79K71j49K3j46L07k58l2K5J00Q8J2j81m8J35j35J5N4
$$ plain form
5438 -208 -231 -73 -262 -104 132 -23 30 -40 108 49 54 -55 62 -68 -21 -114 -164 -27 137 33 14 -203 -39
5461 -39 -68 -36 98 -6 -81 71 58 -15 -89 92 -103 15 8 -171 -50 -176 -100 -60 123 -59 -314 -53 -15 113
5485 113 -185 -208 -74 -11 56 36 -44 107 -192 -163 66 -198 81 22 65 -35 2 63 53 -20 -100 11 -123 86
5509 86 -58 212 81 -200 -92 -119 29 -73 16 -14 -44 159 -60 -143 217 -53 -6 38 48 -69 159 -101 157
5532 157 -105 164 -134 -17 137 -86 -2 88 228 139 -59 -47 8 -38 9 -40 -137 76 -10 -170 -71 119 -109 86
5556 86 -1 -48 66 54 91 -51 -51 182 -19 -56 3 4 76 -99 -77 -263 -254 91 -105 -27 26 242 -76 185 -143 -208
5582 -208 -83 152 -78 176 -111 -101 7 7 25 -11 67 -21 -218 -80 -65 -227 -33 92 -96 234 154 -29 286
5605 286 -146 249 -167 141 161 -118 153 4 27 -119 188 -70 -102 -77 23 111 123 -58 -106 29 -106 -91 -37
5628c7O6r0O3N4p0L5j75K24j9j42j81K5K49L19k63O2k0j37k36J41K44m8J90l41
5652h7P0j22K70l0J4L0k66K71l07J61j40K85j83l6K05j85m6m2K04j6l9Rn7J93
5676A56l00K05o6J70k8l9k23P3p6K07j67k1K41n3mj47OJ54P2n4j34Q0P4Ll1m2
5702E6J3O0Rm1j81nQ9N7L8j51P5P3o2J23l0k81Q3K13j36k20L69k59k08N42k56
5727c0N3q2J08J2J2k34K4K7J44j53K76j51J3N8k0p6j68M02k14P8j08Nl6j96K01
5752e5J37j08j16L0K28j47p9M1P8m7Q0m0q8K04j89J51k06K77k63K25kl00Q9K59
5776A59o8nR0k00J50k35j7l5Q4J29m0n8J47rk84QL67J00l48J61O8n50J84J55J59
5801A12Rj78m6L8J17r9r4j26K59j86N0Q9N5j16J99k00J07j65L8K69l33M3K23j96
$$ plain form
5628 -37 29 -61 2 56 -14 21 -154 70 51 -91 -272 -247 2 321 58 120 100 -37 -273 -132 112 64 254 -87
5652 -87 -17 -139 131 101 115 145 -121 150 -157 4 -136 149 -34 -70 135 -50 -96 -138 66 50 11 20 -37 156
5676 156 -144 61 -5 165 137 98 -125 -52 -128 79 -88 -109 132 79 75 -72 -66 88 160 106 -28 52 126 129 98 56
5702 56 69 129 138 97 -84 -89 0 57 95 -56 19 92 30 153 123 -158 -75 138 2 -218 151 -108 -316 226 -30
5727 -30 23 -59 49 61 73 -161 -137 -110 34 -119 157 6 19 77 57 -19 -187 215 1 79 -29 -24 -60 -256 -55
5752 -55 82 -26 -142 -112 116 -31 -110 -69 9 -38 42 2 -86 118 -71 80 -126 151 -112 113 111 -189 -100 159
5776 159 91 86 176 -24 126 -109 -126 -161 -77 52 12 -46 101 92 -192 -184 183 283 -65 96 164 -386 -202 -47 112
5801 112 121 -57 -103 -65 52 -47 -141 -267 -8 -194 -144 -55 0 -116 83 -117 -10 -175 -137 132 -201 -158 65 -131
5825a31P1K87j68j07k31L33p5K59j65j41K87r5Ml06M3K45j28K07l01Q1j43O6J27
5848A9K06j81n2J14k37K15L6n7O4k6L8k22j41J14J53j00m5J65j07KJL6J13j91
5872h3J26m0N7k27J17L2mp9p4J33j5J14l8k39O4l8L53j37j85K85r6J36n1p5j54
5897a18J64p7J01j37o5j92L61N2k17J12k0J03qj79J54q7J26j23j93K36j30K63
5919A26k8j69Q8j6R7j94P5J51Q9j53k34J09j7M9J46l69M86%m38N30l04j32J07
5942aj27J33j19K58j35l51K82j63N7Q0p1J85Qk54L34j42M6j16j46J29J30m1q0
5965a04L53r9m49K78J83j96J35k6j22Q8j53p8J71N1O1r8k60J95K70m10K07K62
5987B59k79o6L2O7J81j42O3Q8q7N6l56j40L90k02J96M7j04N2J18k41Q9q8O3J7
$$ plain form
5825 -131 -60 227 59 -48 -279 54 -21 238 73 -68 219 124 128 -178 -135 110 -18 189 -112 -31 -174 -108 19
5848 19 225 44 -8 106 -131 84 120 63 127 101 139 -83 -224 -110 43 -57 -102 63 -44 -42 -41 -5 108 -83
5872 -83 43 3 60 -167 -50 -18 -22 -101 -175 -42 -57 57 19 -220 -156 -194 159 22 -163 122 26 162 111 36 -118
5897 -118 46 -31 70 -67 -132 -324 37 89 -128 -16 -36 67 59 -120 34 -53 73 -50 -243 -7 -137 126
5919 126 98 -71 17 1 98 -96 -21 130 219 66 -168 -59 -76 -27 119 -250 236 236 -202 328 24 -108 -1
5942 -1 -128 5 -114 144 9 -342 -60 -223 -166 -86 -157 28 36 -218 116 -26 20 -96 -242 -113 17 -24 -104
5965 -104 249 150 -299 -21 162 -34 101 75 -47 41 -112 -190 -19 32 93 -5 -265 -70 200 -210 -3 259
5987 259 -20 -86 -54 13 194 52 115 203 116 172 -184 -324 66 -136 60 107 3 55 173 -68 21 -67 -4 13
6011A3l3J53l0j29j19Q0q8K05k09K45o8J19r8j09J70k72L88k31j26K33k61j95
6033c62L56n8K27m69R2J32j4R6j59J53p7M4m7O5k06O9K56n6j5K5K65l46j73R1
6057a11L14k92K30n8p6q2k4j27L52k78L17k25J95P8j42k57J05J39m1o4J62j85
6079g0J78j36J7J06j42J88M7j45j89N3J15p4O8K1m9J54k52J90j53J7L09k64N8
6102D7j0o7J11J59k36m4J35l80J63O5q1N6L6J83j32k02K10J1k5J9j93J53j17K11
6126G2j76N2K49j22k9j14o2J15p5K54j76K40k81P8k2P7mj35J74q1o7k4K3K59j53
6151G2j02j07K32J32j34j07M9Q2j60K25%l2j46j35N4O9L3J29j90R8j83J54JPk33
6176a92R5n7K37j6j26K70k67Q0k46K70M3k59J63j85N8K27o2K5k60R2J01J94or7
$$ plain form
6011 13 -20 133 103 -26 -145 -65 -153 52 -157 88 20 139 41 -68 102 -170 218 -13 -139 94 -167 -362
6033 -362 -6 -64 163 -306 -214 -82 -96 0 -159 -6 -83 -39 -86 -21 -227 -158 98 42 27 52 317 -29 -202 -111
6057 -111 203 -89 141 83 7 -75 -99 -226 126 -152 165 -60 135 213 71 -186 -81 58 17 -47 115 -70
6079 -70 108 -28 -11 95 -47 141 188 43 -146 -93 22 -52 16 37 -12 142 -110 80 -73 -56 253 -11 47
6102 47 37 -30 81 240 4 -40 95 -285 -122 -57 -138 -82 -46 137 5 -197 13 24 -1 18 -175 -22 -139 72
6126 72 -104 -52 197 75 46 -68 -130 -15 -90 164 -12 228 -53 25 3 80 76 -59 115 34 -33 -57 -34 225 72
6151 72 -30 -137 95 227 93 -14 35 117 -43 182 182 150 4 -131 -77 -8 25 154 -36 62 -121 33 34 41 -192
6176 -192 -97 -154 83 67 -59 211 -56 24 -222 48 91 -168 -5 -190 -132 95 33 58 -202 -110 -9 185 179 82
6200H2j58kk02J09q2L1O2K35j82Nj82L03p6j83J54J96m2j07K79j15j16j09r6K86
6224I0M6J9l22J92P8j68K23N4l14K34P7o2q8j00o4L05k42O6N9j04K09k80J39j59
6248a12K25jj02j27J64J1j03k46L76j71J8K38l64K89QP5m9k02O1n6J57J54k80
6271c7O6j49L2J18j35J76j46Rn8R1o4J90k80J3K40l35M72l84P6K20P3J40l32n0
6295e4R5J64J83m32o1K12k8K08l22j97K46n8J3p7O8K36k14K70m67J44L4j38J98
6318B3k05N1K72k31j25L3M5L3j90M32j45r1L4J57J38m16J46K52k53k25K69m9J58
6341A13o2r4N3j42JR5J66j00nR4r9J42k30J51k84J69M6j0J47l55L34j18n9K34
6365A87q2Q3n9l36K07L8rl54L95l2l01K63J29n6J40j51J46j75K14k25K1O8k78
$$ plain form
6200 82 -76 -78 -280 -171 -253 -222 -160 75 -107 -102 -284 19 -57 -240 -86 110 68 -39 240 125 9 -100 -196 90
6224 90 136 155 -167 25 103 -65 158 212 -102 132 209 147 59 -41 -105 200 -42 24 83 -21 188 -92 47 -112
6248 -112 113 112 10 -117 47 58 -45 -291 85 -86 -68 170 -194 95 103 178 129 -73 -12 -68 89 243 -37
6271 -37 29 -120 -88 30 -105 71 -75 -66 -124 -33 -97 93 -187 -174 66 -269 203 -181 -105 115 188 328 -4 -54
6295 -54 41 205 388 -44 -105 107 79 287 -35 -232 14 -44 -31 -108 -40 196 -18 252 -215 -71 -37 -175 23
6318 23 -182 -131 141 -90 -215 -182 -137 -104 -294 138 -7 -98 -64 93 231 -185 -39 213 -40 -265 4 -45 113
6341 113 51 -43 10 -132 -131 -36 130 30 25 119 20 162 -68 83 -201 -32 14 4 151 -204 130 12 -47 187
6365 187 105 188 129 -207 0 38 29 -325 70 38 -263 0 129 73 213 62 208 33 247 22 43 111 -167
6388a67K7Mm7L24j53qO1j96L07k72L70l36j16K96J36j82n8l61L35k0m8J40j54
6411a18M33l01K01k53J30j73j15L18j18r2J22N6K6j04k74K96j5k09K53k47K72
6432H8r4j83K67R0j90lJ11l78L54j7M1j01j35N0J60j30J42j20K31N8k80J26j58
6455g1Q1N2NJ49k39M4q3K48k92M0L08N8m67K16M0k01L89j33j83KP0n7j54q9J39
6480a28rL43k34o7K5K47l60p6K96m06K18R2R8J3J62l18k4K4J22K31l06O0N8j32
6504g1r7J59m2J90j00R1j45K18n17M49j02J18J3o4M8km6j14J61o0r7J12J27k73
6528d4k7KN4J13jj23J43j16J90k31n6n1J1K27n8j51O6o5L9K13j49M1j86K64n8
6553D7kJ31l28l9L93m50j41K12J64k78L42M6j71R5k58J98kk98K86P0m7p3J65j68
$$ plain form
6388 -167 -140 -136 -183 141 -12 -20 41 -155 152 -120 250 -86 -202 94 230 48 -10 -371 -36 -56 -104 36 -118
6411 -118 315 14 215 -38 92 -81 -196 122 4 -88 34 90 116 12 -262 34 19 -190 63 -184 88
6432 88 -6 -189 78 168 -22 -25 86 -292 62 45 86 -15 -150 -100 60 -70 72 -48 183 241 -39 87 -71
6455 -71 10 62 67 216 -23 21 -62 186 -106 -66 242 300 -167 49 89 -112 277 144 -39 -37 33 -24 -178 -267 -128
6480 -128 -137 206 -28 -95 -70 177 -183 -259 37 -369 -151 -59 39 52 214 -104 -128 -104 18 249 -57 3 61 -71
6504 -71 -168 -9 -51 139 39 130 -15 203 -314 135 33 151 164 100 148 146 100 -14 147 87 -10 102 229 -44
6528 -44 -71 -69 -15 98 97 -26 117 1 191 -40 -96 -147 -136 91 33 -118 -52 -117 -78 135 -14 27 -159 105 47
6553 47 45 176 -152 -191 202 -248 -389 -177 -13 -291 51 97 -74 21 -237 -39 -41 -339 -53 17 -30 -103 62 -106
6577a06j86N17k53j5L10q0l22K91po5j18j81K20K05k10l27N70k58J04k40M9R6
6599fJ56j30M4l5j37J33Nl2mL7j05N0l5L09j36j64K3N5j59J04J6q7K0P8k70L57
6625H7n1j10J78k69K21j57J83P8j97J24k17R4K17j75l4l2N3Q9k81K70R5j17j86
6648a37J95k37L39k14J65m5J04j58m0J4k77M74l11J34M0J34k38J73k30j09J67
6669e7j05K27o2j64L04k69L18k26J85j94Q9M01m05L4j12kJ67k78K04J43j59j71
6691a32J30N7j55KL6J76j96J20j91J27K15j80J17j94k0k14N64l16J23r1l1Q7m4
6714a0O3j82O2o5K25k88K09J61k68J21J39L6J3k71J69r7K87k56j14M5l05N25k20
6737b1J68k57K1kJ26J26j62k1L0P8j00k25K84J7J1J07l17r2J47J94j08l18J70
$$ plain form
6577 -106 -292 225 -28 -43 267 187 -135 156 149 84 -34 -215 5 210 0 -327 243 -15 89 -151 -102 -6
6599 -6 150 20 64 29 -108 25 30 -2 -6 31 -74 -24 -59 250 114 -50 -27 28 -131 -27 -11 -98 -78 0 -270 87
6625 87 36 -74 104 -165 56 -101 82 160 -37 87 -130 -36 181 6 -28 -60 -7 82 -199 71 166 49 -137
6648 -137 58 -179 160 -54 111 66 170 12 -28 -14 -291 183 -128 6 46 180 -58 115 -115 -224 -57
6669 -57 -162 65 3 -161 143 -126 192 -34 151 -43 46 447 42 76 -36 -38 129 -149 55 198 39 -132
6691 -132 -2 55 -100 -98 -62 114 -82 38 -153 -26 189 9 126 -68 -88 -302 262 -54 69 -22 -53 34 -10
6714 -10 53 -129 -67 -132 93 -195 14 175 -93 28 167 203 216 -55 114 17 304 48 -66 -21 -326 199 -21
6737 -21 147 -110 -89 -91 35 161 -1 -22 8 86 -14 -239 45 62 73 180 -137 -229 -82 112 4 -314 -144
6760a44J49kr0K90j76k40K74Q6j01M7k29j29J88Q6J66R7k61q4J03k68K99L44l01
6783A04k55K12k94L31Q9k74K37j80r1j06L02m0k27L35q1k31K24j09R0j63J18J2
6805CJ30k4q9m3q6J52n9O4J69l26K08J04j63m1J6J02j06q0J87J29n5l00K40k49
6829a17L55k13J58q6k35K25j86j49L4J93P2k65L85j95P5k3o2M3L1r0J3L31m13
6852a19q4L16j86J27o2K9k21K57l8O0m0k34N0L7J87l8j89j10K16m7J47j72J29
6875A5M2k38J07L58l06L1M4j71n5L42k73o1K79k00k6K02k67K26k6j0m9J41k55
6898a50K55j27N3o5M3m20L43RL5j0l21L43j33Q6K16j95R6n3J60j09k14P1J73k8
6922E8j06K0j45p1l0K16r1J88M8J48l75M2N7Q6j4p8J63k66J55k52K74L02l01J28
$$ plain form
6760 -144 5 3 -87 203 27 -213 61 147 46 93 -136 -265 -77 9 175 272 11 -73 30 -238 61 405 104
6783 104 -151 61 -233 98 187 -87 150 -30 -121 -227 75 35 -192 143 62 -169 55 -54 36 -127 -9 3
6805 3 133 109 20 -23 -109 43 -16 48 217 -109 99 203 40 -1 15 117 11 -69 118 247 192 -108 132 -117
6829 -117 238 25 183 97 -138 87 -99 -248 -214 -21 51 -214 171 -24 51 28 -34 9 40 -50 -37 294 -119
6852 -119 -203 113 -73 54 -8 21 -200 57 19 79 39 -195 -145 -108 79 41 -148 -258 -42 -89 58 -114 15
6875 15 57 -181 -74 284 -22 9 53 -118 -173 169 -104 -165 114 -86 -112 90 -177 49 23 13 -36 105 -150
6898 -150 105 -22 31 -34 9 -411 -68 -59 -24 -34 -355 -12 -145 -59 157 -38 58 5 165 56 -158 -87 86 58
6922 58 -48 -28 -173 -244 -274 -58 -149 39 87 235 -140 -98 -41 45 31 -47 116 -150 5 -247 27 329 28 156
6946A56k23J85j80J16j07K9J20R8p9k16k31L16n1J1K72k71J68j80K16l87J91j9
6968f6L1N8K5K39k11J7k93L2K52M6Q2k31O9L44l28r2n4j24n4L69M7m1L8j06J78
6993B27m4k75K76j9L3j1l38J82J76l05j69J09K58J72L5l09l55L04K22m0k76k07
7015c54J97J19Nl5K33L01k60J30k17n17K23l8K65j49l67M7K92Q60m60K65k23L71
7037F88k07q37N28j75J32j47k8R2r7L1k36L05J41l45O1O8M4L9k82K05K00j61o4
7060d5J16J91j12j83J04o6J5J33l13L42j58q1JM5Q5k82K96l42M16q3K2j16L0J89
7084B04j80l8k1J1K09j45O4N7n8k04N6J9K14k53j22J87o8Q1j65K29Q8k90OJ0K82
7109A73m55O09k46k75J83p1L1M8Q1j11K36j35J28n73M44p2K0J51k05K13j64R3
$$ plain form
6946 156 -67 118 -62 54 -53 -24 96 194 115 -101 -332 -16 -67 -56 216 -55 113 -67 149 -238 -47 -66
6968 -66 -35 23 48 287 76 93 -200 -168 84 130 212 -19 50 394 66 -26 -80 -204 -258 111 158 117 155 49 227
6993 227 183 -92 184 165 198 187 -151 31 207 -98 -267 -158 100 272 307 -2 -357 -53 169 129 -147 -354
7015 -354 -157 -38 -33 -68 165 466 206 336 119 -398 -175 -213 52 -97 -464 -417 -125 735 275 540 317 688
7037 688 481 -356 172 -3 129 -18 -46 46 -51 -20 -256 49 190 -155 -94 -26 18 57 -225 -20 180 19 -45
7060 -45 71 262 150 -33 71 5 20 153 -160 182 24 -57 -56 -11 74 -208 88 -254 162 79 101 -15 15 204
7084 204 24 -14 -35 -24 185 40 104 161 103 -101 -45 -26 188 -65 -187 0 -68 13 -152 77 165 -125 -119 -109 173
7109 173 -282 327 81 -194 -11 -82 -51 -3 78 -33 203 68 196 -377 67 -5 15 166 -39 174 10 103
7131A03j41N1L07l13P7QJ26l88L92m13J92M3J87k54mL9O2k9J52m39L24k5k02J90
7155D5R0j64k0J18k11mK13j03j48L61l17J18k9o8R4m5j84L18p2L0J13O5j92R8
7179A06k2m6P4N3k35N2j07L30k74j80M33j52J25j12m1N5j15j41K83l14K53J39
7201A64j62J99n94M22j77J07p0p6J35n4M69l39J37m5l8J05j88l09L90K09j0k08
7223F7K22k64K2l01K08K06k56l1K30k58J86j63R2m6l3J65J3O9l69K63k07J79p2
7246g8J2j90o4L35Q8l00O9O2P9p6J05j21Q4J3m1jn3J21J32J13k69k31K75p4J47
7271A37p3j01j15K57k72J18k23N7J30L93l64Q4j51q7J27K91j23n7j17OQ2J70l07
7294a38J56n3J30N0k79K48l08K34j94n4J04jJ27p4q5K36J22m4j13J86l18J20j36
$$ plain form
7131 103 -38 13 320 7 84 92 218 -170 222 -191 1 44 231 -23 -27 12 74 45 197 -242 82 57 -145 45
7155 45 135 -29 -49 69 -142 -146 67 -36 -184 177 -140 -22 -51 -119 -25 -70 -254 64 -8 22 135 200 8 106
7179 106 84 38 112 165 -70 -18 -125 205 -69 -249 184 32 157 45 4 59 -56 -197 86 -228 25 164
7201 164 2 201 -393 29 -148 -41 -111 -187 -52 -106 363 24 161 116 78 183 -5 -314 76 285 275 67
7223 67 289 25 47 -254 -46 160 -96 -127 103 -155 31 -132 -40 -86 -119 46 59 128 -241 22 -185 -6 -78
7246 -78 -66 -256 -320 15 103 -197 -128 -66 13 -63 42 -79 5 18 -23 -24 -77 44 176 289 20 -211 64 -10 137
7271 137 64 -37 -152 105 -167 -49 -272 -215 -85 308 -56 28 -123 -210 -83 208 85 28 -89 -83 -1 169 -138
7294 -138 18 -35 95 145 -134 114 -194 40 -154 -208 -104 -105 22 -52 -137 99 221 177 64 250 -68 52 -84
7317h4n5J95k78K55J5J08l98K78k22L9j04L16k18K89j08j16m1J31N7j00j32L27
7339A54M8l43O9j01P7L15k22j94K88j97K76j07j70L3r4J03qo7J97j56R6J34j20
7362A1o9PK20l27O9P7k85K59K39j07k52J68K56k29K8l4j4J12n0L6k23K66k02O
7386c8n6Q8J87l16j15L16J82k03j33J6L13n06L12j1j50R6K48j31K22m3k23m9K15
7409B21l55J32k44J67J45j15q0m8m7L91kl34J62k69K75r8J20j56R9L18k19k14
7431a51K77j48J34j57L4O0K18j54l6Q8k11K00j42j8J4o5M5L0lOj43k04M41k66
7455a51J67J28j2l83K29K73k12j72J14m8n3J96k9j79O5j28J15L46k77J1P6k32
7477a56N14l41J5k81K13R8M0k11K1J39k4k40K06N0k31K33j4j58K37Q9k57j54K30
$$ plain form
7317 -84 -139 56 -222 33 48 156 -242 36 -186 -147 -251 65 -153 136 28 -88 -129 2 59 -41 -173 154
7339 154 202 -141 -72 -173 -96 219 -3 -197 91 -106 170 63 -107 -74 -168 -65 -73 -140 57 -99 -3 131 11
7362 11 -58 -51 169 -158 -89 -12 -297 -38 201 94 -158 10 266 37 65 31 17 129 79 115 -108 158 -44 -38
7386 -38 -94 -6 181 -135 -250 66 248 45 -88 -72 241 -265 47 36 -114 -18 230 99 321 278 55 6 221
7409 221 -134 -2 -246 -79 66 -49 -129 -177 -224 167 165 -169 -7 -276 -1 -99 21 -135 -36 282 63 -151
7431 -151 126 -22 112 -45 -11 49 267 113 77 165 -46 154 12 -6 8 -57 -12 18 15 21 -122 -326 115 -151
7455 -151 16 144 132 -251 -22 251 39 -133 -19 -67 -120 76 47 -132 -67 -195 -80 266 -11 0 76 -156
7477 -156 358 17 32 -249 -36 62 102 -109 -88 51 27 -213 -7 43 -188 45 31 -127 110 199 -58 -212 18
7500A8NJ6Pl45N23j52J76p6o8P8j26o6M1L6k86J15M19k01j54L38l99P1J87m10
7524b53L54k69K80l6j14J24q7j83M3K41k31J39p5L7O0j15O5K5L9N0j99J36J4j49
7548a04J19j21K79l68L07j03J01j58R9O1k40q5K88j15J45n8q1J03l06K37o5P2
7570Gk07L64j74J66o1J40l07K30j63j28r7J19P8r2J69p5P3j2j04J9m6L30o8j35
7594B6j33K77j03L5j84R0NP4K0j08J6M2j29Lo3K29p4m4j43N6jK63k81J35j01L43
7620B50j46j55J31J10j24M4j12q6J32P7O2k16j02L5J01L7j35k5J91P7j00J09j57
7643bj57K39j96J12k2P5j49M5j06L76j74k15M45m33K18j3r5mK31n0o2k25K43j45
7667f4J35Qq8j5J79m09J71K12k3j98r4K65r4k9R4J68k56O0J05k21K74j24j54L13
$$ plain form
7500 18 23 39 46 -299 224 72 248 172 104 182 56 -10 31 67 -219 -104 315 114 -40 298 -101 -30 157 -253
7524 -253 101 -168 112 76 -38 86 -1 -184 -141 100 -131 8 -67 -30 30 -85 -20 5 44 94 -105 31 45 -104
7548 -104 15 -106 173 -195 112 9 110 -48 51 112 -128 -213 75 -40 105 47 -34 69 -237 0 -65 7
7570 7 -200 164 -10 156 95 235 -72 158 -5 -133 -230 -111 -33 -125 44 -31 42 30 -74 -55 -101 229 161 26
7594 26 -107 170 67 102 -82 8 13 87 107 -1 15 57 -72 -69 -132 97 23 -21 -164 -108 -109 154 -127 8 -93 250
7620 250 104 -51 80 190 66 110 -2 -88 44 121 183 -33 -135 -100 1 38 -97 -122 69 146 46 155 -2
7643 -2 -159 80 -116 -4 -26 49 -100 -55 -161 215 41 -174 271 -162 56 43 -52 -56 175 125 63 -162 81 -64
7667 -64 71 79 -9 -24 155 -254 -83 129 106 -92 -186 79 -15 -44 50 218 -38 22 127 -94 180 56 -98 215
7691B15k09J03j39J37k57J46p6o0J62k22J49o0J60j79L33l24n1P0K07j86k26L00
7713gk02R9J0k62L11k02K55j25K56p6N5l4j14J76rj82j05K35j06R3k92L9l8pK63
7738C1J06p1l5j03J1M68m96J47k67J74J12Q4k40pJ35k33K38K5Q3m5k09nK46j65
7762a6K5m6LP5l15J66K55k04L2J65m07K51j43R9K21j89k6J01R7p1J07j28k13K05
7786D4j86J34J67p8k77M10l0j50J13L6k23L21l32K4J51j97L0O7R0j82L1o4k1k1
7810a43J24L5J06j06Q7j12J34j42j59J90J26l94K87j61l7m1K04j6J65j90J38o2
7832C3k0J5j22p3J39q7r7L41n6L1j14q1p6n3J39q3jJ57lq0j06K01k35J87M7o3
7858f0Q7M8j98J35L7J38k60R7j36L03j07J5l21K67j42J30J77j42k0J3j69J89M3
$$ plain form
7691 215 6 109 -30 107 -150 -4 -80 -140 22 -200 -51 -111 49 -130 203 -121 -172 -102 105 -81 -307 -7
7713 -7 -209 -110 -100 -362 -51 -253 2 -123 133 57 112 78 -36 140 131 -51 -156 79 -27 66 -226 -187 -225 -232 31
7738 31 137 66 31 -72 -61 407 -89 58 -209 -35 77 161 -79 -86 49 -184 54 79 162 117 -92 -97 149 -16
7762 -16 9 -37 -34 41 -274 -108 147 -57 -25 140 -267 -16 -159 -60 161 -28 -54 47 144 73 180 52 -161 44
7786 44 -142 -8 159 81 -196 214 184 34 147 183 -40 281 -51 -27 124 -73 -43 24 114 -68 -37 -101 -122 -143
7810 -143 -19 16 122 16 103 -9 125 -17 -176 14 140 -254 33 -128 -165 -206 -2 -18 147 -43 95 33
7832 33 13 28 -94 -167 -28 -115 -212 129 73 104 -10 -91 -167 -220 -81 -164 -165 -8 -11 -91 -197 4 -231 -44 3 -60
7858 -60 27 75 -123 12 49 187 -73 24 -112 191 84 99 -222 45 -97 33 210 68 48 61 -108 81 124
7881A24j52Q5j61K53n1NOq5k1j69J35k30M33k08p8K53k8n3k68K06j54N53l93J43
7905A45j58l7J90j71q7R6q6m8J80j5N8j8nj49OJ35p9ON6k29M94j10k74J25j84
7930a59K45O3j24J46Jj06k28J23J21j06j67M68j73q4j33k3p1Q2J07l4P4k22qL03
7954I5M4j57M0j44K21q1j30L1K27k96L57r6k51m7K38J12jk99L43K2k75K6R4J32
7978B05k13j14M7j42J3K13R9O0k55J06nj10l2K44k16J08r6q3K32OJ6K10l37j27
8002a71p9N7K40K7j88j09M12k40J73l35J10J75L2l37J36J22n0Q1m9R5j09R6J45
8025B34j35L9l04m7L18j08j39L8J7K96j32M5j47K33J11l34L6k46K63P3j24J36
8047A23rN9j47QN9j71M1K1O1O8O3o1o7k36L64M1m13K22q3J83k3j74J07L8J78l04
$$ plain form
7881 124 -28 57 -104 149 98 103 109 24 3 -166 -31 -261 172 -36 -114 139 111 58 -210 -4 -158 395 2 145
7905 145 -13 -50 140 -31 -118 -22 -108 -156 24 9 67 49 44 -105 -99 36 -43 -37 19 -210 284 174 -100 25 -159
7930 -159 86 149 25 171 172 66 -162 -39 82 -24 -191 277 104 20 -113 -136 -207 -125 -18 -52 22 -200 -208 95
7954 95 139 -18 22 -122 99 18 -112 -81 146 -150 207 111 -140 -187 51 163 162 -137 206 228 -47 -21 73 205
7978 205 -8 -122 -75 -217 -204 9 108 168 -87 19 14 -96 -128 116 -100 8 -88 -171 61 67 83 293 -44 -171
8002 -171 -250 -193 47 74 -114 -223 189 -51 122 -213 -103 72 104 -233 -97 25 -25 56 7 102 -7 89 234
8025 234 99 138 -166 -213 105 -3 -142 -104 -87 209 77 122 -25 208 319 -15 21 -225 38 111 -13 123
8047 123 114 173 26 34 93 -78 -37 -16 45 113 176 115 48 -188 176 217 -196 26 -57 126 103 -71 36 74 252 -52
8073e2j70L86l96L41k28M6j34R5K6L32l82l3L51k10j4J24J94l59N6oL32k14k37
8096a52L1R5j75J72K1o9j9%K36k77K11J24m01J02Q0j15K68j32L7j78m6J46J11
8119G0m5j90J44K96l71LM9m4m0J22j0j13J34R0k54P2K39k30N1J01j71rK28l34
8143b12K53m5j62J18L45k47o9J42j36n5J87J20o6k28J05k97K27j32K01j10m0j21
8165b22K16O1k08L56m6Q4k82K24j8k59J25M4J3j30R3j26m2K5j29L80k88K26j16
8188a9J32q0j58
$$ plain form
8073 -52 -222 164 -232 109 -119 -73 -207 -112 -86 246 -136 -169 182 -28 -42 82 276 -83 -27 -33 299 85 -152
8096 -152 -121 -26 -201 -29 -8 -77 -96 -96 140 -137 74 198 -203 -101 -21 -136 132 0 37 -141 -187 -41 70
8119 70 25 -165 -21 275 -96 -93 -44 -88 -128 -6 -16 -129 5 95 -159 -87 152 -78 -27 74 -97 -106 122 -212
8143 -212 41 -4 -166 -48 297 50 -19 123 -13 -68 119 239 173 -55 50 -247 -20 -152 49 -61 -101 -222
8165 -222 -6 55 -153 203 157 241 -41 183 165 -94 31 75 88 -42 51 -75 -117 -92 -221 159 -129 97 -19
8188 -19 113 33 -125
8191a25
$$ Imaginary data points
##PAGE= N=2
##DATA TABLE= (X++(I..I)), XYDATA
0@%%%%%%%%%%%%qJ6j6J6j6K4l2L2m0M8n6P2q0Q8j04J20j44J68j91K15k40K75l15
35a68L54l95M44m98N55o19O88p61Q44r34J030j137J255j382J524j681J851k039
53a069K249k483K749l052L395l793M262m823N507o363P472q966J1100j4414K0288
68A2059l3736J19561L1967j76003J09793j1401k2309N2365k1285l0561M0335P182
80G7967l3848m2510N6985J4623l7062L9023j7910n4434L7889j5719J2495N0990
92H8489o5950k4331M8237k3443m180j681r064L4059j0956k4916j2607k5001N3901
105B2557J7222n3663J6480q833k3852L4425j5396o892J6092j5674J4717j7450
117b0267k6982K9457n041J3446J5731n2114O873J8944j9249L0561q169k5525K9567
$$ plain form
0 0 0 0 0 0 0 0 0 0 0 0 0 0 -8 8 -8 8 -8 16 -16 16 -24 24 -32 40 -40 48 -56 64 -80 88 -103 112 -128 147 -168
35 -168 186 -209 235 -263 292 -327 361 -400 444 -490 540 -597 658 -724 800 -881 970 -1069
53 -1069 1180 -1303 1446 -1606 1789 -2004 2258 -2565 2942 -3421 4051 -4915 6185 -8229 12059
68 12059 -21677 97884 129851 -46152 63641 52240 29931 82296 61011 30450 70785 77967
80 77967 44119 1609 58594 73217 36155 75178 57268 2834 40723 25004 37499 88489
92 88489 22539 -1792 46445 23002 18822 17141 8077 42136 31180 6264 -6343 -31344 22557
105 22557 39779 -13884 2596 -6237 -30089 4336 -11060 -17952 -1860 -17534 -2817 -20267
117 -20267 -47249 -17792 -22833 -9387 6344 -45770 -38897 -19953 -39202 -8641 -16810 -42335 -12768
130a2768j1837j5047J3998q870J2886J0692r884j239k3129R065K9597j4810P062
143a4284j126k4991K8039l2k2834K4170r06K80J1516k8005K203J7070j820J5213
157D493j0865j0553J2686j2099R374J1486j6121J4385J741j3887J0115r554J743
170g056J9327o949K473p017j3255J9822J175o381J2127j1388J195R854j5547M836
184C216Q275j770J0003j0719q011Q137l450Q588M321j0920O415l380o029R579
198A4255n305L055Q874j0715K638j700q619J2146J939k684M066j0433p29O171
212A2959l906N157q35l576N261p286l306M605k172P074J39j0118J956j501j509
227B942O318l768L97J933p608M87k19j449O015k450k812J168o247k21L528j139
$$ plain form
130 -12768 -24605 -39652 -25654 -34524 -21638 -10946 -20830 -22069 -45198 -36133 -6536 -21346 -14284
143 -14284 -15410 -40401 -12362 -12394 -35228 -11058 -11964 -11684 -168 -28173 -25970 -8900 -10720 4493
157 4493 -6372 -16925 -4239 -16338 -6964 4522 -11599 2786 4527 -9360 755 -8799 -7056
170 -7056 12271 5322 7795 778 -12477 7345 8520 2139 14266 2878 4073 13927 -1620 3216
184 3216 11491 9721 19724 9005 994 9131 5681 14269 18590 7670 14085 10705 4676 14255
198 14255 8950 12005 20879 10164 12802 11102 2483 14629 16568 13884 17950 7517 6788 12959
212 12959 9053 14210 13375 9799 15060 7774 4468 9073 6901 13975 14114 3996 5952 4451 2942
227 2942 9260 5492 5889 7822 214 701 482 -967 5048 2598 -214 954 -5293 -5514 -1986 -3125
243c125L878k651n147P38k618J250K816k580K554j123n752M86l98J853M390l197
259h626k004k68k534J587J101M27L168j830k878m6j293K966K531j055J926j998
275h826k076R59L8L007L242k021l01r32r64K549N50J916K276j639j483J89j87
292c703L126K039l55P47j321r28N71O24K919J617j257l08j491j24K263L60J576
309F355Q08j542j192l15k23K749Q72k28m93j588l82O6O17J776N30j382m24j974
327D030J94J680j89R25j77j778k59j516K87K205k3p9j010k190N05J7j54K334q16
346C986q90q08k253Q36J434lR49j703j322N32j969J024J678o45O61j497k663J959
364f94p08O50J681j780J28q89k233K363J7j04J510k949M72P7k553K421Q22q99
$$ plain form
243 -3125 753 -1898 -7045 -6307 -8925 -7675 -4859 -7439 -4885 -6008 -11760 -11274 -11672 -9819 -5429 -8626
259 -8626 -10630 -10898 -13432 -11845 -10744 -10317 -7149 -8979 -11857 -11903 -13196 -10230 -7699 -8754 -6828 -8826
275 -8826 -10902 -9943 -9905 -6898 -3656 -5677 -5978 -6910 -7874 -5325 -4775 -2859 -583 -2222 -3705 -3516 -3703
292 -3703 -577 1462 1107 1854 533 -395 176 800 3719 5336 4079 3771 2280 2156 4419 4779 6355
309 6355 7163 5621 4429 4114 3891 6640 7512 7284 6791 5203 4821 4887 5504 7280 7810 6428 6004 4030
327 4030 4224 5904 5715 6640 6463 4685 4426 2910 3197 5402 5379 5300 4290 2100 2605 2622 2468 4802 3986
346 3986 3096 2288 35 871 2305 2302 3251 1548 226 758 -1211 -187 1491 846 1507 10 -2653 -694
364 -694 -1402 -752 929 -851 -723 -1612 -3845 -1482 -1465 -1569 -59 -3008 -2536 -2459 -5012 -2591 -1769 -2668
382b668J475l270j060K514j274J693K84k756K374k040j530K784j632J681J639
397a786l792J319n74j405M321j461n03J931m025J584J686k088L432j147j145K823
413h30l866N39L278k213L676m91m268L257j037O62L476l936K036K037l669L057
429A708j278j132N985l041n95J654m099M487J382l467L636k251j121M041l912
444A997J416K620l160L563j741l656M461k437J265M027o311J536J427l237M746
459F516k983k118N298l749Q4J135n076N486M64m107L399m573oN367n373J794J046
476B604m692N196k797l554N120l615J782L175p095K744K80k760O083m197k434
491d160M600m621K972J228o317N895j67l066L900n882J254N712n069K474p06m509
$$ plain form
382 -2668 -1193 -4463 -5523 -3009 -4283 -2590 -2306 -5062 -2688 -4728 -6258 -3474 -5106 -3425 -1786
397 -1786 -5578 -4259 -4833 -6238 -1917 -3378 -3881 -1950 -5975 -4391 -2705 -4793 -1361 -2508 -3653 -830
413 -830 -4696 -4157 -879 -3092 584 93 -4175 -918 -1955 -1293 2183 -1753 283 2320 -1349 1708
429 1708 430 -702 5283 2242 1647 3301 -798 3689 5071 1604 5240 2989 1868 5909 1997
444 1997 3413 6033 2873 6436 4695 1039 5500 3063 4328 8355 2044 3580 5007 1770 6516
459 6516 3533 1415 6713 2964 3048 4183 -893 4593 5057 950 4349 -224 -230 5137 -236 1558 2604
476 2604 -2088 3108 311 -3243 1877 -1738 44 3219 -3876 -1132 -852 -3612 2471 -1726 -4160
491 -4160 440 -4181 -1209 19 -6298 -403 -570 -3636 264 -5618 -4364 1348 -3721 -1247 -1953 -6462
507f462O432k338k068M560m689K646K781o312L888l58k314O677m529j885L758
522b13m484M396J428n890N039j494j499M807o321J639M420m127L494k135m375
537e315O453j609p83L095n614L241K334n107M391k134j382O232n151j76K749m436
553c212N230N83n009M102k441l54M702m856J065K753l774M411k035l914N656k259
569F48J101K124n888L184K116l381M394k982j401M756l741M15J640l376M717k41
585D085l859L265k787P46L750m328J318J153l536M061j798k144L565k617J211
600B085K082n255K665O33j773L077l222j315L627k987J234R24l749L252m49k285
616a456K168k809J028K624l651J185m16k185L447j461j275K616k922J262R34k892
$$ plain form
507 -6462 -30 -2368 -4436 124 -4565 -1919 862 -5450 -1562 -1920 -4234 2443 -2086 -3971 -213
522 -213 -4697 -301 1127 -4763 276 -1218 -2717 2090 -4231 -2592 1828 -2299 1195 -940 -5315
537 -5315 1138 -471 -1254 1841 -3773 -532 1802 -3305 1086 -1048 -2430 3802 -1349 -1525 1224 -3212
553 -3212 2018 2601 -2408 1694 -747 -1101 3601 -1255 -190 2563 -1211 3200 1165 -2749 2907 648
569 648 1749 3873 -2015 1169 3285 -96 4298 1316 -85 4671 930 1345 2985 -391 4326 4085
585 4085 226 3491 704 1450 5200 872 2190 3343 -193 3868 2070 -74 3491 874 2085
600 2085 4167 -1088 1577 2210 437 3514 292 -1023 2604 -383 851 1775 -1974 1278 829 -1456
616 -1456 712 -2097 -1069 1555 -2096 -911 -1327 -3512 -65 -1526 -2801 -185 -3107 -1845 -911 -3803
632c803J981k94j232L044k878l63J974j838J823M68k715K124n81p71K065k242
648c238P69K203k701J715m23j378K678p43q54J918k200J148J086j867K160o68
664c95m64J637j527L39J314j589K091k98j423J210o31p0J814j549L75O79j457
681E6J368n43n95J721m06o63Q37j413P58O51j297J256n61k90P99j191N94P91j015
700H57N68m07q63R38k11j24P52r32K79M4p00P10l39l11Q16o89L02M8p22M57K80
721G53l41N09n33n75R32k40K66j80l60K41j68l17L92j7L3K38m95j8L29k84L88
742E53j18l94K83n35j54N55j55r6J64j71Ll77j42K16L8K2k17m92K12n3m77N30
764h05l12J16J88q22P1L44k55N34m28m02M43m19J08M59n8n9J03l16J11J12k56
$$ plain form
632 -3803 -1822 -2116 -3348 -304 -3182 -3545 -1571 -3409 -1586 -1118 -3833 -1709 -2290 -3061 -996 -3238
648 -3238 -2469 -266 -2967 -1252 -1675 -3053 -375 -1118 -1972 -54 -2254 -1106 -20 -1887 273 -395
664 -395 -859 778 -749 -410 904 -685 1406 1108 -315 895 264 194 2008 459 834 1513 56
681 56 1424 881 286 2007 1601 938 1775 362 1120 1771 474 1730 1169 879 1678 487 1081 1872 857
700 857 1425 1018 155 1093 882 758 1510 578 857 901 201 911 572 261 1077 388 690 738 16 473 753
721 753 412 921 388 -187 745 505 771 591 231 472 304 -13 379 362 395 633 138 120 449 165 553
742 553 435 41 324 -211 -365 190 35 -61 103 -68 -65 -442 -584 -368 -330 -308 -525 -1017 -805 -858 -1335 -805
764 -805 -1117 -1001 -813 -1635 -1564 -1220 -1475 -941 -1369 -1771 -1328 -1747 -1639 -1180 -1238 -1297 -1194 -1510 -1399 -1287 -1543
785a543L36r1J13J5k32J03K82J6M43j87j98L03q6K96M5L62P1j50jK64o7O60j64
808E90k5J04M2r8L67o4K08J46k72P5K17O1J68J02k15L17m19kJ52k2L50m3l52K71
832A658p05J26M61n08K35P7m32J15k55M7K19m33J32n9l42q9j5j77L82k90j33O7
854H1m13M88k92n60O14k89k70N46j008L81M92l42L1n1l28L63o68L29M82n90L57
875f47L04q45R61m18l41R10o63K21R9o55P42J41l32M27o64OO91p22L52L60o54
896g27Q38o07l06Q51m74L25M75p91L18J48q87R14l40l49Q67p03J02O7l08O01L1
917D5m62O54q40J18P91j086N61K20p61J140m14p88Q35p64O68L57j251O45L43n93
937e82J062q44J10P78p38O17j34p03J005j51l06R63j361N71J189j410Q63l44m43
$$ plain form
785 -1543 -1207 -1298 -1185 -1170 -1402 -1299 -1017 -1001 -558 -745 -943 -640 -726 -430 -385 -23 48 -102 -103 161 94 754 590
808 590 565 669 711 613 980 916 1124 1270 998 1073 1290 1351 1519 1621 1406 1723 1304 1302 1454 1432 1782 1739 1387 1658
832 1658 953 1079 1540 1032 1267 1344 912 1027 772 819 1038 605 737 678 336 247 232 55 437 147 14 81
854 81 -332 156 -136 -696 -82 -371 -641 -95 -1103 -722 -230 -572 -541 -592 -920 -557 -1225 -896 -414 -1004 -647
875 -647 -343 -1188 -227 -645 -986 -76 -739 -518 -419 -1074 -332 -191 -523 -96 -760 -754 -63 -785 -433 -73 -727
896 -727 111 -496 -802 49 -425 -100 375 -416 -98 50 -837 77 -263 -612 255 -448 -346 -279 -587 14 45
917 45 -417 237 -603 -485 306 -780 -219 1 -760 380 -34 -822 13 -751 -83 274 -977 -332 11 -582
937 -582 480 -364 -254 524 -214 403 269 -434 571 420 114 1077 -284 287 1476 66 929 585 142
956A42J320o91k36P94j049P94K63q86O15k55m0Q91j224K07P92q15O34k3q27J010
976A416n63k53P26j154J52O21p89P55m35o44P98l82k60N42j030M35K08r16Q61
995H8n83k50R48j252L0N69q70J265m51q24R07p60k1P75j167L15P68n55L83l54
1015a039m67Q98n18L81Mq34P50K48q16R30q03J21J141r34L66K40o43J204k63p17
1035g51N51m91L26P62q41N60J32n58Q98n16r6P08l66K39Nn45N46R6m38N81q16
1056a4L34N69p15M47J11r45J094k97m42O21q59N95J55n05L85j41l59O63p25J28
1076A00M96p26P28m12n53M76K94m11N44p17j72P30n02L20q7o08J046l54k37L98
1096C53o98P34J45k57K1l52J3P68m26n5J80m50N01J95p08N27k56l75O14n89K63
$$ plain form
956 142 1462 771 535 1329 280 1074 1337 451 1066 811 771 1662 438 645 1437 622 1256 1233 406 1416
976 1416 853 600 1326 172 324 945 156 911 476 -168 630 248 -12 530 -500 -65 143 -773 88
995 88 -495 -745 203 -1049 -1019 -450 -1320 -55 -506 -1330 -423 -1183 -1204 -429 -1596 -1281 -513 -1068 -685 -1039
1015 -1039 -1506 -608 -1126 -745 -741 -1575 -825 -577 -1393 -463 -1266 -1145 -4 -938 -572 -332 -975 229 -34 -751
1035 -751 -200 -691 -365 397 -444 116 248 -310 588 72 -24 684 318 557 562 17 563 659 221 802 -14
1056 -14 320 889 174 621 732 -213 881 584 142 763 -96 499 654 149 534 393 34 697 -28 100
1076 100 596 -130 598 186 -367 109 403 -8 536 -181 -353 377 -125 195 108 -500 546 192 -45 353
1096 353 -345 389 534 277 298 -54 -41 727 301 246 426 -24 477 672 -36 491 235 -140 474 -115 148
1117A48L80k69L57j96m80N77l75J51K64o17LL11m10L27p4j65J02l90J25r3m94
1138h18M72J63k51J88j82k97K85j8m92L57j54M09l32k39K31j90K40J72m68L62
1158e62j6l25K05J57k93M7p8L99n3j54L32R7k57K67l29K04K47o1N2L30j66j63
1180a20J27o2L70j50R8M9n5J46J73L8M1k21L64j94qJ84k2J34j80m1M4kj50O8L72
1205A003l27M0R1m61K61k9ml0L4j14J62k98m9Q0l05M50k41l6l92P1Q5j14Q6K26
1229A89l22j47R8J68j70J79M3l15k8J06r5K0k39J71j53J39K45QK01o98M18J56
1251b6k21m3j36k80L05M15p39Q87p16J034p75N95L98j112N77j76k87J456j476
1270c20L38L29M61o79J52p4j95M84l28j26P4l46O1J02j77K66R2k46Pj64K13j82
$$ plain form
1117 148 528 259 616 420 -60 517 142 293 557 -60 -57 254 -156 171 97 -68 34 -356 -231 -324 -818
1138 -818 -346 -183 -434 -246 -428 -725 -440 -458 -950 -593 -747 -338 -670 -909 -678 -868 -628 -456 -924 -562
1158 -562 -578 -903 -698 -541 -834 -787 -865 -466 -519 -673 -341 -244 -501 -234 -563 -359 -112 -173 -121 209 43 -120
1180 -120 7 -55 315 165 263 312 257 403 576 614 655 434 798 604 596 780 758 892 712 671 715 713 563 631 1003
1205 1003 676 716 807 346 607 578 574 544 578 464 626 328 279 359 54 504 263 227 -165 -94 -9 -123 -37 189
1229 189 -133 -280 -182 -14 -184 -5 38 -277 -305 -199 -294 -274 -513 -342 -495 -356 -111 -103 98 -600 -182 -26
1251 -26 -247 -290 -426 -706 -401 14 -725 162 -554 480 -295 300 698 -414 163 -13 -300 1156 -320
1270 -320 18 347 808 129 281 207 12 496 168 42 116 -230 -169 -67 -244 22 114 -132 -125 -289 -76 -258
1292b58J61l23l3R7K47l53K7K60k6R9j96K2q2j2J82k46J43j73J04k99J32K95J6
1315b16J27j19l01K06J88Q6l8Lm4J84NN8O0j94M00k22M12l15J65k02J85Q0k8M3
1339E23r8J18j86L42l24L99j83l4o8R2k70K36n5K6j68J56oj92J03j43L3m4J1r2
1363A76K17j90j30n3J0j06J64l68j1L97j89q9j21k4Qq2j12M7p0k2k1J0L56j16
1387c19k24J41N7j15J82j80n8L18l46J58P0j95M21j83Q2k22L02r3M62k87q0L8
1409g1m5L0ml3L39k01N8M01l92L28k79J63K17k97L4j50N2J85J55m23L67q5k24
1432A25K5j48O6J05j52K44l96M7K44l10J14J2P7lj39l2J44j06q6J85k57K06j02
1455a37J20%j11j46K42j92O1J17l79K32j03J44j07k5K13K17l58L58l14R9K04j22
$$ plain form
1292 -258 -97 -420 -453 -356 -109 -462 -435 -175 -201 -102 -298 -276 -358 -370 -188 -434 -291 -464 -360 -659 -527 -232 -216
1315 -216 -89 -208 -509 -303 -115 -29 -67 -64 -108 76 81 139 199 5 405 183 595 280 445 243 428 508 480 523
1339 523 425 543 357 699 375 774 591 557 489 581 311 547 492 518 350 506 500 308 411 268 301 257 268 176
1363 176 393 203 73 20 30 -76 88 -280 -291 106 -83 -172 -293 -317 -309 -391 -503 -456 -526 -548 -569 -559 -203 -319
1387 -319 -543 -402 -345 -460 -278 -458 -516 -198 -544 -386 -316 -511 -90 -273 -191 -413 -111 -204 258 -29 -109 -71
1409 -71 -116 -86 -90 -123 216 15 73 474 82 410 131 294 511 214 248 98 150 335 490 67 434 349 125
1432 125 150 2 68 173 21 265 -131 -84 160 -150 -36 -24 53 50 -89 -121 23 -83 -169 16 -241 -35 -137
1455 -137 -17 -17 -128 -274 -32 -224 -163 -46 -425 -193 -296 -152 -259 -284 -71 146 -212 146 -168 -69 135 13
1477A3J49K8k16J62m6J72j28J6J84L3q4J81j87P1o6l0l8K72L3k39J37j34l25M92
1501D50q6o6n5j93K86l49M68l77l18M19l4k29M1Jk70N13k37j27J28k71q5K8p0
1524d33L54m65J44K40k68PRk31K79j17N6j28K02Q2j91r7K57l6J66j01l8J5N8L1
1548b05r3L2j60L67m26L04m5K09l0M1J31n9l0q1L37m5l56O70m44M2QK69j58K42
1572E20l12M8M28k76JJ2M9n6k84J99K3k63K22m8j47K21j03J48o4k97J21k01K95
1595B36k14o3k49Q8RK78j74q9L58k40Q9m4l16M52m34J46p4J32l44J72K64k77J12
1618a82J36k47q5L06r5K02l50N7K7L03k05K42k45K02k02K26O3j09p8L12o2k88
1640g2p2L89k2q9J33O2q6J2r7k00J37M7J30k57L75%k82J49j91j71k27K29K48j8
$$ plain form
1477 13 162 190 -26 136 90 262 134 150 334 367 283 464 277 348 282 252 214 486 519 280 417 283 -42 450
1501 450 364 298 243 50 336 -13 455 78 -240 179 145 -84 -43 -42 -312 201 -36 -163 -35 -306 -391 -363 -433
1524 -433 -79 -544 -400 -160 -428 -421 -412 -643 -364 -481 -425 -553 -351 -269 -460 -557 -300 -336 -170 -271 -309 -294 -236 -205
1548 -205 -298 -266 -426 -59 -485 -181 -226 -17 -47 -6 125 66 36 -45 292 247 -109 561 117 159 167 436 278 520
1572 520 208 256 684 408 409 421 470 414 130 329 352 89 311 263 116 337 234 382 318 21 142 -59 236
1595 236 22 -41 -290 -202 -193 85 -89 -178 180 -60 29 -15 -331 121 -313 -167 -241 -109 -453 -281 -17 -294 -182
1618 -182 -46 -293 -378 -72 -167 35 -315 -258 -231 72 -133 109 -136 66 -136 90 153 44 -34 278 216 -72
1640 -72 -144 245 223 134 267 329 243 255 158 -42 95 142 272 15 390 390 108 257 66 -105 -332 -103 145 127
1664A27J53j49L7kk76j96K30o7N5j50K22k33J5n7J68k64K12L0j54Q2k08L57k26
1687b94R5p9q2J45J50n3J60j25n1M14k45k96K51L08k82L4p3J42j57J06q9J24Q1
1710A84K61j85K3n4J58Q6o2r0q1K04j1k0j68L85l69L3J22N8j90K4k10J30L12l53
1734A87J05m12K32j08K72l64M2Q6j21N0M8j05j19j73R9j10L41m19K35j73L55j9
1756g1r0m51J85n1O42m23O44p94l31J82j95K64M1L42n5R1j43K4J17rJ25%M3k81
1780a94L78j42J08k65J85Q2m3K3P6k46J33M8J88o3M7n0J28O4k41M6r4Rj30K61
1804C08j06j4n0L73n08K61j87r6K18m3j08R5m52J82J17n7K22j91j07j62M23m93
1826c75J87j77K06K82m39J93J93l1j62pk62K48q0n3K25j63M21k71l8n3r0L27q5
$$ plain form
1664 127 280 131 168 166 -110 -306 -76 -143 -88 -238 -16 -249 -234 -291 -123 -387 -175 -145 -299 -217 -425 -68 -294
1687 -294 -199 -278 -360 -215 -65 -118 42 -83 -134 280 35 -261 -10 298 16 50 -23 119 -38 68 -21 103 184
1710 184 445 260 283 229 387 473 411 321 240 444 433 413 245 630 261 294 416 474 284 308 98 228 540 187
1734 187 292 -120 112 4 276 -88 -46 40 -81 -31 17 -88 -207 -380 -281 -391 -50 -469 -234 -407 -52 -71
1756 -71 -161 -612 -427 -478 164 -259 385 -409 -740 -558 -753 -489 -448 -106 -161 -70 -213 -189 -72 -81 44 44 87 -194
1780 -194 184 42 150 -115 70 152 109 132 208 -38 95 143 331 268 315 265 393 457 216 262 168 177 47 308
1804 308 202 188 138 511 3 264 77 -19 199 156 48 143 -309 -127 -10 -67 155 -36 -143 -305 118 -375
1826 -375 -188 -365 -159 123 -316 -123 70 39 -123 -130 -392 -144 -224 -277 -52 -215 206 -65 -103 -156 -246 81 -4
1849dl2m9J12j15K36j62m4K85k01K11k64K25j07qL3L4M4K15j58k24K91m5l62L16
1873B27P8m2m7j68Q2J89m96L90k62k73N43j30n5J18k88J89R6k91J09j8j38R4J18
1896B5j93p0j05L25k77j2J30k00J66L1k45K04L7j35L00k06j23J48j82J17k1o5
1918c51M45m02K31J9j74J97O1j53j5L40m68N32j90P9k56j8n0M87l58J29R3j39
1940C9M98k14O0k45K63J30l23K2N22k88m24K88j33r0M87p71M03Q3j34J24m16J02
1962a7K15k34n3K39l36L03p0r7j8k45J09L66k69L7j12k45J72M6j18K59k44J78
1984a34J20l60L02R9l28M08k77M8p5Q2j93P2J15J70k75K2J18L31m07l8K3p1M21
2007A73k33J91k97J1M69l13MJ64k54L83j57k32L81l6l17L76m83L33L3n0On7l8
$$ plain form
1849 -4 -36 -85 27 -88 148 -14 -58 227 26 237 -27 198 91 83 116 150 194 409 251 27 318 273 -89 227
1873 227 305 263 216 48 130 319 -177 213 -49 -322 221 91 36 154 -134 55 151 -140 -31 -49 -187 -93 25
1896 25 -168 -238 -343 -18 -295 -307 -177 -377 -211 -180 -425 -221 -184 -319 -19 -225 -348 -200 -382 -265 -286 -351
1918 -351 94 -308 -77 -58 -232 -35 26 -127 -142 198 -270 262 72 151 -105 -123 -173 314 -44 85 178 39
1940 39 537 323 383 138 401 531 208 230 752 464 40 328 195 105 592 -179 224 307 173 297 -119 -17
1962 -17 198 -36 -89 150 -186 117 47 -50 -68 -313 -204 162 -107 -70 -182 -427 -255 -209 -327 -68 -312 -134
1984 -134 -14 -374 -72 27 -301 107 -170 -122 -197 -115 -308 -236 -121 49 -226 -204 -86 245 -162 -200 -177 -248 173
2007 173 -60 131 -166 -155 314 1 5 169 -85 298 141 -91 290 254 -63 313 -170 163 196 146 152 95 57
2030E7J58l20K39j32lJ51J10k01k66L31l95K72m3M5J26j90O2k86L33J9j74j66
2052b73K81j50p7N3j12L96l48J85l7j17j12J71J01l06J64P8L0l4K2K75l47K53
2074I6K78l00k7K42j25O1k92K45J78l26J32j0n5J06j05K15j13k70L22R3k61L93
2096D77k57k97L19P9N5k35j37J98N2n41K22J17o2J57j41L43j78j14j04P0j76j25
2118b78L94j19j85l3J97k8r9J20j14n9k2J9K9J46k35j02L66j88m9k56R8K78l11
2141d31R6K17j89%J13l4J61r0K07j20q8K55L6O3k84J11K97m93l4J82K12q6J88
2164B89N6j62%K0J0J69k96K6L6Q1p3j5k8J7J37J0k5j54Q1k09J20j24J98l84K33
2189A3r5r0J48j83K66k01Q4p1J32j91N4O8r6o5O5j45L2J94mj16p6N5j37R4J11
$$ plain form
2030 57 215 -105 134 2 -1 150 260 59 -207 124 -271 1 -42 3 129 -61 1 -285 48 67 -107 -273
2052 -273 8 -142 -219 -166 -278 118 -230 -45 -82 -199 -311 -140 -39 -345 -181 -103 -73 -107 -85 190 -157 96
2074 96 374 74 47 289 164 225 -67 178 356 30 162 152 97 203 98 313 200 -70 252 345 84 477
2096 477 220 -77 242 321 376 141 4 202 254 -287 -65 52 -10 147 6 349 171 57 -47 23 -153 -278
2118 -278 116 -3 -188 -221 -24 -52 -151 -31 -145 -204 -226 -207 -178 -32 -267 -369 -3 -191 -240 -496 -398 -120 -431
2141 -431 -335 -118 -307 -307 -194 -228 -67 -157 50 -70 -158 97 133 196 -88 23 320 -173 -207 -25 187 101 289
2164 289 345 183 183 203 213 382 86 112 148 229 156 141 113 130 267 277 252 98 179 -30 90 -34 164 -220 13
2189 13 -82 -172 -24 -207 59 -142 -58 -129 3 -188 -134 -66 -162 -227 -162 -307 -275 -81 -85 -201 -277 -222 -359 -265 -154
2214a54o2K9J42j04M2k07K81J22l32L1J65l1J5J16r1K64p4j11L9O1j61k9j04L18
2238A65P5r8j22K42K2l4m0j96Q0J81J57j21j6j43n0k1L4k75K38K20k33j46J17
2261C6qm7j43K00R5m6j30n6P7M3l46N32l79N2n5Nk13K46m9j38N4J47L38m32j11
2286c28J42n7Nm1O2K04j70J21nM4p7J08J87o5j42j04Q7R4j84m4K13J53l4j46M79
2311E02o00K73M4j53K72k22m2K63k20j6R8j68p2L93j59j54N2P0L36n03j03K89
2333A80p5k18J53j25j01M76l85K67j53j68K45l39K09j70J94k21M44m66J39j56
2353b70jK87K2k92J95KK0j31o5K19j95R5nj23L15Jj10j06m8r8M67k52R%j10L50
2379A76L1k3N6k70O9K66k28L07j03p7l2j59j31K29QJ26k5j75J56Lk30J55O9N1
$$ plain form
2214 -154 -216 -187 -45 -149 -107 -314 -33 89 -243 -212 -47 -78 -63 53 -38 226 152 41 80 141 -20 -49 -153 165
2238 165 240 142 20 262 284 250 210 14 94 275 432 311 295 152 102 81 115 -160 78 298 65 -81 36
2261 36 28 -19 -162 38 133 87 -43 -99 -22 21 -325 207 -172 -120 -175 -170 -383 -137 -186 -324 -270 -123 215 -217 -328
2286 -328 -186 -243 -238 -279 -217 -13 -183 -62 -67 -23 -100 8 195 130 -12 -116 -29 65 -119 -163 50 203 169 23 502
2311 502 -98 175 219 66 338 116 74 337 117 101 199 31 -41 352 193 39 91 161 497 -6 -109 180
2333 180 105 -113 40 -85 -186 290 -95 172 19 -149 96 -243 -34 -204 -10 -231 213 -253 -114 -270
2353 -270 -271 16 38 -254 -59 -57 -37 -168 -233 -14 -209 -114 -119 -242 73 74 -36 -142 -190 -288 179 -73 -64 -64 -174 176
2379 176 207 184 240 -30 39 305 77 384 281 204 172 13 -118 111 119 245 220 45 201 204 -26 129 198 249
2403B49l7j14n8l7q3J7kN9J3l00L46j12Q9Lk94J45J2k33N3K93rk17J78l27L22
2428d4P1j89J80l27J56kl3M8L8p5J12p1k56N40l23j53L88k58L88l61R8P5q6N1
2452c3J93l33K60J82o41N66K59l12j33j45K35MN5j1k0k66M00l33K96J00kk35L94
2475D80m09K28p2k40J81l37L38k4k98L44jk58K05n9j32J97j61J65k0l48K52m14
2497c83r6N64j52J2R7r3J1m4l5o1J74k55J83M5j0p0k77K04K79k39k59L67k93K85
2521d6k04J37P0l26M19K6P8r2j42M2J34q9K75k27J75k31K85l2j27J58j15K07l51
2544B4m5mJ41j34P7n7K55l64K80j31j21J1J99k50L70p6j39m1r7L9k56K89pR3l25
2569b69K53k05K54j42k0rj57Q8K76m86L51J1Lk5j2j94K22j16r1J6J37J43Nl18
$$ plain form
2403 249 212 98 40 3 -80 -63 -65 -6 7 -293 53 -59 30 33 -261 -116 -104 -337 -284 9 0 -217 -39 -366 -44
2428 -44 27 -162 18 -309 -153 -155 -188 -140 -102 -177 -65 -136 -392 148 -175 -328 60 -198 190 -171 -73 2 -84 -33
2452 -33 160 -173 87 269 -372 194 453 141 8 -137 98 102 157 146 126 -140 260 -73 223 323 321 86 480
2475 480 71 299 227 -13 168 -169 169 145 -153 191 190 -68 137 78 -54 143 -18 147 127 -221 31 -383
2497 -383 -479 85 -67 -55 42 -51 -40 -84 -119 -180 -6 -261 -78 -33 -43 -113 -390 -186 93 -146 -405 -38 -331 -46
2521 -46 -250 -113 -43 -369 50 76 154 62 -80 -38 96 7 282 55 230 -1 284 252 125 283 168 375 24
2544 24 -21 -25 116 -18 59 2 257 -107 173 42 -79 -68 131 -119 251 175 36 -5 -102 -63 -319 -30 -37 56 -269
2569 -269 -16 -221 33 -109 -129 -138 -295 -207 69 -417 -66 -55 -52 -77 -89 -283 -61 -177 -268 -252 -115 28 33 -285
2593b85J89K5j15P7j0l6k0L08l05L95l29J38L66m32J46k5j51J57J27l83M63K5
2615C25j08o6L6K8O2jpj75j34J31n3%Q9j73L9j60K90J5k54K18j02J04k55J32K16
2640A97k51op1J57k1K11m11j00J77q1R9j53K56j98r5L43j92lQJ16J63j35J8k09
2664a81p6j5K05j97L2O8J28R2l16K84J88n7k73J93R1j03j17p9K46p2k4J03j35
2687a5Om7K91J46j76j46K06k70J36M3J5k20M5J24k06K67l0o3nq4k54M62l49J39
2711A5K34j86r5j39J58k9k0J06m9j6k15L22l82K4J76j04J58j60J47q2N3o5P1K4
2735e4J81j34k24M7J10R7p5J10j37J63j08J16j88j35M56l54N6o4J12O7j53m6L90
2758B33k51K23l57J18K76j25K22l39K96k13J22k55M00J24l96K27k88J6P8j59K41
$$ plain form
2593 -285 -96 -71 -186 -109 -119 -155 -175 133 -172 223 -106 32 398 -34 112 87 -64 93 220 -163 300 325
2615 325 217 151 187 215 277 276 269 94 -40 91 38 38 127 -46 -7 -167 123 138 -116 102 0 104 -151 -19 197
2640 197 -54 -60 -131 26 5 216 -195 -295 -118 -199 -100 -253 3 -195 -290 53 -139 -142 -134 -18 145 10 28 -181
2664 -181 -257 -272 -67 -264 -232 -164 -36 56 -260 24 212 155 -118 75 166 63 -54 -133 113 41 17 120 -15
2687 -15 -9 -56 235 381 205 59 265 -5 131 174 189 -31 14 138 -68 199 169 106 101 17 -237 225 -124 15
2711 15 249 63 -32 -171 -13 -42 -62 44 -5 -21 -236 86 -296 -272 -96 -200 -42 -202 -55 -137 -84 -149 -78 -54
2735 -54 127 -7 -231 -184 -74 23 -52 58 -79 84 -24 92 -96 -231 225 -129 -73 -137 -25 42 -111 -157 233
2758 233 -18 205 -152 -34 242 117 339 0 296 83 205 -50 350 474 78 305 17 33 111 -48 193
2779A93j79K07l11J70nM4r2o0K03J04k64j31J41l02O9J40J15j48J78j93m7J55
2801a3J43k92P3j64K54j03j47L25j14N7R0k35j63P9Or9K33n3J32nK6J75l17k18
2825c30L16J58j09l6j43K43J44Q6m04M5j69N12r3R7j1m52N17n17K24N9k34K05
2847A08L53m00O5o0k58K45r4P2pP0K2j31K32m13K80k6l1j22J37mj36K47k96j2
2871a59J24j17Q1o1j04nJ55k29L18K5j56j45J81l1J9M4j7O9j23J28J8Q0j57K8
2895c4o3J72J24j19k02K42j38J06O3j02j34J29J39l08N35k76r8qo8O4N7k43K20
2918E8o6J69r9m7K36K0j12R5j78l21K61k6R5n7KK04k46q0R7k6M8k04j68N08n3
2943A10l23J02K10k87K04M5l32L02k69J03J36k5K6j14M0J71l79K74j07J42K01
$$ plain form
2779 193 14 221 -90 80 75 119 27 -33 170 274 10 -121 20 -282 -213 -73 42 -106 72 -121 -168 -13
2801 -13 130 -162 -89 -253 1 -102 -249 76 -38 19 109 -126 -289 -210 -204 -303 -70 -123 9 4 30 205 -112 -330
2825 -330 -14 144 35 -1 -144 99 243 329 -75 -30 -199 313 220 317 306 -146 371 -146 78 137 -97 108
2847 108 461 61 126 66 -192 53 -41 31 24 94 116 -15 217 -196 84 58 27 -95 42 38 -98 149 -147 -159
2871 -159 -35 -152 -71 -132 -236 -241 -86 -315 3 28 -128 -273 -92 -123 -104 -60 -77 -8 -131 -3 15 95 -62 -34
2895 -34 -97 75 199 80 -122 120 -18 88 151 49 -85 44 183 -125 410 134 36 28 -40 24 81 -162 58
2918 58 -8 161 62 15 251 271 159 254 76 -245 16 -10 85 28 30 234 -12 -92 5 -21 27 -177 -345 163 110
2943 110 -213 -111 99 -188 16 61 -271 31 -238 -135 1 -24 2 -112 -72 99 -280 -6 -113 29 230
2964B30n20L00r1j07L8l6m2J88J6N8L05l22K5R6q0n3j3j8J06o8J3R1m5o7L6J00
2990A40M3l60N0QL71k05J73p0j41Q0O2N4k74r9L30l04L03k43j19J76J70k88J12
3013c1J27o7j34m8L37r8k42p3K37k38O6L80m78J69m4k9J80J80k61j03K4K07j03
3036d2O7q9j9Q9J59k62m0m0O2j27L60n41N27K5K51l74M49n97r8L32P5j78O6L07
3060C62o84K18L99n06K50l68M85K42n24N2k70J314p11l9j86K45j3j79J81k2m2
3081B04L56L97p60m02r5N47K65r44Q23n12M27K56p08M71m32L08m72L35P8m54K72
3102d0j87L55j58j51R2J52k09J53K4m01K71m5k2o8J09J06L1J34j65O6j21oJ75
3125I5m5k26K38J5J51J18k44q7L65k10l24N15k42p5L98j94l4N6J40l74j44J37
$$ plain form
2964 230 -290 10 -81 -188 -150 -186 -228 -40 -24 34 339 17 42 138 58 5 -8 -26 80 12 25 116 71 4 40 140
2990 140 183 -177 -127 -119 252 47 220 150 9 89 151 205 -69 -168 162 -142 161 -82 -201 -25 145 -143 -31
3013 -31 96 29 -105 -153 184 86 -156 -229 8 -230 -164 216 -262 -93 -137 -166 14 194 -67 -170 -146 61 -42
3036 -42 25 -64 -83 6 165 -97 -137 -177 -115 -242 118 -423 104 129 380 6 455 -142 -240 92 167 -11 55 362
3060 362 -322 -104 295 -211 39 -329 156 398 -126 -74 -344 970 259 220 34 279 266 87 268 246 204
3081 204 560 957 197 -205 -300 247 512 -432 391 -121 306 562 -146 325 -107 201 -271 64 142 -312 -40
3102 -40 -227 128 -30 -181 -89 63 -146 7 31 -370 -99 -144 -166 -234 -125 -19 12 146 -19 47 -74 -80 95
3125 95 50 -176 62 77 228 346 102 15 380 170 -154 361 119 44 442 248 214 270 410 36 -108 29
3147B9j6Q1j73K14r9j76K86j13o3L20j45Q4l54L43j54j14o0M7N7k82J23J63j90
3170a92J04m8L55j35k90J36k0n8j41J16p2K14m4K68l26K82j39k99L17J31j34O
3192C1J86j30o7jl27K37J46J29k60o2K72l37K4L05o4J19k71L04j08m7j45J77k14
3215a03Q2Q6K64l37J82R1l0k60L5K14j52K60p51P04j71j5j00L9j9m3P6m9j63L76
3239B16m08K58J35k16l3L1l2j43K55l47J67j17K54o2r5R4R2j52J04j01J09k97
3261b88M8q7K13M7M8J5k70K86l72N36l39K85k31QL0O8L19n73L14J26j90j7K38
3284B14k5JK7O6j53j98J95M3L2Q0j89q7K19k4M2j45J42K6j11J83l17J13P0j29
3308G5r9J1j45J37j77J17K26J56k13j92Q1p0j3j95M64k09J2kn8J55j98j00K86
$$ plain form
3147 29 13 94 -79 135 36 -140 146 33 -30 290 145 229 -125 218 64 -50 -110 -63 -6 -288 -165 -2 -192
3170 -192 -88 -136 219 84 -206 -70 -90 -148 -289 -173 -245 -31 -75 193 -133 149 10 -289 28 159 25 31
3192 31 217 87 20 19 -308 -71 75 204 -56 -118 154 -183 -159 146 82 201 -70 234 126 79 -66 111 -103
3215 -103 -21 65 329 -8 174 265 235 -25 10 224 72 332 -419 285 114 99 -1 38 19 -24 52 3 -160 216
3239 216 -192 66 201 -15 -48 -17 -49 -192 63 -284 -117 -234 20 -42 -137 -43 49 -103 1 -100 9 -288
3261 -288 -240 -327 -114 -67 -19 -4 -274 12 -360 176 -163 122 -109 -101 -71 -3 316 -257 57 183 -7 -24 214
3284 214 189 190 217 283 130 -68 127 170 202 282 93 6 225 201 243 98 240 266 155 338 21 134 204 75
3308 75 -24 -13 -158 -21 -198 -81 145 301 88 -104 -23 -93 -106 -301 163 -46 -34 -36 -94 61 -137 -237 49
3331D9R1j68J39l6J13j99l42L35o6mJ08l6j05Q73r87J61O27p46L40N4k24M2p5
3354e6o8L97m14J75j28J62j41K06k56J54O0J93l14O5o5J87j61r2L13q0k49o3j9
3377a94K17K50m21J06o5J94P5q0l8j15j0K31j12j59L0j7Jj73K05O6M3j51k5M4
3401i8k03L00j07l2j6K9J52k12J93l02J82q8K26Q7p1j6J52j92j02L7rL8J44J18
3425B10k11J82r1L7J02j60N6N1J9j23j70J36J17l40K27n0L3N5j05J46o9K2J4j9
3449F9kJ62j5J6m3j71R9k11J8k8J13n8K23j02j37N3o7o7N6j4M4n9M4j6m1K76k7
3476A15m00K43K11q3j0q0m5Q6q7k0N5N2q1o0J63j24J64k55K14j30K6K10j42p0
3500d8J30M3J90k71k3P6l3j69J90k74L01j21J78j4l38N15j40k17K34l33L01k31
$$ plain form
3331 49 140 -28 111 75 188 -11 -353 -18 -84 -88 20 -16 -121 752 -235 -74 553 -193 147 201 -23 19 -56
3354 -56 -124 273 -141 34 -94 68 -73 133 -123 31 91 284 -30 35 -30 157 -4 -96 217 137 -112 -175 -194
3377 -194 23 273 -148 -42 -107 87 162 82 44 -71 -81 150 38 -121 -91 -108 -107 -280 -75 -9 34 -117 -142 -98
3401 -98 -301 -1 -108 -140 -156 -127 25 -187 6 -296 -114 -202 24 111 40 24 176 -16 -118 -81 -90 -52 92 210
3425 210 -1 181 90 127 229 69 125 176 195 72 -98 38 155 -185 42 -8 25 80 -25 121 52 74 88 69
3449 69 67 229 214 230 187 16 115 -96 -78 -106 7 -51 172 70 -67 -14 -81 -148 -92 -106 -62 -121 -77 -93 -134 142 115
3476 115 -285 -42 169 86 76 -4 -49 37 -50 -70 -15 37 -44 -104 59 -65 99 -156 58 -72 -46 164 22 -48
3500 -48 82 125 315 44 21 97 64 -105 85 -189 112 -9 169 155 -183 332 192 -25 209 -124 177 -54
3522e4J91P6L7m1n4k94J23O9j46J40p0J08j45J34K5j36J5J19j54K0j5J21J55k73
3546d9M5L15j25m14o9J26P4K8Q3k6L8J2j00K82k98j80J30J51k75O0J50J01j59
3569a00J72k25L47l6l11L43l51J47K10j79R6J73j97k40J27P5k32K19O0Kj63p9
3591a42K52k30J31l2m0M72m88J73q6K2L9n6R8n9R7m02K15R8J27j35k4o1J02J34
3615B05j62k04J44m2m3l5R8q0O3j27J9k60M78q6k2K7k41J05J30J18j74J32j20
3638g7l30N26O2j27k5R5J9j49P1l0j36O6J24Oj59M41m88P3K22j70m2M51k77JJ16
3663B63j59J0j11J42k16K56L1j56m5L73k05k49P4M7k4QJ18j72l1n6L22j76r0j01
3687a47J10m7J23j32O3j07Q9o0K3L28l69L29r8l11Q7j22J14K53q0k40J08J20k17
$$ plain form
3522 -54 137 213 250 209 155 -139 -16 53 -93 47 -23 85 -60 74 99 -37 -22 97 -57 -37 -52 69 224 -49
3546 -49 -4 311 186 -228 -297 -171 -97 -69 14 -12 26 38 -62 220 -78 -258 -128 23 -252 -192 -42 59 -100
3569 -100 72 -153 194 158 -153 190 -161 -14 196 17 113 286 89 -151 -24 51 -181 38 98 100 -63 -142
3591 -142 110 -120 11 -21 -61 411 -77 96 10 32 71 15 113 54 151 -251 -36 62 189 54 30 -31 71 205
3615 205 43 -161 -17 -59 -102 -137 -39 -119 -56 -183 -164 -424 54 -32 -54 -27 -268 -163 -33 85 -89 43 -77
3638 -77 -407 119 181 54 29 124 143 -6 65 35 -101 -35 89 95 -64 377 -111 -38 184 14 -28 423 146 147 263
3663 263 104 114 3 145 -71 185 216 60 15 388 183 -66 8 55 31 39 157 -15 -46 -102 220 44 -46 -147
3687 -147 -37 -84 39 -93 -30 -137 -48 -108 -85 243 -126 203 105 -206 -119 -241 -127 126 46 -194 -86 34 -183
3710a83k5J78k02L85n8n58L29P8m8J42k68N3L09jm6O5j95j3Kr2L44l9j51Q0j42
3735e6J31J75k21m8K26nk91L23o3q0K11j18n6l1j72o7K26k5R6j05j94L17k09L3
3759clp4lq1j48J76KO7l0q9K10k18J44p9M3M8j3l6J18k00J03K6K3J21j08J54j66
3786a6K11l89K00r1M6K09k56J03Q2k22J75m6o1j9J03j01m0j04M15lo8k9j47Q6
3810C8l78M59k13L86m12J57J97k68K0j26jN2j56K32N9p7m5L41k60Q0j31O9O6k16
3834a27j11R4J31p6j09P2J03J18m48M17j04J11k88O2K91j23j42j43M1n2O3j3K07
3857b6k13M3J74K2L5Q1O6J84p22L22j17J7p1J36l4K05j4J3P4M7k57M7Q3K30j55
3882A70l06J92k42M70k88J36p2p1J19j35R6j44J32O8j9k00q5J88m6o1J13O3k49
$$ plain form
3710 -183 -208 -30 -232 153 95 -463 -134 -56 -104 38 -230 -177 132 131 85 150 -45 -58 -56 -148 196 157 6 86 -56
3735 -56 75 250 29 -19 207 202 -89 234 171 91 302 184 128 97 -75 -142 84 59 155 50 -144 173 -36 -3
3759 -3 -6 -80 -83 -164 -312 -136 -134 -67 -97 -186 24 -194 -50 -129 -86 -38 -51 -87 31 -169 -66 -40 -17 104 -4 150 -16
3786 -16 195 -194 6 -85 -39 170 -86 17 99 -123 52 6 -55 -74 29 -72 -112 -216 199 196 128 99 -48 38
3810 38 -340 119 -94 292 -120 37 234 -34 -14 -140 -141 -89 -245 -13 46 -31 -76 265 5 85 -46 23 89 -127
3834 -127 -238 -144 -13 -89 -198 -126 -23 95 -353 64 -40 71 -217 -155 136 13 -129 -272 -231 -283 -220 -233 -26
3857 -26 -239 -196 -22 0 35 116 182 366 -356 -34 -151 -134 -205 -69 -103 102 88 101 175 222 -35 12 95 325 170
3882 170 -136 56 -186 284 -4 132 60 -11 108 -27 69 -75 57 125 106 -94 -179 9 -37 -98 15 78 -171
3905a71J16K82k92N3p8o3J60R9K1O4k84j52L40j73j5J31n5k30J77J73j2j68j07
3928a84n6J96m19K65K72n2K9j33m1rJ03J14J87j88j2k71K11J88j78P8k84L18j15
3951A9K57l49o2N28n30K79j32o0L13j77j51J38L6k81R5L43k05q1Q0k14L53j89
3973A0j03R1M6rk09K92k4L2j18K54m03Q7J61j62K59L9K8k17J1k1k27J40K86j82
3997F1r0k9NK5p9N1l0q9K87k71R3j17J06j45M30l35M3K35k5j59J44J71j47q7j82
4022a34j3J45J70j78j25L73k30Q0j04lJ20j92L63l37o8J99q9J1K55r8O6j80J58
4045A89j11o9pk8K13l18K86k01L2K08k35L2j0J7R3j0k40K46k14J56k57K81J31
4068A84j14J56k25Rj27L66k64p1o0N9j54N9L06j59J84j81J9K90l02K88k78j80
$$ plain form
3905 -171 -55 227 -65 -12 -90 -153 7 106 127 191 -93 -245 95 -78 -93 38 -17 -247 -70 103 91 -77 -184
3928 -184 -240 -44 -463 -198 74 22 51 -82 -123 -132 -29 85 272 84 72 -199 12 200 22 100 -184 134 19
3951 19 276 -73 -135 393 -137 142 10 -50 263 86 -65 73 109 -172 -77 266 61 -20 60 -154 199 10
3973 10 -93 -2 44 35 -174 118 94 126 8 262 -141 -54 107 -55 204 243 271 54 65 44 -183 -43 243 61
3997 61 -29 -58 -53 -28 -107 -56 -86 -175 112 -159 -66 -183 -77 -222 208 -127 -84 151 126 -33 111 282 135 48 -134
4022 -134 -147 -2 168 -10 -135 238 8 88 -16 -19 101 -91 272 -65 -133 66 -23 -12 243 145 211 31 189
4045 189 78 9 2 -26 187 -131 155 -46 -14 194 -41 -9 -19 -2 91 81 -159 87 -127 29 -228 53 184
4068 184 70 226 1 10 -117 249 -15 -86 -146 -87 -241 -182 124 -35 149 -32 -13 277 -25 263 -15 -195
4090a95j7L22m7J27k82N5O6k9J1J88j86J97m1l53L78k87K20j14jq4J05mj12J92
4114A09l01J93J46j6j46k5j56n2N12j19J0l5J17j9m67J09J46j74K66N4l34K43
4136F1q2J27l3o6j48J50k91J74R6R7l46m8J46n1O9K85k33K06k40J45K5J45m13
4159b25Q0J74k57J67M3M3J48k36r3L15k30Q5k9J9%O2rj21L14l44J70o5J28Nk28
4184h4K11k14p6J29M03m00n0J17k01K04q5oK36j88L38j93j9m33L96j10j25P1l4
4207a13L0n8K03j30L37m10J58K4j89P2n6L62k52j50K79j63k7j77L10k92K38K7
4229B3o9n2P5R0k43J58l6k75K60o9J81j22J0J54p5J75j05O3j69K03l84L21m6k
4253F6Q3lk13R4jj00K01M2O0q2LJ8l79L76l25J74KJ37j18K76j72l80L43Q5k93
$$ plain form
4090 -195 -212 110 63 190 -92 -37 29 0 11 199 13 210 169 -184 194 -93 127 13 12 -72 33 29 -83 109
4114 109 -192 1 147 131 -15 -40 -196 -248 264 145 155 120 237 218 -249 -140 6 -168 98 152 -182 61
4136 61 -21 106 73 7 -141 9 -282 -108 -12 85 -261 -309 -163 -214 -145 140 -93 113 -127 18 43 188 -225
4159 -225 -145 29 -228 -61 -18 25 173 -63 -156 159 -71 14 -15 4 4 66 57 -64 250 -94 76 11 139 144 -84
4184 -84 127 -87 -163 -34 369 -31 -81 36 -165 39 -46 -52 184 -4 334 141 122 -311 85 -25 -150 -79 -113
4207 -113 -83 -141 62 -68 269 -141 17 41 -148 -76 -132 230 -22 -172 107 -56 -83 -260 50 -242 -4 23
4229 23 -46 -98 -23 67 -176 -18 -54 -329 -69 -138 43 -79 -69 85 10 185 80 143 -26 177 -207 114 68 66
4253 66 149 146 -67 27 26 -74 127 169 229 147 150 168 -211 165 -160 14 16 153 35 311 139 -241 102 187 -106
4278a06k7q5K69j78p9K47J23l16k6m1J90J23j08K06l76K19J0J73j11l5j74J42
4300D0J6n7j0j93J72P5j50K2P1k02K94p1j98L05j03J87m19L04M3j49j29L27k14
4323c9J02r6j07K20k49M01k74J7l1q1l3K60k6j00R3j15J40m2OJ38j40oL1q0k46
4348b57L89J22m30K09Q6l67J69O3L8q4k4j31K68q8K46k71j31R6O8p0J28K3j30
4371g8J15P5j82J96k52j5m1k0R2K5J0O9m1K97j33q5l24M21k52r6J04j4K08o5o2
4396d8K5mQ3r8j73K24J41n5k26L62j31q1J16j60k5n4M22l09k7OQ4j31p9K07kJ83
4422B50k73K46l07L23j67j85K83m8j8j21J97j74J81j15No4j45J38j17P0L0O8k81
4445b24K9OP3lN0R2J4j9J65r8k32k6L7J32L5K1j09N3K07k93J91r0l6k3o5J52Q3
$$ plain form
4278 -106 -133 -218 51 -127 -206 41 164 -152 -178 -219 -29 94 -14 192 -184 35 45 218 107 72 -102 40
4300 40 56 -1 -11 -204 -32 43 -107 -85 -14 -216 78 7 -191 114 11 198 -221 83 126 -23 -152 175 -39
4323 -39 63 -33 -140 80 -169 232 -42 -25 -56 -137 -170 90 64 -36 57 -58 82 40 46 184 44 38 69 -11 -257
4348 -257 132 254 -176 33 119 -248 -79 -16 22 -62 -86 -217 51 -37 209 -62 -193 -97 -29 -99 29 52 -78
4371 -78 37 112 -70 126 -126 -141 -182 -202 -110 -85 -75 -6 -47 250 117 32 -292 129 -123 -219 -115 -129 79 14 -48
4396 -48 -23 -27 56 -42 -215 9 150 95 -131 231 100 19 135 -25 -50 -104 318 9 -18 -12 72 -59 -138 69 67 250
4422 250 -23 223 -84 239 72 -113 170 122 104 -17 180 6 187 72 77 13 -132 6 -111 -41 -11 57 -224
4445 -224 -195 -189 -116 -119 -69 23 37 18 183 85 -147 -173 -136 -4 31 52 -57 -4 203 -90 101 11 -25 -48 -113 39 122
4472A22O1Kk89L8L3l2L79o70N70j20j72J58J57l69M14m45L01L7nq2m0k77K82q
4496D5J23j70j08K26l0q4L0K35l04K83l67L46k94J12J09j10J52l14J84p2j72j1
4518a91J80Q9j34K30j75j69K9o7K81J15k13j86K72j08K74k42m6J3Lp1j41K04O5
4541A2r4J0R8l6q0K61l43J70j44K22j31J20J24j20M8p2J80j36j79O5M8k36K48
4564C5j80K66r2mJ5M0j39P1P2p5J33m16M21k5k87qL9K72k5j6m6J17j59L4lq0R7
4591E7k6J48k71o1K64k42J43j73J26q3l3J00K5j2J70l24j01M08m4J0k45M6jL26
4615B07j97j43j3L11l7j18j53m5K30KL2l23M17r6l3J2Q1k84K09K02j72L17p17
4638c11K85p2M1k68K72K68n5n9j15L3j66q3K88K1m1J89j48j13PK82k58K86l79
$$ plain form
4472 122 183 185 -104 -66 -33 -65 314 -356 214 94 -78 80 237 -132 282 -163 138 175 170 88 48 -229 53 45
4496 45 168 -2 -110 116 86 2 32 267 -37 246 -121 225 -69 43 152 42 194 -120 64 -8 -180 -191
4518 -191 -11 78 -56 174 -1 -170 -141 -208 73 188 -25 -211 61 -47 227 -15 -61 -48 -45 -116 -257 -53 12
4541 12 -82 -72 26 -10 -90 171 -172 -2 -146 76 -55 65 189 69 117 45 225 89 -90 -25 23 -213 35
4564 35 -145 121 29 25 40 80 -59 12 84 9 142 -274 147 122 -165 -173 -134 138 113 97 51 168 9 43 40 -40 57
4591 57 31 179 -92 -153 111 -131 12 -161 -35 -118 -151 -51 -26 -38 132 -192 -293 115 71 81 -164 -118 -119 207
4615 207 10 -133 -146 165 128 10 -143 -188 42 44 76 -247 170 74 41 53 134 -150 59 261 89 406 -311
4638 -311 -26 -98 -57 -325 -53 215 160 101 -14 19 -147 -230 58 79 38 227 79 -34 -27 255 -3 283 -96
4661i6K61k71J65j23m8J89m15N30m29K98L5J72l89Q5q5J39l8J02O2m35K94Q2m9
4684C6L5R0l10J90k1M7O2j96j22J19n4K90k99K63q1j10J04K02j15m4R0q9J4L6
4708A37j97L00l70J63j22J74k73Q7n1K77o0j45J22J94n4j90LJ6j44J94j40jJ65
4731H5J18J3k60J3J80j02%k31J60q5q1M11j77L04j67k32L4l20J49J54j24R5QJ11
4755E6j06J71pl93L17j5r9n7q1L18k11j06L23K86m53j13M45o6J1o6j55J07p8j89
4779a61J73j91L09j91M9J95j78r1j66M16j80N8j46J42j51J50j2P8k73J37K3m5
4801e5j66M29k01o2L0l0k75J59L17j82l5R8k47K95J30j8r1p0p9n9m0k7O8k24J51
4826a84K60j96k15J5M06r9j83J72J26L1j16J39Ol55L12j09m3J55o1J54k94OK76
$$ plain form
4661 -96 165 -106 59 -64 -112 77 -338 192 -237 61 96 268 -121 -36 -121 18 -20 82 144 -291 3 85 36
4684 36 71 161 -149 41 20 67 129 -67 -189 -70 -124 166 -133 130 49 -61 43 245 130 86 176 87 101 137
4708 137 -60 240 -130 33 -89 85 -188 -101 -152 125 65 -80 42 236 182 -8 -5 11 -133 61 -79 -80 85
4731 85 203 216 -44 -31 149 47 47 -184 -24 -109 -190 221 44 348 181 -51 -17 -337 -188 -34 -158 -63 -55 56
4755 56 -50 121 114 -279 38 23 -76 -133 -214 104 -107 -213 110 396 -57 -170 275 209 220 154 -1 106 28 -161
4779 -161 12 -179 130 -61 -12 183 5 -86 -252 164 -16 42 -104 38 -113 37 25 103 -170 -33 -10 -55
4801 -55 -221 208 7 -55 -25 -55 -330 -171 146 -36 -71 27 -220 75 205 187 96 26 -53 -112 -152 -179 -111 -335 -184
4826 -184 76 -120 -335 -320 86 -13 -196 -24 102 133 17 156 162 -193 119 10 -33 122 61 215 -79 -73 203
4849B03k01M6k9M0K83l91J75o2j71K32j22n3L0j10J88J5j46J34j32K09Q3j47k3
4872E1k80J92K01l68J54K41j25k70K16r0J54J71k00l26M23l18P3K02k47R9M4l1
4894c4J17J35m40J24n7L44j56k26J19p9L89k25k67K99j60k07M21j58o2OK88j00
4916G1j06L2mp3J24j39p8J10J98l74L37M2K06j68K19n09Q4J4p0J06K06l8k06l4
4940e0J25K1j30O4J38M5k71J18O5J55j52n2j7R3j35M2j31K62k91J64J21l24QJ66
4964C4m3j37J20r1L8R4Q3l8L9n8k55K48o3n5J91j18k30K23J03Rj12k3n8J92r7
4989d%J12k12K92l0k79J04J39k02K45j1k22l64J84K88j59N6N6m7J30j47K60k75
5012h6K58l80K01L9o1q0J66K11l97O9k9J00k06L71J29l42p8J63J49j60J14k48
$$ plain form
4849 203 2 48 19 59 342 -49 126 64 -107 125 3 -50 -20 -130 58 73 -73 61 -71 138 221 74 51
4872 51 -229 -37 164 -204 -50 191 66 -204 12 -78 76 247 47 -279 144 -174 -101 101 -146 -47 -3 -34
4894 -34 83 218 -222 -98 -155 189 33 -193 -74 -153 236 11 -256 43 -117 -324 97 -61 -123 -117 171 71
4916 71 -35 -3 -7 -80 44 -95 -173 -63 135 -239 98 140 346 178 397 -112 -28 -14 -84 22 228 190 -16 -50
4940 -50 75 96 -34 30 168 213 -58 60 125 280 128 76 59 152 17 59 -72 190 -101 63 184 -140 -132 34
4964 34 -9 -146 -26 -117 -79 15 98 60 99 41 -214 34 -29 -84 107 -11 -241 -18 85 94 -18 -41 -99 93 -4
4989 -4 -4 108 -104 188 158 -121 -17 122 -80 165 154 -68 -432 -248 40 -119 -63 -7 -54 76 -71 189 -86
5012 -86 172 -208 -7 32 -29 -109 57 268 -129 -60 -89 11 -195 176 305 -37 -115 48 197 37 151 -97
5034i7J36o2j81M80l82mm6L11q5jl25J51l7Q1J65J84k40k09J18K86m05J31J08
5057G7k23K08m8N7k26K36J6j95J68J61k26p7R9O9j03J14l27N21m02K18ln5j7k92
5081b50K70K80k14j86J95l1J2k08P7J14o1j25R4q3K37Q2l26L49L4j06l47L29M7
5104A83p3j92J64l8n8k88J89n5M8J17k96K31j68J5J59J96l0k2P7m35L31j95N7
5127h3K58l54J88k8j24J48m3k5J70K6j66Q2o3OL49l78O7m4j40J56q6P2rO2Kp9
5153c6qL40m03k2P4K35nj14j17K40j96N4j45J37p5j13Q2J81l2M8K7k45o3K37k64
5178a83J13K71k73k3o9k6K97oj05nj9J38p1n5n4J19M6j06J39k32K68k31r6JK24
5203F2j91lL15n1j40O9j04m08L22K76n9k65K94M8l44K14LO2l4J85k19j6k4k0Q9
$$ plain form
5034 -97 39 -23 -204 276 -106 -110 -156 155 70 69 -256 -105 -142 -61 104 288 48 -161 -43 243 -162 -31 77
5057 77 -146 62 14 71 -155 81 97 -98 70 231 5 -72 27 96 -7 107 -220 301 -101 117 114 59 42 -250
5081 -250 20 300 86 -100 95 64 76 -132 -55 59 -2 -127 -33 -116 121 203 -123 226 260 154 -193 136 183
5104 183 110 -82 82 44 -14 -302 -113 -168 -120 -3 -299 -68 -236 -221 -62 134 104 82 159 -276 55 -140 -83
5127 -83 175 -179 9 -19 -143 5 -38 -63 107 133 -33 49 -14 -8 341 -37 30 -14 -154 2 -84 -12 -21 41 43 -36
5153 -36 -44 296 -107 -129 -55 180 175 61 -56 184 -12 42 -103 34 -41 -154 -72 109 77 125 152 -93 -156 81 -183
5178 -183 -70 201 -72 -95 -164 -190 107 101 -4 -9 -28 110 39 -16 -70 49 95 -11 128 -104 164 -67 -163 -162 62
5203 62 -129 -132 183 132 -8 61 -43 -451 -129 147 88 -177 117 165 -179 35 38 100 66 251 32 16 -8 -28 61
5228F1J20k03L3j26N3J42Kk6k02J41N9K53l83K4K09m37K35j5j01R3J45o1K36p9
5252A73k36rN6O1j06J23P7l41J37j75M55l33o0J72m32N16k16J31j95L04k18o7
5274a83K01L0l0K34o2k95RQ2JQ6LM3p6k07L50j22k4N4k01K9J9K31j54j41K29q
5300I8q3k8m0L6J02N1j38j99L89q3k41J78k43K76M9L2m6j58N3M9J91n44J72K76
5324A49k49j58K86J26j76o6J18k31o1M18j37K16k70l5L13j91p0r1K4R7L8l4n07
5347d91N57n8L6l40o8M84j21q9M2J72j95J24P0k02N6J46k89K95K0p7p4Q4Rl34
5371b43L25j96K12k5P4kk28K02p2q7L5R6m7J0J03j72P4J30j48j39J53j46p6J8
5395a49J76K32k75M1kk58J07J63J09j13L24l35k32M13p9j62R7J05J7j93J49j75
$$ plain form
5228 61 181 -22 11 -115 -62 80 82 56 -146 -5 54 307 -76 -52 157 -280 -45 -60 -161 -68 77 16 252 173
5252 173 -63 -72 -16 45 -61 62 139 -202 -65 -240 215 -118 -178 -6 -438 78 -138 -7 -202 102 -116 -183
5274 -183 18 48 18 252 190 -105 -96 -14 -13 73 76 119 43 -164 186 64 40 94 -107 -78 -59 172 18 -123 106 98
5300 98 15 -13 -53 -17 85 136 -2 -201 188 105 -136 42 -201 75 124 156 110 -48 5 54 245 -299 -127 149
5324 149 -100 -258 28 154 -22 -88 30 -201 -262 156 19 235 -35 -70 243 52 -18 -109 -85 12 50 16 -491
5347 -491 66 8 44 -296 -364 120 -1 -90 -48 124 -71 53 123 -79 -23 123 -166 129 149 72 -2 82 91 -243
5371 -243 82 -114 98 73 147 145 -83 119 47 -40 -5 91 44 54 157 -15 59 189 41 -98 55 -91 -167 -149
5395 -149 27 259 -16 25 23 -235 -128 35 144 31 355 20 -212 201 122 -40 57 162 179 -14 135 -40
5417d0j74J17J14L4j86K05l49J68K33j32K1k26r6K28j46M23l54J89j56L18l7l67
5439b13M14k04J74l39J09M34k97J46l97L23J91j54k55K03M4Jl61J39L84l05j0
5460B7j2L03l83J60j96J81j48j29K46J40k12L9J08k90K43j12J40j83p4N5P8J00
5482H1j13K63k77r8L90l97PJ41R6l14K38j30J42n8J22k19J79l09J72K61l41P3
5504i1O9k08n5L69j08J13l21K27P5j22%J13k77J73K35p5l22K00j29K06jk96L08
5527H3Q6r9P2On8q9k01K9j8K96j5Q8r5j7l69M35p8n6J70N5l70K25k15K29Q8j01
5553H1j82j5K20j50J37N1O7k83K57k18N6l82L69p1J46k97K33j80J8P9J01Q1k39
5576a21J37N4J02j57K7p6j98K11oO9l4j55J92m6J13j01k2K72l26N5J42k45L35
$$ plain form
5417 -40 -214 -97 17 51 -135 70 -279 -111 122 -10 11 -215 -311 -83 -229 194 -160 29 -127 191 154 -213
5439 -213 201 -3 171 -168 -59 375 78 224 -173 150 341 187 -68 135 179 180 -181 -42 342 37 27
5460 27 15 318 -65 95 -101 80 -68 -197 49 189 -23 16 124 -166 77 -35 105 -78 -152 -97 -19 81
5482 81 -32 231 -46 -144 246 -151 -144 -3 93 -221 17 -113 29 -29 93 -126 53 -256 -84 177 -164 -91
5504 -91 -22 -230 -285 84 -24 89 -232 -5 70 -52 -52 61 -216 -43 192 117 -205 -5 -134 72 71 -225 83
5527 83 169 70 142 148 90 1 -200 -171 -189 107 92 180 85 68 -301 134 56 0 170 225 -145 80 -135 94 182 81
5553 81 -101 -116 104 -46 91 142 209 -74 183 -35 21 -361 8 -63 83 -214 19 -161 -143 -64 37 118 -121
5576 -121 16 70 172 15 42 -34 -232 -21 -27 42 8 -147 45 -1 112 11 -11 261 -65 -10 132 -113 222
5599B22k71M2j20K53P6k43L12k76J04L6N4p8o8k05L67j38l77L83j55k2L5J56j00
5622a3J1K17j47j01J76k57N9P4J14K4m10K29M1q9q0J71K4R6j68J08lJ8k05J45
5646C4K22k38j42r4K22L3j15J17J83k35L7j26K09K4j60N9J99k19n3J63p5M8j07
5669a4J89l35j04J97J39k74J36j58K81j58j56M03l54K15J29q5j3L02j58m4l07
5690a69J95J00j70JK72j16m5J1P3l03K61j22j73L13k94J60m0o9K43k7k15N0L33
5713B69m02K97Q6k84J39j3j85j98OQL91m2k42K34j72r2j0M71l66M0M1J80K8k62
5737g8k49J32O5J97j95l7J78M2r5m7K46j91j65J26L36l49J10K5J31l43Q3J15p9
5760d2N6L3k44J49r4j3L8j37L65k38Pl7P0K28j62RJ00l6q1K47j64k5r9J21j3M3
$$ plain form
5599 222 -49 -7 -127 126 202 -41 271 -5 99 135 189 111 43 -162 205 67 -310 73 -82 -104 -69 87 -13
5622 -13 -2 215 68 -33 143 -114 -55 19 133 157 -253 -24 17 -72 -152 19 43 139 -29 79 76 94 -111 34
5646 34 256 18 -124 -218 4 37 -78 39 222 -13 24 -102 107 131 -29 30 229 10 -43 120 45 93 -14
5669 -14 175 -160 -264 -67 72 -202 -66 -224 57 -101 -257 146 -208 7 136 51 38 340 182 138 -169
5690 -169 26 126 -44 -43 229 113 68 79 152 -151 110 -12 -185 128 -166 -6 -46 -115 128 101 -114 -64 269
5713 269 -133 164 250 -34 105 92 -93 -291 -285 -277 114 72 -170 64 -108 -200 -210 261 -105 -65 -24 156 184 -78
5737 -78 -327 -195 -130 67 -128 -165 13 55 -40 -87 159 -32 -197 -71 265 -84 26 51 182 -161 -78 37 -42
5760 -42 14 47 -197 -48 -142 -155 -117 -254 111 -127 -120 -157 -87 141 -21 -12 88 52 -29 218 54 29 -70 51 38 81
5786H1j4j75K10k22J30j36J12rP5m7j77K06j04J34pJ94j43k10J02j75k9K43j70
5809a31m1J6J8L59l93K01J4J75l10l4J01J7q4PK23j74J73q2J23o6j75n3j60qM36
5834A52k38M9N9%q8J3J25j8k44K22j03J10q4k5J57N7o1O5l26J87r9j09L3J36%
5859c0j59J24OK31l64J74p9j09L43R7k93O4J01p6j46j5L30l31Q5O1k27J34l03
5882c82M33l8j85R5o5L95k15j33J83k7r1M8K75n5m66L44M7r1j3k44K78l78K54
5905c1l9P6K22l26Oj18M72j94o2J86k03L9k09J72J53p3l1j73O0K61k54K55j54
5928C5j83Q5R8o3k47K85J0J16j99p9j62N0K18j97K39o5k55N55J6j46j45K5n8L18
5952B51j88o1Q0r8O5j66L4R2j34J83Pj40J0N0j51K71M9j64M7q9k5O3p3L15l41
$$ plain form
5786 81 67 -108 102 -120 10 -126 -14 -23 52 5 -172 34 -70 64 57 251 108 -102 0 -175 -204 39 -131
5809 -131 -172 -156 -138 221 -172 29 43 218 -92 -126 -25 -8 -92 -85 138 -36 137 55 178 112 -63 -116 -276 -284 152
5834 152 -86 -37 22 22 -66 -53 72 54 -190 32 -71 39 -45 -70 87 144 83 148 -178 9 -90 -199 -166 -30 -30
5859 -30 -189 -65 -59 172 -192 -18 -97 -206 137 234 -59 5 106 30 -116 -131 199 -132 -47 14 -213 -79 -382
5882 -382 51 13 -172 -77 -142 253 38 -95 88 61 -30 18 293 238 -228 116 163 72 59 -185 93 -285 -31
5905 -31 -70 6 228 -98 -92 -210 262 68 6 192 -11 28 -181 -9 144 71 40 -133 -73 188 -66 189 35
5928 35 -148 -63 35 -28 -275 10 20 136 -63 -142 -304 -254 -36 -233 6 -59 -314 241 257 111 -34 -9 -67 251
5952 251 63 2 82 -16 49 -117 -83 9 -125 58 65 -75 -65 -15 -166 105 154 -10 37 -52 -77 -14 -87 228 -113
5977a13M18j07j25M2k76P9J16J43r5L8P2j83j16J45m4N2LJ43n6k19J03L9j20K27
6001A66lm3j48p1J19j5L3K79o17J1KK43J79j89L0j71J19q5K8P9k9q2Q4Q6L9K1
6027F5l53L90%j83Q7J03j46Q4M8p8O2l59K04Q5J51l60K93n8q7qj6K03J7k73J44
6052A5L8k5R3Q2R6k97n1K29k87J20pJ49k57R7M9k0M4j83J13P2k39K10J93l12J11
6077C3o3j1lQ1J5l14L87j63J89k02l6J12j81J23P2J1k1l64L89m4o1M7r1K73j07
6102G1J9o7L0j09K94l47J25j52K24q6j39j93J55L17k33m0O9J32n3Q9j12j7M8J9
6126D4O7m0j25q3J71m1J8L1j29K38K3k77J81r0j64m3J74K47rk93m5K71M2j20p
6151D1K5J9j0p5j66J03J22j88K4lJ72L0nj49l0l5r6L59m51K47J59P8j29j60J37
$$ plain form
5977 -113 305 198 73 115 -161 -82 34 177 82 120 192 9 -107 38 -6 46 49 192 136 -83 20 59 -61 166
6001 166 163 120 -28 -99 20 5 38 317 -300 -289 -287 -44 135 -54 -24 -195 -76 -161 -133 -54 -83 -165 -81 5 44 65
6027 65 -288 102 102 -81 6 109 -37 47 95 17 79 -280 -76 9 160 -200 93 35 -52 -60 -76 127 144 -129 15
6052 15 53 28 121 203 299 2 -49 180 -107 13 6 155 -102 -5 44 24 68 -115 -2 70 -169 41 234 -78 33
6077 33 -30 -41 -44 37 52 -262 125 -38 151 -51 -87 25 -156 -33 39 50 29 -335 54 10 -51 -4 -95 178 71
6102 71 90 23 53 -56 238 -109 16 -136 88 2 -137 -330 -175 142 -91 -131 -62 70 17 106 -6 -23 25 44
6126 44 111 71 -54 -137 34 -7 11 42 -87 151 174 -103 78 -12 -176 -219 -45 202 193 -100 -145 126 168 48 41
6151 41 66 85 75 0 -166 -63 59 -129 -105 -108 64 94 89 -60 -90 -125 -221 138 -313 -66 93 171 42 -118 19
6176A9j41N8l5J07j35j28O7K4J53m1j57L43j24l3k4oQR6qn7R0J42l62J57M5mk06
6203a52M84k34k4J54j87j09k64M42m0j70J50j72J69p3j1L38l93Q5J7P5k80J71
6225b4R1j52ll5M9K49m18J20r7M02k17k00J21K89k72r1J12j25oM38k15J19l64
6248b29K95q9k85J81M7J9M1M25o27J04J00j8k94K31N1o6K69j96q2J5L0L12l31
6271i7K12j05R7j53PJ00l3j39K87k55J01J71k70m4O8N2k39M19l72K91M6jj58K50
6295B35j11k18K52k8R7m36L14k43m4M31p5j96l30N69o17L07k6J07L9j23J34K03
$$ plain form
6176 19 -122 -64 -99 8 -127 -255 -188 -164 -11 -52 -209 134 10 -23 -47 -53 -45 51 43 -14 76 218 -144 13 58 54 -152
6203 -152 332 98 74 228 41 -68 -332 110 70 -100 50 -122 47 -26 -37 301 -92 -7 10 85 -195 -24
6225 -24 67 -85 -88 -123 -74 175 -243 -123 -220 182 -35 -235 -114 175 -97 -188 -76 -201 -207 231 16 135 -229
6248 -229 66 -23 -308 -127 -80 -61 -20 405 -222 -118 -18 -36 -330 -99 -48 -114 155 -41 -123 -108 -78 234 -97
6271 -97 115 10 107 -46 -39 61 28 -111 176 -79 22 193 -77 -121 -53 -1 -240 179 -193 98 144 143 -15 235
6295 235 124 -94 158 130 227 -209 105 -138 -182 249 174 -22 -352 217 -400 -93 -119 -12 27 -96 38 241
$$ [...]
8191h9
##END NTUPLES=NMR FID
##END=
