##TITLE=1H_LR-678-C1
 CDCl3, 8 sc, 
 28.6.2019
##JCAMPDX= 6.0         $$ Bruker NMR JCAMP-DX V2.0
##DATA TYPE= NMR FID
##DATA CLASS= NTUPLES
##ORIGIN= UXNMR, Bruker Analytische Messtechnik GmbH
##OWNER= root
$$ XWIN-NMR		Version 3.5
$$ Fri Jun 28 15:38:26 2019 Russian Standard Time (UT+4h)  she@DPX200
##.OBSERVE FREQUENCY= 200.13155
##.OBSERVE NUCLEUS= ^1H
##.DELAY= (6, 6)
##.ACQUISITION MODE= SIMULTANEOUS
##.ACQUISITION SCHEME= undefined
##.AVERAGES= 8
##.DIGITISER RES= 18
##SPECTROMETER/DATA SYSTEM= spect
##.PULSE SEQUENCE= zg30
##.SOLVENT NAME= CDCl3
##.SHIFT REFERENCE= (INTERNAL, CDCl3, 0, 15.7039)
##AUDIT TRAIL= $$ (NUMBER, WHEN, WHO, WHERE, WHAT)
$$ ##TITLE= Audit trail, XWIN-NMR		Version 3.5
$$ ##JCAMPDX= 5.01
$$ ##ORIGIN= Bruker BioSpin GmbH
$$ ##OWNER= she
$$ F:/spectra/data/she/nmr/H-F/1/audita.txt
$$ ##AUDIT TRAIL=  $$ (NUMBER, WHEN, WHO, WHERE, WHAT)
(   1,<2019-06-28 15:37:29.37 +0400>,<she>,<DPX200>,
      <created by zg, POWCHK disabled, PULCHK disabled
       configuration hash MD5:
       00 E9 B6 7A A2 85 ED C7 34 08 36 98 17 FE 4E 26
       data hash MD5: 16K
       4E 44 18 A8 3A 1D 27 DD 12 32 EB 4D 1F 3F 23 81>)
$$ ##END=
$$ 
$$ hash MD5
$$ 69 72 CC 77 B6 6D 9D 34 2E 62 55 13 CA BF F2 50
##$RELAX= 
##$RELAX= 
##$RELAX= 
##$RELAX= 
##$RELAX= 
##$RELAX= 
$$ Bruker specific parameters
$$ --------------------------
##$DU= <F:/spectra>
##$EXPNO= 1
##$NAME= <H-F>
##$PROCNO= 1
##$TYPE= <nmr>
##$USER= <she>
##$AMP= (0..31)
100 100 100 100 100 100 100 100 100 100 100 100 100 100 100 100 100 100 
100 100 100 100 100 100 100 100 100 100 100 100 100 100 
##$AQSEQ= 0
##$AQ_mod= 1
##$AUNM= <au_zg>
##$AUTOPOS= <>
##$BF1= 200.13
##$BF2= 200.13
##$BF3= 200.13
##$BF4= 200.13
##$BF5= 200.13
##$BF6= 200.13
##$BF7= 200.13
##$BF8= 200.13
##$BYTORDA= 1
##$CFDGTYP= 0
##$CFRGTYP= 5
##$CHEMSTR= <none>
##$CNST= (0..31)
1 1 145 1 1 1 1 1 1 1 1 1 1 1 1 1 1 1 1 1 1 1 1 1 1 1 1 1 1 1 1 1 
##$CPDPRG= <>
##$CPDPRG1= <>
##$CPDPRG2= <>
##$CPDPRG3= <>
##$CPDPRG4= <mlev>
##$CPDPRG5= <mlev>
##$CPDPRG6= <mlev>
##$CPDPRG7= <mlev>
##$CPDPRG8= <mlev>
##$CPDPRGB= <>
##$CPDPRGT= <>
##$D= (0..31)
0 1.2 0 0 0 0 0 0 0 0 0 0.03 0 0 0 0 0 0 0 0 0 0 0 0 0 0 0 0 0 0 0 0 
##$DATE= 1561721848
##$DBL= (0..7)
120 120 120 120 120 120 120 120 
##$DBP= (0..7)
150 150 150 150 150 150 150 150 
##$DBP07= 0
##$DBPNAM0= <>
##$DBPNAM1= <>
##$DBPNAM2= <>
##$DBPNAM3= <>
##$DBPNAM4= <>
##$DBPNAM5= <>
##$DBPNAM6= <>
##$DBPNAM7= <>
##$DBPOAL= (0..7)
0.5 0.5 0.5 0.5 0.5 0.5 0.5 0.5 
##$DBPOFFS= (0..7)
0 0 0 0 0 0 0 0 
##$DE= 6
##$DECBNUC= <off>
##$DECIM= 24
##$DECNUC= <off>
##$DECSTAT= 4
##$DIGMOD= 1
##$DIGTYP= 9
##$DL= (0..7)
0 120 120 120 120 120 120 120 
##$DP= (0..7)
150 150 150 150 150 150 150 150 
##$DP07= 0
##$DPNAME0= <>
##$DPNAME1= <>
##$DPNAME2= <>
##$DPNAME3= <>
##$DPNAME4= <>
##$DPNAME5= <>
##$DPNAME6= <>
##$DPNAME7= <>
##$DPOAL= (0..7)
0.5 0.5 0.5 0.5 0.5 0.5 0.5 0.5 
##$DPOFFS= (0..7)
0 0 0 0 0 0 0 0 
##$DQDMODE= 0
##$DR= 18
##$DS= 0
##$DSLIST= <SSSSSSSSSSSSSSS>
##$DSPFIRM= 0
$$ [...]
##$SUBNAM2= <"">
##$SUBNAM3= <"">
##$SUBNAM4= <"">
##$SUBNAM5= <"">
##$SUBNAM6= <"">
##$SUBNAM7= <"">
##$SUBNAM8= <"">
##$SUBNAM9= <"">
##$SW= 24.9336996594482
##$SWIBOX= (0..15)
0 0 2 0 0 0 0 0 0 0 0 0 0 0 0 0 
##$SW_h= 4990.01996007984
##$TD= 16384
##$TD0= 1
##$TE= 0
##$TE2= 300
##$TE3= 300
##$TEG= 300
##$TL= (0..7)
0 120 120 120 120 120 120 120 
##$TP= (0..7)
150 150 150 150 150 150 150 150 
##$TP07= 0
##$TPNAME0= <>
##$TPNAME1= <>
##$TPNAME2= <>
##$TPNAME3= <>
##$TPNAME4= <>
##$TPNAME5= <>
##$TPNAME6= <>
##$TPNAME7= <>
##$TPOAL= (0..7)
0.5 0.5 0.5 0.5 0.5 0.5 0.5 0.5 
##$TPOFFS= (0..7)
0 0 0 0 0 0 0 0 
##$TUNHIN= 0
##$TUNHOUT= 0
##$TUNXOUT= 0
##$USERA1= <user>
##$USERA2= <user>
##$USERA3= <user>
##$USERA4= <user>
##$USERA5= <user>
##$V9= 5
##$VALIST= <valist>
##$VCLIST= <CCCCCCCCCCCCCCC>
##$VD= 0
##$VDLIST= <DDDDDDDDDDDDDDD>
##$VPLIST= <PPPPPPPPPPPPPPP>
##$VTLIST= <TTTTTTTTTTTTTTT>
##$WBST= 1024
##$WBSW= 4
##$XGAIN= (0..3)
0 0 0 0 
##$XL= 0
##$YL= 0
##$YMAX_a= 319595
##$YMIN_a= -763987
##$ZGOPTNS= <>
##$ZL1= 120
##$ZL2= 120
##$ZL3= 120
##$ZL4= 120
##$ABSF1= 10
##$ABSF2= 0
##$ABSG= 5
##$ABSL= 3
##$ALPHA= 0
##$AQORDER= 0
##$ASSFAC= 0
##$ASSFACI= 0
##$ASSFACX= 0
##$ASSWID= 0
##$AUNMP= <proc_1d>
##$AZFE= 0.1
##$AZFW= 0.1
##$BCFW= 1
##$BC_mod= 2
##$BYTORDP= 1
##$COROFFS= 0
##$CY= 11.3945322036743
##$DATMOD= 1
##$DC= 2
##$DFILT= <>
##$DTYPP= 0
##$F1P= 18.9103706918063
##$F2P= -1.10871071338519
##$FCOR= 0.5
##$FTSIZE= 0
##$FT_mod= 4
##$GAMMA= 1
##$GB= 0.15
##$INTBC= 1
##$INTSCL= 1
##$ISEN= 128
##$LB= 0.24
##$LEV0= 0
##$LPBIN= 0
##$MAXI= 10000
##$MC2= 0
##$MEAN= 0
##$ME_mod= 0
##$MI= 1.114404
##$NCOEF= 0
##$NC_proc= 0
##$NLEV= 6
##$NOISF1= 3.799351
##$NOISF2= 2.8
##$NSP= 1
##$NTH_PI= 0
##$NZP= 0
##$OFFSET= 15.70392
##$PC= 1
##$PHC0= -8499.665
##$PHC1= 13.00097
##$PH_mod= 1
##$PKNL= yes
##$PPARMOD= 0
##$PSCAL= 0
##$PSIGN= 0
##$REVERSE= no
##$SF= 200.130013532006
##$SI= 16384
##$SIGF1= 3
##$SIGF2= 2
##$SINO= 400
##$SIOLD= 16384
##$SREGLST= <1H.CDCl3>
##$SSB= 0
##$STSI= 0
##$STSR= 0
##$SW_p= 3612.71676300578
##$SYMM= 0
##$S_DEV= 0
##$TDeff= 0
##$TDoff= 0
##$TI= <>
##$TILT= no
##$TM1= 0
##$TM2= 0
##$TOPLEV= 0
##$USERP1= <user>
##$USERP2= <user>
##$USERP3= <user>
##$USERP4= <user>
##$USERP5= <user>
##$WDW= 1
##$XDIM= 8192
##$YMAX_p= 0
##$YMIN_p= 0
$$ End of Bruker specific parameters
$$ ---------------------------------
##NTUPLES= NMR FID
##VAR_NAME=  TIME,          FID/REAL,        FID/IMAG
##SYMBOL=    X,             R,               I
##VAR_TYPE=  INDEPENDENT,   DEPENDENT,       DEPENDENT
##VAR_FORM=  AFFN,          ASDF,            ASDF
##VAR_DIM=   8192,          8192,            8192
##UNITS=     SECONDS,       ARBITRARY UNITS, ARBITRARY UNITS
##FACTOR=    0.0002004,     1,               1
##FIRST=     0,             0,               0
##LAST=      1.6414764,     0,               0
##MIN=       0,             -763987,         0
##MAX=       1.6414764,     319595,          0
$$ Real data points
##PAGE= N=1
##DATA TABLE= (X++(R..R)), XYDATA
$$ [...]
$$ plain form
2351 -1589 904 1925 -739 -1110 1372 1815 -416 -815 1841 2023 -392 -195 1841 712 -775 172
2367 172 1650 995 -391 836 1534 14 -1286 486 1450 -715 -1206 887 1450 -1191 -1574 307 951
2384 951 -1410 -1873 346 183 -1304 -1513 288 -173 -1325 -887 480 90 -1555 -699 550 -250 -569
2401 -569 138 845 -348 -287 454 464 -678 -544 787 1131 -413 -140 1208 1067 -261 192 1707 967
2419 967 -29 -12 1149 1343 -162 30 569 134 -128 -11 367 292 -53 223 239 -812 -534 16 -232 -1203
2439 -1203 -870 422 -124 -1096 -1116 -489 -317 -1660 -1006 -65 -427 -1158 -993 77 -20 -819 -865 69 -291 -426
2459 -426 -456 412 118 153 339 127 292 653 649 435 355 961 1107 1001 179 624 1254 639 -234 691 1041 919
2481 919 317 310 762 513 -130 12 607 -90 -60 -153 -235 -258 -255 -464 -649 -841 -934 -812 -972 -1033 -868 -911 -1211 -1647
$$ packed form
2351a589K493J021k664l71K482M43k231l99K656J82k415J97K036j129j487R47
2367A72J478o55j386J227O98j520j300J772R64k165m91K093N63k641l83J881O44
2384I51k361m63K219j63j487k09J801m61j152M38J367l90j645Q56J249q00l19
2401e69P07P07j193O1P41J0j142J34J331L44j544K73J348j41j328M53J515p40
2419I67r96J7J161J94j505J92N39m35k62J17L78p5l45K76J6j051K78N50k48r71
2439a203L33J292n46r72k0O27J72j343O54R41l62p31J65J070r7p99m6R34l60j35
2459d26l0Q68k94L5J86k12J65L61mk14q0O06J46j06q22M45O30o15q73R25L50j22
2481I19o02pM52k49o43J42N95o97L0r3q2k3Lk09j85j92r3J22j60o1J65m3l00m36
$$ plain form
2505 -1647 -865 -654 -1289 -1537 -794 -206 -567 -805 -261 483 -429 -724 -296 675 180 110 115 480 824 775 626
2526 626 497 308 960 768 617 862 1483 1139 494 442 1279 1330 457 250 452 1218 101 -128 1050 1030
2546 1030 -24 -245 180 -21 -420 -740 -50 193 -447 -656 -641 -647 -972 -670 -840 -1029 -1067 -295 -596 -1069 -1120
2567 -1120 -665 -166 -1208 -738 -27 107 -995 -365 884 298 -773 -853 319 467 -435 -74 627 507
2585 507 374 456 1031 215 168 755 998 67 424 1514 1166 247 -134 1026 524 -569 370 1345 707 -269
2605 -269 172 1004 -119 -1180 -489 894 315 -702 10 1006 -118 -1069 -331 149 -620 -990 29 249
2623 249 -832 -339 740 -17 -1540 -1169 286 123 -1439 62 1210 149 -1441 -231 1496 -182
2639 -182 -1492 180 1437 -139 -1089 692 1442 -453 -1421 413 1026 -897 -453 1294 818 -824 -379
$$ packed form
2505a647P82K11o35k48P43N88l61k38N44P44r12k95M28R71m95p0NL65L44m9j49
2526F26j29j89O52j92j51K45O21l44o45n2Q37N1q73k07K02P66j117k29J178k0
2546A030j054k21M25k01l99l20O90K43o40k09J5ol25L02j70j89l8P72l01m73n1
2567a120M55M99j042M70P11J34j102O30J249n86j071q0J172J48r02L61P01j20
2585E07j33Q2N75q16m7N87K43r31L57J090l48r19l81J160n02j093R39R75o38r76
2605b69M41Q32j123j061O91J383n79j017P12R96j124r51P38M80p69l70J019K20
2623B49j081M93J079p57j523L71J455j63j562J501J148j061j590J210J727j678
2639a82j310J672J257j576r50J781P50j895r68J834O13j923M44J747m76j642M45
$$ plain form
2656 -379 1379 452 -1280 -223 1012 -323 -1124 607 1906 -106 -1672 268 1048 -1124 -1614 874
2672 874 1792 -623 -1537 1053 1312 -1165 -1252 1017 1433 -1148 -676 1946 992 -1429 -132 1844 330
2689 330 -1321 478 2227 321 -1026 1040 2404 -869 -1559 1053 1708 -1089 -1586 1774 1765 -1545 -1625
2706 -1625 1672 1080 -2375 -1623 1285 346 -2231 -796 1398 -460 -2727 -1163 1175 -1040 -2415 182
2722 182 1623 -1630 -2723 156 1013 -1977 -2162 1522 1200 -2399 -1707 1761 1211 -1987 -1002 2361 878
2739 878 -2095 -30 2948 945 -1509 815 2945 555 -1407 1482 3165 -135 -1112 2294 2675 -511
2755 -511 -960 2535 2477 -1390 -914 2781 1740 -1808 -473 2786 564 -3174 -696 2722 50 -3086
2771 -3086 -416 1671 -1357 -3758 -273 2013 -1325 -3109 -190 579 -2637 -3014 801 683 -3041 -2252
$$ packed form
2656c79J758r27j732J057J235j335q01J731J299k012j566J940P80k172m90K488
2672H74R18k415r14K590K59k477q7K269M16k581M72K622r54k421J297J976j514
2689C30j651J799J749j906j347K066J364l273o90K612O55k797m97L360rl310q0
2706a625L297n92l455P52K908r39k577J435K194j858k267J564K338k215j375K597
2722A82J441l253j093K879Q57k990j85L684l22l599O92L468n50l198R85L363j483
2739H78k973K065K978k003k454K324K130k390j962K889J683l300r77L406L81l186
2755e11m49L495n8l867M76L695j041l548J335L259k222l738K478L418k672l136
2771c086K670K087l028k401L485K286l338j784K919P69l216l77L815j18l724P89
$$ plain form
2787 -2252 1091 380 -3405 -1347 2118 -128 -3511 -916 2292 -62 -2729 508 3363 -305 -2898
2802 -2898 889 3497 -22 -1685 2245 3330 -337 -494 3223 2992 -615 -638 2969 1576 -1242 532
2818 532 4278 1562 -2321 524 3103 -225 -2587 994 3582 -640 -3200 973 2326 -1871 -3018
2833 -3018 889 1566 -2735 -3253 1162 1450 -2609 -2245 1245 -232 -4411 -2331 1751 -23 -2825 -933
2849 -933 1932 -1194 -3804 -40 2568 -1379 -2969 1434 2526 -1479 -2045 1994 2991 -1937 -2291 2478
2865 2478 2511 -1309 -624 3358 2206 -1441 -453 3169 1483 -1729 617 3621 743 -1513 1468 3192
2881 3192 -328 -2083 1928 2931 -1284 -1914 2330 2669 -1854 -2298 1917 1012 -2894 -1909 2255 1539
2897 1539 -2764 -1749 1602 -669 -3379 -371 1803 -764 -3806 -438 1763 -1148 -2335 499 1817
$$ packed form
2787b252L343p11l785K058L465k246l383K595L208k354k667L237K855l668k593
2802b898L787K608l519j663L930J085l667j57L717k31l607k3L607j393k818J774
2818E32L746k716l883K845K579l328k362L581K588m222k560M173J353m197j147
2833c018L907O77m301n18M415K88m059L64L490j477m179K080M082j774k802J892
2849i33K865l126k610L764K608l947j590M403J092m005n66M039R97m928l54M769
2865B478L3l820O85L982j152l647R88L622j686l212K346L004k878k256K981J724
2881C192l520j755M011J003m215o30M244L39m523m44M215r05l906R85M164p16
2897A539m303J015L351k271k710L008K174k567l042L368K201k911j187K834J318
$$ plain form
2912 1817 -2070 -2730 1362 1849 -1521 -1538 2306 1302 -2663 -1186 2528 1284 -2419 -199 3058 1050
2928 1050 -2112 596 2890 266 -2046 522 2512 -61 -1693 1689 2505 -841 -1122 1426 1577 -1517
2944 -1517 -1010 2101 1106 -1852 -974 1693 657 -2404 -280 2107 -244 -2800 -136 2307 44 -2406
2960 -2406 157 1440 -1475 -2503 589 1952 -829 -1586 717 1319 -1648 -1133 1525 899 -1924 -474
2976 -474 1672 569 -1338 144 1844 -91 -2105 174 1974 7 -1791 757 1678 -825 -1260 1075
2992 1075 1823 -988 -1384 975 1235 -1194 -1224 1358 979 -1287 -1108 1058 402 -1621 -131 1322 -256
3009 -256 -1767 107 1115 -442 -1450 785 1406 -823 -1278 811 1099 -1154 -805 1094 957 -1173
3025 -1173 -909 1338 808 -965 -432 1537 936 -909 19 1338 317 -490 241 1220 104 -596 646
$$ packed form
2912A817l887o60M092M87l370j7L844j004l965J477L714j244l703K220L257k008
2928A050l162K708K294k624k312K568J990k573j632L382Q16l346k81K548J51l094
2944a517N07L111r95k958Q78K667j036l061K124K387k351k556K664K443k263k450
2960b406K563J283k915j028L092J363k781p57K303O02k967N15K658o26k823J450
2976d74K146j103j907J482J700j935k014K279J800j967j798K548R21k503m35K335
2992A075P48k811l96K359K60k429l0K582l79k266J79K166o56k023J490J453j578
3009b56j511J874J008j557j008K235O21k229m55K089K88k253L49J899j37k130
3025a173K64K247n30j773N33J969o01j845R28J319j021q07P31R79j116p00J242
$$ plain form
3042 646 1138 -354 -812 524 878 -937 -721 836 690 -939 -494 733 337 -1021 -639 736 -88
3059 -88 -1504 -625 900 -173 -1332 -611 580 -414 -1139 -43 628 -402 -479 527 578 -400 -800 584
3077 584 235 -500 -212 1178 570 -627 234 1250 660 -842 494 924 326 -343 944 1442 528 -261
3095 -261 91 772 71 -158 576 850 48 9 252 9 -644 -432 223 -150 -718 45 442 -358 -966 -524
3115 -524 -29 -569 -1114 -294 257 -643 -890 -391 256 -530 -794 -633 -32 -510 -520 82 440 77 -47 125
3135 125 265 62 55 607 248 313 854 1085 253 49 915 510 162 318 838 1027 472 -43 570 533 375
3156 375 -92 246 404 86 132 42 305 -173 -691 -536 -674 -717 -76 -335 -337 -249 -320 -270 -813 -855 -528 -490 -752
3179 -752 -963 46 -115 -590 -558 -225 -63 -728 -679 -108 59 163 142 191 438 508 322 183 -26 795 601
$$ packed form
3042F46M92j492m58J336L54j815K16J557j46j629M45J227l96j358L82J375q24
3059h8j416Q79J525j073j159P21J191r94p25J096O71j030p7J006N1r78m00J384
3077E84l49p35K88J390o08j197Q61J016n90j502J336M30n98o69J287M98r14p89
3095b61L52O81p01k29P34K74q02l9K43k43o53K12O55l73n68P63L97q00o08M42
3115e24M95n40n45Q20N51r00k47M99O47p86k64J61O01m78j0O02L58l63j24J72
3135A25J40k03pN52l59O5N41K31q32k04Q66m05l48J56N20J89n55n15O13l7j58
3156C75m67L38J58l18M6r0K63m78n18J55j38m3O41k59kQ8p1N0n43m2L27L8k62
3179g52k11J009j61m75L2L33J62o65M9N71J67J04k1M9K47P0j86j39k09Q21j94
$$ plain form
3200 601 566 651 654 966 639 273 562 720 641 208 536 1004 723 -54 -81 464 226 -266 -219 209 130 -298 -430
3223 -430 -76 -388 -589 -959 -434 -662 -472 -413 -432 -963 -1032 -954 -961 -1200 -629 -232 -371 -854 -770 113 -246 -748
3245 -748 -635 -331 -416 -270 -91 554 294 175 89 570 677 257 687 489 324 460 883 797 533 740 1150
3266 1150 812 461 446 857 296 210 825 866 380 175 574 425 196 -659 220 324 -420 -673 -532 3 -600
3287 -600 -662 -269 -85 -802 -678 -364 -270 -826 -498 -155 -781 -1030 -150 112 -309 -901 -178 231 -284 -740 244
3308 244 160 -404 -288 660 725 -257 -191 824 561 -66 -157 843 930 -178 -67 830 819 180 571 683 271
3329 271 -196 671 751 164 -470 575 611 -172 -465 656 281 -674 -988 391 845 -975 -893 382 99
3348 99 -1035 -722 445 -93 -1225 -685 339 -75 -786 -66 307 -582 -641 298 537 -723 -689 617 682
$$ packed form
3200F01l5Q5LL12l27l66K89J58p9m33L28M68k81p77k7N45k38m92M7M28p9m28j32
3223d30L54l12k01l70N25k28J90N9j9n31o9P8pk39N71L97j39m83Q4Q83l59n02
3245g48J13L04q5J46J79O45k60j19q6M81J07m20M30j98j65J36M23q6k64K07M10
3266A150l38l51j5M11n61q6O15M1m86k05L99j49k29q55Q79J04p44k53J41N35o03
3287f00o2L93J84p17J24L14R4n56L28L43o26k49Q80K62m21n92P23M09n15m56R84
3308B44q4n64J16R48O5r82O6J015k63o27r1J000Q7j108J11Q97j1o39L91J12m12
3329B71m67Q67Q0n87o34J045L6p83k93J121l75r55l14J379M54j820Q2J275k83
3348I9j134L13J167n38j132N40J024m14p11P20L73q89n9R39K39j260L4J306O5
$$ plain form
3367 682 -767 -635 677 364 -1063 -567 1339 580 -643 -196 1108 337 -865 -141 1314 337 -752
3384 -752 403 885 -8 -746 133 831 -479 -825 461 865 -720 -642 875 461 -1279 -741 1043 458
3402 458 -1160 -291 921 189 -918 -109 1278 -389 -1485 163 1000 -96 -636 256 985 -481 -1136
3419 -1136 645 859 -1027 -697 1027 660 -772 64 1289 413 -997 -354 936 187 -1195 383 1519
3436 1519 -345 -1598 292 1285 -763 -1732 239 1066 -764 -945 522 777 -1197 -1430 547 375 -1276
3453 -1276 -1034 1048 105 -1410 -478 822 -42 -1860 -122 937 -396 -1157 427 1485 -675 -1561
3469 -1561 908 1731 -576 -895 1375 1572 -208 -491 1715 1385 -735 -510 1532 1235 -578 507 1926
3486 1926 589 -916 297 1498 78 -973 883 1320 -382 -1070 1017 998 -1369 -1487 812 782 -1370
$$ packed form
3367F82j449J32J312l13j427M96J906p59j223M47J304p71j202P24J455r77j089
3384g52J155M82q93p38Q79O98j310l46J286M04j585P8J517m14j740N38J784n85
3402D58j618Q69J212p32j107Q09J387j667j096J648Q37j096n40Q92P29j466o55
3419a136J781K14j886L30J724l67j432Q36J225q76j410O43J290p49j382J578J136
3436A519j864j253J890R93k048r69J971Q27j830j81J467K55j974k33J977j72j651
3453a276K42K082r43j515R32J300q64j818J738J059j333p61J584J058k160q86
3469a561K469Q23k307l19K270J97j780k83K206l30k120K25K042k97j813J085J419
3486A926j337j505J213J201j420j051J856M37j702o88K087j9k367j18K299l0k152
$$ plain form
3503 -1370 -1561 511 608 -2037 -1517 914 -36 -2246 -1226 574 -85 -1888 -514 1020 -873 -1958
3519 -1958 -323 556 -1082 -1450 601 910 -1151 -1259 1411 1174 -1270 -708 1827 1268 -1069 -232 2257
3536 2257 1295 -1388 37 2288 1095 -935 774 2396 417 -580 1003 2034 72 -1206 747
3551 747 1596 -459 -380 1106 1029 -1165 -984 1108 807 -1777 -795 951 -35 -1851 -686 821 -461
3568 -461 -2400 -564 1136 -743 -2197 -272 880 -1056 -1695 -215 542 -1142 -1338 366 495 -1203
3584 -1203 -971 1119 135 -1225 -712 1322 702 -1093 -20 1845 314 -1038 426 1737 341 -770
3600 -770 1022 1949 78 -817 1067 1670 -123 -791 1180 1505 -355 -170 950 993 -565 -265 1327
3617 1327 443 -864 -237 1135 -228 -1390 -147 620 -572 -1883 37 925 -1063 -1666 215 633
$$ packed form
3503a370j91K072R7k645N20K431r50k210J020J800o59j803J374J534j893j085
3519a958J635Q79j638l68K051L09k061j08K670k37k444N62K535n59k337Q37K489
3536B257r62k683J425K251j193k030J709J622j979r97J583J031j962j278J953
3551G47Q49k055P9J486p7k194J81K092l01k584R82J746r86j816J165J507j282
3568d61j939J836J700j879j454J925J152j936o39J480P57j684j96J704J29j698
3584a203K32K090r84j360N13K034o20j795J073J865j531j352J464J311j396j111
3600g70J792R27j871q95J884O03j793o68J971L25j860J85J120M3j558L00J592
3617A327q84j307O27J372j363j162J243P67j192j311J920Q88j988o03J881M18
$$ plain form
3633 633 -1305 -1701 267 580 -1027 -977 495 173 -1217 -1092 435 291 -1167 -469 1119 2 -951
3650 -951 347 914 -173 -1015 503 1165 -562 -605 972 1335 -295 -531 1139 702 -550 -369 1526
3667 1526 958 -694 -18 1202 502 -937 63 825 99 -681 112 790 -36 -706 -8 482 -286 -964
3685 -964 429 373 -923 -532 431 726 -841 -458 439 34 -572 -230 664 177 -704 -80 786 190 -950
3704 -950 -157 591 -123 -545 583 953 36 -667 99 294 -412 -485 654 633 64 -112 812 185 -696 -344
3724 -344 489 -28 -855 -207 779 299 -980 -228 570 -409 -775 -145 448 -483 -650 275 178 -354 -292 -52
3744 -52 -103 -309 -93 268 477 -330 41 329 -20 -592 5 761 264 -384 635 891 72 -381 252 528
3764 528 406 -80 753 985 108 -50 407 670 299 46 369 -256 -219 28 318 -5 -416 -158 94 -583
$$ packed form
3633F33j938l96J968L13j607N0J472l22j390J25J527j44j458O98J588j117r53
3650i51J298N67j087q42J518O62j727m3J577L63j630k36J670m37j252J81J895
3667A526n68j652O76J220p00j439J000P62p26p80P93O78q26o70O98M90p68o78
3685i64J393n6j296L91R63K95j567L83Q97m05o06L42Q94m87q81O24Q66n96j140
3704i50P93P48p14m22J128L70r17p03P66J95p06p3J139k1n69j76R24o27q81L52
3724c44Q33n17q27O48R86m80j279P52P98r79l66O30N93r31j67R25r7n32O2K40
3744e2n1k06K16L61K09q07L71K88l49n72N97P56m97o48J019K56q19m53O33K76
3764E28j22m86Q33K32q77j58M57K63l71k53L23o25L7K47K90l23m11K58K52o77
$$ plain form
3784 -583 -401 -238 -153 -530 -742 -179 -89 -513 -808 -462 -105 -475 -564 -112 -346 -401 -914 -163 -53 -219 -284 -21
3806 -21 216 -460 4 120 -453 -306 213 314 86 -155 503 673 62 36 175 394 386 125 898 734 26
3827 26 127 570 619 308 256 91 135 205 118 28 122 75 -183 -227 -100 -140 161 -128 -430 -483 -222 -255 -727 -789 -489
3852 -489 -456 -770 -577 -61 -44 -631 -862 -224 33 -75 -84 -209 -193 -145 -275 9 347 535 78 -387 301 295 187
3875 187 222 -93 599 697 583 297 604 393 586 137 228 602 743 -53 108 352 436 339 123 -18 107 281
3897 281 -245 -335 171 122 -293 -556 -249 -33 -280 -191 -76 -250 -122 -654 -489 -286 -52 -219 -769 -573 7
3918 7 -506 -179 -43 19 -76 22 -32 411 81 -185 -60 118 412 422 122 316 255 149 286 37 172 257 595
3941 595 209 268 317 500 363 86 131 279 -92 273 -1 362 211 123 -210 277 -85 -80 -327 106 -428 -151
$$ packed form
3784e83J82J63Q5l77k12N63R0m24k95L46L57l70q9M52k34n5n13P51J10j66o5K63
3806b1K37o76M64J16n73J47N19J01k28k41O58J70o11k6J39K19qk61P73j64p08
3827B6J01M43M9l11n2j65M4P0q7r0R4m7k58m4J27m0L01k89l02n3K61l3m72o2L00
3852d89L3l14J93N16J7n87k31O38K57j08rj25J6M8j30K84L38J88m57m65O88oj08
3875A87L5l15O92R8j14k86L07k11J93m49R1L74J41p96J61K44Q4r7k16j41J25J74
3897B81n26r0N06m9m15k63L07K16k47Q9J15j74J28n32J65K03K34j67n50J96N80
3918Gn13L27J36O2r5R8n4M43l30k66J25J78K94J0l00J94o1j06J37k49J35Q5L38
3941E95l86N9M9J83j37k77M5J48l71L65k74L63j51q8l33M87l62Nk47M33n34K77
$$ plain form
3963 -151 -121 -241 -161 -271 -366 -483 -380 -137 -15 -360 -75 -136 35 -394 -495 119 130 -151 55 58 392 -146
3985 -146 -31 470 328 -43 419 288 216 667 207 319 769 186 156 321 242 212 456 420 12 83 48 277
4007 277 -338 -62 203 98 -38 -236 145 -149 -545 -397 -117 18 -307 -282 279 -221 -397 -247 -69 133
4027 133 -292 -597 -111 -325 41 -115 -177 -122 -55 1 -322 -231 -169 778 113 45 161 714 468 -236 404 492 631
4050 631 379 134 631 429 118 184 415 109 -68 271 165 126 -132 326 85 -136 -80 -57 155 -221 -412
4071 -412 260 84 -439 -6 261 -518 -775 -294 120 -145 -565 -377 375 -520 -818 44 -57 -200 -387 -81
4091 -81 345 -93 -87 420 227 -177 -72 270 258 -262 419 439 111 109 591 572 -74 -141 516 582 -10 -607 300
4114 300 598 -174 -255 -22 140 -55 -216 249 345 -202 -340 0 -310 -496 -275 103 0 -397 76 80 -393
$$ packed form
3963a51L0j20Q0j10r5j17J03K43J22l45K85o1J71m29j01O14J1k81K06LL34n38
3985a46J15N01j42l71M62j31p2M51m60J12M50n83l0J65p9l0K44l6m08P1l5K29
4007B77o15K76K65j05j36j98L81k94l96J48K80J35l25K5N61n00j76J50J78K02
4027A33m25l05M86k14L66j56o2N5O7N6l23R1O2R47o65o8J16N53k46p04O40Q8J39
4050F31k52k45M97k02l11O6K31l06j77L39j06l9k58M58k41k21N6K3K12l76j91
4071d12O72j76n23M33K67p79k57M81M14k65m20J88P52q95k98Q62j01j43j87L06
4091h1M26m38ON07j93m04J05L42j2n20O81K0l28kM82j9o46o7O57O6n92n97R07
4114C00K98p72q1K33J62j95j61M65R6n47j38L40l10j86K21L78j03l97M73Mm73
$$ plain form
4135 -393 -207 -121 306 -368 -525 -134 106 -102 -420 21 255 -245 -243 -57 150 -145 -256 251 540 -122 -117 400
4157 400 616 -58 333 62 374 -117 531 711 392 -65 197 223 22 112 375 447 -37 -183 237 360 -505
4178 -505 -139 622 84 -695 -150 151 -278 -629 -276 7 -67 -480 -284 -257 -450 -355 -76 -73 -246 -751 45 198
4200 198 -92 -395 582 37 -485 -303 686 532 -243 41 538 148 -529 -21 699 84 -232 315 465 446
4220 446 -162 431 385 92 -30 531 151 103 -311 290 -66 -136 -300 132 105 -325 -562 308 31 -650 -198
4241 -198 11 -206 -756 -284 203 91 -551 -308 -49 -206 -666 -214 68 -349 -272 169 110 -222 97 40 -164
4262 -164 -235 -133 346 338 -293 124 332 137 -120 142 323 -165 125 155 808 198 221 226 483 -75 -323 455
4284 455 340 164 65 -8 230 -74 -48 105 -205 -560 -221 78 -227 -10 -353 127 -136 -413 -247 -65 -289
$$ packed form
4135c93J86Q6M27o74j57L91K40k08l18M41K34n00KJ86K07k95j11N07K89o62NN17
4157D00K16o74L91k71L12m91O48J80l19m57K62K6k01R0K63P2m84j46M20J23q65
4178e05L66P61n38p79N45L01m29l51L53K83p4m13J96K7j93R5K79Lj73n05P96J53
4200A98k90l03R77n45n22J82R89j54p75K84M97l90o77N08P20o15l16N47J50j9
4220D46o08N93m6k93j22N61l80m8m14O01l56p0j64M32k7m30k37Q70k77o81M52
4241a98K09k17n50M72M87j12o42K43K59j57m60M52K82m17P7M41n9l32L19n7k04
4262a64p1J02M79qo31M17K08j95k57K62J81m88K90L0O53o10K3NK57n58k48P78
4284D55j15j76r9p3K38l04K6J53l10l55L39K99l05K17l43M80k63k77J66J82k24
$$ plain form
4305 -289 -711 -176 -23 119 -508 64 -13 -463 -187 -482 352 81 -392 103 163 -41 -209 87 63 -59 327
4326 327 778 101 -6 250 318 -42 -15 365 646 80 253 385 291 -78 -289 463 277 68 -148 339 31
4347 31 -127 -221 -47 -213 -106 -304 19 -95 -63 -405 -96 14 -414 -310 -7 -396 -208 231 -11 -142 7
4368 7 190 176 -418 -100 133 148 -99 -124 144 141 130 -221 165 229 -18 -207 327 369 226 106 332 49 186
4391 186 131 50 31 -175 116 300 -215 -249 162 -35 -202 -202 92 217 -229 -261 -276 -417 -291 -273 -147 -87 -466
4414 -466 -606 8 -54 -135 -263 -367 -162 -271 144 307 -139 61 -29 207 -151 240 393 14 11 344 304 66
4436 66 -130 313 575 270 31 66 707 268 -147 -313 205 -164 267 91 95 119 -216 -93 16 77 -3 -20 -186
4459 -186 -256 -185 -235 -163 -191 -339 -369 -349 -534 -87 110 -420 -306 107 -28 -188 -332 -313 -143 -403 -204 141 60
$$ packed form
4305b89m22N35J53J42o27N72p7m50K76k95Q34k71m73M95O0k04j68K96k4j22L86
4326C27M51o77j07K56O8l60K7L80K81n66J73J32r4l69k11P52j86k09k16M87l08
4347C1j58r4J74j66J07j98L23j14L2l42L09J10m28J04L03l89J88M39k42j31J49
4368GJ83j4n94L18K33J5k47k5K68lj1l51L86O4k47j89N34M2j43j20K26k83J37
4391A86n5q1j9k06K91J84n15l4M11j97j67%K94J25m46l2j5j41J26J8J26O0l79
4414d66j40O14o2q1j28j04K05j09M15J63m46K00r0K36l58L91J53l79lL33m0k38
4436F6j96M43K62l05k39L5O41m39m15j66N18l69M31j76MK4l35J23J09O1q0j7j66
4459a86p0P1n0P2k8j48l0K0j85M47J97n30J14M13j35j60j44J9J70k60J99L45q1
$$ plain form
4482 60 -134 62 -154 -102 67 50 100 84 400 120 326 -74 221 452 626 343 378 427 362 548 228 42 124
4505 124 285 106 241 95 165 167 335 151 -61 -48 85 -198 -374 -43 -309 -346 -185 -259 -483 -645 -263 -337
4527 -337 146 -220 64 -11 -196 -394 -393 -265 -175 -59 -123 6 128 -176 -208 -40 55 -108 44 212 242 131 112
4550 112 300 14 396 110 292 297 337 -90 570 402 609 474 399 141 132 387 372 6 159 411 -130 125
4572 125 195 56 -427 -50 53 -15 -75 -246 -84 -167 -298 -271 -271 -536 -240 -340 -198 -176 -253 -190 -83 -347 -305 -183
4596 -183 -58 -100 -255 -426 -173 -47 -496 -22 -302 110 198 -302 -77 -97 311 216 37 146 87 254 -162 425
4618 425 299 229 212 18 89 120 114 316 50 -119 -72 -32 -136 -93 -140 -153 -266 -31 26 -23 -48 131 -11 157 -494
4643 -494 -25 -214 -70 -212 -191 140 -438 5 -226 -130 118 -212 200 28 -153 97 -15 -259 231 221 132
$$ packed form
4482F0j94J96k16N2J69j7N0j6L16k80K06m00K95K31J74k83L5M9o5J86l20j86Q2
4505A24J61j79J35j46P0KJ68j84k12J3J33k83j76L31k66l7J61p4k24j62L82p4
4527c37M83l66K84p5j85j98JJ28R0J16o4J29J22l04l2J68R5j63J52J68L0j11j9
4550A12J88k86L82k86J82NM0m27O60j68K07j35p5k58rK55j5l66J53K52n41K55
4572A25P0j39m83L77J03o8o0j71J62q3j31K7%k65K96j00J42K2p7O3J07k64M2J22
4596a83J25m2j55j71K53J26m49M74k80M12Q8n00K25k0M08r5j79J09n9J67m16N87
4618D25j26p0j7j94P1L1oK02k66j69M7M0j04M3m7j3j13K35N7m9k5J79j42J68o51
4643d94M69j89J44j42K1L31n78M43k31R6K48l30M12j72j81K50j12k44M90j0q9
$$ plain form
4664 132 240 175 428 56 -109 268 87 185 -3 -76 240 266 -235 16 110 14 55 -76 143 -144 -83 8 55
4687 55 -234 95 -238 -333 -183 -11 -11 103 -90 98 -75 -6 -156 21 -395 -14 -39 -61 20 245 128 -163 44
4710 44 -158 -233 102 173 32 82 -29 148 -90 24 248 30 -68 253 250 337 40 -52 241 -180 -162 332 384 -69
4734 -69 -34 -108 69 -254 -205 -274 -87 -140 -371 -285 -43 -649 -253 -231 -368 -462 -141 -83 -375 -542 -39 -203 -303
4757 -303 -335 -131 -17 -453 -375 156 57 -267 121 248 146 -64 122 160 422 255 -107 916 336 196 72
4778 72 81 374 152 524 337 424 102 117 242 136 225 132 -42 -161 -95 133 252 -262 -117 -204 -116 -406 -219
4801 -219 -473 -191 -528 -613 119 -255 -370 -327 -569 -183 -25 -313 -242 -85 -484 -134 -65 -287 425 234 134
4822 134 -133 -216 234 357 -194 -3 376 200 -223 469 337 389 159 312 448 258 115 480 417 317 135
$$ packed form
4664A32J08o5K53l72j65L77j81R8j88p3L16K6n01K51R4r6M1j31K19k87O1R1M7
4687E5k89L29l33r5J50J72%J14j93J88j73O9j50J77m16L81k5k2Q1K25j17k91K07
4710D4k02p5L35P1j41N0j11J77k38J14K24k18r8L21lQ7k97r2K93m21J8M94N2m53
4734f9L5p4J77l23M9o9J87n3k31Q6K42o06L96K2j37r4L21N8k92j67N03j64j00
4757c03l2K04J14m36P8N31r9l24L88J27j02k10J86L8K62j67l62J023n80j40j24
4778G2RK93k22L72j87Q7l22J5J25j06Q9r3j74j19O6K28J19n14J45q7Q8k90J87
4801b19k54K82l37q5P32l74j15M3k42L86J58k88P1J57l99L50O9k22P12j91j00
4822A34k67q3M50J23n51J91L79j76m23O92j32N2k30J53J36j90j43L65o3j00j82
$$ plain form
4843 135 166 282 156 -48 167 -155 -140 182 366 16 -91 23 -86 -151 -395 -49 -67 -175 -189 -559 207 -298
4865 -298 -596 -597 -346 -396 -427 -167 -242 -239 -372 -276 -364 -192 -379 216 -133 -414 172 343 -59 -70 317 355 56 -81
4889 -81 149 556 57 -194 479 460 125 -255 329 640 -64 -64 153 317 -213 240 -23 -39 -112 -53 246 180 -180
4912 -180 -211 160 -342 -217 187 397 -219 -258 -101 169 -190 -464 -72 21 -274 -384 14 304 -84 -487 271
4933 271 101 -254 -100 178 116 -291 142 113 -33 -258 42 287 -90 -108 506 139 39 -111 381 29 -2
4954 -2 -38 644 706 -377 -302 586 205 -152 -75 156 186 -121 -148 179 68 -52 50 188 -2 -104 -84 67 -470
4977 -470 -304 169 -199 -429 -315 -134 -215 -389 -533 38 44 -416 -198 314 71 -357 -19 311 223 -18 -47 158
4999 158 246 -72 143 80 300 188 286 284 -68 -41 351 212 152 -115 662 291 -369 -222 62 -96 -198 -82
$$ packed form
4843A35L1J16j26k04K15l22J5L22J84l50j07J14j09o5k44L46j8j08j4l70P66n05
4865b98k98jK51n0l1K60p5Lj33R6q8J72j87N95l49k81N86J71m02j1L87L8k99j37
4889h1K30M07m99k51O73j9l35l80N84L11p04%K17J64n30M53k63j6p3N9K99o6l60
4912a80l1L71n02J25M04K10o16l9J57K70l59k74L92R3k95j10L98K90l88m03P58
4933B71j70l55J54K78o2m07M33k9j46k25L00K45l77j8O14l67j00j50M92l52l1
4954bl6O82O2j083P5Q88l81l57P7K31L0l07k7L27j11j20J02J38j90j02K0J51n37
4977d70J66M73l68k30J14J81q1j74j44N71Om60K18N12k43m28L38L30q8k41k9K05
4999A58Q8l18K15o3K20j12R8kl52K7L92j39o0k67P77l71o60J47K84j58j02J16
$$ plain form
5021 -82 211 -158 -233 -132 230 -148 -135 55 170 -251 -71 268 19 21 -99 -168 -156 -194 -54 282 6 -486 -178
5044 -178 180 -176 208 74 43 -18 -365 269 213 51 -218 31 281 -91 8 38 181 -73 -66 270 313 -53 -198
5067 -198 204 324 61 264 140 -117 -155 215 149 44 88 -55 -105 -128 -478 28 312 -139 -329 -136 -166 -44
5089 -44 -494 -217 -43 -307 -156 92 211 57 -239 63 -187 -17 -73 38 176 -99 -12 369 -230 -256 483
5110 483 -17 -210 -323 217 146 278 216 418 77 -149 194 175 189 194 -23 178 -5 -114 -139 93 24 -382 174
5133 174 -47 -55 -16 -223 -168 37 -248 124 149 -70 -300 39 -176 -160 -22 32 -68 -383 -282 119 5 -109
5155 -109 12 47 38 -140 50 426 158 -19 75 57 -6 221 198 231 65 -30 9 42 3 456 176 269 68 838
5179 838 579 181 71 -147 -15 155 -128 -274 -209 10 -25 221 -18 -17 -90 -338 -241 -118 -232 -178 -184 -379 -306
$$ packed form
5021h2K93l69p5J01L62l78J3J90J15m21J80L39k49Kj20o9J2l8J40L36k76m92L08
5044a78L58l56L84j34l1o1l47O34n6j62k69K49K50l72R9L0J43k54PL36M3l66j45
5067a98M02J20k63K03j24k57l8L70o6j05M4j43n0k3l50N06K84m51j90J93l0J22
5089d4m50K77J74k64J51K48J19j54k96L02k50J70n6J11J38k75Q7L81n99k6P39
5110D83n00j93j13N40p1J32o2K02l41k26L43j9J4Nk17K01j83j09k5K32o9m06N56
5133A74k21qL9k07N5K05k85L72K5k19k30L39k15J6J38N4j00l15J01M01j14j14
5155a09J21L5rj78J90L76k68j77R4j8o3K27k3L3j66r5L9L3l9M53k80R3k01P70
5179H38k59l98j10k18J32J70k83j46O5K19l5K46k39Jp3k48R7J23j14N4oj95P3
$$ plain form
5202 -306 -283 -3 -84 -213 16 -236 -142 -333 -222 -62 -190 -41 -4 -147 50 238 290 -62 190 167 128 478
5224 478 456 287 476 207 124 247 155 262 146 302 123 37 30 706 245 -217 147 376 223 -236 -250 -60
5246 -60 -487 -258 -292 177 -140 -220 -429 -257 -102 -247 -113 -360 -360 -281 -370 -149 -200 31 -57 -386 -114 -197 7
5269 7 -156 -436 -96 135 135 89 -86 216 -175 7 -25 161 -46 -90 218 157 495 39 281 455 554 44 154
5292 154 146 269 253 -86 47 116 452 31 -51 -90 -7 80 -26 -53 -128 97 -148 -138 -202 119 -109 -202 -89 -100 -262
5317 -262 -458 23 20 -61 -234 -341 -16 -159 126 -394 -385 64 -252 -24 134 190 -160 -33 32 140 284 -31
5339 -31 -9 -120 135 165 206 255 134 55 -58 -18 235 -21 154 35 -50 481 -3 11 -344 -43 56 11 -170 -45
5363 -45 211 97 19 -125 -70 -192 55 -97 66 -121 -100 -116 106 72 -171 8 -279 -184 -39 -24 -73 144 89
$$ packed form
5202c06K3K80q1j29K29k52R4j91J11J60j28J49L7j43J97J88N2l52K52k3l9L50
5224D78k2j69J89k69q3J23r2J07j16J56j79q6pO76m61m62L64K29j53m59j4J90
5246f0m27K29l4M69l17q0k09J72J55j45J34k47%P9q9K21n1K31q8l29K72q3K04
5269Gj63k80L40K31%m6j75L02l91J82l2J86k07m4L08o1L38m56K42J74R9n10J10
5292A54qJ23j6l39J33O9L36m21q2l9Q3Q7j06k7p5K25k45J0o4L21k28r3J13j1j62
5317b62j96M81lq1j73j07L25j43K85n20RM49l16K28J58N6l50J27O5J08J44l15
5339c1K2j11K55L0M1M9j21p9j13M0K53k56J75j19q5N31m84J4l55L01R9m5j81J25
5363d5K56j14p8j44N5j22K47j52J63j87K1j6K22l4k43J79k87R5J45J5m9K17n5
$$ plain form
5386 89 -55 139 117 243 84 -23 -110 -75 196 223 -146 -121 54 349 -37 83 200 249 72 -135 214 469
5408 469 189 104 90 80 -174 142 24 -19 -24 -468 -100 -27 -169 98 265 -95 -96 -51 -110 -9 -237 300 187 -46
5432 -46 -74 7 297 -200 52 107 165 21 -43 290 224 70 -48 258 -33 -115 91 334 270 181 252 127 -180 -3
5456 -3 22 -79 65 20 443 126 -84 -216 -108 160 -178 -194 -8 -97 -677 -166 110 34 -501 -108 69 -173
5478 -173 -604 -299 43 65 -274 -438 -56 -196 -223 -140 131 -23 -174 195 62 -216 -84 50 37 -89 -77 336
5500 336 155 265 16 574 427 109 282 443 161 -79 319 361 -82 -189 175 196 322 20 235 214 -189
5521 -189 173 220 20 -385 0 101 -154 -668 -158 183 -116 79 -3 -33 -689 -419 -363 136 -511 -172 -218 -40
5543 -40 -384 -97 -280 -116 -480 -55 333 -43 -27 -292 85 -251 -46 412 217 5 -25 6 174 205 78 526
$$ packed form
5386H9j44J94k2J26j59j07q7L5K71K7l69K5J75K95l86J20J17M9j77k07L49K55
5408D69k80q5j4j0k54L16j18m3nm44L68P3j42K67J67l60jM5n9J01k28N37j13k33
5432d6k8Q1K90m97K52N5N8j44o4L33o6j54j18L06k91q2K06K43o4q9P1j25l07J77
5456cK5j01J44m5M23l17k10j32J08K68l38j6J86q9n80N11K76p6n35L93J77k42
5478a73m31L05L42K2l39j64L82j40k7Q3K71j54j51L69j33k78J32J34j3j26J2M13
5500C36j81J10k49N58j47l18J73J61k82k40L98M2m43j07L64K1J26l02K15k1m03
5521a89L62M7k00m05L85J01k55n14N10L41k99J95q2l0o56K70N6M99o47L39m6J78
5543d0l44K87j83J64l64M25L88l76J6k65L77l36K05M58j95k12l0L1J68L1j27M48
$$ plain form
5565 526 431 124 183 531 400 -15 255 246 299 -114 -80 556 101 -95 56 345 -75 -188 -202 336 239 -196 -27
5588 -27 236 -232 -299 117 -126 -324 -457 -136 -110 -478 -284 -237 15 -325 -330 308 -287 -519 54 82 -45 -603
5610 -603 46 446 280 -143 -131 228 -225 -286 203 180 -117 -83 502 546 245 23 348 362 -68 15 228 303 -153
5633 -153 76 201 421 -173 -149 183 111 -163 145 345 8 -57 -5 234 -182 -709 16 -91 -194 -264 67 -43
5655 -43 -765 -247 618 -268 -290 -190 -7 235 -335 -293 341 148 -125 71 232 -41 -408 224 526 120 17
5676 17 239 0 -325 -134 280 253 -249 37 596 153 -160 265 436 15 -123 76 335 5 -290 -123 349
5697 349 -166 -76 140 149 -58 -464 24 74 -310 -329 -89 394 -526 131 274 -348 -446 111 73 109 35 -106 353
5720 353 -176 -394 71 491 -127 -196 145 369 -119 77 55 148 -98 42 387 112 -220 -272 374 -21 -43 -71
$$ packed form
5565E26r5l07N9L48j31m15K70rN3m13L4O36m55j96J51K89m20j13j4N38r7m35J69
5588b7K63m68o7M16k43j98j33L21K6l68J94M7K52l40nO38n95k32N73K8j27n58
5610f03O49M00j66m23J2L59m53o1M89k3k97L4N85M4l01k22L25J4m30Q3K13P5m56
5633a53K29J25K20n94K4L32p2k74L08K00l37o5N2K39m16n27P25j07j03p0L31j10
5655d3p22N18Q65q86k2J00J83K42n70M2O34j93k73J96J61k73l67O32L02m06j03
5676A7K22k39l25J91M14k7n02K86N59m43l13M25J71m21j38J99K59l30k95J67M72
5697C49n15R0K16Rk07m06M88N0l84j9K40M83r20O57J43o22r8N57l8L6p4j41M59
5720C53n29k18M65M20o18o9L41K24m88J96k2R3k46J40L45k75l32n2O46l95k2k8
$$ plain form
5742 -71 437 18 -25 106 338 49 -579 259 -137 -132 37 140 145 -315 -288 186 -18 -373 -436 96 -61 -270 -262
5765 -262 138 -114 -374 -65 182 71 -219 203 228 -279 -71 297 60 28 -117 388 373 212 -93 21 245
5786 245 133 92 244 189 57 -141 401 -44 -55 69 404 79 80 -21 236 -248 -131 201 409 -217 -484 59
5808 59 189 -257 -220 88 -40 -356 -313 -33 -193 -141 -201 -39 -194 -311 -284 -70 -233 -330 105 309 -142 -119 -118
5831 -118 168 -228 -121 186 8 78 117 119 27 -34 21 437 102 -35 482 243 -24 83 311 547 -111 26
5853 26 209 275 151 133 -33 -167 -171 -226 -35 78 -341 -58 121 1 -126 -280 359 -5 -257 -163 327 -34
5875 -34 -192 55 -164 122 -247 -316 -101 -47 -390 101 117 -298 -300 -273 371 -33 -16 132 246 223 -136 -55 406
5898 406 86 -148 135 224 368 153 365 227 -104 -96 89 195 -30 129 254 -113 -360 254 38 -40 208
$$ packed form
5742g1N08m19m3J31K32k89o28Q38l96NJ69J03Nm60K7M74k04l55o3N32j57k09Q
5765b62M00k52k60L09K47j11k90M22K5n07K08L68k37l2j45N05j5j61l05J14K24
5786B45j12m1J52n5j32j98N42m45j1J24L35l25Jj01K57m84J17L32K08o26k67N43
5808E9J30m46L7L08j28l16M3K80j60N2o0J62j55j17K7K14j63r7M35K04m51K3J
5831a18K86l96J07L07j78P0L9Kr2o1N5M16l35j37N17k39k67J07K28K36o58J37
5853B6J83O6j24j8j66j34mn5J91J13m19K83J79j20j27j54O39l64k52R4M90l61
5875c4j58K47k19K86l69o9K15N4l43M91J6m15kK7O44m04J7J48J14k3l59Q1M61
5898D06l20k34K83Q9J44k15K12j38l31QJ85J06k25J59J25l67k47O14k16p8K48
$$ plain form
5919 208 23 91 66 -113 70 234 -176 -331 70 -192 -168 -315 -68 -85 -335 -117 -172 66 138 -23 48 213
5941 213 -162 185 151 -131 -169 -160 -42 -176 89 338 294 102 266 169 396 -398 -141 73 79 29 50 275 -184
5964 -184 67 94 269 241 252 194 117 -211 -62 -11 25 19 -72 130 2 -86 -159 -71 -254 -176 79 -254 -144 -123 -109
5989 -109 -79 88 -274 -210 10 179 -278 -122 -22 -73 -66 1 10 33 -195 185 -217 -76 -281 -14 204 246 -78
6012 -78 362 -37 -81 -30 65 402 -88 31 27 361 73 279 116 48 -149 -92 -1 212 -31 -325 5 -13 -66 56
6036 56 162 -129 96 -10 -138 -380 -75 148 -144 -179 -190 -392 6 208 14 66 -217 -236 -33 -83 -120 -279
6058 -279 190 -24 47 -83 253 -52 22 -144 44 -253 -126 132 117 143 77 146 67 -88 51 118 -56 201 90
6081 90 278 76 57 -17 -22 65 145 -173 102 -202 -95 97 272 -56 -403 126 63 -16 -355 222 -28 -311 -243
$$ packed form
5919B08j85O8k5j79J83J64m10j55M01k62K4j47K47j7k50K18n5K38P2j61P1J65
5941B13l75L47l4k82l8RJ18j34K65K49m4j92J64r7K27p94K57K14On0K1K25m59
5964a84K51K7J75k8J1n8p7l28J49N1L6or1K02j28q8p3Q8j83P8K55l33J10K1J4
5989a09L0J67l62O4K20J69m57J56J00n1PO7RK3k28L80m02J41k05K67K18M2l24
6012g8M40l99m4N1R5L37m90J19mL34k88K06j63o8j97N7R1K13k43k94L30j8n3J22
6036E6J06k91K25j06j28k42L05K23k92l5j1k02L98K02j94N2k83j9K03n0l7j59
6058b79M69k14P1j30L36l05P4j66J88k97J27K58j5K6o6O9p9j55J39O7j74K57j11
6081I0J88k02j9p4nQ7Q0l18K75l04J07J92J75l28l47N29o3p9l39N77k50k83O8
$$ plain form
6104 -243 -13 287 -118 -211 71 141 -471 -102 130 60 69 -104 43 203 25 -149 292 147 -83 -202 97 -10
6126 -10 158 310 242 86 239 320 29 157 -423 160 -39 26 -134 185 419 -127 -211 86 199 200 -418 376
6148 376 -104 -341 -268 -76 -41 -281 -390 -52 -56 -278 -122 31 -314 -221 360 -74 -52 153 233 -159 -54 -337
6170 -337 138 227 125 -20 -27 -137 -356 -40 299 42 -121 336 292 -108 39 266 132 224 -62 237 163 -185
6192 -185 -126 189 -33 -96 77 158 -107 -85 3 146 -52 -381 -337 4 71 121 292 117 -360 -108 16 -124 90
6215 90 -71 -32 47 -267 -37 258 267 -151 103 299 264 -176 31 223 2 -364 268 192 -218 222 74 208
6237 208 -72 40 273 309 -185 -143 -50 175 -234 -104 -192 -110 -5 -15 53 -70 -149 310 10 316 -270 -50 -26
6260 -26 -134 -105 374 231 -279 71 2 207 43 -255 251 57 -291 -399 123 64 -113 -60 5 -195 -250 13
$$ packed form
6104b43K30L00m05r3K82P0o12L69K32p0Rj73J47J60j78j74M41j45k30j19K99j07
6126a0J68J52o8j56J53Q1k91J28n80N83j99O5j60L19K34n46q4K97J13Jo18P94
6148C76m80k37P3J92L5k40j09L38mk22J56J53l45R3N81m34K2K05Q0l92J05k83
6170c37M75Q9j02j45pj10k19L16L39k57j63M57m4m00J47K27j34R2k86K99p4l48
6192a85N9L15k22o3J73Q1k65K2Q8J43j98l29M4L41O7N0J71j75m77K52J24j40K14
6215I0j61L9P9l14K30K95Rm18K54J96l5m40K07J92k21l66O32p6m10M40j48J34
6237B08k80J12K33L6m94M2R3K25m09J30q8Q2J05j0O8j23p9M59l00L06n86K20K4
6260b6j08K9M79j43n10L50o9K05j64k98N06j94l48j08N22n9j77N3O5k00n5K63
$$ plain form
6282 13 19 -21 -164 -303 113 0 87 51 81 -128 241 146 265 -128 -22 431 -77 -207 155 232 58 46 -128
6305 -128 463 104 -156 77 252 -29 -158 -5 132 -25 -229 -76 -181 -67 -80 -412 173 -171 -29 -134
6325 -134 -193 -130 -414 -13 -42 -205 -53 267 -114 -180 -365 -141 -243 -327 -140 386 -65 -523 142 205 -149 -126
6347 -126 214 73 110 37 59 -38 16 -245 213 -163 -97 3 115 15 -86 171 223 371 -431 255 207 81 -109
6370 -109 246 131 -137 -26 -34 136 150 90 106 -41 -123 -80 15 219 266 13 5 -154 -278 204 -12 -305 -302 134
6394 134 40 301 -13 75 -26 -162 244 18 41 -82 87 72 21 88 200 191 128 27 -140 71 117 185 48 -7
6418 -7 234 -232 229 172 43 139 317 50 275 -119 13 23 -43 158 358 50 -338 -117 56 103 -214 -258 42
6441 42 -172 -81 -26 16 312 83 265 -120 -119 -103 -204 -28 -7 -85 -14 222 -204 142 307 211 65 -115 -128 203
$$ packed form
6282A3Om0j43j39M16j13Q7l6L0k09L69r5J19l93J06M53n08j30L62P7j74j2j74
6305a28N91l59k60K33J75k81j29J53J37j57k04J53j05J14j3l32N85l44J42j05
6325a34n9O3k84M01k9j63J52L20l81o6j85K24j02q4J87N26m51m58O65O3l54K3
6347a26L40j41L7p3K2r7N4k61M58l76O6J00J12j00j01K57N2J48q02O86m8j26j90
6370a09L55j15k68J11qJ70J4o0J6j47q2M3R5K04M7k53qj59j24M82k16k93LM36
6394A34r4K61l14Q8j01j36M06k26K3j23J69j5n1O7J12ro3j01j67K11M6O8j37n5
6418gK41m66M61n7j29R6J78k67K25l94J32J0o6K01K00l08l88K21J73M7l17m4L00
6441D2k14R1N5M2K96k29J82l85JJ6j01J76K1p8P1K36m26L46J65r6j46j80j3L31
$$ plain form
6465 203 -314 17 226 -252 -148 173 165 -182 116 -10 -174 114 90 170 235 -106 -343 -191 -268 -172 121 131 -36
6488 -36 -45 -104 -6 -278 -140 203 -4 79 -9 47 155 -172 -421 121 237 -74 -58 219 89 -133 121 183 -141
6511 -141 -64 -77 281 111 153 78 110 -77 -72 176 182 424 126 99 179 -131 -127 401 361 -92 -125 -32 50 -151 -31 -86
6537 -86 310 -27 -136 47 -41 149 -101 -115 -158 -284 38 -129 -202 -354 -72 -147 -179 -239 43 -141 -237 -112 -365
6560 -365 99 -274 -210 -18 -100 30 236 47 215 -51 48 203 -83 139 115 -12 100 284 434 187 -2
6581 -2 -49 26 123 -285 -82 172 224 27 175 -81 -76 34 -24 116 107 -91 -203 -186 -2 -132 239 241 57 15 -39
6606 -39 -227 -21 -175 -154 80 -301 -188 -235 -232 -308 311 42 -168 14 52 -66 22 -46 122 29 -20 115 74 17
6630 17 113 176 20 -230 206 -61 247 161 -72 249 -85 -43 -176 33 180 -150 -424 80 107 20 125 -158
$$ packed form
6465B03n17L31K09m78J04L21ql47K98j26j64K88k4Q0O5l41k37J52p7R6K93J0j67
6488c6rn9R8k72J38L43k07Q3q8N6J08l27k49N42J16l11J6K77j30k22K54O2l24
6511a41P7j3L58j70M2p5L2j87NK48OK42k98k7Q0l10MN28m0m53l3R3Q2k01J20n5
6537h6L96l37j09J83q8J90k50j4m3j26L22j67p3j52K82p5l2o0K82j84r6J25k53
6560c65M64l73O4J92q2J30K06j89J68k66R9J55k86K22k4j27J12J84J50k47j89
6581bm7P5R7m08K03K54N2j97J48k56NJ10n8J40rj98j12J7J84j30L71Kj84m2n4
6606c9j88K06j54K1K34l81J13m7Lp6O19k69k10J82L8j18Q8o8J68r3m9J35m1n7
6630A7R6O3j56k50M36k67L08q6k33L21l34M2j33K09J47l30k74N04K7q7J05k83
$$ plain form
6652 -158 -185 84 -75 -317 133 -233 -191 -331 -54 -294 318 -147 4 321 -254 -59 29 -219 116 167 298
6673 298 -180 -22 17 -97 90 264 -30 -133 -170 -214 109 201 133 291 -177 40 -333 136 270 -62 134 169
6695 169 163 104 228 143 -23 59 -45 -202 110 286 -4 -30 -44 -32 -210 -276 -416 2 -233 -208 -42 -291 68
6718 68 -171 -119 -128 -31 90 -211 -286 42 60 -113 -281 195 -408 184 -41 -8 -74 288 -154 205 -27 72 169 90
6742 90 94 14 306 161 246 131 513 -131 404 -156 -19 220 -44 -69 243 134 110 -245 -15 10 157 0 11
6765 11 156 31 -220 -259 -111 -71 28 -308 -133 -107 -197 31 -304 -95 111 -229 -82 -145 -244 -168 -22 -8 120
6788 120 -264 221 118 -140 -57 142 237 225 106 185 476 -44 233 115 13 185 101 50 -35 102 288 246 228
6811 228 236 -163 38 38 64 -85 24 201 -79 -77 115 56 -71 98 -270 135 23 -191 -148 -244 -271 -153 97 -150
$$ packed form
6652a58k7K69j59k42M50l66M2j40K77k40O12m65J51L17n75J95Q8k48L35N1J31
6673B98m78J58L9j14J87J74k94j03l7m4L23R2o8J58m68K17l73M69J34l32J96L5
6695A69on9J24q5j66Q2j04j57L12J76k90k6j4J2j78o6j40M18k35K5J66k49L59
6718F8k39N2rR7J21l01p5L28J8j73j68M76o03N92k25L3o6L62m42L59k32R9R7p9
6742I0Mq0K92j45Q5j15L82o44N35n60J37K39k64k5L12j09k4l55K30K5J47j57J1
6765A1J45j25k51l9J48M0R9l36J75K6r0K28l35K09K06l40J47o3r9P6J46J4J28
6788A20l84M85j03k58Q3J99R5j2j19P9K91n20K77j18j02J72q4n1q5J37J86m2j8
6811B28Ql99K01%K6j49J09J77k80KJ92n9j27J69l68M05j12k14M3r6k7J18K50k47
$$ plain form
6835 -150 -4 184 197 18 53 -465 168 -50 146 -104 -83 -78 124 317 240 254 -86 -111 -48 -246 -59 149 261
6858 261 114 -159 286 130 -79 163 -138 -160 -19 -105 -54 120 -220 86 178 -199 24 268 99 179 -12 300
6880 300 -191 -15 224 -4 -14 -242 -171 34 -110 -298 -161 -75 -211 -30 -69 -206 -144 246 172 1 276 1
6902 1 -32 135 -44 318 -107 79 -113 -182 -56 -8 -209 -101 -21 -310 -115 36 241 40 -255 -169 97 112 70
6925 70 489 229 87 -18 -62 -18 53 -42 80 174 -132 -176 -5 35 87 -37 19 -17 -162 -28 -136 -232 -253 -39
6949 -39 333 168 -185 -259 -125 143 -202 164 90 -30 -112 -50 -119 -301 -73 20 84 2 -10 75 120 24 342 176
6973 176 80 56 14 88 6 0 -91 29 42 -44 -186 334 0 118 -1 -109 113 -262 -279 67 -144 15 -40 -331
6997 -331 -363 -114 -157 89 -145 -117 296 135 -11 -10 327 -269 -111 -30 153 -26 -186 89 -113 235 167 234 -3
$$ packed form
6835a50J46J88J3j79L5n18O33k18J96k50K1NK02J93p7J4l40k5O3j98J87K08J12
6858B61j47k73M45j56k09K42l01k2J41q6N1J74l40L06R2l77K23K44j69Q0j91L12
6880C00m91J76K39k28j0k28P1K05j44j88J37Q6j36J81l9j37O2L90p4j71K75k75
6902Al3J67j79L62m25J86j92o9J26M8k01J08Q0k89J95J51K05k01k95Q6K66J5m2
6925G0M19k60j42j05m4M4P1r5J22R4l06m4J71M0N2j24N6l6j45J34j08r6k1K14
6949c9L72j65l53p4J34K68l45L66p4j20q2O2o9j82K28R3O4q2j2Q5M5r6L18j66
6973A76r6k4m2P4q2or1J20J3q6j42N20l34J18j19j08K22l75j7L46k11J59n5k91
6997c31l2K49m3K46k34K8M13j61j46JL37n96J58Q1J83j79j60K75k02L48o8O7k37
$$ plain form
7020 -3 -47 -44 -47 177 120 -164 -20 71 89 27 192 -36 -67 178 -130 -158 50 85 125 83 138 -127 125 117 11 5 -78
7047 -78 78 -124 -123 -51 131 -321 43 -88 160 177 32 -216 -216 79 49 -278 -72 156 211 -264 -40 -39 -139 -118
7071 -118 14 -35 199 99 184 -139 236 -101 -7 135 125 52 -61 50 -50 48 -44 -186 29 -27 -38 107 124
7094 124 159 -100 114 -219 51 163 135 -280 -241 199 -329 -44 -437 200 -157 -192 -202 156 -273 -200 161 -103
7116 -103 -38 41 85 168 -239 -35 -28 178 -220 107 90 -234 15 -165 -72 166 126 -58 284 -135 -38 191 29
7139 29 31 36 80 367 184 -121 129 -123 49 -84 347 178 255 107 139 -80 -218 128 127 -344 13 138 188 -153
7163 -153 -173 -134 24 -214 -40 80 117 -197 -129 -158 -59 -132 -178 -114 -187 157 -173 -286 -259 249 41 -477 -246 125
7187 125 0 -275 145 -75 -60 149 -26 14 46 -109 127 -108 -273 29 -167 -82 9 137 307 -88 183 -30
$$ packed form
7020cm4LlK24n7k84J44R1J8o2J65k28l1K45l08k8K08L5M0m2N5k65K52qj06oq3
7047g8J56k02JP2J82m52L64j31K48J7j45k48%K95l0l27K06K28N5m75K24Jj00K1
7071a18J32m9K34j00Q5l23L75l37R4J42j0p3j13J11j00R8r2j42K15n6j1J45J7
7094A24L5k59K14l33K70J12k8m15L9M40n28K85l93O37l57l5j0L58m29P3L61k64
7116a03O5P9M4Q3m07K04PK06l98L27j7l24K49j80R3K38m0j84L42m19R7K29j62
7139B9KNM4K87j83l05K50k52J72j33M31j69P7j48L2k19j38L46jm71L57J25N0l41
7163a53k0L9J58k38J74J20L7l14O8k9R9p3m6O4p3L44l30j13K7N08k08n18K31L71
7187A25j25k75M20k20J5K09j75M0L2j55K36k35j65L02j96Q5R1J28J70l95K71k13
$$ plain form
7209 -30 -28 -36 -294 40 -46 -292 -142 -44 -183 158 -20 -34 45 -187 9 -34 17 -47 286 -89 -159 -27 -140 54
7233 54 -37 -456 -93 -175 -173 -30 217 -55 -472 40 32 -149 237 158 -133 151 -234 189 221 59 173 -82 205
7256 205 277 94 115 104 27 3 87 -94 -25 221 -266 -12 -23 -66 233 -196 -187 136 -174 -22 -179 -11 -122 -75
7280 -75 -72 -297 -200 -174 227 434 -75 -96 104 -3 -258 52 87 -16 -276 157 297 -152 41 165 92 42 53
7303 53 -69 25 -148 -50 170 -41 30 -112 400 55 89 -96 -153 347 98 39 191 59 -470 104 -13 214
7325 214 -75 -113 -94 91 -141 21 -165 -102 -363 -103 192 107 42 269 289 -311 170 -206 -278 156 -55 217
7347 217 -110 79 100 -264 -290 -74 -378 -204 220 355 -237 60 -112 27 94 -340 -88 63 -52 -60 5 -40
7369 -40 252 -40 -11 114 -11 197 -120 86 99 -30 156 -181 6 -97 144 42 19 -164 -107 -282 12 78
$$ packed form
7209c0Kqk58L34q6k46J50R8j39L41j78j4P9k32J96m3N1o4L33l75p0J32j13J94
7233E4r1m19L63q2KJ43K47k72m17N12qj81L86p9k91K84l85M23L2j62J14k55K87
7256B05P2j83K1j1p7k4Q4j81O9K46m87K54j1m3K99m29RL23l10J52j57J68j11M7
7280g5Lk25R7K6M01K07n09k1K00j07k55L10L5j03k60M33J40m49J93J24p3n0J1
7303E3j22R4j73R8K20k11P1j42N12l45L4j85n7N00k49n9J52j32n29N74j17K27
7325B14k89l8J9J85k32J62j86O3k61K60K95q5o5K27K0o00M81l76p2M34k11K72
7347B17l27J89K1l64k6K16l04J74M24J35n92K97j72J39O7m34K52J51j15qO5m5
7369d0K92k92K9J25j25K08l17K06J3j29J86l37J87j03K41j02k3j83N7j75K94O6
$$ plain form
7391 78 175 241 107 -40 -79 -126 -216 -65 15 146 -278 169 -195 -99 -51 24 -81 41 -116 10 -21 445 9 6
7415 6 139 -24 159 175 -234 414 38 122 -55 -58 -104 -140 -79 173 235 150 -164 74 69 77 141 2 -31 0 7 193 55
7442 55 -31 165 -313 68 -143 -32 82 170 3 114 9 -61 -14 -248 251 -90 28 92 130 5 -4 93 -216
7465 -216 -46 -192 -123 155 123 286 -62 139 2 127 43 -237 -173 -181 37 5 239 132 245 -8 -1 156 -63
7488 -63 -157 90 35 -122 -70 61 23 -57 19 -248 -25 102 -141 -56 183 -143 3 34 15 -92 158 -250 -352
7511 -352 24 -233 49 -139 -105 -307 -172 125 -309 -155 -29 -17 34 104 66 65 -72 224 369 180 277 -58 -118
7534 -118 -11 31 251 51 -86 -40 278 27 59 235 363 130 -50 126 19 -142 -114 -144 -61 294 33 -14
7556 -14 0 266 -159 15 -80 -128 108 -80 -111 200 -315 -74 -152 30 8 0 141 71 272 -85 -187 116 -5
$$ packed form
7391G8R7O6j34j47l9m7r0J51Q0J31m24M47l64R6M8P5j05J22j57J26l1M66m36l
7415FJ33j63J83J6m09O48l76Q4j77lm6l6O1K52O2q5l14K38nQO4j39l3L1PJ86j38
7442E5q6J96m78L81k11J11J14Q8j67J11j05p0M7k34M99l41J18O4L8j25rR7l09
7465b16J70j46O9K78l2J63l48K01j37J25q4k80O4qK18l2K34j07J13k53PJ57k19
7488f3r4K47n5j57N2J31l8q0P6k67K23J27k43Q5K39l26J46L1j9j07K50m08j02
7511c52L76k57K82j88L4k02J35K97m34J54J26J2N1P0l8jj37K96J45j89R7l35o0
7534a18J07M2K20k00j37M6L18k51L2J76J28k33j80J76j07j61K8l0Q3L55k61m7
7556a4J4K66m25J74r5m8K36j88l1L11n15K41p8J82k2qJ41p0K01l57j02L03j21
$$ plain form
7579 -5 140 173 -63 -98 60 170 -236 -9 -113 124 153 -194 143 -282 122 182 -425 71 -87 274 -153 22
7601 22 37 16 366 -77 107 118 164 -242 64 -188 -97 -7 -298 -142 57 253 -90 -24 34 6 69 265 87 -15
7625 -15 225 -65 -56 131 14 111 -198 227 208 -28 198 1 -170 -233 41 22 -226 68 41 142 154 142 280
7648 280 217 -29 49 -96 115 -29 -64 -29 -70 -71 158 132 -51 -136 133 -90 -161 -186 65 17 322 -318 321 7
7672 7 -275 148 98 2 -580 -279 169 114 187 120 -303 169 -86 245 134 19 -81 -142 291 55 -229 185 -19
7695 -19 -131 27 257 132 84 208 -119 50 -334 -61 221 92 121 -13 -217 65 -174 -384 -147 -163 -15
7716 -15 -172 22 -327 -40 -46 117 149 -37 242 -303 65 -35 -103 -138 -268 44 154 -59 -105 -57 -209 -36 -33
7739 -33 -158 -180 -259 -239 -237 28 134 -132 -3 145 -425 323 119 -177 77 -84 376 151 77 194 -151 43
$$ packed form
7579eJ45L3k36l5J58J10m06K27j04K37K9l47L37m25M04O0o07M96j58L61m27J75
7601B2J5k1L50m43J84J1M6m06L06k52R1R0k91J56J99J96l43O6N8k8O3J96j78j02
7625a5K40k90RJ87j17R7l09M25j9k36K26j97j71o3K74j9k48K94k7J01J2j2J38
7648B80o3k46P8j45K11j44l5L5m1jK29k6j83q5K69k23p1k5K51m8L05o40O39l14
7672Gk82M23n0r6n82L01M48n5P3o7m23M72k55L31j11j15j00o1M33k36k84M14k04
7695a9j12J58K30j25m8J24l27J69l84K73K82j29K9j34k04K82k39k10K37j6J48
7716a5j57J94l49K87oJ63L2j86K79n45L68j00o8l5j30L12J10k13m6M8j52J73L
7739c3j25k2p9K0KK65J06k66J29J48n70P48k04k96K54j61M60k25p4J17l45J94
$$ plain form
7761 43 46 40 109 310 36 -85 262 46 114 243 1 200 -321 -338 -64 45 188 -29 -162 -157 10 120 115 -475
7785 -475 -220 8 56 153 16 141 138 -350 -159 121 500 72 12 -95 -2 -81 106 63 -12 -55 -126 43 100 -292
7809 -292 278 372 -59 253 299 135 -229 290 22 101 -204 124 263 -186 68 2 199 305 -70 8 -98 -209
7831 -209 -143 -265 13 -36 -14 42 -99 6 -280 110 -220 -230 30 -110 -362 76 -339 12 -92 -74 94 151
7853 151 -91 24 207 -404 -80 -172 -53 78 -91 -91 40 -279 54 -43 -214 161 174 -91 229 -39 -174 180
7875 180 -46 143 90 -440 18 -51 -113 11 -82 87 121 -290 40 -140 -37 84 -99 65 -245 22 -197 -216
7897 -216 -105 44 -108 -24 -433 -53 -178 -117 -12 188 -12 28 82 119 14 -89 179 312 -112 -122 42 56
7919 56 225 247 164 -61 89 27 56 222 19 146 168 50 -11 -142 100 99 24 10 17 -144 -312 150 -2 -58 -100
$$ packed form
7761D3LoO9K01k74j21L47k16O8J29k42J99n21j7K74J09J43k17j33NJ67J10nn90
7785d75K55K28M8R7j37J25lm88J91K80L79m28o0j07R3p9J87m3p5m3p1J69N7l92
7809b92N70R4m31L12M6j64l64N19k68P9l05L28J39m49K54o6J97J06l75P8j06j11
7831b09O6j22K78m9K2N6j41J05k86L90l30j0K60j40k52M38m15L51j04J8J68N7
7853A51k42J15J83o11L24r2J19J31j69%J31l19L33r7j71L75J3k65L20k68j35L54
7875A80k26J89n3n30M58o9o2J24r3J69L4m11L30j80J03J21j83J64l10K67k19j9
7897b16J11J49j52Q4m09L80j25O1J05K00k00M0N4L7j05j03K68J33m24j0J64J4
7919E6J69K2q3k25J50o2K9J66k03J27K2j18o1j31K42jp5j4Pj61j68M62j52n6m2
$$ plain form
7944 -100 18 165 -317 -110 144 92 -4 11 -70 -47 -105 -322 -12 153 -315 76 134 82 55 -206 147 -39 -149
7967 -149 43 -112 143 -46 104 106 21 183 -175 30 -44 -347 -62 74 -124 -145 187 38 -126 -46 -74 165
7989 165 234 -134 167 40 -145 -34 106 -225 35 173 -210 -290 -246 -159 -153 -274 -143 185 -40 -154 -105 92
8011 92 100 36 67 93 -37 100 -329 -141 64 71 48 142 164 68 -110 172 213 59 85 86 -187 29 -280 229 -127
8036 -127 159 180 -26 198 86 -116 -134 149 -38 328 240 179 72 -156 66 -56 1 -286 181 -188 -139 -8
8058 -8 106 166 -15 30 180 -337 -123 157 -103 89 3 -56 -28 -61 16 -158 38 39 111 236 55 104 -131 -63 32
8083 32 124 134 61 35 86 214 42 -84 68 -177 229 216 258 8 -94 -64 -167 123 42 -168 -187 -101 86 245
8107 245 -103 -27 76 43 112 42 -287 179 101 -4 -127 -76 -294 -15 87 52 -60 -12 -45 213 136 -191 161
$$ packed form
7944a00J18J47m82K07K54n2r6J5q1K3n8k17L10J65m68L91N8n2k7k61L53j86j10
7967a49J92j55K55j89J50Kq5J62l58K05p4l03K85J36j98k1L32j49j64Q0k8K39
7989A65O9l68L01j27j85J11J40l31K60J38l83q0M4Q7Oj21J31L28k25j14M9J97
8011I2Qo4L1K6j30J37m29J88K05Pk3R4K2r6j78K82M1j54K6Jk73K16l09N09l56
8036a27K86K1k06K24j12k02j8K83j87L66q8o1j07k28K22j22N7k87M67l69M9J31
8058hJ14O0j81M5J50n17K14K80k60J92q6n9K8l3P7j74J96JP2J25j81M9k35O8R5
8083C2R2J0p3k6N1J28j72j26J52k45M06j3M2k50j02L0j03K90q1k10j9Q6J87J59
8107B45l48P6J03l3O9p0l29M66p8j05j23N1k18K79J02l5j12M8l3K58p7l27L52
$$ plain form
8130 161 59 6 -84 60 -60 96 22 -84 111 -159 -114 44 -382 274 167 159 272 96 -161 -68 114 26 -215
8153 -215 -128 153 -116 -62 -223 -222 -68 -201 35 -244 158 32 -91 96 72 -312 133 104 -151 272 14 -84
8175 -84 -97 -168 -76 -140 -66 -210 -55 -62 97 219 -434 -345 112 22 32 205
$$ packed form
8130A61j02n3r0J44j20J56p4j06J95k70M5J58m26O56j07qJ13j76k57R3J82q8k41
8153b15Q7K81k69N4j61JJ54j33K36k79M02j26j23J87k4l84M45k9k55M23k58r8
8175h4j3p1R2o4P4j44J55pJ59J22o53Q9M57r0J0J73
8191B05
$$ Imaginary data points
##PAGE= N=2
##DATA TABLE= (X++(I..I)), XYDATA
$$ plain form
0 0 0 0 0 8 -8 0 -8 8 -16 16 -24 24 -32 40 -48 56 -68 80 -96 111 -132 154 -176 202 -233 265 -304 344 -391
29 -391 440 -494 555 -622 695 -776 863 -960 1065 -1181 1308 -1449 1605 -1775 1969 -2180
45 -2180 2423 -2692 3003 -3360 3779 -4275 4878 -5621 6577 -7839 9602 -12247 16649 -25305
59 -25305 48830 -245488 -763987 -239954 206781 73954 -247205 -147175 9521 -114848
69 -114848 -309139 -214214 -44831 -50426 -197084 -276979 -238761 -74011 61542 -18330 -248819
80 -248819 -286306 -119853 -82262 -227507 -188862 65866 144516 -38311 -102752 18202 -3847
91 -3847 -157918 -55885 259415 319595 79074 -14772 151777 246049 166332 142213 192586
102 192586 141671 61858 140693 274910 275707 214796 186546 80654 -85821 -51603 186828
$$ packed form
0@%%%Qj6QqJ6k4L2m0M8n6P2q8J04j24J48j76K07k43K86l30L78m35M98n69O48p35
29c91Q31r34J049j177J317j471J639j823K025k246K489k757L054l380L744m149
45b180M603n115N695o363P139q054R153j0499J2198j4416J7441k1849K8896m1954
59b5305P4135k94318n18499N24033M46735j32827l21159J00030J56696j24369
69a14848j94291R4925J69383n595j46658p9895L8218J64750J35553p9872k30489
80b48819l7487J66453L7591j45245L8645K54728P8650j82827o4441J20954k2049
91c847j54071J02033L15300O0180k40521r3846J66549R4272p9717k4119N0373
102A92586n0915p9813P8835J34217P97o0911k8250j05892j66475L4218K38431
$$ plain form
113 186828 270438 103189 8884 96751 87637 -74385 -100336 51263 88120 -35839 -70577
124 -70577 7521 387 -59368 -13039 28608 -99666 -230515 -165282 -55457 -75281 -84545 4628
136 4628 -21161 -226923 -317873 -174972 -73846 -143023 -157027 -49250 -53678 -192279 -197431 -50020
148 -50020 -20169 -134932 -148848 -38303 -2775 -38653 12397 98242 64919 -16312 -10392 18967
160 18967 2258 48706 181948 213696 93730 28551 86196 93682 25704 63767 186488 171712
172 171712 39191 32682 151143 165367 67391 46796 92357 52105 -10788 59222 170593
183 170593 145434 50816 32564 33026 -32957 -57116 30596 84877 21196 -26899 5751 -9504
195 -9504 -99252 -112182 -35871 -35600 -120825 -130361 -57437 -48213 -99947 -92152 -61567 -117357 -188473
$$ packed form
113A86828Q3610j67249r4305Q7867r114j62022k5951J51599L6857j23959l4738
124g0577P8098p134n9755M6329M1647j28274j30849O5233J09825j9824r264Q9173
136D628k5789k05762r0950J42901J01126o9177j4004J07777m428j38601n152J47411
148e0020K9851j14763j3916J10545L5528l5878N1050Q5845l3323q1231N920K9359
160A8967j6709M6448J33242L1748j19966o5179N7645P486o7978L8063J22721j4776
172A71712j32521o509J18461J4224r7976k0595M5561m0252o2893P0010J11371
183A70593k5159r4618j8252M62o5983k4159Q7712N4281o3681m8095L2650j5255
195i504q9748j2930P6311K71q5225r536P2924R224n1734P795L0585n5790p1116
$$ plain form
208 -188473 -148224 -64563 -54356 -61674 -19526 -18407 -104187 -139015 -59172 -3438 -42197 -50515
220 -50515 18821 39597 -20720 -28901 36212 42474 -23348 -32748 28508 51213 34673 65538 108997
233 108997 73870 9481 12030 47606 45467 51240 108593 137462 88189 47700 69877 79334 43587
246 43587 40088 82683 86135 44982 49269 93962 81274 16558 -3393 15257 -3591 -36061 -6165
259 -6165 46621 30548 -24231 -37562 -32594 -64363 -90442 -61004 -25388 -35918 -52709 -37991
271 -37991 -36157 -68057 -82049 -63821 -63745 -84791 -70939 -28247 -18967 -41218 -40529 -30378 -57606
284 -57606 -90591 -69116 -22347 -11881 -19620 -3076 11064 -12661 -37658 -22415 -864 -4184
296 -4184 -714 29437 49380 41354 37951 49540 43100 21050 23088 49319 61861 60574 74906
$$ packed form
208a88473M0249Q3661J0207p318M2148J119q5780l4828P9843N5734l8759q318
220e0515O9336K0776o0317q181O5113O262o5822r400O1256K2705j6540L0865M3459
233A08997l5127o4389K549L5576k139N773N7353K8869m9273m0489K2177R457l5747
246D3587l499M2595L452m1153M287M4693j2688o4716j9951J8650j8848l2470K9896
259f165N2786j6073n4779j3331M968l1769k6079K9438L5616j0530j6791J4718
271c7991J834l1900j3992J8228P6k1046J3852M2692R280k2251O89J0151k7228
284e7606l2985K1475M6769J0466p739J6544J4140k3725k4997J5243K1551l320
296d184L470L0151J9943q026l403J1589o440k2050K038K6231J2542j287J4332
$$ plain form
309 74906 90544 73553 42417 35079 42298 36562 32448 52337 69114 56898 35781 30337 25153
322 25153 3966 -9564 -839 9463 6715 6726 13913 7795 -14535 -31230 -35575 -39722 -42281 -31100
336 -31100 -16313 -17398 -27668 -33162 -40170 -57270 -68431 -59654 -45675 -41840 -40028 -31147 -28906 -41588
350 -41588 -52521 -51388 -46463 -45980 -38881 -20849 -5968 -1434 -2900 -6068 -12602 -16862 -10719 4154
364 4154 18285 28425 36145 38086 33445 28348 27460 25731 24570 30449 43667 54173 54971 51319 45223
379 45223 34460 23565 22035 29386 36133 36891 38153 39896 36348 24594 11629 4183 1557 2093
393 2093 6565 13230 17011 11480 -1585 -15524 -23842 -26299 -27275 -27430 -24366 -19124 -16483 -21031 -30826
408 -30826 -40270 -46934 -50313 -48156 -39437 -28074 -22298 -23912 -28940 -32394 -34133 -35710 -34676 -28983 -19341
$$ packed form
309G4906J5638j6991l1136p338P219n736m114J9889J6777j2216k1117n444n184
322B5153k1187j3530Q725J0302k748J1P187o118k2330j6695m345m147k559J1181
336c1100J4787j085j0270n494p008j7100j1161Q777J3979L835J812Q881K241j2682
350d1588j0933J133M925M83P099J8032J4881M534j466l168o534m260O143J4873
364D154J4131J0140P720J941m641n097q88j729j161N879J3218J0506P98l652o096
379D5223j0763j0895j530P351O747P58J262J743l548j1754j2965p446k626N36
393B093M472O665L781n531j3065j3939q318k457r76j55L064N242K641m548r795
408c0826r444o664l379K157Q719J1363N776j614n028l454j739j577J034N693R642
$$ plain form
423 -19341 -8859 -5 3925 1258 -5257 -10842 -11130 -4040 6651 16836 22654 25032 25829 24085 18789
438 18789 14055 14459 17672 21110 28422 40426 46983 39579 25407 17835 18494 18818 20019 25990 33497
453 33497 34225 28023 21997 17004 9136 1146 -1918 -174 5251 11169 13333 5375 -6664 -14092 -19181
468 -19181 -24992 -27285 -20212 -12132 -13070 -16351 -14059 -16425 -30322 -42057 -37074 -26719 -24289 -21856
482 -21856 -12145 -7399 -16649 -26871 -26119 -22408 -23676 -21548 -12226 -4035 281 4525 3771 -7260 -15980
497 -15980 -10476 -567 1102 5468 20825 28058 14971 3339 11321 18599 9561 3902 17581 30498
511 30498 28148 25773 32001 29234 12295 4450 12712 18532 17536 24290 31794 23564 9594 8979 10489
526 10489 -1077 -9143 3887 15996 6525 -1736 6787 7126 -14050 -25853 -12198 -4172 -16489
$$ packed form
423a9341J0482Q854L930k667o515n585k88P090J0691J0185N818K378P97j744n296
438A8789m734M04L213L438P312J2004O557p404j4172p572O59L24J201N971P507
453C3497P28o202o026m993p868p990l064J744N425N918K164p958j2039p428n089
468a9181n811k293P073Q080r38l281K292k366j3897j1735M983J0355K430K433
482b1856R711M746r250j0222P52L711j268K128R322Q191M316M244p54j1031q720
497a5980N504R909J669M366J5357P233j3087j1632P982P278r038n659J3679J2917
511C0498k350k375O228k767j6939p845Q262N820r96O754P504q230j3970o15J510
526A0489j1566q066J3030J2109r471q261Q523L39k1176j1803J3655Q026j2317
$$ plain form
539 -16489 -19658 -3638 1741 -13178 -20937 -15747 -23265 -37389 -28402 -5983 -4428 -16733 -14237 -8251
553 -8251 -21036 -33234 -20259 -6129 -14871 -21507 -5488 5892 -5216 -10379 1771 271 -20028
566 -20028 -17881 10746 20864 5741 6445 23805 17451 -6839 -5421 17697 20753 10375 19762
579 19762 33990 20869 4303 15218 26764 11637 928 17966 27501 10616 6873 29938
591 29938 31854 1225 -12725 4603 9854 -3495 5023 27499 16303 -14868 -15902 3864 -3458
604 -3458 -21228 -9423 8247 -7079 -25080 -8456 6909 -13981 -33350 -19205 -10118 -27765
616 -27765 -29098 160 8202 -18819 -28739 -11675 -14454 -36763 -25710 7611 6363 -17985 -13052
629 -13052 6753 -5727 -25330 -7334 17149 985 -19001 2356 25739 11537 -1588 16583
$$ packed form
539a6489l169J6020N379j4919p759N190p518j4124Q987K2419J555j2305K496N986
553h251j2785j2198J2975J4130q742o636J6019J1380j1108n163J2150j500k0299
566b0028K147K8627J0118j5123P04J7360o354k4290J418K3118L056j0378R387
579A9762J4228j3121j6566J0915J1546j5127j0709J7038R535j6885l743K3065
591B9938J916l0629j3950J7328N251j3349Q518K2476j1196l1171j034J9766p322
604c458j7770J1805J7670j5326j8001J6624J5365k0890j9369J4145R087j7647
616b7765j333K9258Q042k7021r920J7064k779k2309J1053L3321j248k4348M933
629a3052J9805j2480j9603J7996K4483j6164j9986K1357K3383j4202j3125J8171
$$ plain form
641 16583 22076 -6626 -15367 17034 34758 17901 14712 33008 22639 -9061 -4116 28349 27967
654 27967 5464 13206 33079 17151 -4828 13233 33057 7588 -19500 -55 21629 4032
666 4032 -6368 18710 25165 -12416 -33712 -10324 2210 -15262 -13036 11464 3252 -30183 -28529
679 -28529 -2436 -10227 -35768 -22829 1977 -14417 -37562 -15168 12394 -7567 -34516 -21304
691 -21304 -6564 -25769 -29373 5928 22107 -5794 -19421 1079 588 -24530 -14574 24249 24583
704 24583 -8523 -6441 24275 19122 -6465 5101 29938 13514 -12276 7248 38136 28132
716 28132 9912 22500 27034 -2497 -13786 17925 35883 15720 8461 26539 18926 -13273 -8697
729 -8697 24132 18869 -14540 -9922 18272 9252 -17494 -3961 20637 -1990 -36844 -25268 2211
$$ packed form
641A6583N493k8702q741L2401J7724j6857l189J8296j0369l1700M945L2465l82
654B7967k2503P742J9873j5928k1979J8061J9824k5469k7088J9445K1684j7597
666D032j0400K5078O455l7581k1296K3388J2534j7472K226K4500q212l3435J654
679b8529K6093p791k5541J2939K4806j6394k3145K2394K7562j9961k6949J3212
691b1304J4740j9205l604L5301J6179k7901j3627K0500m91k5118R956L8823L34
704B4583l3106K082L0716n153k5587J1566K4837j6424k5790J9524L0888j0004
716B8132j8220J2588M534k9531j1289L1711J7958k0163p259J8078p613l2199M576
729h697L2829n263l3409M618K8194r020k6746J3533K4598k2627l4854J1576K7479
$$ plain form
742 2211 -5498 -18105 180 9252 -20117 -38804 -18515 -5941 -21930 -20569 4802 560 -30172
755 -30172 -27217 3592 558 -26873 -20197 4653 -6012 -27645 -5760 26008 10555 -19921 -10720
768 -10720 7647 -6205 -15041 14451 33646 10558 -8423 8533 16996 -1143 -218 25583 25283
781 25283 -1588 1363 28876 25874 1354 6563 26008 10642 -13989 3503 32792 22861 -49
794 -49 8432 17617 -4652 -20132 3574 21353 3781 -8129 6271 7489 -15754 -17529 6054
807 6054 5734 -20301 -21420 909 -441 -17745 -9116 8113 -8415 -35217 -24793 -863 -5431
820 -5431 -17189 -2829 7392 -14526 -30420 -12289 2364 -10911 -16230 2707 7196 -11481 -12561
833 -12561 8554 9091 -11689 -11026 8563 6016 -7481 4544 26055 15810 -6334 -1499 12608
$$ packed form
742B211p709j2607J8285R072k9369j8687K0289J2574j5989J361K5371m242l0732
755c0172K955L0809l034k7431O676K4850j0665k1633K1885L1768j5453l0476R201
768a0720J8367j3852q836K9492J9195k3088j8981J6956Q463j8139R25K5801l00
781B5283k6871K951K7513l002k4520N209J9445j5366k4631J7492K9289r931k2910
794d9Q481R185k2269j5480K3706J7779j7572j1910J4400J218k3243j775K3583
807F054l20k6035j119K2329j350j7304Q629J7229j6528k6802J0424K3930m568
820e431j1758J4360J0221k1918j5894J8131J4653j3275n319J8937M489j8677j080
833a2561K1115N37k0780O63J9589k547j3497J2025K1511j0245k2144M835J4107
$$ plain form
846 12608 4249 -3283 15534 29223 12149 -1930 10585 18058 3358 -1328 15092 17860 246
859 246 -825 19190 19824 1115 -1376 10604 3560 -12206 -3365 16506 11786 -4027 -627 5871
873 5871 -7856 -19868 -6695 5838 -3486 -10564 -736 1064 -13505 -16366 -2489 -2922 -19900 -19715
887 -19715 -3006 -322 -11719 -8555 2890 -5823 -24217 -19443 -1692 -959 -8606 -2525 5912 -3300
901 -3300 -13105 -4463 3302 -3984 -8015 2566 8454 1249 915 11659 10723 -2284 -3895 6892 7766
916 7766 1495 9163 21237 15440 1859 3880 11758 6337 -555 8572 19406 12457 3690 8887
930 8887 14111 5229 -1997 3833 7731 1215 -3 8893 9840 670 -2379 1209 -3370 -11832 -8096
945 -8096 1986 668 -6296 -4381 -1132 -8946 -16407 -10948 -4881 -9641 -13512 -7129 -2666 -8473 -11512
$$ packed form
846A2608q359p532J8817J3689j7074j4079J2515P473j4700m686J6420K768j7614
859B46j071K0015O34j8709k491J1980p044j5766Q841J9871m720j5813L400O498
873E871j3727j2012J3173J2533r324p078R828J800j4569k861J3877m33j6978J85
887a9715J6709K684j1397L164J1445q713j8394M774J7751P33p647O081Q437r212
901c300r805Q642P765p286m031J0581N888p205l34J0744r36j3007j611J0787Q74
916G766o271P668J2074n797j3581K021P878n421o892R127J0834o949q767N197
930H887N224q882p226N830L898o516j218Q896R47r170l049L588m579q462L736
945h096J0082j318o964J915L249p814p461N459O067m760l871O383M463n807l039
$$ plain form
960 -11512 -6949 -6805 -15147 -16853 -7269 -1506 -3860 -4415 -1286 -3442 -9529 -7649 -1135 -1209 -3048 1255
976 1255 6491 4511 1747 4817 7008 1774 -339 6186 12323 9944 8277 11951 12416 7911 5931
991 5931 9336 9446 6152 7949 13676 13663 9180 6603 7457 4395 1127 3096 7028 5815 3078 3023 3038
1008 3038 -837 -3277 -2936 -3702 -6994 -6432 -1890 -1121 -5524 -8224 -7811 -9720 -13113 -12454 -7641 -6287
1024 -6287 -9091 -9344 -7552 -8437 -10346 -10514 -9027 -8799 -8695 -5546 -3190 -2737 -3207 -3269 -3954 -4804 -3046 -258
1042 -258 1430 2357 4470 6642 5278 3038 3398 5319 5668 5460 8301 11954 11717 9026 7815 7969 7759
1059 7759 6733 6856 8777 9864 9304 8422 7501 5866 4255 2135 1443 2190 3455 4266 2697 982 -6
1076 -6 -1738 -4300 -5406 -5057 -4303 -4396 -4520 -3646 -3728 -6252 -8944 -9795 -9563 -9130 -8571 -6777 -4615 -5077 -6299
$$ packed form
960a1512M563J44q342j706R584N763k354n55L129k156o087J880O514p4j839M303
976A255N236j980k764L070K191n234k113O525O137k379j667L674M65m505j980
991E931L405J10l294J797N727j3m483k577Q54l062l268J969L932j213k737n5J5
1008C038l875k440L41p66l292N62M542P69m403k700M13j909l393O59M813J354
1024f287k804k53J792q85j909j68J487K28J04L149K356M53m70o2o85q50J758K788
1042b58J688R27K113K172j364k240L60J921L49k08K841L653k37k691j211J54k10
1059G759j026J23J921J087n60q82r21j635j611k120o92P47J265Q11j569j715r88
1076fj732k562j106L49P54r3j24Q74q2k524k692q51K32M33N59J794K162m62j222
$$ plain form
1095 -6299 -7472 -7820 -8314 -8130 -6906 -4380 -1318 -514 -1129 -2347 -2346 -2310 -2284 -1607 827 3284 4609 4367
1113 4367 4459 5511 5073 2513 1458 3386 6389 7725 7567 7908 8318 7103 4740 3313 4029 5274 5347
1130 5347 5400 6226 7737 6813 3553 363 -208 764 1072 738 1886 3404 2809 -517 -2827 -3423 -3515 -5033
1148 -5033 -5186 -2725 -734 -1482 -3320 -4443 -4987 -6625 -7577 -6599 -4940 -3743 -3481 -3459 -3376 -3529 -4466 -6332
1166 -6332 -6619 -5043 -2666 -1970 -1684 268 1530 -776 -4376 -3635 -690 596 -677 821 4526 4780
1182 4780 2026 390 1814 2525 1660 965 3762 6324 6453 5167 4289 3212 3197 2588 2360 2960 5293
1199 5293 6514 5169 2973 3063 4075 1944 -793 733 4130 3524 256 1143 3190 1690 -2120 -3205
1215 -3205 -909 -886 -2447 -1384 191 -274 -2140 -3318 -4166 -4959 -4962 -3358 -2981 -3930 -3110 -1914 -3594 -6570
$$ packed form
1095f299j173l48m94J84J224K526L062Q04o15j218JL6K6O77K434K457J325k42
1113D367R2J052m38k560j055J928L003J336j58L41M10j215k363j427P16J245P3
1130E347N3Q26J511r24l260l190n71R72L08l34J148J518n95l326k310n96r2j518
1148e033j53K461J991p48j838j123n44j638r52R78J659J197K62K2Q3j53r37j866
1166f332k87J576K377O96K86J952J262k306l600P41K945J286j273J498L705K54
1182D780k754j636J424P11q65o95K797K562J29j286q78j077j5o09k28O00K333
1199E293J221j345k196R0J012k131k737J526L397o06l268Q87K047j500l810j085
1215c205K296K3j561J063J575m65j866j178q48p93lJ604L77r49Q20J196j680k976
$$ plain form
1233 -6570 -5661 -3361 -3816 -5245 -3217 -1089 -2086 -4542 -3046 -762 -2820 -4260 -2225 192 -394 -573
1249 -573 1729 2819 -24 -1775 1105 2421 1725 2646 4937 4379 2154 2854 5262 4014 1887 3444
1265 3444 5616 5039 3423 5538 6557 4005 1183 2888 4687 2913 2122 4823 5158 1730 -86 1081
1281 1081 1060 -1333 -1223 1255 744 -2099 -1617 -409 -2384 -4887 -3938 -2716 -4641 -5980 -3183 -1537
1297 -1537 -4308 -6187 -4095 -3835 -7646 -8121 -3555 -1564 -3726 -4737 -2271 -2375 -5962 -5444 -1312 -474
1313 -474 -2645 -1699 1484 1101 -723 886 2452 685 -901 1898 4242 4160 4584 6878 5525 1494
1329 1494 1676 5420 6105 3515 4472 8280 6480 2314 3001 6724 5096 484 791 4333 4257 1728 2506
1346 2506 4371 1670 -2318 -2160 -1004 -1822 -1747 -186 340 -2817 -3924 -2850 -3939 -6379 -5401 -2415
$$ packed form
1233f570R09K300m55j429K028K128r97k456J496K284k058j440K035K417n86j79
1249e73K302J090k843j751K880J316o96R21K291n58k225P00K408j248k127J557
1265C444K172n77j616K115J019k552k822J705J799j774p91K701L35l428j816J167
1281A081k1k393J10K478n11k843M82J208j975k503R49J222j925j339K797J646
1297a537k771j879K092K60l811m75M566J991k162j011K466j04l587N18M132Q38
1313d74k171R46L183l83j824J609J566j767j586K799K344q2M24K294j353m031
1329A494J82L744O85k590R57L808j800m166O87L723j628m612L07L542p6k529P78
1346B506J865k701l988J58J156q18P5J561N26l157j107J074j089k440R78K986
$$ plain form
1362 -2415 -3745 -6586 -4330 -1152 -3596 -7377 -5454 -2752 -5165 -7541 -3894 581 -1366 -3455 -2216
1377 -2216 -635 -2984 -4118 -1090 1894 1273 305 2455 2084 273 1615 4212 3250 976 2254 5057
1393 5057 4422 3501 6129 6728 2330 -296 3095 5971 3747 3133 5065 5212 1091 -148 3120 4459
1409 4459 767 -925 1257 1997 -15 -313 1521 -101 -2560 -3099 -1913 -2226 -2889 -683 104 -2918
1425 -2918 -4954 -3045 -2337 -4647 -4517 -1807 -1149 -4436 -4876 -1969 -893 -3505 -3782 -1577 -1443 -3101
1441 -3101 -2412 88 203 -1364 -820 683 -701 -1557 675 2510 1066 1006 1918 1511 -567 475 4432
1458 4432 4201 1003 619 2785 3002 1173 1979 4136 2645 -598 124 3343 4058 2128 1697 891 -139
1475 -139 -410 1285 2670 921 564 962 -52 -1904 -722 1162 -54 -2016 -1047 678 -624 -2197
$$ packed form
1362b415j330k841K256L178k444l781J923K702k413k376L647M475j947k089J239
1377b216J581k349j134L028K984o21r68K150l71j811J342K597r62k274J278K803
1393E057o35r21K628N99m398k626L391K876k224o14J932J47m121j239L268J339
1409D459l692j692K182P40k012k98J834j622k459n39J186l13o63K206P87l022
1425b918k036J909P08k310J30K710O58l287m40K907J076k612k77K205J34j658
1441c101O89K500J15j567N44J503j384q56K232J835j444o0R12m07k078J042L957
1458D432k31l198l84K166K17j829Q06K157j491l243P22L219P15j930m31q06j030
1475a39k71J695J385j749l57L98j014j852J182J884j216j962R69J725j302j573
$$ plain form
1491 -2197 -1062 271 -1448 -3511 -1893 -140 -1137 -1724 -491 312 -1717 -3667 -2709 -1422 -1266 -959
1507 -959 -488 -832 -1656 -1463 -788 -1390 -1783 -439 -399 -1620 -1286 1195 2291 134 -1671 -394 114 -1199
1525 -1199 -979 2131 3172 1140 -7 748 437 -260 360 2498 2079 964 1234 2268 2306 1342 1733 1358
1543 1358 29 -76 1445 2786 2247 2337 2380 894 -1026 -416 1288 1488 132 949 2251 575 -1069
1560 -1069 -697 171 -733 -2179 -1493 106 -480 -1281 -297 -283 -1998 -3058 -2898 -2558 -2575 -1019 40 -1057
1578 -1057 -2968 -2264 -1510 -2404 -2745 -1915 -777 -1679 -2213 -208 850 -482 -1990 -1403 -649 -1045 -613 1448
1596 1448 2369 1565 406 1116 927 406 1122 2184 2864 2244 3071 3113 2061 1837 2453 2604 1856 1466 2864
1615 2864 3577 2091 1614 2839 2397 -30 -253 773 1553 341 41 1031 386 -1025 -1877 -1284 -1646 -2275
$$ packed form
1491b197J135J333j719k063J618J753r97n87J233Q03k029j950R58J287J56L07
1507i59M71l44q24J93O75o02l93J344M0j221L34K481J096k157j805J277N08j313
1525a199K20L110J041k032j147P55l11o97O20K138m19j115K70J034L8r64L91l75
1543A358j329j05J521J341n39R0M3j486j920O10J704K00j356Q17J302j676j644
1560a069L72Q68r04j446O86J599n86q01R84J4j715j060J60L40j7J556J059j097
1578a057j911P04P54q94l41Q30J138r02n34K005J058j332j508N87P54l96M32K061
1596A448R21q04j159P10j89n21P16J062O80o20Q27M2j052k24O16J51p48l90J398
1615B864P13j486m77J225m42k427k23J026P80j212l00R90o45j411q52N93l62o29
$$ plain form
1633 -2275 -1587 -1318 -2134 -2432 -1624 -2297 -3491 -3815 -2842 -2235 -3826 -2697 -964 -1210 -3381 -3553 -2078 -1620
1651 -1620 -2093 -1535 108 130 -1038 -1166 -284 627 43 535 1084 944 1192 1842 2397 2066 2041 2433 2276 1335
1671 1335 2519 4022 3291 1883 2592 3491 2125 1035 1905 3142 2233 844 1362 2743 1428 -602
1687 -602 -443 -13 136 -463 -182 261 -631 -1781 -1971 -2499 -2486 -1836 -1743 -2319 -2340 -1520 -1319 -2472 -3717 -3020
1707 -3020 -1745 -2315 -2767 -1696 -283 -1483 -2385 -1635 -348 -929 -1635 -1528 2 509 752 842 1104 915
1725 915 251 183 731 1096 2411 2863 2092 1877 2089 2369 958 484 1373 2313 2115 1956 2617 2454 1384
1744 1384 312 257 1383 840 261 676 1276 981 381 -258 -682 -1259 -1198 -1530 -1310 -537 161 -322 -1098 -1600
1764 -1600 -1888 -2063 -2294 -2231 -817 -524 -786 -850 -433 -814 -2110 -2713 -1797 -684 114 -34 626 321 -252
$$ packed form
1633b275O88K69q16k98Q08o73j194l24R73O07j591J129J733k46k171j72J475M58
1651a620m73N58J643K2j168j28Q82R11n84M92N49j40K48O50N55l31k5L92j57r41
1671A335J184J503p31j408P09Q99j366j090Q70J237r09j389N18J381j315k030
1687f02J59M30J49n99K81M43q92j150j90n28J3O50R3n76k1Q20K01j153j245O97
1707c020J275n70m52J071J413j200r02P50J287n81p06J07J530N07K43R0K62j89
1725I15o64o8N48L65J315M52p71k15K12K80j411m74Q89R40j98j59O61j63j070
1744A384j072n5J126n43n79M15O00k95o00o39m24n77O1l32K20P73O98m83p76n02
1764a600k88j75k31O3J414K93k62o4M17l81j296o03R16J113P98j48O60l05n73
$$ plain form
1783 -252 -1114 -841 -170 38 263 426 584 1405 1369 1012 328 109 306 30 511 1441 2134 2224 984 775
1803 775 1128 371 -503 -251 640 1218 1307 1278 1340 333 -495 -938 -557 -27 433 474 556 568 101 -635 -1129 -838
1825 -838 -573 -396 -635 26 347 763 -229 -1122 -600 -524 -437 -854 -337 795 534 -753 -651 110 -26 -1069
1845 -1069 -1553 -564 568 378 739 712 -157 -893 -1369 -1301 -386 382 195 63 -89 -72 11 -498 -1050 -362 209
1866 209 -242 -380 634 873 -240 -1048 -540 616 53 -137 268 903 851 128 879 944 245 -92 4 592
1886 592 936 1189 1171 651 226 433 427 -168 -161 876 1368 268 26 1137 1033 -546 -1208 42 845 346
1906 346 -450 574 652 -1304 -2060 -756 -64 -863 -1000 -512 -713 -1459 -840 -433 -1753 -1726 -971 -408 -1555
1925 -1555 -866 460 423 -1613 -1631 25 -169 -1331 -943 1431 1405 -352 -82 1515 828 -1040 221 2154
$$ packed form
1783b52q62K73O71K08K25J63J58Q21l6l57o84k19J97k76M81R30O93R0j240k09
1803G75L53p57q74K52Q91N78Q9k9O2j007q28m43L81N30M60M1Q2J2m67p36m94K91
1825h38K65J77k39O61L21M16r92q93N22P6Q7m17N17J132k61j287J02P61j36j043
1845a069m84R89J132j90L61k7q69p36m76O8R15P68j87j32j52J7Q3n09n52O88N71
1866B09m51j38J014K39j113q08N08J156n63j90M05O35n2p23P51O5o99l37R6N88
1886E92L44K53j8n20m25K07on95PJ037M92j100k42J111j04j579o62J250Q03m99
1906C46p96J024P8j956p56J304O92p99j37M88k01p46O19M07j320K7P55N63j147
1925a555O89J326l7k036j8J656j94j162L88K374k6j757K70J597o87j868J261J933
$$ plain form
1943 2154 1814 468 1503 2468 1103 -149 903 1464 407 395 2086 2479 948 727 1764 605 -1427
1960 -1427 -324 1926 926 -655 295 2071 397 -2454 -1199 905 -822 -2688 -1016 966 -358
1975 -358 -2138 -425 511 -2263 -3863 -1595 -434 -1808 -1270 874 155 -2610 -2057 -186 -836 -2663
1991 -2663 -926 2078 553 -1683 316 2452 -118 -2314 -42 2207 198 -1111 2470 4208 1001
2006 1001 -613 1468 2065 -706 -567 3023 3472 447 299 2996 1472 -1341 265 2561 335 -1957
2022 -1957 591 3411 650 -1892 609 1805 -2479 -4197 216 2708 -802 -2624 652 890 -3194
2037 -3194 -4277 -120 642 -2941 -2605 867 538 -2572 -1580 1265 -789 -3929 -1377 1808 -917 -2306
2053 -2306 1334 3292 -872 -3247 592 2560 -1281 -1780 3332 3897 -948 -2029 3082 2844 -1692 -926
$$ packed form
1943B154l40j346J035R65j365j252J052N61j057j2J691L93j531k21J037j159k032
1960a427J103K250j000j581R50J776j674k851J255K104j727j866J672J982j324
1975c58j780J713R36k774j600K268J161j374N38K144p19k765N53J871o50j827
1991b663J737L004j525k236J999K136k570k196K272K249k009j309L581J738l207
2006A001j614K081N97k771J39L590M49l025j48K697j524k813J606K296k226k292
2022a957K548K820k761k542K501J196m284j718M413K492l510j822L276K38m084
2037c194j083M157P62l583L36L472l29l110R92K845k054l140K552L185k725j389
2053b306L640J958m164k375L839J968l841m99N112N65m845j081N111k38m536P66
$$ plain form
2069 -926 3422 2482 -1779 457 4444 2583 -1465 71 2470 -416 -2381 1818 4118 -86 -2534
2084 -2534 1196 2128 -2690 -2705 2743 2659 -3442 -3609 2028 1680 -3426 -2799 2086 134 -4843 -2369 2687
2101 2687 599 -3161 -812 2249 -1433 -4566 -135 3106 -985 -2846 1206 2476 -1900 -2836 2510
2116 2510 2965 -2573 -1988 3625 2503 -2573 -652 4564 2064 -3337 -891 4128 1417 -3027 705
2131 705 5019 391 -3780 359 3585 -474 -2373 1839 3047 -2072 -3227 2126 2825 -2532 -2260 2440
2147 2440 1165 -4248 -1816 4029 1329 -4358 -1794 2739 -440 -4685 -109 4372 -818 -4653 -183
2162 -183 3383 -1437 -3484 1342 3222 -2135 -3430 2177 2921 -1878 -1696 3064 1442 -3189 -786 4468
2178 4468 1944 -2907 -32 4162 118 -4161 851 4483 209 -3496 1351 4001 -1309 -3756 1597
$$ packed form
2069i26M348r40m261K236L987j861m048J536K399k886j965M199K300m204k448
2084b534L730R32m818j5N448q4o101j67N637l48n106O27M885j952m977K474N056
2101B687k088l760K349L061l682l133M431L241m091j861M052J270m376r36N346
2116B510M55n538N85N613j122n076J921N216k500n401K446N019k711m444L732
2131G05M314m628m171M139L226m059j899M212J208n119j155N353O99n357K72M700
2147B440j275n413K432N845k700n687K564M533l179m245M576M481n190l835M470
2162a83L566m820k047M826J880n357j295N607P44m799J82M760j622m631K403N254
2178D468k524m851K875M194m044m279N012L632m274l705M847K650n310k447N353
$$ plain form
2193 1597 3384 -2505 -3198 2172 2629 -2761 -2510 2653 1977 -3608 -2498 2140 440 -3393 -216 3192
2209 3192 -632 -4338 -647 2820 -1029 -3637 1364 3775 -2356 -3583 1804 3513 -1879 -3296 1573
2224 1573 2501 -2464 -1426 3803 3072 -2280 -1461 3011 1318 -2265 560 3991 764 -2583 587 3760
2240 3760 -71 -2627 1432 3020 -1685 -2558 2190 3360 -1963 -2629 1942 1621 -3393 -2738 2416 1514
2256 1514 -3310 -1747 2651 532 -4160 -1955 2034 -492 -3395 -513 2204 -931 -3152 471 1958
2271 1958 -1590 -3084 1098 1658 -1745 -1817 2958 2238 -2559 -1825 2665 1591 -2062 -18 3875 1614
2287 1614 -2126 92 4001 1324 -1949 91 3074 400 -1592 1421 3369 -119 -2072 1023 1429
2302 1429 -1242 -1390 2030 1604 -1977 -1106 2007 385 -2617 -938 1744 -485 -3445 -726 2224 -339
$$ packed form
2193A597J787n889o93N370M57n390K51N163o76n585J110M638j700l833L177L408
2209C192l824l706L691L467l849k608N001K411o131j227N387J709n392j417M869
2224A573R28m965J038N229p31n352Q19M472j693l583K825L431l227l347L170L173
2240C760l831k556M059J588m705q73M748J170n323o66M571l21n014O55N154r02
2256A514m824J563M398k119m692K205L989k526k903K882K717l135k221L623J487
2271A958l548j494M182N60l403p2M775p20m797P34M490j074l653K044L893k261
2287A614l740K218L909k677l273K040K983k674j992L013J948l488j953L095M06
2302A429k671j48L420m26l581Q71L113j622l002J679K682k229k960K719K950k563
$$ plain form
2318 -339 -3075 -730 1447 -1598 -3215 -539 1554 -1210 -2270 435 1425 -1416 -2052 587 578 -1658
2334 -1658 -979 1752 890 -1215 169 2278 524 -1559 196 2151 475 -887 1409 3002 516
2349 516 -1375 1154 2545 -193 -636 1699 2035 -523 -749 1413 1821 -736 -772 671 356 -1459 -374
2366 -374 841 -20 -1210 -482 382 -1323 -2137 -481 807 -1091 -1563 22 577 -1176 -1830 135 460
2383 460 -1324 -1374 437 701 -1077 -934 762 440 -860 -449 986 304 -541 557 990 649 -183 763
2401 763 1268 140 -378 844 1215 62 152 1361 1433 -306 -197 966 916 -914 -46 1002 646 -1026
2419 -1026 -1077 575 319 -1062 -885 -200 -328 -1215 -554 -179 -509 -738 -296 -264 -1074 -931 -329 -292 -1155 -549
2439 -549 193 184 -884 -735 461 -78 -735 -429 1004 645 -344 345 696 541 -78 128 798 934 412 1116
$$ packed form
2318c39k736K345K177l045j617K676K093k764j060K705R90k841o36K639rk236
2334a658O79K731q62k105J384K109j754k083J755J955j676j362K296J593k486
2349E16j891K529J391k738m43K335L36k558k26K162M08k557l6J443l15j815J085
2366c74J215q61j190P28Q64j705q14J656J288j898m72J585N55j753o54J965L25
2383D60j784n0J811K64j778J43J696l22j300M11J435o82q45J098M33l41q32R46
2401G63N05j128n18J222L71j153R0J209P2j739J09J163n0j830Q68J048l56j672
2419a026n1J652k56j381J77O85j28q87O61L75l30k29M42L2q10J43O02L7q63O06
2439e49P42rj068J49J196n39o57L06J433l59r89O89L51j55o19K06O70J36n22P04
$$ plain form
2459 1116 992 1073 838 372 823 809 828 845 286 219 540 627 280 -824 -132 123 -172 -1243 -183 543 -9
2480 -9 -771 -920 -141 -328 -1062 -1053 -414 -492 -1115 -1327 -595 -597 -920 -883 -978 -803 -678 -210 -388 -159 -133 -74 -138 -144 375
2505 375 206 333 -174 505 1156 448 323 712 1042 637 236 958 1365 1244 792 816 1166 917 778 552
2525 552 539 459 547 232 499 492 541 98 -548 -598 239 84 -753 -656 -318 -296 -634 -946 -484 -374 -1323 -1480 -704
2548 -704 -717 -1193 -995 -684 -408 -828 -772 -634 -746 -793 -704 -165 -308 -95 407 78 -778 -557 533 678 28
2569 28 0 1304 928 104 314 1286 1260 -130 -184 1228 1094 487 858 1331 785 286 405 754 218 -82
2589 -82 452 992 285 242 957 137 -921 -825 427 175 -1025 -521 552 -82 -1105 -750 459 -490 -1765
2608 -1765 -930 318 -160 -1175 -318 705 -372 -1618 -568 89 -810 -775 140 626 -471 -250 705 309
$$ packed form
2459A116j24Q1k35m66M51j4J9J7n59o7L21Q7l47j104O92K55k95j071J060P26n52
2480ip62j49P79j87p34RO39p8o23k12P32kl23L7r5J75J25M68j78K29K6N9o4oN19
2505C75j69J27n07O79O51p08j25L89L30m05m01P22M07j21m52K4L50k49j39k26
2525E52j3q0Q8l15K67pM9m43o46n0Q37j55q37R7L38K2l38l12M62J10r49j57P76
2548g04j3m76J98L11K76m20N6J38j12m7Q9N39j43K13N02l29q56K21J090J45o50
2569B8k8J304l76q24K10R72k6j390n4J412j34o07L71M73n46m99J19L49n36l00
2589h2N34N40p07m3P15q20j058R6J252k52j200N04J073o34j023L55J209r49j275
2608a765Q35J248m78j015Q57J023j077j246J050O57q99L5R15M86j097K21R55l96
$$ plain form
2626 309 -1208 -712 865 292 -515 194 1833 410 -1239 -36 1444 204 -1171 207 1699 369
2642 369 -672 1012 1627 -403 -1314 286 1286 -424 -562 1203 1001 -1301 -719 1190 182 -1409
2658 -1409 -652 1142 172 -1615 397 1918 -307 -2021 55 1310 -550 -1266 1444 1874 -563 -1351
2674 -1351 1048 1483 -1098 -1244 1163 1527 -821 -517 1675 541 -1784 -674 1429 278 -1634 112
2690 112 1879 -443 -1718 356 1698 -1369 -2421 548 1298 -1473 -1922 989 1327 -1929 -1964 988
2706 988 769 -2448 -1763 1308 823 -2034 -880 1936 68 -2353 -211 1912 144 -1748 771 1985
2722 1985 -1200 -1999 1316 2087 -935 -1293 2137 2548 -1516 -836 2793 2399 -1070 -383 2553 1545 -1303
2739 -1303 287 3168 1110 -2081 349 2728 142 -1808 984 2427 -769 -2155 767 1725 -1156
$$ packed form
2626C09j517M96J577n73q07P09J639j423j649J203J480j240j375J378J492j330
2642C69j041J684O15k030r11J600J000j710j38J765k02k302N82J909j008j591
2658a409P57J794r70j787K012J521k225j714K076J255j860p16K710M30k437p88
2674a351K399M35k581j46K407L64k348L04K192j134k325J110K103j151j912J746
2690A12J767k322j275K074J342l067j052K969P50k771m49K911L38l256l5K952
2706I88k19l217O85L071m85k857J154K816j868k421K142K123j768j892K519J214
2722A985l185p99L315P71l022l58L430M11m064O80L629l94l469O87K936j008k848
2739a303J590K881k058l191K430K379k586j950K792J443l196j386K922R58k881
$$ plain form
2754 -1156 -2190 1322 1051 -2722 -2125 1465 305 -2981 -1875 1465 -206 -3921 -1865 2028 -568
2769 -568 -3754 -1335 1574 -1305 -3105 14 2171 -1134 -3135 493 1122 -1571 -1768 2283 2376 -1602
2785 -1602 -1327 2799 1895 -1511 326 3501 1571 -2061 404 4084 1778 -1501 1504 3983 363
2800 363 -2272 1578 4399 255 -1694 2021 3226 -727 -1710 2092 2143 -2027 -1791 1784 959 -2386
2816 -2386 -904 2429 -247 -4098 -1306 1768 -1158 -3745 -234 2126 -1808 -4455 -370 1346 -2317
2831 -2317 -3568 296 1535 -2709 -3211 1415 1848 -2446 -2119 1574 809 -2949 -982 3129 1781 -1917
2847 -1917 -150 2943 107 -2171 1291 3455 249 -1657 2127 3567 -283 -1292 2823 3584 -1202
2862 -1202 -1710 3103 3209 -1377 -720 2834 1688 -2550 -1134 2651 1031 -2084 -584 2394 -226 -3050
$$ packed form
2754a156j034L512k71l773N97L590j160l286J106L340j671l715K056L893k596
2769e68l186K419K909k879j800L119K157l305k001L628O29k693j97M051R3l978
2785a602K75M126r04l406J837L175j930l632K465L680k306l279L005K479l620
2800C63k635L850K821m144j949L715J205l953r83L802N1m170K36L575q25l345
2816b386J482L333k676l851K792L074k926k587L511K360l934k647M085J716l663
2831b317j251L864J239m244n02M626M33m294L27L693p65l758J967M111j348l698
2847a917J767L093k836k278L462K164l206j906L784J440l850j009M115P61m786
2862a202n08M813J06m586O57L554j146m238J416L785j620l115J500K978k620k824
$$ plain form
2878 -3050 -147 2033 -1440 -3549 366 1319 -1703 -2769 1471 1634 -2940 -3251 979 399 -3372 -1937
2894 -1937 2388 964 -3261 -1854 1945 124 -2694 -394 2558 97 -2689 297 2613 -75 -1774
2909 -1774 1196 2210 -1271 -1581 2381 2761 -679 -957 2381 1768 -2293 -798 3305 1475 -2036 -340
2925 -340 3078 1003 -2096 -205 2142 -235 -2424 506 2647 -254 -2206 781 1787 -1718 -2497
2940 -2497 951 1259 -1772 -1542 1630 975 -2367 -1257 1694 362 -2546 -733 1761 65 -2708 -174
2956 -174 2527 26 -2552 -10 1841 -1117 -2030 867 2509 -250 -1639 690 1357 -1036 -867 1719
2972 1719 1098 -1453 -798 1819 798 -1397 29 1953 -103 -2079 208 2258 63 -2036 601
2987 601 1397 -809 -2047 818 1790 -1074 -1848 764 1277 -1104 -1309 1202 867 -1454 -1231 1111 724
$$ packed form
2878c050K903K180l473k109L915R53l022j066M240J63m574l11M230n80l771J435
2894a937M325j424m225J407L799j821k818K300K952k461k786K986K316k688j699
2909a774K970J014l481l10L962L80l440k78L338o13m061J495M103j830l511J696
2925c40L418k075l099J891K347k377k189K930K141k901j952K987J006l505p79
2940b497L448L08l031K30L172o55l342J110K951j332k908J813K494j696k773K534
2956a74K701k501k578K542J851k958r13K897J642k759j389K329O67k393J69K586
2972A719o21k551O55K617j021k195J426J924k056j976K287K050k195k099K637
2987F01P96k206j238K865R72k864p74K612N13k381k05K511l35k321K23K342l87
$$ plain form
3004 724 -1274 -298 1487 -28 -1260 90 1426 -236 -1101 699 1617 -437 -1059 840 1453 -511
3020 -511 -830 1454 1035 -961 -1022 1104 1355 -955 -503 1425 504 -1288 -570 1251 239 -913 -325
3037 -325 738 -334 -1216 469 756 -988 -1443 241 619 -867 -1022 583 540 -1213 -1167 367 615 -1509
3055 -1509 -674 702 342 -1024 -218 1213 251 -1239 -191 878 103 -651 380 1228 -17 -547 731
3072 731 1138 -75 -357 856 1199 -231 314 1241 559 -536 85 1301 423 -825 79 827 687 -648
3090 -648 -90 806 -132 -1093 -491 342 -253 -575 30 109 -720 -744 -453 -278 -669 -952 22 -261 -880 -266 327
3111 327 -419 -982 -340 53 -466 -874 -61 919 -18 -345 186 895 -30 -403 30 498 639 163 846 751
3131 751 594 213 381 825 433 445 839 356 115 655 789 -198 -31 440 441 -196 -367 328 649 -348 -957
$$ packed form
3004G24j998R76J785j515j232J350J336j662q65J800R18k054o22J899O13j964
3020e11l19K284m19j996o1K126K51k310M52J928r21j792P18J821j012j152N88
3037c25J063j072q82J685K87j744m55J684L78j486j55J605m3j753M6J534K48k124
3055a509Q35J376l60j366Q06J431r62j490J048J069p75p54J031Q48j245n30J278
3072G31M07j213k82J213L43j430N45R27o82j095O21J216q78j248R04P48j40j335
3090f48N58Q96r38r61O02Q33n95l22O05P9q29k4K91J75l91k83R74k83o19O14N93
3111C27p46n63O42L93n19m08Q13R80r37l27N31P09r25l73M33M68J41m76O83r5
3131G51j57l81J68M44l92J2L94m83k41N40J34r87J67M71Jo37j71O95L21r97o09
$$ plain form
3152 -957 -170 -277 -427 -1158 -576 105 -439 -903 -427 -170 -751 -672 -789 -249 -438 -106 -76 -196 -92 223 74
3173 74 -150 -277 162 -107 -84 45 721 658 -160 -181 566 663 564 249 633 811 426 384 669 211 556 164
3195 164 172 404 625 872 514 245 547 394 -322 -64 -341 386 44 -311 -296 -83 -316 -1076 -983 -353 -294 -650
3217 -650 -888 -126 -330 -532 -689 -468 -449 -408 -682 -703 -198 -334 -201 -458 -220 -154 118 -31 -104 227 293 123
3239 123 218 299 800 482 -100 291 1011 742 311 538 777 781 343 678 741 687 262 677 711 37 414 403 277
3262 277 109 -207 43 -220 -453 -128 366 -313 -611 -583 310 -420 -1121 -398 86 -491 -1234 -474 -210 -329
3282 -329 -1353 -589 -173 -553 -1056 -429 -98 -545 -261 -1 190 -144 -35 49 113 7 382 805 251 83
3302 83 428 1187 405 -5 806 1382 146 259 694 1148 170 -22 659 1009 69 -128 685 650 -372 -46
$$ packed form
3152i57P87j07j50p31N82O81n44m64M76K57n81P9j17N40j89L32L0j20J04L15j49
3173G4k24j27M39k69K3J29O76o3q18k1P47R7r9l15L84J78l85m2K85m58L45l92
3195A64QK32K21K47l58k69L02j53p16K58k77P27l42l55J5K13k33p60R3O30N9l56
3217f50k38P62k04k02j57K21J9M1k74k1N05j36J33k57K38O6K72j49p3L31O6j70
3239A23R5Q1N01l18n82L91P20k69m31K27K39Mm38L35O3n4m25M15L4o74L77j1j26
3262B77j68l16K50k63k33L25M94o79k98K8Q93p30p01P23M84n77p43P60K64j19
3282c29j024P64M16l80n03O27L31m47K84K60J91l34J09Q4O4j06L75M23n54j68
3302H3L45P59p82m10Q11N76j236J13M35M54r78j92O81L50r40j97Q13l5j022L26
$$ plain form
3322 -46 748 532 -723 -286 568 -324 -407 -289 121 -272 -592 231 -19 -1220 -1036 60 118 -1125 -1346 4
3342 4 249 -1126 -932 346 188 -1040 -408 436 63 -676 -125 494 158 -825 -120 820 21 -498 284 984
3362 984 130 -163 437 526 -359 -496 1257 482 -775 -306 1344 853 -482 -50 1035 345 -1243 -173
3380 -173 1436 413 -1043 -252 779 -4 -774 51 691 -486 -1050 405 837 -689 -397 582 660 -1097
3398 -1097 -756 1037 491 -1126 -278 1316 437 -789 -73 1169 -403 -1302 130 1309 0 -874 425
3415 425 1121 -658 -1257 721 1106 -110 -1000 913 511 -800 -510 796 -195 -1489 -303 1335 -19
3432 -19 -1527 169 933 -580 -1806 -115 910 -686 -1497 -58 1251 -584 -1486 493 785 -1363
3448 -1363 -1120 719 812 -854 -329 1410 528 -1299 -377 1460 103 -1152 184 1928 455 -682
$$ packed form
3322d6P94k16j255M37Q54q92q3J18M10l93l20Q23k50j201J84J096N8j243k21J350
3342DK45j375J94J278j58j228O32Q44l73p39N51O19l36r83P05R40p99n19P82P00
3362I84q54k93O00Q9q85j37J753p75j257M69J650m91j335M32J085o90j588J070
3380a73J609j023j456P91J031p83p70Q25O40j177n64J455M32j526K92R79P8j757
3398a097L41J793n46j617Q48J594q79j226P16J242j572q99J432J179j309q74J299
3415D25O96j779n99J978L85j216q90J913m02j311K90J306r91j294J186J638j354
3432a9j508J696P64j513j226J691J025j596q11J439J309j835r02J979K92k148
3448a363K43J839R3j666N25J739q82j827R22J837j357j255J336J744j473j137
$$ plain form
3464 -682 1114 1785 -381 -932 1148 1959 248 -766 1168 1329 -461 -804 1192 995 -1036 -943 1253
3481 1253 797 -1450 -315 1121 -322 -1719 -557 912 -559 -1991 108 870 -1006 -1834 35 798
3497 798 -1940 -1988 336 760 -1363 -1744 566 320 -1690 -1363 1105 564 -1416 -474 1416 462 -1198
3514 -1198 57 1682 384 -1081 829 2076 424 -302 1639 1964 -160 -322 1512 1613 -797 -583
3530 -583 2008 1525 -773 -112 1905 1044 -1269 -418 1954 1045 -1065 56 1238 -150 -1409 108
3546 108 1029 -829 -1704 -132 562 -1286 -1682 246 311 -2279 -1863 595 132 -2114 -1259 809 -75 -2064
3564 -2064 -816 1302 -173 -2028 -728 1352 -199 -1353 -70 1698 -209 -1265 667 1703 -101
3579 -101 -981 1240 1555 -414 -403 1570 1333 -755 342 2061 1095 -766 474 2256 629 -749 432
$$ packed form
3464f82J796O71k166n51K080Q11j711j014J934J61j790l43J996j97k031R3K196
3481A253m56k247J135J436j443j397J162J469j471j432K099P62j876q28J869P63
3497G98k738m8K324M24k123l81K310k46k010L27K468n41j980R42J890r54j660
3514a198J255J625j298j465J910J247j652p26J941L25k124j62J834J01k410K14
3530e83K591m83k298O61K017q61k313Q51K372r09k110J121J182j388j259J517
3546A08R21j858q75J572O94j848l96J928O5k590M16K458m63k246Q55K068q84j989
3564b064J248K118j475j855J300K080j551j154J283J768j907j056J932J036j804
3579a01q80K221L15j969J1J973k37k088J097J719r66j861J240J782j627j378J181
$$ plain form
3596 432 1910 180 -1152 494 1702 -2 -1238 311 1250 -815 -1185 663 1002 -1142 -1278 492
3612 492 83 -1403 -1125 462 75 -1643 -539 746 -392 -2207 -312 603 -558 -1582 10 1119
3628 1119 -865 -1557 56 1264 -739 -1353 819 1196 -324 -890 571 849 -552 -229 1040 968 -582
3645 -582 362 1213 630 -309 201 1432 281 -549 404 939 29 -808 775 1290 -514 -748 631 609 -672
3664 -672 -806 1278 496 -1015 -640 585 358 -1349 -631 547 -122 -1106 -138 601 -198 -1162 -353 290
3682 290 -396 -671 477 582 -625 -823 428 536 -852 -721 717 275 -505 -518 1262 737 -806 -293
3700 -293 1102 442 -1074 -41 595 25 -609 111 538 -172 -667 89 154 -52 -635 384 302 -400 -515
3719 -515 744 65 -811 -341 595 50 -629 -66 598 103 -926 -384 570 105 -659 -3 456 -131 -444
$$ packed form
3596D32J478j730j332J646J208j704j236J549R39k065l70J848L39k144j36J770
3612D92m09j486K78J587l87j718J104J285j138j815J895R15j161j024J592J109
3628A119j984o92J613J208k003o14K172L77j520n66J461K78j401L23J269p2j550
3645e82R44Q51n83r39N10J231j151q30R53N35r10q37J583N15j804k34J379k2j281
3664f72j34K084p82j511L75J225k27j707P18J178o69r84R68P39p99r64Q09O43
3682B90o86k75J148J05j207j98J251J08j388J31J438m42p80j3J780n25j543N13
3700b93J395o60j516J033O36n70o34P20M27p10m95P56O5k06n83J019q2p02j15
3719e15J259o79q76M70R36n45o79N63O64m95j029N42R54m65p64O56M59n87l13
$$ plain form
3738 -444 282 450 -39 -403 560 509 -229 253 847 185 -201 -225 318 362 -538 292 826 385 122 80 728
3759 728 -221 -536 74 492 -331 -224 84 389 -281 -641 -118 -75 -203 -868 -213 -233 -540 -193 -84 -219 -357
3780 -357 -492 -130 -301 -645 -9 78 -564 -578 -71 419 -249 -411 -28 376 -162 -330 255 421 105 159 522
3801 522 482 294 419 566 497 10 285 310 364 123 381 664 26 356 453 319 74 50 556 599 -216 -109
3823 -109 79 41 2 -593 -10 -90 -148 -634 -462 -200 -512 -530 -463 -325 -377 -709 -418 -204 -480 -443 -344 -505 92
3846 92 -205 13 -179 -290 -140 -21 -320 -230 407 122 -171 -11 472 626 405 21 490 249 492 314 669
3867 669 427 327 446 36 255 395 243 281 82 -17 212 22 -18 -57 214 2 -217 -16 138 -556 -282
3888 -282 -556 -88 50 -333 -250 -272 -488 -649 -404 -255 -286 -228 -528 -264 -197 -199 -431 -485 -100 -186 -39 -172 15
$$ packed form
3738d44P26J68m89l64R63n1p38M82N94o62l86k4N43M4r00Q30N34m41k63m2O48
3759G28r49l15O10M18q23J07L08L05o70l60N23M3j28o65O55k0l07L47J09j35j38
3780c57j35L62j71l44O36Q7o42j4N07M90o68j62L83M04n38j68N85J66l16N4L63
3801E22m0j88J25J47o9m87K75K5N4k41K58K83o38L30R7j34k45k4N06M3q15J07
3823a09J88l8l9n95N83q0n8m86J72K62l12j8O7J38n2l32K91K14k76L7R9j61N97
3846I2k97K18j92j11J50J19k99R0O37k85k93J60M83J54k21l84M69k41K43j78L55
3867F69k42j00J19m10K19J40j52L8j99r9K29j90m0l9K71k12k19K01J54o94K74
3888b82k74M68J38l83Q3k2k16j61K45J49l1N8l00K64O7kk32n4L85q6J47j33J87
$$ plain form
3911 15 92 -11 -153 76 -381 422 -8 154 277 432 12 244 177 371 220 39 430 545 698 234 120
3932 120 343 -19 327 78 110 -120 -179 -188 -211 -43 85 138 -248 -189 -518 -87 -392 -455 -84 -157 -366 -147 -302
3955 -302 -350 -415 -440 -341 -403 292 -63 -153 -127 -514 100 85 173 317 293 94 18 -26 176 316 252 338 538 317 504
3980 504 94 233 335 112 -236 101 125 -74 336 51 122 131 45 98 146 -248 -61 272 -102 -108 -40 23 -161 -459
4004 -459 -310 -380 -458 -420 -218 -64 -433 -566 -161 -56 -577 -529 -168 -162 72 -115 174 100 -635 141 208 340 211
4027 211 81 345 140 389 105 540 367 346 413 348 279 238 629 465 84 -100 733 -31 -324 161 252 128
4049 128 -189 52 60 -106 -380 -63 100 -76 -477 -237 76 -337 -687 -96 -208 -604 -323 -104 -356 -565 -397
4070 -397 -29 38 -531 -83 31 -43 -306 -31 373 259 -174 585 506 -98 -243 286 353 235 122 98 717 283
$$ packed form
3911A5P7j03j42K29m57Q03m30J62J23J55m20K32o7J94j51j81L91J15J53m64j14
3932A20K23l62L46k49L2k30n9rk3J68J28N3l86N9l29M31l05o3L71p3k09K19j55
3955c02m8o5k5R9o2O95l55r0K6l87O14j5Q8J44k4j99p6m4K02J40o4Q6K00k21J87
3980E04m10J39J02k23l48L37K4j99M10k85P1Rq6N3M8l94J87L33l74oO8O3j84k98
4004d59J49p0p8L8K02J54l69j33M05J05n21M8L61OK34j87K89p4p35P76O7J32j29
4027B11j30K64k05K49k84M35j73k1O7o5o9m1L91j64l81j84Q33p64k93M85R1j24
4049A28l17K41Qj66k74L17J63j76m01K40L13m13l50N91j12l96K81K19k52k09J68
4070c97L68O7n69M48J14p4k63K75M04j14m33P59p9o04j45N29O7j18j13k4O19m34
$$ plain form
4092 283 155 177 444 10 296 321 377 -276 238 335 -110 -291 127 226 -227 -400 238 233 -279 -349 -465 173 -135
4115 -135 -431 -263 239 -528 -431 170 71 -433 -520 -241 122 -640 -110 31 -84 -384 -121 299 -133 -454 -3
4136 -3 382 40 -64 514 267 -135 -204 143 405 -202 -266 418 348 -43 12 425 244 137 127 280 293 -199 -32
4159 -32 256 315 75 35 72 -345 -273 310 27 -427 -229 129 -15 -528 -292 -58 116 -813 -559 -149 256 -266
4181 -266 -525 373 -195 -526 -299 34 261 -294 -145 39 220 70 346 188 275 56 249 284 148 183 475
4202 475 398 -99 -151 1093 560 -265 -204 545 380 -369 -226 420 190 -596 -229 -4 51 -100 69 87 -276
4223 -276 -535 -129 -49 -112 -703 -217 -357 -561 -120 2 -313 -354 -303 323 -58 -400 -199 277 9 -747 187
4244 187 614 133 -478 52 709 87 -146 -156 427 60 -78 421 690 130 332 592 384 -16 153 531
$$ packed form
4092B83j28K2K67m34K86K5N6o53N14R7m45j81M18R9m53j73O38nn12p0j16O38l08
4115a35k96J68N02p67R7O01r9n04q7K79L63p62N30J41j15l00K63M20m32l21M51
4136cL85l42j04N78k47m02o9L47K62o07o4O84p0l91N5M13j81j07j0J53J3m92J67
4159c2K88N9k40m0L7m17P2N83k83m54J98L58j44n13K36K34J74r29K54M10M05n22
4181b66k59Q98n68l31K27L33K27n55J49J84J81j50K76j58Q7k19J93L5j36L5K92
4202D75p7m97n2J244n33q25O1P49j65p49J43O46k30p86L67K25N5j51J69J8l63
4223b76k59M06Q0o3n91M86j40k04M41J22l15m1N1O26l81l42K01M76k68p56R34
4244A87M27m81o11N30O57o22k33j0N83l67j38M99K69n60K02K60k08m00J69L78
$$ plain form
4264 531 232 26 460 468 338 -47 32 358 141 -304 104 504 13 -480 -277 155 37 -337 90 331 -281
4285 -281 -670 -190 -185 -443 -328 -99 -257 -299 -341 184 -113 -331 -82 -315 -135 -460 -55 404 -33 -178 166
4306 166 389 -172 -172 64 123 87 -50 242 600 240 -138 154 288 96 536 410 92 73 359 185 210 -29
4328 -29 -192 -19 99 -30 341 284 -193 -171 89 -143 -222 -313 117 166 -254 -93 75 -15 -105 -353 -206 -109 -242
4351 -242 -42 -80 -171 14 -388 -399 -47 -56 50 -29 -146 317 240 329 -72 -179 78 169 114 -30 116 98 115 81
4375 81 274 -27 -71 -212 374 -94 -239 107 175 181 115 -46 -56 -126 -54 105 6 -76 -130 -196 -374 -233 -296 -166 -164
4400 -164 -683 51 -26 73 -403 -228 -199 17 -41 -103 156 51 -29 -61 353 46 105 140 95 18 344 140 505 327
4424 327 267 69 111 169 292 244 432 38 -116 227 358 -300 48 133 -170 -110 36 180 11 -354 -262 -416
$$ packed form
4264E31k99k06M34Qj30l85P9L26k17m45M08M00m91m93K03M32j18l74M27K41o12
4285b81l89M80Nk58J15K29j58m2m2N25k97k18K49k33J80l25M05M59m37j45L44
4306A66K23n61%K36N9l6j37K92L58l60l78K92J34j92M40j26l18j9K86j74K5k39
4328b9j63J73J18j29L71n7m77K2K60k32p9r1M30M9m20J61J68r0r0k48J47R7j33
4351b42K00l8r1J85m02j1L52rJ06p9j17M63p7Q9m01j07K57R1n5j44J46j8J7l4
4375H1J93l01m4j41N86m68j45L46O8Oo6j61j0p0P2J59r9q2n4o6j78J41o3J30K
4400a64n19P34p7R9m76J75K9K16n8o2K59j05q0l2M14l07N9L5m5p7L26k04L65j78
4424C27o0j98M2N8J23m8J88l94j54L43J31o58L48Q5l03O0J46J44j69l65R2j54
$$ plain form
4446 -416 -137 -67 -275 -257 -359 -449 -180 -347 -283 -546 -270 -94 -302 -154 -234 -158 -531 -91 47 -23 -78 0 429
4469 429 -13 -140 213 88 150 -90 37 207 287 357 362 400 486 360 108 330 503 381 273 278 364 634 118
4492 118 6 27 445 352 -46 -24 128 4 -304 -475 -218 40 -44 -388 -359 -368 -98 -464 -468 -546 -344 -226 -226 -174
4516 -174 -315 -349 -94 -31 -514 75 -246 -89 -118 -76 -78 -34 122 -59 136 -51 -187 88 271 -83 347 247
4538 247 476 586 249 60 595 449 73 153 277 658 583 -99 45 366 272 238 16 109 90 17 14 -130 98
4561 98 -266 -275 -405 21 123 -82 -55 -188 -81 -417 -391 -719 -21 -147 -379 -55 0 -66 -275 -49 -658 -52
4583 -52 -8 -298 111 138 175 -124 67 213 -67 6 -142 -118 582 301 100 -1 257 88 44 2 92 109 454
4606 454 103 131 237 -6 311 25 27 -28 39 141 449 -340 -383 -55 -208 -200 190 -230 142 -134 -188 -169 334
$$ packed form
4446d16K79P0k08J8j02r0K69j67O4k63K76J76k08J48q0P6l73M40J38p0n5P8M29
4469D29m42j27L53j25O2k40J27J70Q0P0NL8Q6j26k52K22J73j22j08NQ6K70n16
4492A18j12K1M18r3l98K2J52j24l08j71K57K58q4l44K9rK70l66mp8K02J18%N2
4516a74j41l4K55O3m83N89l21J57k9M2kM4J56j81J95j87j36K75J83l54M30j00
4538B47K29J10l37j89N35j46l76Q0J24L81p5o82J44L21r4l4k22R3j9p3lj44K28
4561I8l64rj30M26J02k05K7j33J07l36K6l28O98j26k32L24N5o6k09K26o09O06
4583e2M4k90M09K7L7k99J91J46k80P3j48K4P00k81k01j01K58j69m4m2R0J7L45
4606D54l51K8J06k43L17k86Kn5O7J02L08p89m3L28j53QL90m20L72k76n4J9N03
$$ plain form
4629 334 -139 -48 -260 -210 -420 270 -77 -312 -250 11 -227 199 -79 251 149 220 -314 -201 275 108 167 -222
4651 -222 -116 245 0 426 108 -53 20 143 -32 143 94 56 -290 -226 141 1 21 7 14 -58 -167 -74 -4 54
4675 54 -157 139 10 -73 -189 32 -338 -75 -169 1 339 -130 -293 -160 -145 -363 110 193 60 -216 8 190
4697 190 151 -286 1 155 190 -120 216 325 133 -41 121 321 151 45 349 165 156 -100 -254 263 -13
4718 -13 45 -106 36 89 218 365 -238 -339 290 8 -224 -306 175 172 13 -326 -212 -214 -266 -357 -139 -21 -271
4741 -271 -193 32 39 -68 -482 -96 -13 -176 143 69 66 161 259 408 -96 35 160 550 341 336 465 359 25 92
4765 92 461 409 178 -45 415 202 -183 259 59 77 -110 87 -169 -13 102 -19 32 -104 -327 -280 -254 -166
4787 -166 -141 -6 -156 -524 -269 80 7 -516 -678 -282 11 -513 -378 -119 -166 -329 -483 -362 -1 -229 -55
$$ packed form
4629C34m73R1k12N0k10O90l47k35O2K61k38M26k78L30j02P1n34J13M76j67N9l89
4651b22J06L61k45M26l18j61P3J23j75J75m9l8l46O4L67j40K0j4Pp2j09R3P0N8
4675E4k11K96j29q3j16K21l70K63r4J70L38m69j63J33J5k18M73Q3j33k76K24J82
4697A90l9m37K87J54L5l10L36J09j92j74J62K00j70j06L04j84rk56j54N17k76
4718a3N8j51J42N3J29J47o03j01O29k82k32q2M81lj59l39J14kn2r1K18J18k50
4741b71P8K25Pj07m14L86Q3j63L19p4lR5R8J49n04J31J25L90k09nJ29j06l34O7
4765I2L69n2k31k23M60k13l85M42k00J8j87J97k56J56J15j21N1j36k23M7K6Q8
4787a66K5J35j50l68K55L49p3n23j62L96K93n24J35K59m7j63j54J21L61k28J74
$$ plain form
4808 -55 -45 209 59 -177 171 40 155 86 273 346 310 533 590 -7 111 270 414 60 142 344 36 379
4830 379 178 501 274 0 -262 443 40 11 -252 98 5 16 -166 -225 -83 -437 -126 -194 -356 -271 -32 -61
4852 -61 -627 -121 -68 -387 -737 -264 251 -281 -260 141 425 -21 -362 -28 -108 109 -474 12 298 135 -159
4873 -159 260 244 139 251 307 198 220 88 458 355 60 99 491 4 -210 520 294 99 -299 -92 256
4894 256 123 -83 -49 229 2 -101 180 83 -258 -495 -61 80 -604 -200 138 -46 -512 -297 98 -197 -255
4915 -255 -146 70 -239 -183 41 208 -305 -232 0 209 -124 -334 437 179 30 -115 679 288 -132 -15 42
4936 42 309 72 -106 425 148 237 511 55 161 -389 209 241 -124 -149 259 222 75 -178 157 331 -343 -252
4958 -252 180 -212 -420 -100 91 167 -348 -266 -1 -138 -549 -279 216 -281 -611 33 299 -82 -52 167 147
$$ packed form
4808e5J0K54j50k36L48j31J15o9J87P3l6K23N7n97J18J59J44l54Q2K02l08L43
4830C79k01L23k27k74k62P05m03k9k63L50r3J1j82n9J42l54L11o8j62Q5K39k9
4852f1n66N06N3l19l50M73N15n32K1M01K84m46l41L34q0K17n83M86K86j63k94
4873a59M19j6j05J12N6j09K2j32L70j03k95L9L92m87k14P30k26j95l98K07L48
4894B56j33k06L4K78k27j03K81r7l41k37M34J41o84M04L38j84m66K15L95k95n8
4915b55J09K16l09N6K24J67n13P3K32K09l33k10P71k58j49j45P94l91m20J17N7
4936D2K67k37j78N31k77Q9K74m56J06n50N98L2l65k5M08l7j47k53L35J74o74R1
4958b52M32l92k08L20J91P6n15Q2K65j37m11K70M95m97l30O44K66l81L0K19k0
$$ plain form
4979 147 -103 -15 160 252 -56 -163 511 321 -56 -5 464 118 -126 62 293 272 8 11 144 184 55 209
5001 209 267 -137 -114 122 425 -97 148 124 -27 -213 -15 208 168 -393 -90 -129 -15 -119 -586 224 -263 -594
5023 -594 -157 392 -219 -294 -466 131 177 -250 -8 -149 112 -139 98 166 79 -80 245 300 -79 272 226 577
$$ packed form
4979A47k50Q8J75R2l08j07O74j90l77N1M69l46k44J88K31k1k64LJ33M0j29J54
5001B09N8m04K3K36L03n22K45k4j51j86J98K23m0n61L03l9J14j04m67Q10m87l31
5023e94M37N49o11p5j72N97M6m27K42j41K61k51K37O8q7j59L25N5l79L51m6L51
$$ [...]
8191b
##END NTUPLES=NMR FID
##END=
