##TITLE=1H_LR-677-C1
 CDCl3, 8 sc, 
 1.7.2019
##JCAMPDX= 6.0         $$ Bruker NMR JCAMP-DX V2.0
##DATA TYPE= NMR FID
##DATA CLASS= NTUPLES
##ORIGIN= UXNMR, Bruker Analytische Messtechnik GmbH
##OWNER= root
$$ XWIN-NMR		Version 3.5
$$ Mon Jul  1 14:51:44 2019 Russian Standard Time (UT+4h)  she@DPX200
##.OBSERVE FREQUENCY= 200.13155
##.OBSERVE NUCLEUS= ^1H
##.DELAY= (6, 6)
##.ACQUISITION MODE= SIMULTANEOUS
##.ACQUISITION SCHEME= undefined
##.AVERAGES= 8
##.DIGITISER RES= 18
##SPECTROMETER/DATA SYSTEM= spect
##.PULSE SEQUENCE= zg30
##.SOLVENT NAME= CDCl3
##.SHIFT REFERENCE= (INTERNAL, CDCl3, 0, 15.7039)
##AUDIT TRAIL= $$ (NUMBER, WHEN, WHO, WHERE, WHAT)
$$ ##TITLE= Audit trail, XWIN-NMR		Version 3.5
$$ ##JCAMPDX= 5.01
$$ ##ORIGIN= Bruker BioSpin GmbH
$$ ##OWNER= she
$$ F:/spectra/data/she/nmr/H-F/1/audita.txt
$$ ##AUDIT TRAIL=  $$ (NUMBER, WHEN, WHO, WHERE, WHAT)
(   1,<2019-07-01 14:47:39.60 +0400>,<she>,<DPX200>,
      <created by zg, POWCHK disabled, PULCHK disabled
       configuration hash MD5:
       00 E9 B6 7A A2 85 ED C7 34 08 36 98 17 FE 4E 26
       data hash MD5: 16K
       A4 AC 2F 12 01 A0 43 12 03 E9 63 65 DF D9 D7 BF>)
$$ ##END=
$$ 
$$ hash MD5
$$ 50 0D AD DC FB BC 85 53 DD B5 AA 0B 7B DA 0B 4C
##$RELAX= 
##$RELAX= 
##$RELAX= 
##$RELAX= 
##$RELAX= 
##$RELAX= 
$$ Bruker specific parameters
$$ --------------------------
##$DU= <F:/spectra>
##$EXPNO= 1
##$NAME= <H-F>
##$PROCNO= 1
##$TYPE= <nmr>
##$USER= <she>
##$AMP= (0..31)
100 100 100 100 100 100 100 100 100 100 100 100 100 100 100 100 100 100 
100 100 100 100 100 100 100 100 100 100 100 100 100 100 
##$AQSEQ= 0
##$AQ_mod= 1
##$AUNM= <au_zg>
##$AUTOPOS= <>
##$BF1= 200.13
##$BF2= 200.13
##$BF3= 200.13
##$BF4= 200.13
##$BF5= 200.13
##$BF6= 200.13
##$BF7= 200.13
##$BF8= 200.13
##$BYTORDA= 1
##$CFDGTYP= 0
##$CFRGTYP= 5
##$CHEMSTR= <none>
##$CNST= (0..31)
1 1 145 1 1 1 1 1 1 1 1 1 1 1 1 1 1 1 1 1 1 1 1 1 1 1 1 1 1 1 1 1 
##$CPDPRG= <>
##$CPDPRG1= <>
##$CPDPRG2= <>
##$CPDPRG3= <>
##$CPDPRG4= <mlev>
##$CPDPRG5= <mlev>
##$CPDPRG6= <mlev>
##$CPDPRG7= <mlev>
##$CPDPRG8= <mlev>
##$CPDPRGB= <>
##$CPDPRGT= <>
##$D= (0..31)
0 1.2 0 0 0 0 0 0 0 0 0 0.03 0 0 0 0 0 0 0 0 0 0 0 0 0 0 0 0 0 0 0 0 
##$DATE= 1561978059
##$DBL= (0..7)
120 120 120 120 120 120 120 120 
##$DBP= (0..7)
150 150 150 150 150 150 150 150 
##$DBP07= 0
##$DBPNAM0= <>
##$DBPNAM1= <>
##$DBPNAM2= <>
##$DBPNAM3= <>
##$DBPNAM4= <>
##$DBPNAM5= <>
##$DBPNAM6= <>
##$DBPNAM7= <>
##$DBPOAL= (0..7)
0.5 0.5 0.5 0.5 0.5 0.5 0.5 0.5 
##$DBPOFFS= (0..7)
0 0 0 0 0 0 0 0 
##$DE= 6
##$DECBNUC= <off>
##$DECIM= 24
##$DECNUC= <off>
##$DECSTAT= 4
##$DIGMOD= 1
##$DIGTYP= 9
##$DL= (0..7)
0 120 120 120 120 120 120 120 
##$DP= (0..7)
150 150 150 150 150 150 150 150 
##$DP07= 0
##$DPNAME0= <>
##$DPNAME1= <>
##$DPNAME2= <>
##$DPNAME3= <>
##$DPNAME4= <>
##$DPNAME5= <>
##$DPNAME6= <>
##$DPNAME7= <>
##$DPOAL= (0..7)
0.5 0.5 0.5 0.5 0.5 0.5 0.5 0.5 
##$DPOFFS= (0..7)
0 0 0 0 0 0 0 0 
##$DQDMODE= 0
##$DR= 18
##$DS= 0
##$DSLIST= <SSSSSSSSSSSSSSS>
##$DSPFIRM= 0
$$ [...]
##$SUBNAM2= <"">
##$SUBNAM3= <"">
##$SUBNAM4= <"">
##$SUBNAM5= <"">
##$SUBNAM6= <"">
##$SUBNAM7= <"">
##$SUBNAM8= <"">
##$SUBNAM9= <"">
##$SW= 24.9336996594482
##$SWIBOX= (0..15)
0 0 2 0 0 0 0 0 0 0 0 0 0 0 0 0 
##$SW_h= 4990.01996007984
##$TD= 16384
##$TD0= 1
##$TE= 0
##$TE2= 300
##$TE3= 300
##$TEG= 300
##$TL= (0..7)
0 120 120 120 120 120 120 120 
##$TP= (0..7)
150 150 150 150 150 150 150 150 
##$TP07= 0
##$TPNAME0= <>
##$TPNAME1= <>
##$TPNAME2= <>
##$TPNAME3= <>
##$TPNAME4= <>
##$TPNAME5= <>
##$TPNAME6= <>
##$TPNAME7= <>
##$TPOAL= (0..7)
0.5 0.5 0.5 0.5 0.5 0.5 0.5 0.5 
##$TPOFFS= (0..7)
0 0 0 0 0 0 0 0 
##$TUNHIN= 0
##$TUNHOUT= 0
##$TUNXOUT= 0
##$USERA1= <user>
##$USERA2= <user>
##$USERA3= <user>
##$USERA4= <user>
##$USERA5= <user>
##$V9= 5
##$VALIST= <valist>
##$VCLIST= <CCCCCCCCCCCCCCC>
##$VD= 0
##$VDLIST= <DDDDDDDDDDDDDDD>
##$VPLIST= <PPPPPPPPPPPPPPP>
##$VTLIST= <TTTTTTTTTTTTTTT>
##$WBST= 1024
##$WBSW= 4
##$XGAIN= (0..3)
0 0 0 0 
##$XL= 0
##$YL= 0
##$YMAX_a= 72790
##$YMIN_a= -83912
##$ZGOPTNS= <>
##$ZL1= 120
##$ZL2= 120
##$ZL3= 120
##$ZL4= 120
##$ABSF1= 10
##$ABSF2= 0
##$ABSG= 5
##$ABSL= 3
##$ALPHA= 0
##$AQORDER= 0
##$ASSFAC= 0
##$ASSFACI= 0
##$ASSFACX= 0
##$ASSWID= 0
##$AUNMP= <proc_1d>
##$AZFE= 0.1
##$AZFW= 0.1
##$BCFW= 1
##$BC_mod= 2
##$BYTORDP= 1
##$COROFFS= 0
##$CY= 11.3945322036743
##$DATMOD= 1
##$DC= 2
##$DFILT= <>
##$DTYPP= 0
##$F1P= 18.9103706918063
##$F2P= -1.10871071338519
##$FCOR= 0.5
##$FTSIZE= 0
##$FT_mod= 4
##$GAMMA= 1
##$GB= 0.15
##$INTBC= 1
##$INTSCL= 1
##$ISEN= 128
##$LB= 0.24
##$LEV0= 0
##$LPBIN= 0
##$MAXI= 10000
##$MC2= 0
##$MEAN= 0
##$ME_mod= 0
##$MI= 1.114404
##$NCOEF= 0
##$NC_proc= 0
##$NLEV= 6
##$NOISF1= 3.799351
##$NOISF2= 2.8
##$NSP= 1
##$NTH_PI= 0
##$NZP= 0
##$OFFSET= 15.70392
##$PC= 1
##$PHC0= -8655.772
##$PHC1= 11.00097
##$PH_mod= 1
##$PKNL= yes
##$PPARMOD= 0
##$PSCAL= 0
##$PSIGN= 0
##$REVERSE= no
##$SF= 200.130013532006
##$SI= 16384
##$SIGF1= 3
##$SIGF2= 2
##$SINO= 400
##$SIOLD= 16384
##$SREGLST= <1H.CDCl3>
##$SSB= 0
##$STSI= 0
##$STSR= 0
##$SW_p= 3612.71676300578
##$SYMM= 0
##$S_DEV= 0
##$TDeff= 0
##$TDoff= 0
##$TI= <>
##$TILT= no
##$TM1= 0
##$TM2= 0
##$TOPLEV= 0
##$USERP1= <user>
##$USERP2= <user>
##$USERP3= <user>
##$USERP4= <user>
##$USERP5= <user>
##$WDW= 1
##$XDIM= 8192
##$YMAX_p= 0
##$YMIN_p= 0
$$ End of Bruker specific parameters
$$ ---------------------------------
##NTUPLES= NMR FID
##VAR_NAME=  TIME,          FID/REAL,        FID/IMAG
##SYMBOL=    X,             R,               I
##VAR_TYPE=  INDEPENDENT,   DEPENDENT,       DEPENDENT
##VAR_FORM=  AFFN,          ASDF,            ASDF
##VAR_DIM=   8192,          8192,            8192
##UNITS=     SECONDS,       ARBITRARY UNITS, ARBITRARY UNITS
##FACTOR=    0.0002004,     1,               1
##FIRST=     0,             0,               0
##LAST=      1.6414764,     0,               0
##MIN=       0,             -83912,          0
##MAX=       1.6414764,     72790,           0
$$ Real data points
##PAGE= N=1
##DATA TABLE= (X++(R..R)), XYDATA
$$ [...]
1309f93MJ29J62o8n2Q5K47R3n9J42K44n1O4R4rQ8J68lP7l4J86r3m3Mj2J28rk01
$$ -693 -689 -560 -398 -466 -518 -433 -186 -93 -152 -10 234 183 247 341 332 420 588 585 662 628 814 721 678 682 670 798 789 588
1337E88M3M5j40p4j70J0j00q0Qj00q1r6J58k66ro6m6O7k27L5J14j91m4M9Rp7J80
$$ 588 631 676 536 462 292 302 202 122 130 30 -51 -147 11 -255 -264 -330 -376 -309 -536 -501 -387 -578 -622 -573 -564 -641 -461
1364d61j96K02L3j7mJ35o7O6P1R9J02L4L16j9j3j44j08J85J8J72J20r6Q5M2m6
$$ -461 -657 -455 -422 -439 -443 -308 -375 -309 -238 -139 -37 -3 313 294 281 137 29 214 232 404 524 428 513 555 509
1389E09j95O4j2L8j11NM5Kj64j56l6Q4j7k08O6m7N9j95P5q2j54n3nK6l2J25M2
$$ 509 314 378 366 404 293 298 343 345 181 25 -11 73 56 -152 -86 -133 -74 -269 -194 -276 -430 -483 -488 -462 -494 -369 -327
1416c27J85j62j43Q2r9P8L4J39J32J68J8lj06L8N4K3K1K9J87J58l7N7k33Q2n0
$$ -327 -142 -304 -447 -365 -464 -386 -352 -213 -81 87 105 102 -4 34 88 111 132 161 348 506 469 526 293 375 325
1441C25j05K05Q6J13j17m4K0k25l4j65K6j74J42J26j6k11j2q2l06j39qK99j79
$$ 325 220 425 511 624 507 463 483 258 224 59 85 -89 53 179 163 -48 -60 -142 -448 -587 -595 -296 -475
1464d75lJ49j39M1k50J50j74k8P8L10j12L4K34l8mo6J51o6O7K36P5J98n2Q8J1
$$ -475 -478 -329 -468 -427 -677 -527 -701 -729 -651 -341 -453 -419 -185 -223 -227 -293 -142 -208 -141 95 170 368 316 404 415
1489D15j14o5J87J19N6K16q8K04k09j37p0l3OJ6J4N8j3r0j19l2k67j3p6j3j92
$$ 415 301 236 423 542 598 814 726 930 721 584 514 481 487 503 517 575 562 472 353 321 54 41 -35 -48 -240
1514b40L4N6Kk01m9Nj58k11MJ43kQ3l9k9j10j7k8P0R8R8J57P3N3o8k8jN7J14K23
$$ -240 -206 -150 -148 -349 -398 -393 -551 -762 -758 -615 -617 -534 -573 -602 -712 -729 -757 -687 -589 -491 -334 -261 -208 -276 -304 -305 -248 -134 89
1543H9KK11k9L7L1O8n9J63O8q8O1O9m2K9MR9m8j72j07J39j07r2O1q9j15p0j03
$$ 89 91 302 273 310 341 409 350 513 581 493 554 623 581 610 614 713 665 493 386 525 418 326 387 298 183 113 10
1570A0p2p3l4K25p0k65O6k3j64j55l7J56jM0k36K43k55J34n8m6J21N8L2O5j6J54
$$ 10 -62 -135 -169 56 -14 -279 -213 -236 -400 -555 -592 -436 -437 -397 -633 -390 -645 -511 -569 -615 -494 -436 -404 -339 -355 -201
1596b01L6J53q7m4K00R3l3P4O4N4M3J00j10M7R8n0O6K7O6q1O1pk64M6k1m4m2l7
$$ -201 -165 -12 -99 -143 57 150 117 191 255 309 352 452 342 389 487 437 503 530 596 515 576 569 305 351 330 286 244 207
1624B07j2r4j08l4p1KK6j73p0L5K0l4Qj57j17Q0J12j11J21R8j21k6J0K7K9O0J32
$$ 207 195 101 -7 -41 -112 -110 -84 -257 -327 -292 -272 -306 -298 -455 -572 -492 -380 -491 -370 -272 -393 -419 -409 -382 -353 -293 -161
1651a61N1Q7M6l0k2J75l2P7J15p4K19L4L9j40o3lM8L4K3N0l1j1j42N1p4j9m5m
$$ -161 -110 -23 23 -7 -29 146 114 191 306 232 451 485 524 384 321 318 366 400 423 473 442 431 289 340 266 247 202 198
1679A98kq1l2L5k02l6m0j26r3o8o4Q8N2J6o6j31J02j99J04k4N9Q1O9L2K9r7J08
$$ 198 196 115 83 118 -84 -120 -160 -286 -379 -447 -511 -423 -371 -355 -421 -552 -450 -649 -545 -569 -510 -429 -360 -328 -299 -396 -288
1706b88j2M6R1K47M5jk1r2J78j36J27J70m7O8J72mj1N8q5Kj46n1K7KR9k8N5p3
$$ -288 -300 -254 -163 84 129 128 107 15 193 57 184 354 307 375 547 543 532 590 505 507 361 310 337 339 438 410 465 392
1734C92j99j6j77m6j4j5M0J3p4r7m3j58k02K06p5K3j6M9J9j6p0j31K23n7j1P3
$$ 392 193 177 0 -46 -60 -75 -35 -22 -96 -193 -236 -394 -596 -390 -465 -442 -458 -409 -390 -406 -476 -607 -384 -441 -452 -379
1760c79J04O4J2m6J86l0L0J1J56nqJ45L7Q2k8nL0m6L6Q4OQ5J6nj79j7p1j3Q9p3
$$ -379 -275 -211 -199 -245 -59 -89 -59 -48 108 103 95 240 277 359 331 326 356 310 346 430 436 521 537 532 353 336 265 252 341 268
1790B68K6j23O3j16n0P6j63j32o7m7K0O5k9K4j16j18k4j21J44K3JL3j2L3q7J27
$$ 268 294 171 234 118 68 144 -19 -151 -218 -265 -245 -180 -209 -185 -301 -419 -443 -564 -420 -397 -396 -363 -375 -342 -429 -302
1816c02m4K0J11K7P7J11j5K4Q9P0k5J17q3M0P2J39j18J53k7N3j06q6J34M2L1j41
$$ -302 -346 -326 -215 -188 -111 0 -15 9 98 168 143 260 177 217 289 428 310 463 436 489 383 297 431 473 504 363
1842C63%q5Q1j06j63o4NR3k0j26r8J9j27j17J16q5N1om2j5k01J67l5j79J2R2P7
$$ 363 363 278 359 253 90 26 31 124 104 -22 -120 -101 -228 -345 -229 -314 -263 -269 -311 -326 -527 -360 -395 -574 -562 -470 -393
1869c93M8K9Q7p8P0O2J88j50R1mJ19j7J63j6p9J95j41P8Q3J49j46J87%%k4j11
$$ -393 -345 -316 -229 -307 -237 -175 13 -137 -46 -50 69 52 215 199 120 315 174 252 335 484 338 525 525 525 501 390
1895C90qN3j29J29L2j15p7N6j72j07O1o5J04j77j27K0r6P7j71o3K1p1R0n0j01
$$ 390 382 435 306 435 467 352 275 331 159 52 113 48 152 -25 -152 -132 -228 -151 -322 -385 -364 -435 -345 -395 -496
1920d96k5M5j5l6J13j03K24j07R8L3J3lL5N1l4J02K2J78R6J21l7l5m2NK03j12
$$ -496 -521 -476 -491 -527 -414 -517 -293 -400 -302 -269 -256 -259 -224 -173 -207 -105 -83 95 191 312 275 240 198 203 406 294
1946B94J32J65rn8Oj6j61R7j10OP5J01r3j22n2j36j17L4J48j68j19Q5j17J3j44
$$ 294 426 591 582 524 530 514 353 450 340 346 421 522 429 307 255 119 2 36 184 16 -103 -18 -135 -122 -266
1971b66R1j09q3k0J6k8O3J41k07n8kN0q1J00Q7J01l2Q7P8j24Q0O8l7l1J46jJ63
$$ -266 -175 -284 -367 -387 -371 -399 -336 -195 -402 -460 -462 -412 -493 -393 -306 -205 -237 -150 -72 -196 -116 -48 -85 -116 30 29 192
1998A92K7R7j3n3Q5j9l7j6J35l9L0J29p8j79q3M3L9r7P4j8N9p1J6l62L0o7O6M1
$$ 192 219 316 303 250 335 316 279 263 398 359 389 518 440 261 178 221 260 163 237 219 278 207 223 -139 -109 -176 -110 -69
2026f9l2N2l08j6J57k09J13o6r2K54m2L8j70R9q7J00K8m6P2M7K2l0K08J63j05
$$ -69 -101 -49 -357 -373 -216 -425 -312 -378 -470 -216 -258 -220 -390 -291 -378 -278 -250 -296 -224 -177 -155 -185 23 186 81
2051H1k7k5J36P2P0l0J72K7k6J1k96N7J80j4j0J4nKj25j22Jk9j09J73j11M5j70
$$ 81 54 29 165 237 307 277 449 476 450 461 165 222 402 388 378 392 387 389 264 142 143 114 5 178 67 112 -58
2078e8m6p5L0k11J7R0n5j16J33n7Q1j16M6j86N6R3q8J93m7J00nM9m2JJ34Ko2J45
$$ -58 -104 -179 -149 -360 -343 -253 -308 -424 -291 -348 -267 -383 -337 -523 -467 -374 -462 -269 -316 -216 -221 -172 -214 -213 -79 -77 -139 6
2106FJ66J77j52j1J7m9K03j13lJ14M0LL0j04J22r5j8j32J06o2R7p1k6j08M4q7
$$ 6 172 349 197 186 203 154 357 244 241 355 395 398 428 324 446 351 333 201 307 245 342 271 245 137 181 94
2132I4j61n8K0j06KL4R1r0j52q8N1J3j39N8J9P7k9Mj02N1M6J1J95J10j72J92r9
$$ 94 -67 -125 -105 -211 -209 -175 -84 -174 -326 -414 -363 -350 -489 -431 -412 -335 -364 -360 -462 -411 -365 -354 -159 -49 -221 -29 -128
2159a28K0J05K7p1J54j2QN2Q1j32J73j8j1J24J31j7j17K2LK1j2p1Qj18J85j52
$$ -128 -108 -3 24 -47 107 95 103 155 236 104 277 259 248 372 503 486 369 391 394 415 403 332 340 222 407 255
2185B55m7J60l00om6k9j8l3R2j08j74J07j52l7o2N3j4n2J71j48M5J2L5kL0r2R0
$$ 255 208 368 68 62 16 -13 -31 -64 28 -80 -254 -147 -299 -336 -398 -345 -359 -411 -240 -388 -343 -331 -296 -298 -268 -360 -270
2212b70L3N5N5K0L7J44j18L7m5K01M9R9R8j08n0M4q9K9J23l2J65j45o1J28k80
$$ -270 -237 -182 -127 -107 -70 74 -44 -7 -52 149 198 297 395 287 237 281 192 221 344 312 477 332 271 399 119
2237A19J14R1j67j3q3J51o1m2j2j95m4O8J8q6n7R0k6rP9k63K4j47R4N9j41R0R4
$$ 119 233 324 157 144 61 212 151 109 97 -98 -142 -74 -56 -142 -199 -109 -135 -144 -65 -328 -304 -451 -357 -298 -439 -349 -255
2264b55L8L0p6p7P1m6J78Q7J7J54J0p3P2j72J80J1k20K65J7jJ43Q6j37l8N3k31
$$ -255 -217 -187 -263 -340 -269 -315 -137 -50 -33 121 131 58 130 -42 138 149 -71 194 211 210 353 439 302 264 317 86
2290H6J56J8J60o4o5j03M4j10l9j5j17o8K1K8M8l0j64j52K6j0J15j04L4P1r3n2
$$ 86 242 260 420 356 291 188 232 122 83 68 -49 -117 -96 -68 -20 -50 -214 -366 -340 -350 -235 -339 -305 -234 -327 -379
2316c79j58J14O9r9K1J94o7R3J2M3J6O1pp0O6K09q7K53o9N4%j86J17J76o5lL2
$$ -379 -537 -423 -354 -453 -432 -238 -305 -212 -200 -157 -141 -80 -87 -157 -91 118 31 284 215 269 269 83 200 376 311 308 340
2343C40J27K0j72K2j03K21o8j66Q1j09M5nm1l5k14L5Jj13O9j72K2O6j14q3o3l5
$$ 340 467 487 315 337 234 455 387 221 302 193 238 233 192 157 -57 -22 -21 -134 -65 -237 -215 -149 -263 -346 -409 -444
2369d44l8J39l7L6P3k0j30J15o5Kj9QK44j3O0J3l3Q0M2kP7P1J62k58K40k2m8J03
$$ -444 -482 -343 -380 -344 -271 -291 -421 -306 -371 -369 -388 -380 -136 -149 -89 -76 -109 -29 13 11 88 159 321 63 303 281 233 336
2397C36L4O6j31j21J23J58j36K5J6K4j24p2O9k4K8j48k1J00j19k4l4l21K03n2
$$ 336 370 436 305 184 307 465 329 354 370 394 270 198 267 243 271 123 102 202 83 59 25 -296 -93 -145
2421a45l0j56J18l6j32R2j5l0O4rR8j01l1J57r8O4L2l7J01l2M5J16J6L9l1J33
$$ -145 -175 -331 -213 -249 -381 -289 -304 -334 -270 -279 -181 -282 -313 -156 -254 -190 -158 -195 -94 -126 -81 35 51 90 59 192
2447A92r6K4l2P2J02j35L01q9n7p3rL8R2k3l2P2j64O8l6k6M5j62j3L4l4k06J67
$$ 192 96 120 88 160 262 127 428 339 282 209 200 238 330 307 275 347 183 251 215 189 234 72 59 93 59 -147 20
2474B0P8k94k0K4L2j50JJ05l9m1l3j29R3K7O4m5J46m7Q2Mq8R5M7k5O4k3J43N8
$$ 20 98 -196 -216 -192 -160 -310 -309 -204 -243 -284 -317 -446 -353 -326 -262 -307 -161 -208 -126 -122 -210 -115 -68 -93 -29 -52 91 149
2502A49n7N4r4K27m1j5J18o2Q1K0%j44M4%L5j25P3m5J5O6q2p9L2j36j7N0j15M9
$$ 149 92 146 52 279 238 223 341 279 360 380 380 236 280 280 315 190 263 218 233 299 217 138 170 34 17 67 -48 1
2530Ak0K4j86n1JR6j17Lk6LQ5j59L7P1l5k1O2m2J18j04J97j0j07O6J8J07j21J48
$$ 1 -19 5 -181 -232 -231 -135 -252 -249 -275 -272 -187 -346 -309 -238 -273 -294 -232 -274 -156 -260 -63 -73 -180 -114 -96 11 -110 38
2558C8q1K05L0j4Q7o3P4o0l2J0p6J60J9P9Q2k49k0m9Q0Q9j85M1n3P1J7j46r6K7
$$ 38 -43 162 192 178 265 202 276 216 184 194 118 278 297 376 458 209 189 140 220 309 124 165 112 183 200 54 -42 -15
2586a5j93R1p8J71k39M0L2j48mJ3n2K5K5J62k1K8j53J03lRn3J90m9J40r6J24o2
$$ -15 -208 -117 -195 -24 -263 -223 -191 -339 -343 -330 -382 -357 -332 -170 -191 -163 -316 -213 -216 -207 -260 -70 -119 21 -75 49 -13
2613a3m1j1J83j42L7J56J74m9q5ll9P1q4J01l4R7j2q1J67j74P4jj93m0M9J24j53
$$ -13 -54 -65 118 -24 13 169 343 294 209 206 167 238 154 255 221 318 306 225 392 218 292 291 98 58 107 231 78
2640G8J06j44j45j20J61jj74Q1k08K02n4l7o0j3j4J42p5j83J76J31l7J93j79k5
$$ 78 184 40 -105 -225 -64 -65 -239 -158 -366 -164 -218 -255 -315 -328 -342 -200 -275 -458 -282 -151 -188 5 -174 -199
2664a99J15j4M6q7J65K7K8K52j71J7n9r7M8J75j3J28j05l1J22n5Oj02N8K3r3O0
$$ -199 -84 -98 -52 -139 26 53 81 333 162 179 120 23 71 246 233 361 256 225 347 292 298 196 254 277 184 244
2690B44M5j29r5l5q2M4km9m9n7Pp6n2K7n8J42j46J76n3j01N1j81J02o6K8OJ60
$$ 244 289 160 65 30 -52 -8 -10 -59 -108 -165 -158 -234 -286 -259 -317 -175 -321 -145 -198 -299 -248 -429 -327 -393 -365 -359 -199
2717a99K7J11k9l4p0N9R5Q4K5qJ61OJ7o6j6l6R0N4L2j5QM3p4L9N8j30P3q1K3p1
$$ -199 -172 -61 -90 -124 -194 -135 -40 44 69 61 222 228 245 179 163 127 217 271 303 288 296 339 265 304 362 232 305 224 247 176
2747A76O8j24p8M1rn2n5j7RJ1j47J2n0K1q2J4o2L2q3L8k7J65j41L6k8J11r1J7
$$ 176 244 120 42 83 74 22 -33 -50 -41 -30 -177 -165 -215 -194 -276 -262 -324 -292 -375 -337 -364 -199 -340 -304 -332 -221 -312 -295
2775b95M4K0J7J49l1J09k17J02K05p7P9M0R2j56J01M2N1n2K3Q9qKl4j5P5j29N2
$$ -295 -251 -231 -214 -65 -96 13 -204 -102 103 26 105 145 237 81 182 224 275 223 246 335 327 329 295 280 355 226 278
2802B78r0q0j1J64q9O3j85k2j29R9l5m6J1q8J21p0j54mL1J05k32J93o9J19m5k08
$$ 278 188 108 97 261 172 235 50 28 -101 -2 -37 -83 -72 -160 -39 -109 -263 -267 -236 -131 -363 -170 -239 -120 -165 -373
2828c73J59P2q9r7J1oK42JpR6j16P2j04J32N0kJ40P7n5M5k0r8j7J73k6p8J71r
$$ -373 -214 -142 -231 -328 -317 -323 -81 -80 -87 9 -107 -35 -139 -7 43 41 181 258 203 248 228 130 113 286 260 182 353 344
2856C44nj66O0j31J11j24N9j20J4QJ2j52M5j4o6j03L1m2k5P2P2j17k5O1J29j73
$$ 344 339 173 233 102 213 89 148 28 42 50 62 -90 -45 -59 -125 -228 -197 -239 -264 -192 -120 -237 -262 -201 -72 -245
2882b45m9R8P8o9Q2O2j89P6J6j1J16O1J04l0l8O7jj0K6l4J00%P0J28j32NJ41j99
$$ -245 -294 -196 -118 -187 -105 -43 -232 -156 -140 -151 -35 26 130 100 62 129 128 118 144 110 210 210 280 408 276 281 422 223
2910B23lqQN3j35J01n5l4K7j41j2o8R9m0M0j71k4M1j12P6k15J28q1K2N0j1k9r6
$$ 223 220 212 220 273 138 239 184 150 177 36 24 -44 55 15 55 -116 -140 -99 -211 -135 -350 -222 -303 -281 -231 -242 -271 -367
2938c67M5KQL3J51%R2q4j10J15r4J78R6j67J06R8QJ41j66N7J64k3j17O3k6k4J21
$$ -367 -322 -320 -312 -279 -128 -128 -36 -120 -230 -115 -209 -31 65 -102 4 102 110 251 85 142 306 283 166 229 203 179 300
2965C00m0J56j68N4n0j1L8j57Q5K8k00J45qj50qL1j37J0lm7J03j39j84J59nLO
$$ 300 260 416 248 302 252 241 279 122 207 235 35 180 172 22 14 45 -92 -82 -85 -132 -29 -168 -352 -193 -198 -195 -189
2992a89k42K22j79P3O2k6P8j3j89J44J70q7r8K26j48J60M3r5J92N6j16J97K1r5
$$ -189 -431 -209 -388 -315 -253 -279 -201 -214 -403 -259 -89 -176 -274 -48 -196 -36 7 -88 104 160 44 241 262 167
3016A67M2NN2l6K5J37k37N2R0K3L0k16R2j08J01J7p7j26O1o2J4q4P0o2j6M1m3
$$ 167 209 214 266 230 255 392 155 207 297 320 350 134 226 118 219 236 159 33 94 32 46 -38 32 -30 -46 -5 -48
3043d8j48j9J17m9n5j03L0Q1O1k33K20J6j11PoN5J5M4R1J25j42J9J5O0L6q0Q3
$$ -48 -196 -215 -98 -147 -202 -305 -275 -194 -133 -366 -146 -130 -241 -234 -240 -185 -170 -126 -35 90 -52 -33 -18 42 78 -2 81
3070H1K3M8J24j07QJ6j8N1m1Pj30J50N5J8j94J40m8rl4K4q7pO2m8j10j3P2j32
$$ 81 104 152 276 169 177 193 175 226 185 192 62 212 267 285 91 231 183 174 140 164 77 70 132 84 -26 -39 33 -99
3098i9J0j03mK9J15o4o0n7j72K57m7r7P9j1P1N2k0M3P0j11P6j46L00j14o3J52
$$ -99 -89 -192 -196 -167 -52 -116 -176 -233 -405 -148 -195 -292 -213 -224 -153 -101 -121 -78 -8 -119 -43 -189 111 -3 -66 86
3124H6J32k6k02Q3O6J8P6j78J64j3n5J16j82L4J09jm1l8J5PN3j71q9J05j56OO
$$ 86 218 192 -10 73 139 157 233 55 219 206 151 267 85 119 228 227 186 148 163 170 223 52 -37 68 -88 -82 -76
3151g6p8k2o7N3J39j32j43J0J68j50O1M0R4j36p5j6J03p1K4J52n9J39Qpj14J55
$$ -76 -154 -176 -243 -190 -51 -183 -326 -316 -148 -298 -237 -197 -103 -239 -314 -330 -227 -298 -274 -122 -181 -42 -34 -41 -155 0
3177@j51J72J06jJ20qm9L8l5K9o4N6M6J31j43P6l0K9l1j29MrP7j24K5k4k6k1m8
$$ 0 -151 21 127 126 246 238 189 227 192 221 157 213 259 390 247 323 293 322 291 162 166 157 234 110 135 111 85 64 16
3206A6j17k8m5m1M8j1O1j02j1J6j42J55j6j10J18Q6o3j18M4PJ10j10K03k8l2L7
$$ 16 -101 -129 -174 -215 -167 -178 -117 -219 -230 -214 -356 -201 -217 -327 -209 -123 -186 -304 -260 -253 -143 -253 -50 -78 -110 -73
3232g3K1J04j54O2Q7kl9P3r0J97Rn4J70L4k78J72k7o5K3O1J9q5q9P9l1OK4n4K8
$$ -73 -52 52 -102 -40 47 45 6 79 -11 186 195 141 311 345 67 239 212 147 170 231 250 165 76 155 124 130 154 100 128
3261A28p9n5m6N0j05K2n3l3j2m2Q0j12J6J58k06J60q3m7Q4l4n0L7Q2l9J39O2p9
$$ 128 49 -6 -52 -2 -107 -85 -138 -171 -183 -225 -145 -257 -241 -83 -289 -129 -212 -259 -175 -209 -259 -222 -140 -179 -40 22 -57
3288e7n6K03j15L4J7P1K4r9l0J57J1j9O5p3J1q6J44p1n7Q5O6l8K5j22RN7j72m6
$$ -57 -113 90 -25 9 26 97 121 22 -8 149 160 141 206 133 144 58 202 131 74 159 225 187 212 90 99 156 -16 -62
3316f2j3O1j69N6L6J7k7j00J08j63O4J29j0m5r5p9N5P2p7M3j14K76j4q2K2J12
$$ -62 -75 -14 -183 -127 -91 -74 -101 -201 -93 -256 -192 -63 -73 -118 -213 -292 -237 -165 -242 -199 -313 -37 -51 -133 -111 1
3342Am4J91k61J75m2jJ60o1p7J43j8j16R7N0q6M3R7K7Jm1j24M4Oj3p6Mp6J44l0
$$ 1 -43 148 -113 62 20 19 179 118 41 184 166 50 147 197 111 154 251 278 279 238 114 158 164 151 75 79 3 147 117
3371A17l6j14j0J09j46o8r0J56k1J0o7J90k62L1o9R2n7J03m0Q5q7j23J78r0N1
$$ 117 81 -33 -43 66 -80 -148 -238 -82 -103 -93 -160 30 -232 -201 -270 -178 -235 -132 -172 -87 -174 -297 -119 -209 -158
3396a58M7O9O0j05L8N5k5R2O3k7n4J5R7j39J59Q2j17L0J30p9j00O2LJ06j26N9
$$ -158 -111 -42 18 -87 -49 6 -19 73 136 109 55 70 167 28 187 269 152 182 312 233 133 195 198 304 178 237
3422B37j0k9p7K2k1o4M4n6L2M4j31R7j68Mm7k1L3j9q0Qn7qJ00n5Q9j04J45p7J6
$$ 237 227 198 121 143 122 58 102 46 78 122 -9 88 -80 -76 -123 -144 -111 -130 -210 -202 -259 -267 -167 -222 -133 -237 -92 -169 -153
3451a53J4j08J82r3L2J60k09J63J44j76J22j22K1J36O4j03J23j4j05Q3m3R6j72
$$ -153 -139 -247 -65 -158 -126 34 -175 -12 132 -44 78 -44 -23 113 177 74 197 183 78 161 118 214 42
3474D2P1M8M2Q9r8l4J11j23o2R7J7j88m7N6O5n6m6l8j44J33j33L6R6j43R4j72
$$ 42 113 161 203 292 194 160 271 148 86 183 200 12 -35 21 86 30 -16 -54 -198 -65 -198 -162 -66 -209 -115 -287
3500b87J10n2O3r4J34k12Q2J05jJ9r2J51LP4o1L0R5K8K1R1k3k8r9J30Q0m2O4k1
$$ -287 -177 -229 -166 -260 -126 -338 -256 -151 -152 -133 -225 -74 -71 3 -58 -28 67 95 116 207 184 156 57 187 267 225 289 268
3528B68j52J01p0L9k9K6l4L9oq4J1O7m7j47Q1k7k0r2kk4M6k8n5l1K0l0M6L1p0
$$ 268 116 217 147 186 157 183 149 188 182 98 109 176 129 -18 63 36 16 -76 -78 -102 -56 -84 -139 -170 -150 -180 -134 -103 -173
3557a73l7K1qJ59l9l5o7m8J71j84K27j04M5j36K07Q7j97K55p0OJ21l6M0p7J21
$$ -173 -210 -189 -197 -38 -77 -112 -179 -227 -56 -240 -13 -117 -72 -208 -1 86 -111 144 74 80 201 165 205 128 249
3582B49j42O9n2Q8K1j23M6J6J93j21j91M4r5J31m9Q1q2j75J55J2j20j71K22j02
$$ 249 107 176 124 212 233 110 156 172 365 244 53 97 2 133 84 165 83 -92 63 75 -45 -216 6 -96
3606i6j29J67j88O5Q1k98J33J9l8J18k6Q7n0m7P3l8n3oJ04O7L8K4R2m8L8l3R7
$$ -96 -225 -58 -246 -181 -100 -398 -265 -246 -284 -166 -192 -105 -155 -202 -129 -167 -220 -226 -122 -55 -17 7 99 51 89 56 153
3633A53k1m9O3K7m1J20j16m4J18l8OO8j48J70j17o9K7O6j5j37J03q2M1j6k9j29
$$ 153 132 83 146 173 132 252 136 92 210 172 178 246 98 268 151 82 109 175 160 23 126 44 85 69 40 -89
3659h9P3m6j16J05Rk2Qk14J22K9nq2L1MM2O8j20K8P0pL2K0M4q6R7O2Ko6K5R0M8
$$ -89 -16 -62 -178 -73 -64 -86 -78 -292 -170 -141 -146 -228 -197 -193 -151 -83 -203 -175 -105 -112 -80 -60 -16 -102 -5 57 59 -7 18 108 156
3690A56j38jJ64q4R7L8j03PM8q8N6q0M5J42q2q2Lml1K0m1j8o1J06nj93Q6k9l9
$$ 156 18 17 181 97 194 232 129 136 184 96 152 72 117 259 177 95 98 94 63 83 42 24 -37 69 64 -129 -43 -72 -111
3719a11m3j7J41k05J0l3J17K2p3Q4n3r3P8K0J15j00P6r5J33J0j7m4pL5J07l2%
$$ -111 -154 -171 -30 -235 -225 -258 -141 -119 -192 -108 -161 -254 -176 -156 -41 -141 -65 -160 -27 -17 -34 -78 -85 -50 57 25 25
3746B5Kn8J36l9k2J14j05J84n4J01j08r2K2P7p5K3M7Q7j97pM3Qn9j34K3J19m1
$$ 25 27 -31 105 66 44 158 53 237 183 284 176 84 106 183 108 131 178 265 68 61 104 112 53 -81 -58 61 20
3773B0m2o8J11j16j59M1j2l6P9n6J32j04%J3PK11k68L11j70P6l9J4Q7LL7o3R7
$$ 20 -22 -90 21 -95 -254 -213 -225 -261 -182 -238 -106 -210 -210 -197 -190 21 -247 64 -106 -30 -69 -55 32 35 72 9 106
3800A06j33K9J8M3O4r4J0R0K2k7R8L1q9m8K5Q4Q8j78j2M1j0k5j65J62q6Jj19K
$$ 106 -27 2 20 63 127 33 43 133 155 128 226 257 168 120 145 229 317 139 127 168 158 133 -32 130 44 45 -74 -72
3828g2P9j26J81n9n9j0Kj42N8P9j18J20m9lp7M4J20j38O4NK3j08J61K6l8O5L2
$$ -72 7 -119 62 3 -56 -66 -64 -206 -148 -69 -187 -67 -116 -119 -196 -152 -32 -170 -106 -101 -78 -186 -25 1 -37 28 60
3855F0j42J18m0j9K6J60K1Qj74L9J66j5j0Kj11J61j33P0Lqp3l6OK0o1j08J67K2
$$ 60 -82 36 -4 -23 3 163 184 192 18 57 223 208 198 200 89 250 117 187 190 182 109 73 79 99 38 -70 97 119
3883A19lp8j35j14K04o4m6n6m1M4J11k0m8L9p6R6j84J39k1J9k6O1J32j01L3o0
$$ 119 116 38 -97 -211 -7 -71 -117 -173 -214 -170 -59 -79 -127 -88 -164 -68 -252 -113 -134 -115 -141 -80 52 -49 -16 -76
3909g6M2k3jK46j96M3m1M5JJ39l4q4M6J04j48P2o4J31p8P5n8l2k4Q9j40m5J0J55
$$ -76 -34 -57 -58 188 -8 35 -6 39 40 179 145 61 107 211 63 135 71 202 124 199 141 109 85 174 34 -11 -1 154
3937A54j16j1p4M2l7L0j21L4j11M3J7n0Q1J4pm9M8n4Rj9k8J23k9M8j0N4Pj30K01
$$ 154 38 27 -47 -5 -42 -12 -133 -99 -210 -167 -150 -200 -119 -105 -112 -161 -113 -167 -158 -177 -205 -82 -111 -63 -73 -19 -12 -142 59
3966E9j17J39q6QR4KP4Lr7k1J30k0j19J54l8j9L9n6o7Q7jjn7M9p2o0J38k6n5j46
$$ 59 -58 81 -5 3 97 99 173 176 79 58 188 168 49 203 165 146 185 129 62 149 148 147 90 139 67 7 145 119 64 -82
3996h2K0p8N8K2N6j21K6Rj09o1J20L5j49M2J09o2l9Q5j08N6J37l8r8J39O1o4O0
$$ -82 -62 -140 -82 -60 -4 -125 -99 -90 -199 -260 -140 -105 -254 -212 -103 -165 -204 -119 -227 -171 -34 -72 -170 -31 30 -34 26
4023B6M4p4P8j01Q6K2r2J59KQ4r6J68j93Pm1qJ65pj06nn3k0J11k24J61O8j38p6
$$ 26 70 -4 74 -27 59 81 -11 148 150 234 138 306 113 120 79 71 236 229 123 118 65 45 156 -68 93 161 23 -53
4051e3J85n3k78J92nL8j67Q4l7KM0r8l7J34r2K7l2J9M4n0P9q2%rJ42r5K5J9R0
$$ -53 132 79 -199 -7 -12 26 -141 -57 -94 -92 -52 -150 -187 -53 -145 -118 -150 -131 -87 -137 -58 -140 -140 -149 -7 -102 -77 -58 32
4080C2R5m0l7Nj0J8O5j14J77N1jm1j65K0K09r6o7M1K5p8K7J00j59L7k1Qm2J5m2
$$ 32 127 87 50 55 45 63 128 14 191 242 241 200 35 55 264 168 101 142 167 89 116 216 57 94 73 81 39 54 12
4109A2j2j65O1J68m3o2j66O9n2J56r1mp7nQ3J54j20p1N5J4K2q7J51j01Q5K1JO9
$$ 12 0 -165 -104 64 21 -41 -207 -138 -190 -34 -125 -129 -206 -211 -128 26 -94 -165 -110 -96 -74 -161 -10 -111 -26 -5 -4 65
4137F5n4n8K30j86P8j3J4J04j0j03J48j2Or8L6j25J38q2j1Q3Mq7Qr3M9p0n8O7
$$ 65 11 -47 183 -3 75 62 76 180 170 67 215 203 209 111 147 22 160 78 67 150 154 67 75 -18 31 -39 -97 -30
4165c0m0J43j27j3M0m7Q1j53m1K6j14J63j8o5L7j2K1p4l9J61jm3J19N4j02J06
$$ -30 -70 73 -54 -67 -27 -74 7 -146 -187 -161 -275 -112 -130 -195 -158 -170 -149 -223 -262 -101 -102 -145 -26 28 -74 32
4191C2Q1k30J26J71j11j37J71P0J6j40N0N6K0n1K7q4J91n8j16R6o8O8J7q5j05
$$ 32 113 -117 9 180 69 -68 103 173 189 49 99 155 175 124 151 67 258 200 84 180 112 180 197 112 7
4216Gk5N0L9p5j05J24p5o9M1P5j16m1MK0L3k0n3RN6j90J63p2K6n1J01Q2j1k4o0
$$ 7 -18 32 71 -4 -109 15 -60 -129 -88 -13 -129 -170 -166 -146 -113 -133 -186 -177 -121 -311 -148 -220 -194 -245 -144 -62 -73 -97 -157
4245a57P2J8L5J10j06R7l6OK1QR9l2M7p8J00j82P5ON3k2L4j9n9kJ58j19j57M2
$$ -157 -85 -67 -32 78 -28 69 33 39 60 68 167 135 182 104 204 22 97 103 156 134 168 149 90 88 246 127 -30 12
4273A2J08m6m5o1J43O9k62l0J16j52mQ9j39K25k22J12o7P9K8j01M7k2M0l6O6P
$$ 12 120 74 29 -32 111 180 -82 -112 4 -148 -152 -63 -202 23 -199 -87 -154 -75 -47 -148 -101 -123 -83 -119 -53 -46
4299d6m3l0%M3rQ9NJ9mj6m9k1O3J65q5o3N4K6J0p0M5k7J04m1M9j4lq4J56j52Q1
$$ -46 -89 -119 -119 -76 -85 4 9 28 24 8 -41 -62 1 166 81 18 72 98 108 38 83 56 160 119 168 154 151 67 223 71 152
4330A52n6j45J41o3Km3Km3Q8j54R9j32J84j26K1m0n8J51P3q3n7j82K14jk1r9J02
$$ 152 96 -49 92 29 31 -12 -10 -53 35 -119 -20 -152 32 -94 -73 -113 -171 -20 53 -30 -87 -269 -55 -56 -77 -176 -74
4357g4J20j69N3J21j25J54Q7r8r3Q2O7j05M9P5j33R9M7L9j36P0j01M2J6K5p3N4
$$ -74 46 -123 -70 51 -74 80 167 69 -24 58 125 20 69 144 11 110 157 196 60 130 29 71 87 112 39 93
4383I3q8J77j60MJ61j94J09j52j9Q6r7L3L8nj37K4m5J1rJ3oQ8M7j45M5j2m9m6
$$ 93 5 182 22 26 187 -7 102 -50 -69 17 -80 -47 -9 -14 -151 -127 -172 -161 -170 -157 -163 -75 -28 -173 -128 -140 -189 -235
4411b35J41k6J7O8m4J38j71J41l6K2J21p8O0m3p3J10J26p8m4ML7l2Q6m1n6O2m6
$$ -235 -94 -120 -103 -35 -79 59 -112 29 -7 15 136 58 118 75 2 112 238 160 116 120 157 125 211 170 114 176 130
4438A30r2j1L0O1j57Q2R3q1M6j60Q3l8p6J5L7L2j12LJ54k52n3K16p0J9l6m2M2
$$ 130 38 27 57 118 -39 43 136 55 101 -59 24 -14 -90 -75 -38 -6 -118 -115 39 -213 -266 -50 -120 -101 -137 -179 -137
4465a37J25j24L0q7K28pm2m7l3N5O3k1K2k1Jo5J11m4J27R9p6q6j5J41j54K3J33
$$ -137 -12 -136 -106 -193 35 28 -14 -61 -94 -39 24 3 25 4 5 -60 51 7 134 233 157 71 56 197 43 66 199
4492A99N1k02J98j37r2q6R0l8LN3j04L5R7n4m0j15j01K24q2M3J1k22J84m1J4o2
$$ 199 250 48 246 109 17 -69 21 -17 -14 39 -65 -30 67 13 -27 -142 -243 -19 -101 -58 -47 -269 -85 -126 -112 -174
4518a74RQ3j03K9J00j1o0J14n1j5N9p0J33No6P9k5Kp1Mj4J12j4p3L8L6R0k6R9
$$ -174 -165 -82 -185 -156 -56 -67 -127 -13 -64 -79 -20 -90 43 48 -18 61 36 38 -33 -29 -43 69 55 -18 20 56 146 120 219
4547B19n6p0L9l1l1Q7j77P0N6o8P3j03p3J6orN3NRj07J10j26n7PO9L5o1n8L2Q8
$$ 219 163 93 132 101 70 157 -20 50 106 38 111 8 -65 -49 -55 -64 -11 -6 3 -104 6 -120 -177 -170 -101 -66 -127 -185 -153 -65
4577f5n3Q3p9L9k2P6K0o6O7j05jJ24K3o3J44l5m9J0NJ3J7l2m8O7K3lm7jjJ19r6
$$ -65 -118 -35 -114 -75 -97 -21 -1 -67 0 -105 -106 18 41 -22 122 87 38 48 53 66 83 51 3 70 93 90 43 42 41 160 64
4608F4j20K78r0j26m8J2Q1J3j57P4k6l5P8j25O5J33j56J4j06Q5r1J41n0j02R2
$$ 64 -56 222 132 6 -42 -30 51 64 -93 -19 -45 -80 -2 -127 -62 71 -85 -71 -177 -92 -183 -42 -92 -194 -102
4633a02P5n6Kn6k0K01o1rJ2M5j2Pk4N5n9O1J24p1n2Q5o5j20J41J28l9q9R8j06
$$ -102 -27 -83 -81 -137 -157 44 -17 -26 -14 31 19 26 2 57 -2 59 183 112 60 145 80 -40 101 229 190 101 199 93
4661I3QR2j14p3J42j00kK5q9J07L9j67J28j58m7J54p2N9j61J06P5k29P7l9P6J2
$$ 93 101 193 79 6 148 48 46 71 -18 89 128 -39 89 -69 -116 38 -34 25 -136 -30 45 -184 -107 -146 -70 -58
4687e8l3q6P7N3o7n5J07J11j83pJ0J23K8j31J35LqQ2j9q4M9J3n3J50j47J07n3
$$ -58 -91 -177 -100 -47 -114 -169 -62 49 -134 -141 -131 -8 20 -111 24 27 19 101 82 -2 47 60 7 157 10 117 64
4714F4N7r4KQ9j09M7R1j29J46k7j12O3j65K1R5j33K9O1j1o3J2O4j66J75j92M4
$$ 64 121 27 29 118 9 56 147 18 164 137 25 88 -77 -56 39 -94 -65 -4 -15 -78 -66 -2 -168 7 -185 -141
4740a41j5J0J29j64J23rR5p1J5k%J3l8P4RL8N1n1r4K3L2N4m0j6L1N6k8L4N4P6
$$ -141 -156 -146 -17 -181 -58 -67 28 -43 -28 -30 -30 -17 -55 19 28 66 117 66 -28 -5 27 81 41 25 56 112 84 118 172 248
4770B48k86J44l9L1j08O0J41j71q4J83jr9J8q2n6K09J5l8j52K2k3M8l9j89M9m0
$$ 248 -38 106 67 98 -10 50 191 20 -64 119 118 19 37 -45 -101 108 123 85 -67 -45 -68 -20 -59 -248 -199 -239
4796b39O4M0PO8m6%l1J0N5p1P2p6P4Q4j42Q9%J5O6r1R3J39J7j01J6r9N2k8K22
$$ -239 -175 -135 -128 -60 -106 -106 -137 -127 -72 -143 -71 -147 -73 11 -131 -42 -42 -27 39 -52 41 180 197 96 112 13 65 37 259
4825B59j41NL2j16Q4O8J3k11K6J76j70OP4j48j5k3R0rJ12j60Q6k44M6J23K4q6
$$ 259 118 123 155 39 123 191 204 -7 19 195 25 31 105 -43 -58 -81 9 0 112 -48 38 -206 -160 -37 -13 -99
4851i9j0Q0j04R5j26R1o7l4J20Ok9J41q9n2O3p4J87r0Q1k2j25J22nK4m2JL3L1
$$ -99 -109 -29 -133 -38 -164 -73 -140 -174 -54 -48 -77 64 -25 -77 -14 -88 99 9 90 68 -57 65 60 84 42 43 76 107
4879A07n6N2M5j10l5J12k0M3o1j9jR4m2n3oj41J1Q5m6N0j08L9J19j17k4N3n9m3
$$ 107 51 103 148 38 3 115 95 138 77 58 57 151 109 56 50 -91 -80 5 -41 9 -99 -60 59 -58 -82 -29 -88 -131
4907a31O0rK7j45P0J28p1j31J37k6n9J10l9K7P7o4J6l0MR1j5K5nL8M7n0RRj63
$$ -131 -71 -80 -53 -198 -128 0 -71 -202 -65 -91 -150 -40 -79 -52 25 -39 -23 -53 -49 42 27 52 47 85 132 82 91 100 -63
4936f3J68O1q8rm7O0R2j02l3j05M3R1N3Nn6J7j25N9j07n9J59k0q6P0J7j07k9M5
$$ -63 105 166 78 69 22 82 174 72 39 -66 -23 68 121 126 70 87 -38 21 -86 -145 14 -6 -92 -22 -5 -112 -141 -96
4964i6J9J2l2QJ2k4m5om4KJ81jj66K36p3N8r5R5mm5J19j10L1ml7J47r1n7J28K
$$ -96 -77 -65 -97 -89 -77 -101 -146 -152 -196 -194 -13 -14 -180 56 -17 41 -54 41 37 -8 111 1 32 28 -9 138 47 -10 118 120
4994A20q1J52m1LO2p6J24j26J9j52JN8m8mMKm3j8m2R3m3N2j48J74n4j33K4qN7
$$ 120 39 191 150 153 215 139 263 137 156 4 5 63 15 11 15 17 -26 -44 -86 7 -36 16 -132 42 -12 -145 -121 -129 -72
5023g2r8j8J11l3P1m6P9k8j9m2J1KO6j31O7j7j1J75r0L8PJ69p3ok1N4J4n2k9P4
$$ -72 -170 -188 -77 -110 -39 -85 -6 -34 -53 -95 -84 -82 -16 -147 -80 -97 -108 67 -23 15 22 191 118 112 91 145 159 107 78 152
5053A52J4M3k7o3k3m0R8j46o3J63j00n8J11K7p0l7Jj39R8J5r3J74j82N5mjJ2j07
$$ 152 166 209 182 119 96 56 154 8 -55 108 8 -50 61 88 18 -19 -18 -157 -59 -44 -137 37 -145 -90 -94 -95 -83 -190
5081a90P5K2m2L2J8o2M4M0J3j23J0J55K7k5J73o4j62qM6j0MQ4R9p6k06J71K8N3
$$ -190 -115 -93 -135 -103 -85 -147 -103 -63 -50 -173 -163 -8 19 -6 167 103 -59 -67 -21 -31 -27 57 156 80 -126 45 73 126
5109A26q3q5J00J15j34J32j12O5M1n7o8o9J09r0m3K6N5j52J86j62Q5q3J6Q4j02
$$ 126 43 -42 58 173 39 171 59 124 165 108 40 -29 80 -10 -53 -27 28 -124 62 -100 -15 -98 -82 2 -100
5134a00M5O7L2o3k13J53m3J1N4LN4l9M2m4m6LP1J8O9j48J72j16K12j28J7r2J4
$$ -100 -55 12 44 -19 -232 -79 -122 -111 -57 -54 0 -39 3 -41 -87 -84 -13 5 74 -74 98 -18 194 66 83 -9 5
5161EO2nl0J38j12qQ6Q5j21j0ok5J15qj16Rm5M0Q2j51J7K3q0j4J44o0l8R3j53
$$ 5 67 62 32 170 58 50 136 221 100 90 84 59 174 166 50 59 14 54 136 -15 2 25 -55 -69 75 15 -23 70 -83
5190h3J0j5P9j83J86Ko1PpRP9j50O4L3O7m7L7l3Q1n9m1N3o5J1O8J07j18P3k9j35
$$ -83 -73 -88 -9 -192 -6 -4 -65 -58 -65 -56 23 -127 -63 -30 37 -10 27 -6 75 16 -25 28 -37 -26 42 149 31 104 75 -60
5220f0Q1J2N1j5j48J57L0k2j8Oo4O7J0L6l1q4J03q7m6J25k18N8JLOj14O8o5M8
$$ -60 21 33 84 69 -79 78 108 86 68 74 10 77 87 123 92 8 111 24 -22 103 -115 -57 -56 -53 -47 -161 -93 -158 -110
5249a10M6oqn6M4P7j13JL5P1M1l0k7J19j23q6Q9J9R8r8K1J7%J57j75K8J13j56
$$ -110 -64 -70 -78 -134 -90 -13 -126 -125 -90 -19 22 -8 -35 84 -39 -125 -36 -17 81 -17 4 21 21 178 3 31 144 -12
5277a2N9J7L3m5K2j00Q7r0R5R1n2m4k3J7O7Oj09o5km7J5j34J69o6Oo4J13j82K56
$$ -12 47 64 97 52 74 -26 61 -29 66 157 105 61 38 55 122 128 19 -46 -48 -95 -80 -214 -45 -111 -105 -169 -56 -238 18
5306A8j21j45K34q5mn6J74r6J3rj0Q3j01L0M4P2kq5MJ46p6o9lj4J81j7o5L8j08
$$ 18 -103 -248 -14 -99 -103 -159 15 -81 -68 -77 -87 -4 -105 -75 -31 41 39 -46 -42 104 28 -41 -44 -58 123 106 41 79 -29
5335b9N8J26r5M2r0N7J4n0Oj0qPQ5n1j0r1m4L9k4l3J18j4j08P8J08n3k8q2qP0
$$ -29 29 155 60 102 12 69 83 33 39 29 21 28 113 62 52 -39 -83 -44 -68 -101 17 3 -105 -27 81 28 0 -82 -90 -20
5365b0N6k1l5j5j04P8J25m8K6q3%O9M6q8J88j32Ll5l8J54j23L2P5j69R1qN4J06
$$ -20 36 15 -20 -35 -139 -61 64 16 42 -41 -41 28 74 -14 174 42 45 10 -28 126 3 35 110 -59 32 24 78 184
5393A84p8o2kj8J93q3j10p9k9J60o1M3m2r3J08RN6k37K1K4J32j02Qm9p2K61o8
$$ 184 106 44 42 24 217 134 24 -55 -84 76 15 58 16 -77 31 40 96 -141 -120 -96 36 -66 -58 -107 -179 82 14
5420A4j64J23r7m1N6J18M5p4K9P0k99L20j43M9n1M9mn2J90j76R0n0Q7L9n6P1j15
$$ 14 -150 -27 -124 -165 -109 9 54 -20 9 79 -220 100 -43 6 -45 4 0 -52 138 -38 52 2 89 128 72 143 28
5447B8P7P5r2m8M4m4R3j22P7J12j62p7R1N3r6l7n7J7J9k8J42j80J30j00Qj4J2
$$ 28 105 180 88 40 84 40 133 11 88 200 38 -39 52 105 9 -28 -85 -68 -49 -77 65 -115 15 -85 -77 -91 -79
5474g9n7mJ04K5L5q2j42M4R6jpM3q3Q0N3L2l6n9P1m9q5K25j11Q2m6P0o3O8j8r7
$$ -79 -136 -140 -36 -11 24 -58 -200 -156 -60 -61 -68 -25 -108 -28 25 57 21 -38 33 -16 -101 124 13 95 49 119 56 124 106 9
5504IM8r7P8J25Ko2n0l2N8K3j02k1L2J52j52O2j1j31MN3K4k4qL6j49J15j01j4
$$ 9 57 -40 38 163 165 103 53 21 79 102 0 -21 11 163 11 73 62 -69 -65 -12 12 -12 -20 16 -133 -18 -119 -133
5532a33pK5RQ9j21K12j66P8Kj0k1l4J35l6p0J52j07M8q5n4J34oL8p3mJ46j7j3
$$ -133 -140 -115 -106 -17 -138 74 -92 -14 -12 -22 -43 -77 58 22 -48 104 -3 45 -40 -94 40 34 72 -1 -5 141 124 111
5560A11p6lJ2Q3q4j3L5j29J13L8K8j79OK8O9P0j68O4K9j12M2r3J03j7n8Q9m2l5
$$ 111 35 32 44 127 43 30 65 -64 49 87 115 -64 -58 -30 39 109 -59 5 34 -78 -36 -129 -26 -43 -101 -12 -54 -89
5588h9P6j2j07lO3j01P3N8p9Q3j1R7Q3j65K4l8Q7j1O0m8o2k7J26j7P2J5j52P8
$$ -89 -13 -25 -132 -135 -72 -173 -100 -42 -121 -38 -49 48 131 -34 -10 -48 39 28 88 40 -22 -49 77 60 132 147 -5 73
5616G3NL6o5Pp4J21m5R7j59K21k41P2o5j8j23J26Kl3o0L4L5j8K1Qj8p5O4k4k4
$$ 73 78 114 49 56 -18 103 58 155 -4 217 -24 48 -17 -35 -158 -32 -30 -63 -123 -89 -54 -72 -51 -43 -61 -136 -72 -96 -120
5645a20KO8K0j19O5P0j04Q7r7J50j36k1J77k7j4n4P3j04Q2J5J38j03n3O8O4ko5
$$ -120 -118 -50 -30 -149 -84 -14 -118 -31 -128 22 -114 -135 42 15 1 -53 20 -84 -2 13 151 48 -5 63 127 125 60
5672F0P7m7J9r3J8R8n1o8J49J0r7qqp4j9Q5q8J6J2q1J20j88J98Po5m8J16q7JJ41
$$ 60 137 90 109 16 34 132 81 13 162 172 75 67 59 -15 -34 51 -37 -21 -9 -90 30 -158 40 47 -18 -66 50 -37 -36 105
5702A05k10P5r8O6l8j8J59j38j9K8M7M4K3n2k2J75o0NK1j5j35K20j05j4j3N2o7
$$ 105 -105 -30 -128 -62 -100 -118 41 -97 -116 -88 -41 3 26 -26 -48 127 67 72 93 78 -57 163 58 44 31 83 16
5729A6J40j83J97j05k3J46j04q0K1M9p5o7J76q2l8l7J13m3r7Q5q2J7N6n8o5L5
$$ 16 156 -27 170 65 42 188 84 4 25 74 -1 -68 108 26 -12 -49 64 21 -76 9 -73 -56 0 -58 -123 -88
5755h8Q9o6n0O6pq0J00q5l2J13k2O5j7n0J67k33P0Qln1J28L8p1M1P8J3j85L7J06
$$ -88 1 -65 -115 -49 -56 -136 -36 -121 -153 -40 -62 3 -14 -64 103 -130 -60 -52 -55 -106 22 60 -11 30 108 121 -64 -27 79
5784G9J15k0l5n2J4l8l8L3K4K9J00k69K48j92N5j6j41N9l9J07l4n0Q0n7P0o4P4
$$ 79 194 174 139 87 101 63 25 58 82 111 211 -58 190 -2 53 37 -104 -45 -84 23 -11 -61 19 -38 32 -32 42
5811D2j74J80j08Rj02J95j3l6o4J9j04Q8J93k33R6l2P5l6K15j63M3j33J46o6J
$$ 42 -132 48 -60 -51 -153 42 29 -7 -71 -52 -156 -68 125 -108 -12 -44 31 -5 210 47 90 -43 103 37 38
5836C8l2k5kK4R4N6j55L0O9o7K5P3n7k07K75qo2k2l5R1l1m0M2j11LN3r2L2J6j17
$$ 38 6 -19 -21 3 97 153 -2 28 97 30 55 128 71 -136 139 131 69 47 12 103 72 32 74 -37 -34 19 -73 -41 -25 -142
5866a42J53j36J36q4j7M1q6J5Q7j1j9K09k26N6j11O8R3J1l7P3p7L0k6P9J1%l0
$$ -142 11 -125 11 -73 -90 -49 -135 -120 -33 -44 -63 146 -80 -24 -135 -67 26 37 0 73 -4 26 0 79 90 90 60
5893F0P6ql1r5J82j55Kn2l3J95p6J09j45j12J59q6P6m0J8J6j39J73j76K01j11
$$ 60 136 128 97 2 184 29 31 -21 -54 141 65 174 29 -83 76 -10 66 26 44 60 -79 94 -82 119 8
5918HK1m4o2M7K4K9j07j4K3j5R2j33O0K7J01j46o8J24j3l5J96k03R1J00j22Q8
$$ 8 29 -15 -77 -30 -6 23 -84 -98 -75 -90 2 -131 -71 -44 57 -89 -157 -33 -46 -81 115 -88 3 103 -19 69
5944F9j24J25Qp5j7o7J26Lp3l8K19p4qo9P0np5L3l5n8P7n3N3l7mj46O6K17j57
$$ 69 -55 70 78 3 -14 -81 45 48 -25 -63 156 82 74 5 75 70 -5 28 -7 -65 12 -41 12 -25 -29 -175 -109 108 -49
5973d9P9p4J15o5l3p3j4K0J11j9Pp6M8q9J25m7J6j72J36M4n9M0N0R4j18m6J36
$$ -49 30 -44 71 6 -27 -100 -114 -94 17 -2 5 -71 -23 -112 13 -34 -18 -190 -54 -10 -69 -29 21 115 -3 -49 87
6000H7kQ2j26mm7J58j71M8k6J57j37L9l8j0j05L1K20j53o4l0M2n0J52rN5j36m8
$$ 87 85 167 41 37 -10 148 -23 25 -1 156 19 58 20 10 -95 -64 156 3 -61 -91 -49 -99 53 44 99 -37 -85
6027h5oJ11l2k6M3n4l7P2q1%J41j04j6M1m6N3qO7j05J58m5j77Q6j4J9Nl9J80j11
$$ -85 -91 20 -12 -38 5 -49 -86 -14 -95 -95 46 -58 -74 -33 -79 -26 -34 33 -72 86 41 -136 -50 -64 -45 -40 -79 101 -10
6056a0r8Q8q8J35PQ3j80J90n3P6j64L2M6Lj4k2N0L8l1o9J06j22j1L8jm3M9Lkj45
$$ -10 -108 -20 -108 27 34 117 -63 127 74 150 -14 18 64 67 53 31 81 119 88 19 125 3 -8 30 29 -14 35 38 36 -109
6086a09K37j37p4J17j01j5J24q0J5pM4j29L3P1J19j84Q7r1O0J0l0M7J5R1j87J65
$$ -109 128 -9 -83 34 -67 -82 42 -38 -23 -30 14 -115 -82 -11 108 -76 11 -80 -20 -10 -40 7 22 113 -74 91
6112I1o3L2k44J61RK8j9j3J08j18J03j1o7Q2p7N8j06J42o9J08j65J29j14J38j27
$$ 91 28 60 -184 -23 -14 14 -5 -18 90 -28 75 64 -3 79 2 60 -46 96 27 135 -30 99 -15 123 -4
6137dk4pL0q7J03n6o5N1K6q6J19J6j09R5j7n4J2j3l6K7o2J62l5O4l7j1j30J13
$$ -4 -28 -35 -5 -92 11 -45 -110 -59 -33 -119 0 16 -93 2 -15 -69 -57 -70 -106 -79 -141 21 -14 50 13 2 -128 -15
6165a5M5j0j02N2rJ44o9J32j59M3n6P3q2Q9l9j46J96p9n5K7J44k12K01j84P0M3
$$ -15 30 20 -82 -30 -39 105 36 168 9 52 -4 69 -13 76 37 -109 87 8 -47 -20 124 -88 113 -71 -1 42
6191D2N4q4o1Q2q7n8nL6j6J44o2lLk3M3j54jO1k8O4J9Q2q2M7j13J3M5k7k4RP8
$$ 42 96 12 -49 33 -54 -112 -117 -81 -97 47 -15 -18 -15 -38 5 -149 -150 -89 -117 -53 -34 48 -34 13 -100 -87 -42 -69 -93 -84 -6
6222fP2k8n9M2m3P8K4l8J74n7j61K0K4j8J44j09n0N0n6J61j08kL2j07l8J04q2
$$ -6 66 38 -21 21 -22 56 80 42 216 159 -2 18 42 24 168 59 9 59 3 164 56 54 86 -21 -59 45 -37
6249c7K5Q9j49l2O2lJ13l8n1lQN0r0J54j57n4R3K9N3k8j54J90k23K01j9j01np
$$ -37 -12 77 -72 -104 -42 -45 68 30 -21 -24 -16 34 -56 98 -59 -113 -20 9 62 34 -120 70 -153 48 29 -72 -77 -84
6277h4oJ2J4M2J19l7jo2J21j49K4N3M3Q2k28J18j49J85p4O0K9o6k2pP6j1M7j37
$$ -84 -90 -78 -64 -22 97 60 59 -3 118 -31 -7 46 89 171 -57 61 -88 97 23 83 112 46 24 17 93 82 129 -8
6305hK1R4j83k7J50j21L4NN2j23Q8J8K2m6L0N5o4j02J88k15O3O0P2j45Q4j17N9
$$ -8 13 107 -76 -103 47 -74 -40 -35 17 -106 -18 0 22 -24 6 61 -3 -105 83 -132 -69 -9 63 -82 2 -115 -56
6332e6M7N2o2j04J75k3m1O2k0n1P9r3P6m7Ol5J45m8k2PK8j37Q2j1Q6m1J3k2M4
$$ -56 -9 43 -19 -123 52 29 -12 50 30 -21 58 -35 41 -6 0 -35 110 62 40 47 75 -62 20 9 95 54 67 45 89
6361H9j33j5J74k45L4J22l2l6P6k40J72k7m4P9j1K4j8q4M2P2J5k0j57J45J01j66
$$ 89 -44 -59 115 -130 -96 26 -6 -42 34 -206 -34 -61 -105 -26 -37 -13 -31 -115 -73 -1 14 -6 -163 -18 83 -83
6387h3R8Lj3k7q9J45rq5J00j63J48k2l3O6j06J34q4P0L6n5J04j54o6Q9J8L6l4
$$ -83 15 18 5 -22 -111 34 25 -60 40 -123 25 3 -30 36 -70 64 -20 50 86 31 135 -19 -85 4 22 58 24
6414B4m9R3o7q3J01J1m3pM0NJ5j30M6Ok6Q4j17J36L5p2l9n8Q5q4K2m8J65l0L5
$$ 24 -25 68 1 -82 19 30 -13 -20 20 25 40 -90 -44 -38 -64 20 -97 39 74 2 -37 -95 -10 -94 -72 -120 45 15 50
6443E0j89M7Q0N5Q6j69J19j05J47j53p5K40j67J54o5Ln1Mj9K20k28J09k9o6L0
$$ 50 -139 -92 -12 43 129 -40 79 -26 121 -32 -107 133 -34 120 55 58 7 11 -8 212 -16 93 64 -2 28
6468B8p9L0j1q1J78q6J4M6j1r5K7q9J34o1R6j86O6q5K09j22n8J9j02J99rrOp8
$$ 28 -51 -21 -32 -113 65 -21 -7 39 28 -67 -40 -129 5 -56 40 -146 -80 -165 44 -78 -136 -117 -219 -20 -29 -38 -32 -110
6496a10kP0q5J20j29L21l01N3j1J5R3j3k6RkoN4p5J16M8m5n6L8Ol8j7l8P2jK4
$$ -110 -112 -42 -127 -7 -136 185 -116 -63 -74 -59 34 21 -5 4 2 -4 50 -25 91 139 94 38 76 82 44 27 -11 61 60 84
6526H4l6Q3q2r8R2j28J19Q3r5k0p0nR2j80J78r5R0j30J38j24o9K19j38Q8m2J3
$$ 84 48 131 49 -49 43 -85 34 117 22 2 -68 -73 19 -161 17 -78 12 -118 20 -104 -173 46 -92 -4 -46 -33
6552c3K4j27R5J2l0J21k7j24P8M5Po4K8J3pk8J26m5j1j13j6K15r5J30r7j15N8
$$ -33 -9 -136 -41 -29 -59 62 35 -89 -11 34 41 -23 5 18 11 -17 109 64 53 -60 -76 139 44 174 77 -38 20
6579B0K5%m7L9q1Q8N6o5O2q8L1kj06P0n8K23j05l0n0J4j43K0J01j90K08K9j04
$$ 20 45 45 -2 37 -44 44 100 35 97 9 40 38 -68 2 -56 167 62 32 -18 -4 -147 -127 -26 -216 -8 21 -83
6606h3k0J41r8O1j32K14k18J02o2L2J3J00p9K7J7%L6rQ5j27ko8J57O7j33o3k2
$$ -83 -103 38 -60 1 -131 83 -135 -33 -95 -63 -50 50 -29 -2 15 15 51 42 127 0 -2 -70 87 154 21 -42 -64
6633f4J05m6j24K07j90J11j8j7Q2j76J83j06K3P2j82J63kK7l9Q5j91P3p9Mo0R5
$$ -64 41 -5 -129 78 -112 -1 -19 -36 46 -130 53 -53 -30 42 -140 23 21 48 9 94 -97 -24 -103 -99 -159 -64
6659f4J5k0J42Oj41q6J79j6n8o7J8J31n9n8J02j45J38O8n8J00k45J30L5kM3p4
$$ -64 -49 -69 73 79 -62 -148 31 15 -43 -110 -92 39 -20 -78 24 -121 17 85 27 127 -118 12 47 45 88 14
6685A4N3n9K6r1K9N6n8J4O0J4j36O5M0K6j26J78j44J5J90k54J30k6Mj03J00lM6
$$ 14 67 8 34 -57 -28 28 -30 -16 44 58 -78 -13 27 53 -73 105 -39 -24 166 -88 42 16 20 -83 17 14 60
6712F0j52Q8J32m7o6j15m3RJ22nO5j34J29l3r1J38pj30P0o1J34l2Ll7K9Qq1J65
$$ 60 -92 -4 128 81 15 -100 -143 -134 -12 -17 48 -86 43 10 -81 57 50 -80 -10 -71 63 31 34 -3 26 34 -47 118
6740A18p8rL3N5p8l8J40j22R7k31J34o1K04q6k4k0Pj01J12n7MN6K5M8r7j05P5
$$ 118 40 31 64 119 41 3 143 21 118 -113 21 -40 164 78 54 34 41 -60 52 -5 -1 55 80 128 31 -74 1
6767Ao7l9K9Q0o7kJ25l3j02K4K7o6k5J11K0R9j58K5k0L0L4k7j09J74j93J74Kj80
$$ 1 -66 -105 -76 4 -63 -65 60 27 -75 -51 -24 -90 -115 -4 16 115 -43 -18 -38 -8 26 -1 -110 64 -129 45 47 -133
6795a33J84n9Q9j11J70j14LL0K7r4N4jK8j86K7P3L7R7j93OJ63j62J38K6j97R8
$$ -133 51 -8 81 -30 140 26 29 59 86 -8 46 45 73 -113 -86 -13 24 121 -72 -66 97 -65 73 99 -98 0
6821@p2R5K3j0O6j84J5J82J8k24NM2J5J9L5R0j49J26k1l8K2j30J5J10j31K02o4
$$ 0 -72 23 46 36 102 -82 -67 115 133 -91 -86 -44 -29 -10 25 115 -34 92 71 33 55 -75 -60 50 -81 121 57
6848E7m9J4K9p8M1N0k1M1m2J1k3M1o1O3l0K45k32j45N9J25j84Q8No8J02J2j46
$$ 57 8 22 51 -27 14 64 43 84 42 53 30 71 10 73 43 288 56 -89 -30 95 -89 -1 4 -64 38 50 -96
6875i6R6k5mq3J14l6m0J07l6Rj05J69m3N9j17r3Q6k0K1o6Q7k0k8O6Kj06J10M6
$$ -96 0 -25 -29 -112 2 -34 -74 33 -3 6 -99 70 27 86 -31 -124 -38 -58 -37 -103 -16 -36 -64 2 4 -102 8 54
6903E4L6j16J77j93mO3p3J04Kk3J7k6K25j67j1j81J61j88Q1J44r3N1Q3j87R1j58
$$ 54 90 -26 151 -42 -46 17 -56 48 50 27 44 18 243 76 65 -116 45 -143 -62 82 -11 40 123 -64 27 -131
6929a31K70j32p0L0K5N3r3p2J59j46P6J05k09J21j32J24L6Nj00L2k0J2l7L6J12
$$ -131 139 7 -63 -33 -8 45 -48 -120 39 -107 -31 74 -135 -14 -146 -22 14 19 -81 -49 -69 -57 -94 -58 54
6954E4J1p3K6j20J21Pm6P8J07p3j29J34q4PK3R4r7Pp0n6N9J17r4J48j85P3k5K3
$$ 54 65 -8 18 -102 19 26 -20 58 165 92 -37 97 13 20 43 137 40 47 -23 -79 -20 97 3 151 -34 39 14 37
6982C7r0L4M1K1N2m5j05R6J3j05OJ6L2r4P5N0j14R5m2R6j52l0J32j7Q6j18m7M7
$$ 37 -53 -19 22 43 95 50 -55 41 54 -51 -45 -29 3 -91 -16 34 -80 15 -27 69 -83 -113 19 2 88 -30 -77 -30
7010c0P4j71J20R2p8J21j08n7J7k3P0r3J00l7J2M6k6Q4n0P4j19n7j4l1J62l1O3
$$ -30 44 -127 -7 85 7 128 20 -37 -20 -43 27 -66 34 -3 9 55 29 113 63 137 18 -39 -53 -84 78 47 110
7037A10n6j0k0n3Op6R4N0mr3J24p5L2j5n6j6L7j00Q9K9r0k0J07p3J29J4m1r0L7
$$ 110 54 44 24 -29 -23 -99 -5 45 41 -52 72 -3 29 14 -42 -58 -21 -121 -32 -3 -93 -113 -6 -79 50 64 23 -67 -30
7066c0m6J87k8j57N1M9J9p5L7M9Nk6j27J47k5k6R0Lj9j39Q8N8n3rO3Nj24R2N9
$$ -30 -76 111 83 -74 -23 26 45 -30 7 56 61 35 -92 55 30 4 94 97 78 -61 27 85 32 23 86 91 -33 59 118
7095A18k52J84k30J95K0q3r1J51np5R1j7P5j11O3j78J31l0J30l6k5m6l2lJ25j75
$$ 118 -134 50 -180 15 35 -48 -139 12 7 -68 23 6 81 -30 33 -145 -14 -44 86 50 25 -21 -53 -56 69 -106
7121a06J17N8j50O2o2R7l1p0J39j49M2J41o9QoP6J7j10L4j14p2J40J32j26J0o0
$$ -106 11 69 -81 -19 -81 16 -15 -85 54 -95 -53 88 19 27 21 97 114 4 38 -76 -148 -8 124 -2 8 -52
7147e2j08J72L1n4j8R5k6J6o9J6q6O4m6LM2q1J19K3j21K06k41J12pl9L1n7l5J10
$$ -52 -160 12 43 -11 -29 66 40 56 -13 3 -83 -19 -65 -62 -20 -101 18 41 -80 126 -115 -3 -10 -49 -18 -75 -110 0
7175@q6J14k9j22J33k0j7N8r7mJ11q5J38kk76K35j19J31j06J36j18K8l5m6j3J13
$$ 0 -86 28 -1 -123 10 -10 -27 31 -66 -70 41 -44 94 92 -184 51 -68 63 -43 93 -25 3 -32 -78 -91 22
7201B2J7L5J0o0j43J88K3o8P7j47l2L9Q6m2J4L6O7j40N2j2j3L0j70J59j07o9L1
$$ 22 39 74 84 24 -119 69 92 24 101 -46 -78 -39 47 5 19 55 122 -18 34 22 9 39 -131 28 -79 -148 -117
7228a17R9J9mp0N5M8K3p1j44P6J46j81K22o7%l5JK7pJ5j7M0k1j08R0J13j12R1
$$ -117 -18 1 -3 -73 -18 30 53 -18 -162 -86 60 -121 101 34 34 -1 0 27 20 35 18 58 37 -71 19 132 20 111
7256A11J6O9j19l8n0Q4k6J50j52o1J5k2l4J29j46M2k7m3M8PJ46l8n1o1l0k1J3
$$ 111 127 196 77 39 -11 73 47 197 45 -16 -1 -23 -57 72 -74 -32 -59 -102 -54 -47 99 61 10 -51 -81 -102 -89
7283h9M0k2J37p5r6Q1k1J03j45o4J10O1O0l0MN8j50r1J18j7Q2r4oM9Q8n6j80J48
$$ -89 -49 -71 66 -9 -105 -24 -45 58 -87 -151 -41 20 80 50 54 112 -38 -129 -11 -28 54 -40 -46 3 91 35 -145 3
7311CoK0J19j61K7pPJ18p6m6R3j12m0J58q3M1l7N5j29R3o5l8J0J39o3j37J02r
$$ 3 -3 17 136 -25 2 -5 2 120 44 -2 91 -21 -61 97 14 55 18 73 -56 37 -28 -66 -56 83 20 -117 -15 -24
7339b4J38k35O5j04J44n3L1l2n0J83j24J88jj83J15p6M8P1p1n5P1m7j58K97o7
$$ -24 114 -121 -56 -160 -16 -69 -38 -70 -120 63 -61 127 126 -57 58 -18 30 101 30 -25 46 -1 -159 138 71
7364G1r7M2L5M8J0j20N6qq3L7J26r6J7m0k1J46l3q8M6j7m4Jo9O2J9p3O9J5K0p8
$$ 71 -26 16 51 99 109 -11 45 37 -46 -9 117 21 38 -2 -23 123 90 2 48 31 -13 -12 -81 -19 0 -73 -4 11 31 -47
7394d7m7m2J11J09k2k09R1J18J3q8OM3LL7j50N2J22j24LJ5m1J36l3j30J45k3o7
$$ -47 -94 -136 -25 84 62 -147 -56 62 75 -13 -7 36 39 76 -74 -22 100 -24 -21 -6 -47 89 56 -74 71 48 -19
7421a9M3J9j06k5O3J83r9l4P1j11M0l2j9J46l1j4j52P6LO1k66L01j9j90J4J48
$$ -19 24 43 -63 -88 -25 158 59 25 96 -15 25 -7 -26 120 89 75 -77 -1 2 63 -203 98 79 -111 -97 51
7447E1l4o2o5O8P4m9J8p7J24j65N2l6Q8l1J6J49l6j00N3M3q4m4Mk1O6k0N0o9%
$$ 51 17 -45 -110 -42 32 -17 1 -76 48 -117 -65 -101 -13 -44 -28 121 85 -15 38 81 -3 -47 -43 -64 2 -18 32 -37 -37
7476c7L0J19k18J43K0j01Q7KJ3o2k1J28j77J58r1M2pM0k1j5K0j23M8P3qj60J60
$$ -37 -7 112 -106 37 57 -44 43 45 58 -4 -25 103 -74 84 -7 35 28 68 47 32 52 -71 -23 50 42 -118 42
7503D2k08J04R0j15M2K5N8o7l3J1P2j37P8k2J11P7n4Ko1KP9o1j98J92J5k8L6q4
$$ 42 -166 -62 28 -87 -45 -20 38 -29 -62 -51 21 -116 -38 -60 51 128 74 76 15 17 96 35 -163 29 44 16 52 -32
7531c2J62j26K9l2l0O4qJ2J7M1q7L2J7o7k6O0n5m0M8n3J01m2j82K87j51ON1L0
$$ -32 130 4 33 1 -29 35 27 39 56 97 10 42 59 -8 -34 26 -29 -69 -21 -74 27 -15 -197 90 -61 -55 -4 26
7559B6j10P8j2m9J15l5o4J45q2j05K3J54o7l0m2q5R8J16j09J7N2j3n3J22k5j79
$$ 26 -84 -6 -18 -67 48 13 -51 94 12 -93 -70 84 17 -13 -55 -140 -42 74 -35 -18 34 21 -32 90 65 -114
7585a14J47n1J90q1L0j49M4n7O1N6n1K6l6nK0L1q1o3M1J19m5k8N5r8N0J23r3j07
$$ -114 33 -18 172 91 121 -28 16 -41 20 76 25 51 15 10 30 61 -20 -83 -42 77 32 4 59 -39 11 134 41 -66
7613f6O0q1P5o0N9j9J37k02n9J49o3J12q4NJ17q7o5J05J84k45N5J31r7J9j74L5
$$ -66 -6 -87 -12 -72 -13 -32 105 -97 -156 -7 -70 42 -42 -37 80 -7 -72 33 217 -28 27 158 61 80 -94 -59
7639e9P2l7J12q5nN9L2j02J5j44J99N8j76N0j7M2K6m0N8m5p3M1J48q6r2k2O7R4
$$ -59 13 -24 88 3 -2 57 89 -13 2 -142 57 115 -61 -11 -28 14 40 0 58 13 -60 -19 129 43 -49 -71 -4 90
7667I0j76J13r1j33J26l5R6q2R3j01Q5P9k4n9Mj1k3rRJ21rj32L7n1P6J0j6P7j71
$$ 90 -86 27 -64 -197 -71 -106 -10 -92 1 -100 -15 64 40 -19 -15 -26 -49 -58 -49 72 63 -69 -32 -83 -7 3 -13 64 -107
7696a07J53m4N1M5j25J78j4k12J91r1K3j20J88j42LO0N2j42JP6M8m8k2j46J36
$$ -107 46 2 53 98 -27 151 137 -75 116 25 48 -72 116 -26 -23 37 89 -53 -52 24 72 24 2 -144 -8
7721hqp7O9q9N0K0MO8p1l2J07N0j00N0kp9o8R4N6l1mm9jQ4j43J22K1k0R2k5j29
$$ -8 -16 -93 -24 -113 -63 -43 -39 29 -42 -74 33 83 -17 33 31 -48 -116 -22 34 3 -1 -50 -51 33 -110 12 33 13 105 80 -49
7752d9O8n4Q1j83K83j19o1M2j9OO2k2J1K1j11J35m7Rm6o1l8J21l6M9l8M8j1k74
$$ -49 19 -35 46 -137 146 27 -34 8 -11 -5 57 35 46 67 -44 91 44 53 7 -54 -92 29 -7 42 4 52 41 -233
7780b33J70q6O2k6J17j23J00n2J03j36M6J22m4p3l6K04q8J1j35K59j63m3j7P1
$$ -233 -63 -149 -87 -113 4 -119 -19 -71 32 -104 -58 64 20 -53 -89 115 27 38 -97 162 -1 -44 -61 10
7804A0p1J4P0p1J73r2j0M0n7M4Jj0j51J44o0L7M4kO0Q2j80J8j1J27k01J18p7k1
$$ 10 -61 -47 23 -48 125 33 23 63 6 50 51 41 -110 34 -26 11 55 53 113 195 15 33 22 149 -52 66 -11 -32
7832c2R7o6J3m0l0J85o9o9JL9j1j89J35kL4l8L1M0j62k2J08J02lm3L7r0K0m7J1
$$ -32 65 -1 12 -28 -58 127 58 -11 -10 29 18 -171 -36 -38 -4 -42 -11 29 -133 -155 -47 55 52 9 46 -44 -24 -71 -60
7861f0K5j5K4J49j60J54j46K7J1n8M3Q0l8K6o4rL5j01J76j3r1P7j12Q8m9qO1J
$$ -60 -35 -50 -26 123 -37 117 -29 -2 9 -49 -6 74 36 62 -2 -11 24 -77 99 86 -5 72 -40 48 -1 -9 52 53
7889E3j20L0N5k1k7J07Jm5qj00J00L4j44R3j16J0J19j06P3L5k2m3M3l7J32j67
$$ 53 -67 -37 18 -3 -30 77 78 33 25 -75 25 59 -85 8 -108 -98 21 -85 -12 23 1 -42 1 -36 96 -71
7915g1QJ16q3j0J57j22N7K5j9p6J01K3K5k7j2m0n5l0k7L6m0J71p4k2mQ0j25K1
$$ -71 -63 53 -30 -40 117 -5 52 77 58 -18 83 106 131 104 92 52 -3 -33 -60 -24 -64 107 33 11 7 87 -38 -17
7943a7q5J51j40K57j06p7p2J1J09j37J94j76J04m3KJ2m9j2J7l0K2j06K38p2n4
$$ -17 -102 49 -91 166 60 -17 -89 -78 31 -106 88 -88 16 -27 -25 -13 -62 -74 -57 -87 -65 -171 67 -5 -59
7968e9J35p3q7J32q3L7o0Nj0O3j9N3j16N6J28j28j5K5on7J22lp8P6p3M8nn5J0
$$ -59 76 3 -84 48 -35 2 -58 -53 -63 0 -19 34 -82 -26 102 -26 -41 -16 -22 -79 43 40 -38 38 -35 13 8 -47 -37
7997c7J07j68J23Pm8M6j28M7L2O4n2O3Nj81j5K00k12Q2O0K6P0j14O9r8O4r1P0
$$ -37 70 -98 25 32 -16 30 -98 -51 -19 45 -7 56 61 -120 -135 65 -147 -65 -5 21 91 -23 46 -52 12 -79 -9
8024ir1JN9L8oM3J0N5l8j51J18k9J0N2K5p2l8L8O7j5m1MJ1o2nkO8lnLp1o2J02
$$ -9 -100 -99 -40 -2 -8 35 45 100 62 -89 29 0 10 62 87 15 -23 15 82 67 26 30 41 -21 -26 -28 40 37 32 35 -36 -98 4
8057Dm1M1J5lK0j37J19pk0m0J40j56jJ83l5jq7Jj19J68j4j03P6mQ7j42L7j3n4
$$ 4 -37 4 19 16 36 -101 18 11 -9 -49 91 -65 -66 117 82 81 -6 -5 -124 44 30 -73 3 -1 86 -56 -19 -32 -86
8086h6R0kP8p9q5J00Pk1N7l8j6JL6%p1M3O2r0p0M6l7O8N3P8j34O1p7k4O6o1J2
$$ -86 4 2 80 1 -84 16 23 2 59 21 5 6 42 42 -29 14 76 -14 -84 -38 -75 -7 46 124 -10 51 -26 -50 16 -45 -33
8117c3pJ1M8J19r4j49J5J43j29N2L2k9P3m9L8o7RK1n2P2J3K4j25P7P2j16K5L1
$$ -33 -40 -29 19 138 44 -105 -90 53 -76 -24 8 -21 52 3 41 -26 -17 4 -48 24 37 61 -64 13 85 -31 -6 25
8145B5n4O3p5J51p1oJ15j73p4O7P1J0M4o5q6J42m9n5n8Q3J13j95J59o1L2m6l0
$$ 25 -29 34 -41 110 39 33 148 -25 -99 -32 39 49 93 28 -58 84 35 -20 -78 5 118 -77 82 21 53 7 -23
8172b3O2o2kJ03l9J5Rk5l7j1o0q3K15Pj01Kk9rQ7
$$ -23 39 -23 -25 78 39 54 63 38 1 -10 -70 -153 62 69 -32 -30 -59 -68 19
8191A9
$$ Imaginary data points
##PAGE= N=2
##DATA TABLE= (X++(I..I)), XYDATA
0@%%%%%%%%%%%%%%%%%%%jPj4J6j6J6j6J6j7K3k8L0l2L6m2M5n0N7o4P0p7Q5r3J05
$$ 0 0 0 0 0 0 0 0 0 0 0 0 0 0 0 0 0 0 0 0 -1 6 -8 8 -8 8 -8 8 -9 14 -14 16 -16 20 -22 23 -27 30 -34 36 -41 44 -49 56
43E6j17J27j40J59j78J99k24K53k91L38l98M78n94P71j068J667l307J5344N9715
$$ 56 -61 66 -74 85 -93 106 -118 135 -156 182 -216 262 -332 439 -629 1038 -2269 13075 72790
62G2790k0023n5134p951L3184P876k2711m548K5051J4016j0734m792J5724P736
$$ 72790 52767 -2367 -10318 22866 30742 8031 3483 28534 42550 31816 27024 42748 50484
75E0484j9765k3761O61J7332J0269j538j839l26n976j0621n994j110m208o062
$$ 50484 30719 6958 7619 24951 35220 33682 31843 31517 25541 14920 8926 7816 3608 -2454
89b454K563J1534M981j1070j6265o469J881j548p246k904O849Q454M82p387q420
$$ -2454 109 11643 16624 5554 -10711 -17180 -15299 -16847 -24093 -26997 -20148 -11694 -11212 -18599 -27019
104b7019n558k872k5K323N176O676N310k73o206m722R36K870K22J247P494J1130
$$ -27019 -32577 -35449 -35474 -33151 -27975 -21299 -15989 -16262 -22468 -27190 -26254 -23384 -23162 -21915 -14421 -3291
120c291N590k486n052j883J682L311L498M387N970N500J551k411j489N88o09k575
$$ -3291 2299 -187 -5239 -7122 -5440 -2129 1369 5756 11726 17226 18777 16366 14877 15465 14856 12281
136A2281J713P561N876o21l164q90j523n605m107K263M732P19k148q9L49l949
$$ 12281 13994 21555 27431 26810 23646 22756 21233 15628 11521 13784 18516 19235 17087 16998 17347 13398
152A3398p733m960N27K536N2j244j47J1k756n302m702k009R1L68J182J970J041
$$ 13398 5665 705 1232 3768 3820 2576 2429 2440 -316 -5618 -10320 -12329 -12238 -11870 -10688 -8718 -7677
169g677j676l898l322j484l05R72K642K908J144o47m24M60p42j687k37K815L752
$$ -7677 -9353 -13251 -16573 -18057 -18362 -17390 -14748 -11840 -10696 -11343 -11767 -11307 -12049 -13736 -13973 -11158 -7406
186g406K790K090J449n37j701o33J030J890K427L008K272Q47j67j89p10j136m9
$$ -7406 -4616 -2526 -1077 -1614 -3315 -3948 -2918 -1028 1399 4407 6679 7526 7359 7170 6460 5324 5275
203E275J857K358J415N88L11m91j338j695j247n81O05K046J134q63j599j158j001
$$ 5275 7132 9490 10905 11493 11804 11313 9975 8280 7033 6452 7057 9103 10237 9374 7775 6617 5616
220E616j794j725m7P00o1n35k07j69j288k369j811p92J23K39M15O04J3r06j758
$$ 5616 3822 2097 2050 2750 2689 2154 1947 1778 490 -1879 -3690 -4482 -4359 -4120 -3705 -3101 -3088 -3994 -5752
239e752j468p03L77Q23O32L30K75L24m68q88m02J14L97J063J094J096K87N1j29
$$ -5752 -7220 -7923 -7546 -6723 -6091 -5761 -5486 -5162 -5630 -6518 -6920 -6806 -6409 -5346 -4252 -3156 -2869 -2818 -2947
258b947j38j09O15J203R25L93P45R79K51m07k23P12N78O3M10Q06Q31M31m6m36
$$ -2947 -3085 -3194 -2579 -1376 -451 -58 687 1666 1917 1510 1287 1999 2577 2640 3050 3856 4687 5118 5072 4636
278D636m80k46L07M20L04L33L28j39q97q06l36j51k9j20J30J3o19n16m70p12p48
$$ 4636 4156 3910 4217 4637 4941 5274 5602 5463 4566 3760 3424 3273 3244 3124 3254 3267 2648 2132 1662 950 202
299B02m43l0m1k81l86j58p71r05m71J48Po34k60J71J48j84r7l39j92j23NK22M77
$$ 202 -241 -271 -312 -593 -979 -1137 -1908 -2813 -3284 -3136 -3129 -3763 -4023 -3852 -3704 -3888 -3985 -4324 -4516 -4639 -4634 -4412 -3935
322c935N26K64M1m0j40M36M35K72M82R04K98J66L89L57K37J31L97M97L37M79O95
$$ -3935 -3409 -3145 -3104 -3144 -3284 -2848 -2413 -2141 -1659 -755 -457 -291 98 455 692 823 1220 1717 2054 2533 3228
343C228L32k90l11L26L42J95j33R7L47P4m94j11k3k40m69l99k67J37L0j8o73p11
$$ 3228 3560 3270 2959 3285 3627 3822 3689 3786 4133 4207 3713 3602 3579 3339 2870 2471 2204 2341 2371 2353 1680 969
365I69n67n44n01l20M01J69l79p55m66k60l92n34j96J91K30KJ5L0k79k33l1m6
$$ 969 402 -142 -643 -963 -562 -393 -772 -1527 -1993 -2253 -2645 -3179 -3375 -3184 -2954 -2952 -2937 -2907 -3186 -3419 -3450 -3496
387c496J20L18M82O84K30O4M0J88J88J24K45M41N16O95O05P8o6l8J44k61J16O11
$$ -3496 -3376 -3058 -2576 -1892 -1662 -1598 -1558 -1370 -1182 -1058 -813 -372 144 839 1444 1522 1456 1418 1562 1301 1417 2028
409B028R23J2j12J18j41l92m42l1J80J79L80m3j84m76n33n37n12j64L18rj20l18
$$ 2028 2951 2963 2851 2969 2828 2436 1994 1963 2143 2322 2702 2659 2475 1999 1466 929 417 253 571 562 442 124
431A24m30j77n77k91k81J76k30n9J40P6j66k10j76k17l0j93M56L69M06J65l1K4
$$ 124 -306 -483 -1060 -1351 -1632 -1456 -1686 -1745 -1605 -1529 -1695 -1905 -2081 -2298 -2328 -2521 -2065 -1696 -1290 -1125 -1156 -1132
453a132j51p3J34M07M88M18P9K84k3J91n2k20J15K65N43L78j1J61L0o21k67k8
$$ -1132 -1283 -1356 -1222 -815 -327 91 170 454 431 622 570 350 465 730 1273 1651 1640 1801 1831 1210 943 915
475I15M42M1J67q9L8n55j68j72k80j76J38R0k00k13J64k03m05l58k24P8J42PK10
$$ 915 1357 1398 1565 1476 1514 959 791 619 339 163 301 391 191 -22 142 -61 -466 -824 -1048 -970 -828 -821 -611
498f11oj51l72r6M7j06L41J89K45k56K55J67j30k08J64L40J00P8K13J61K77j53
$$ -611 -617 -768 -1140 -1236 -1189 -1295 -954 -765 -520 -776 -521 -354 -484 -692 -528 -188 -88 -10 203 364 641 488
520D88R9k69J51rK84K20M1j00J38k47l51m44L42K31J9k7R8ql29m00l11N1j06K29
$$ 488 587 318 469 460 744 964 1005 905 1043 796 445 1 343 574 593 566 664 656 327 -73 -384 -333 -439 -210
544b10K14j03j62k46o9l73q1K63J68j42qL34Q2j07j37o6P6J40K41J06J86J5K9
$$ -210 4 -99 -261 -507 -576 -949 -1030 -767 -599 -741 -749 -415 -333 -440 -577 -643 -567 -427 -186 -80 106 121 150
567A50mJ16J05m8J63p8nL12L34K9jk19k43j79n9K66J87J62j02j1l81k77l58J95
$$ 150 146 262 367 319 482 404 399 711 1045 1074 1073 854 611 432 373 639 826 988 886 875 494 217 -141 54
591E4k17J55KN9m8l33j36l11r1j99J03O9K62l4o1j00k03j29k3J55K0P6K33N2J61
$$ 54 -163 -8 -6 53 5 -328 -464 -775 -866 -1065 -962 -893 -631 -665 -726 -826 -1029 -1158 -1181 -1026 -1006 -930 -697 -645 -484
616d84K51r4J29q4j11o8M07L68K17L70n0jp6k61R8K56J47L06J46N2r1k17k37j12
$$ -484 -233 -327 -198 -282 -393 -461 -54 314 531 901 851 850 774 513 611 867 1014 1320 1466 1518 1427 1210 973 861
640H61j34J33j9J50J11k1m09l19k22j61j52J6J45L6k51k0j34j36m13k84R9K3Q3
$$ 861 727 860 841 991 1102 1081 672 353 131 -30 -182 -166 -21 15 -236 -256 -390 -526 -939 -1223 -1124 -1101 -1018
663a018q0P0K58M1l34l29r9J39J76L72n0J85K46J63j71j35J24K12J16P3N70J82
$$ -1018 -1098 -1028 -770 -729 -1063 -1392 -1491 -1352 -1176 -804 -854 -669 -423 -260 -431 -566 -442 -230 -114 -41 529 711
685G11J15k30m3q9J64J47J07K53J16M6j03N4j84k33m7k0O1O2J31J71m41k48k69
$$ 711 826 596 553 464 628 775 882 1135 1251 1297 1194 1248 1064 831 784 764 825 887 1018 1189 748 500 231
708B31k13J16o0m9j81K2J34k89k36j95k24m9N2O5N5J71k64k5Rn7k14R8J60L65
$$ 231 18 134 74 25 -156 -134 0 -289 -525 -720 -944 -993 -941 -876 -821 -650 -914 -939 -930 -987 -1201 -1103 -943 -578
732e78qR7K19j04m5J6J88j63K09J87M17K46n8j84l1o8L1PK63J83K34n2j28l00
$$ -578 -586 -489 -270 -374 -419 -403 -215 -378 -169 18 435 681 623 439 408 340 371 378 641 824 1058 1006 878 578
756E78J7K0j73O2R6J40n8k90q9n9k12k07j24K07j63N8k9j57o5j7k46Qj23J57J69
$$ 578 595 615 442 504 600 740 682 392 303 244 32 -175 -299 -92 -255 -197 -226 -383 -448 -465 -711 -703 -826 -669 -500
781e00O5Nj02L1m6o1l7O9J44J25L32J65j02J42j50K8j23k1L73M32j03R2rj86j31
$$ -500 -435 -430 -532 -501 -547 -608 -645 -576 -432 -307 25 190 88 230 80 108 -15 -36 337 769 666 758 749 563 432
806D32j61J98N2Q6R3J02k27j97n0j57k27j46J91J54j41j19k1p3k54k13j09q2P7
$$ 432 271 469 521 607 700 802 575 378 328 171 -56 -202 -11 143 2 -117 -138 -211 -465 -678 -787 -869 -792
829g92Q2J69mJ42k39k47j03l0J32J93K78j4K01Q6%k25n2J32K25J05M65O4K52j82
$$ -792 -710 -541 -545 -403 -642 -889 -992 -1022 -890 -697 -419 -433 -232 -146 -146 -371 -423 -291 -66 39 504 568 820 638
853F38K6j58j3P1J53K77J08J23o2o0l40o3n9M0m9MJ10m6p6o3k95l75j62j12J13
$$ 638 664 506 493 564 717 994 1102 1225 1163 1103 763 700 641 681 632 636 746 700 624 561 266 -109 -271 -383 -270
878b70J4j81R0l4k72k54j58J49k21q3J89J04J39j6j20L3l65J02J80J51J55J49
$$ -270 -256 -437 -347 -381 -653 -907 -1065 -916 -1137 -1220 -1031 -927 -788 -804 -924 -891 -1256 -1154 -974 -823 -668 -519
900e19K77m9j04O6J89o5P3L04J49M47q0J45n1j25J0J72Q0N6J14J75k7m5j32m2
$$ -519 -242 -291 -395 -329 -140 -205 -132 172 321 768 688 833 782 657 667 839 919 975 1089 1264 1237 1192 1060 1018
924A018j43j83jP7o4k20J27j29j62k87n6q0k83K1kk6j96J0r0j24r2o4O7j38J5
$$ 1018 875 692 691 768 704 484 611 482 320 33 -23 -103 -386 -365 -367 -393 -589 -579 -669 -793 -885 -949 -882 -1020 -1005
949a005M0L6j7J14J5j72q2J67J80K87O4J3J44J63p6J9N6M13p4J15Q4J79J29r8
$$ -1005 -965 -929 -946 -832 -817 -989 -1071 -904 -724 -437 -373 -360 -216 -53 -129 -110 -54 359 285 400 484 663 792 694
973F94m5K00o6M5J09j04M2j1nq5p1J29j67q8k76r4J76k84J5R1j59k21p3k12J2
$$ 694 649 849 783 828 937 833 875 864 859 774 703 832 665 577 301 207 383 99 114 205 46 -175 -248 -460 -448
998d48k9j4j7n7n3k27m0Q1j27J85O8o6J03j85J33K20NR2O3p7J39J85ML4J33J48
$$ -448 -477 -491 -508 -565 -618 -845 -885 -804 -931 -746 -678 -744 -641 -826 -693 -473 -468 -376 -313 -390 -251 -66 -62 -28 105 253
1024B53J66p0j26K58R4j3j14J56J97J29k39p0L3j29Q7k9J19M9j35l15L9k07m9
$$ 253 419 349 223 481 575 562 448 604 801 930 691 621 654 525 612 583 702 751 616 301 340 133 84
1047H4m4J3m0O0j55j85k06P5p6n4l8j4J03j83J0r8P1j49J50kJ25L9NmJ62J1K2
$$ 84 40 53 13 73 -82 -267 -473 -398 -474 -528 -566 -580 -477 -660 -650 -748 -677 -826 -676 -678 -553 -514 -509 -513 -351 -340 -318
1074c18K0L29r4J37P3L2K08k0Q6j62R4K07j7L7M3Q0P4j37q8kP2j06J43k32O4l0
$$ -318 -298 31 -63 74 147 179 387 367 453 291 385 592 575 612 655 735 809 672 584 582 654 548 691 459 523 493
1100D93j00n6j33k06N3r3q7m4j8j6m2k00j45J07j63K1j6O6M6k7l2k3k12Q4L1J86
$$ 493 393 337 204 -2 51 -42 -129 -173 -191 -207 -249 -449 -594 -487 -650 -629 -645 -579 -533 -560 -592 -615 -827 -743 -712 -526
1126e26K24L0K9R8q3k15J27Q5L04L7P2J24J34n3n2r0K15J5P2j1M3J05NNk63j0
$$ -526 -302 -272 -243 -145 -228 -443 -316 -231 73 110 182 306 440 387 335 245 460 475 547 536 579 684 689 694 431 421
1152D21J17j80o0R6l4jLn1j88k54m2q9K1j57K46L3j05k91K9k04QK7mL07Mn7j10
$$ 421 538 358 298 394 360 359 362 311 123 -131 -173 -262 -241 -398 -152 -119 -224 -515 -486 -690 -682 -655 -659 -352 -348 -405 -515
1179e15K4J39k02O2J21K9J41K55L0p3J40N3J26k70O9K69K4n2L01%k8p8k5Nj64
$$ -515 -491 -352 -554 -492 -371 -342 -201 54 84 11 151 204 330 60 129 398 422 370 671 671 643 565 540 545 381
1204C81K06q2J57j30J65j53k62k13j03R1R5j41l6J4j37j36j99k4j00R6q1J01j0
$$ 381 587 505 662 532 697 544 282 69 -34 57 152 11 -25 -11 -148 -284 -483 -507 -607 -511 -592 -491 -501
1227e01r4m8Mr2L6k9P5L1P7J15R5J4n2J81mj10P8J74J94J67J66j7n3o8L4J75J5
$$ -501 -595 -643 -639 -731 -695 -724 -649 -618 -541 -426 -331 -317 -369 -188 -192 -302 -224 -50 144 311 477 460 407 339 373 548 563
1254E63Q6Q0P6Q2l2o3r1L2k03J06m9N9Jj02j03j89j03J44j93p9j12J6p1j34r7
$$ 563 649 729 805 887 855 792 701 733 530 636 587 646 647 545 442 253 150 294 101 22 -90 -74 -145 -279 -376
1279c76j20o6k1j21J8p6N1k7M2j00l5K8J0J6R3O0J35P2k3l3J14O0J83J35M7N9
$$ -376 -496 -562 -583 -704 -686 -762 -711 -738 -696 -796 -831 -803 -793 -777 -684 -624 -489 -417 -440 -473 -359 -299 -116 19 66 125
1305A25J4K65l3N3J74r1K8KJ07K8J36k12J38L9m1j75M0N9j2p4l5l3j58o6k70J09
$$ 125 139 404 371 424 598 507 535 537 644 672 808 596 734 773 732 557 597 656 644 570 535 502 344 278 8 117
1331A17j83J11o7j25j01j8m8j73k2j8k7P8j49m5l9Rj46J70J47lJ19j04J6J0J45
$$ 117 -66 45 -22 -147 -248 -266 -314 -487 -509 -527 -554 -476 -625 -670 -709 -700 -846 -676 -529 -532 -413 -517 -501 -491 -346
1356c46J07L9R2j39J87O0O5J87k1J30L7M0o5K4J10k7r7L20rJ5j54j97n7J6P4l3
$$ -346 -239 -200 -108 -247 -60 0 65 252 231 361 398 438 373 397 507 480 383 703 694 709 555 358 301 317 391 358
1382C58M3k4l5j01k96P5q3K4p8N7n9q1o3J0m8j67l9J27j32J03k9%J73m9R0o6n6
$$ 358 401 377 342 241 -55 20 -63 -39 -117 -60 -119 -200 -263 -253 -301 -468 -507 -380 -512 -409 -438 -438 -265 -314 -224 -290 -346
1409c46L1J06RQ6J70R2M2n0j09J09j01O7K02J68P3r6j09M3r4n0K18n3O4m0m6J08
$$ -346 -315 -209 -200 -114 56 148 190 140 31 140 39 106 308 476 549 453 344 387 293 243 461 408 472 432 386 494
1435D94j85k33O7j51K5k09J25J13m8j25j42j8j13r0p4l7N1J54Q1j10J6j33Qj2
$$ 494 309 76 143 -8 17 -192 -67 46 -2 -127 -269 -287 -400 -490 -564 -601 -550 -396 -315 -425 -409 -542 -534 -546
1459e46p9Q8J45K62Qm4%p4R5k1N6K10J21K50pJ10p7jq7O6m4Q6J38J26j05J7J0
$$ -546 -625 -537 -392 -130 -122 -166 -166 -240 -145 -166 -110 100 221 471 464 574 497 496 409 475 431 517 655 781 676 693 703
1486G03j40j10k1Nn2J29o3L1j73p6k56r8qj43Q7o3J3l6j16kp2j50n6j7J71j53
$$ 703 563 453 432 437 385 514 451 482 309 233 -23 -121 -129 -272 -185 -248 -235 -271 -387 -389 -461 -611 -667 -684 -513 -666
1512f66J5P9L6j3N8j18K9M5Q0O4K04Q1Pm0J7k1N5J77Q0K86R3O1l4n0k5m3M7J62
$$ -666 -651 -572 -536 -549 -491 -609 -580 -535 -455 -391 -187 -106 -99 -139 -122 -143 -88 89 169 455 548 609 575 525 500 457 504 666
1540F66L1K5N1J10k91q4L6r9O3L1j46j53J10j73j0l7j2k89L7o9j77J49j35o4m9
$$ 666 697 722 773 883 592 508 544 445 508 539 393 240 350 177 167 130 118 -171 -134 -203 -380 -231 -366 -430 -479
1565d79k8r6lL4j09J15J3k4J55qj48J44M4j70J55J69Q5q3L4N3K21j29R3K40N2
$$ -479 -507 -603 -606 -572 -681 -566 -553 -577 -422 -430 -578 -434 -390 -560 -405 -236 -151 -234 -200 -147 74 -55 38 278 330
1590C30k2R5L5p9l4J89j6k13J56J26p3Q8q9J46j36j46j99R8j4LNp1O7k19q1n8
$$ 330 308 403 438 359 325 514 498 285 441 567 494 582 493 639 503 357 158 256 242 245 250 179 246 27 -54 -112
1616a12q7n5L3p8n1%m6l6Q1j95n7Q2P0n6J87N1o0P5m6J40j45J14J79m0K21j44
$$ -112 -199 -254 -221 -299 -350 -350 -396 -432 -351 -546 -603 -521 -451 -507 -320 -269 -329 -254 -300 -160 -305 -191 -12 -52 169 25
1642B5K6L0Q5p6J62L7J20r2J05J88j47j5p4l9K6L5J92j51lp8j28J6j84n6J37n5
$$ 25 51 81 166 90 252 289 409 317 422 610 463 448 374 335 361 396 588 437 434 356 228 244 60 4 141 86
1668H6m1k5j19Jj59j72J28j53J8J58j13K7l1Pj08k5o6O7j25J99J97M7J08j95P3
$$ 86 45 20 -99 -98 -257 -429 -301 -454 -436 -278 -391 -364 -395 -388 -496 -521 -587 -520 -645 -446 -249 -202 -94 -289 -216
1693b16M2j24J56J18J26J82K9R5j15j27J23Q7j3J13J1k1J62o7j72L6j04o0M7q
$$ -216 -174 -298 -142 -24 102 284 313 408 293 166 289 376 363 476 487 466 628 561 389 425 321 261 308 300
1717C00P9p3j5k5j33Lr2k24O7q5p7P5O0r8k5r4o2r3r1J21J28ol3Q0j84%JM1k6
$$ 300 379 306 291 266 133 136 44 -180 -113 -198 -275 -200 -140 -238 -263 -357 -419 -512 -603 -482 -354 -360 -393 -313 -497 -497 -496 -455 -481
1746d81J43J8J34l9J69k7m4O5M2J69L6QQ9j2Q8P8o7O9R5k00O5O5l8N4J3k1q3p3
$$ -481 -338 -320 -186 -225 -56 -83 -127 -62 -20 149 185 193 282 270 358 436 369 438 533 333 398 463 425 479 492 471 388 315
1774C15n6J5j37J8P7L5j06j84o6o8p2q4j1J13j28L1J03j78K2j1j49J39k4m1J32
$$ 315 259 274 137 155 232 267 161 -23 -89 -157 -229 -313 -324 -211 -339 -308 -205 -383 -361 -372 -521 -382 -406 -447 -315
1799c15m9R1Q8r8o0KQ8l7J34J20k5K82j04j4J47n1R9O3n8N5J47j07N7o5q0J27
$$ -315 -364 -273 -185 -283 -343 -341 -253 -290 -156 -36 -61 221 117 103 250 199 298 361 303 358 505 398 455 390 310 437
1825D37j14n7L6O9l9j22Joj43q2p0J29j7p8n6K1o1p7J5q1o9M7j44K47j47L6p3
$$ 437 323 266 302 371 332 210 211 205 62 -20 -90 39 22 -56 -112 -91 -152 -229 -214 -295 -364 -317 -461 -214 -361 -325 -398
1852c98k4J6J4M8K6J11l0pP8PQ9p4Q8J59P2n3N5k0J13M5Q6kM3O5j12J40k5p9l1
$$ -398 -422 -406 -392 -344 -318 -207 -237 -244 -166 -159 -70 -144 -56 103 175 122 177 157 270 315 401 399 442 507 395 535 510 431 400
1881D00N1m8J9n2Mp1o7j2j4j26M5k23j00J39p8J27q8L0k43j56K9N6r4J8j0P3j50
$$ 400 451 403 422 370 374 303 236 224 210 84 129 -94 -194 -55 -133 -6 -94 -64 -307 -463 -434 -378 -472 -454 -464 -391 -541
1908e41N5L9j46R8kJ15M5M2r4J74J4M6K3L4LJ05J31O2mJ00Q4j02J74n9j1NQ3p2
$$ -541 -486 -447 -593 -495 -497 -382 -337 -295 -389 -215 -201 -155 -132 -98 -95 10 141 203 199 299 383 281 455 396 385 390 473 401
1936D01J73LM2j63l3oq1q0J09K9j62Nj42n7o4m9J7RL4j02j3m0j37o6p2R9n1j0
$$ 401 574 577 619 456 423 417 336 256 365 394 232 237 95 38 -26 -75 -58 -49 -15 -117 -130 -170 -307 -373 -445 -346 -397 -407
1964d07m2P2j00N8l1pLQ5P7LK37k76K48J12j03P1n5J06j41J94K43p2k9J12M8p8
$$ -407 -449 -377 -477 -419 -450 -457 -454 -369 -292 -289 -52 -328 -80 32 -71 0 -55 51 -90 104 347 275 246 358 406 328
1990C28L5J5k5L2Q2k10K02j77N1J02j54j30j27K20K0j43J23j72j90j9M0k48J22
$$ 328 363 378 353 385 467 257 459 282 333 435 281 151 24 244 264 121 244 72 -118 -137 -97 -345 -223
2013b23q0J98j6j50M9r6j41p0J67QR7p3R3M7j53R2M8J3j8J40P0N5P5j45J01J36
$$ -223 -303 -105 -121 -271 -222 -318 -459 -529 -362 -354 -257 -330 -237 -190 -343 -251 -203 -190 -208 -68 2 57 132 -13 88 224
2039B24r9j05N1J42R4J03j08J4M1O4r9j53P4k3J26kn2jQj28j47m6l1N1o4j1N9
$$ 224 125 20 71 213 307 410 302 316 357 421 322 169 243 220 346 344 292 291 299 171 24 -22 -53 -2 -66 -77 -18
2066a8o2j69j70j4J69q9Q6n8j50J75j4k7p7J09K7q0J15K5kL5N6l9J01o4J82n9
$$ -18 -80 -249 -419 -433 -264 -353 -267 -325 -475 -300 -314 -341 -418 -309 -282 -362 -247 -222 -224 -189 -133 -172 -71 -135 47 -12
2092a2R1J06m5J18J03m9J2j49R0K8J16k8O9R7p0o1j17L1n0mon2m3l5j82p1K1j3
$$ -12 79 185 140 258 361 312 324 175 265 293 409 381 450 547 477 416 299 330 280 276 270 218 175 140 -42 -113 -92 -105
2120a05Q3k47J62j5j21k4q2j9J4j25k2k8NJ46p6l8R7o7O2jM6J50n7J35J41j46
$$ -105 -22 -269 -107 -122 -243 -267 -349 -368 -354 -479 -501 -529 -524 -378 -454 -492 -395 -462 -400 -401 -355 -205 -262 -127 14 -132
2146a32M1J04KJ12K8J1j9K55p5N6pj00J12j32J00J46K4n0r7k7K8o5q1n9j1Q4j86
$$ -132 -91 13 15 127 155 166 147 402 327 383 376 276 388 256 356 502 526 476 379 352 380 315 234 175 164 248 62
2173F2R9O9k20J23k59M6q3O9o4m7j37Q7j39P9j78l2J20l5R0n7k7LJ58m7j8L7O5
$$ 62 161 230 10 133 -126 -80 -163 -94 -158 -205 -342 -255 -394 -315 -493 -525 -405 -440 -350 -407 -434 -431 -273 -320 -338 -301 -236
2200b36P4o4J05J26lJ15j63Q8LR9J30m7J23j12P8J01l1j51k6O2k6K58k44J76j13
$$ -236 -162 -226 -121 5 2 117 -46 42 45 144 274 227 350 238 316 417 386 235 209 271 245 503 259 435 322
2225C22k70K25m6l9Q9m8q3j99K8o2k8n9O7m3k33K27r5J21k73J59j78P7n3R0M2
$$ 322 52 277 231 192 281 233 150 -49 -21 -83 -111 -170 -103 -146 -379 -152 -247 -126 -399 -240 -418 -341 -394 -304 -262
2250b62o9J37P2p7K1l8l7J10l6J56J02j8J51j29M6N5R4q0m7J23R0p6l4J32o2k9
$$ -262 -331 -194 -122 -199 -178 -216 -253 -143 -179 -23 79 61 212 83 129 184 278 198 151 274 364 288 254 386 324 295
2276B95n1N9k29J45J06j09j57R0Km0j35q6J94k02J30p6j20N6j61P4k12o0j1J43
$$ 295 244 303 74 219 325 216 59 149 151 111 -24 -110 84 -118 12 -64 -184 -128 -289 -215 -427 -487 -498 -355
2300c55l8J11j09J15o4l9J09l5P8j0P0p0K22k35K15n0k5J26K0Q0P4o5R7J03r9
$$ -355 -393 -282 -391 -276 -340 -379 -270 -305 -227 -237 -167 -237 -15 -250 -35 -85 -110 16 36 116 190 125 222 325 226
2325B26Q7J62r0j0m8pR4j38l5J8O3j24J3m8N1m7j04J72k11K8j53j49K81k16j29
$$ 226 313 475 385 375 327 320 414 276 241 259 322 198 211 163 214 167 63 235 24 52 -101 -250 31 -185 -314
2350c14L9M2L9j20K5k36R5QO8m9R5N0n8k5r0J19o0Q1O2O3J81p0Q1l9K6J6O7K8
$$ -314 -275 -233 -194 -314 -289 -525 -430 -422 -354 -403 -308 -258 -316 -341 -431 -312 -372 -291 -229 -166 15 -55 26 -13 13 29 96 124
2378A24j52K18M6R3o0j5R6m8J5P1J09j12M5o5o1L4r2lj06n0j07J62mq0m1r3k9
$$ 124 -28 190 236 329 269 254 350 302 317 388 497 385 430 365 304 338 246 243 137 87 -20 142 138 58 17 -76 -105
2405a05r4J40k06l4O5m5k4nk3j1r9J85j97J36O5j35j0J06J00k4j29L06j0l0J30
$$ -105 -199 -59 -265 -299 -234 -279 -303 -308 -331 -342 -441 -256 -453 -317 -252 -387 -397 -291 -191 -215 -344 -38 -48 -78 52
2430E2j51J48N8n3J46j4n9J45K9M1j70J06l5J3j9P2J34j41j69J3L6n1J01m4j74
$$ 52 -99 49 107 54 200 186 127 272 301 342 172 278 243 256 237 309 443 302 133 146 182 131 232 188 14
2455A4M5o7oR1p1j19qn7m1m8l9L0n6P7n6%R9j61N6rl5J04O5O5j62J5N9J29P6m9
$$ 14 59 -8 -14 77 6 -113 -121 -178 -219 -267 -306 -276 -332 -255 -311 -311 -212 -373 -317 -326 -361 -257 -192 -127 -289 -274 -215 -86 -10 -59
2485e9J93o3N6mM8L7j7m9N2P5n9P5J59j56P6j67K4J11j50L0J76k29m9K04q3n9
$$ -59 134 71 127 123 171 208 191 142 194 269 210 285 444 288 364 197 221 332 182 212 388 159 110 314 231 172
2511A72j14O8p0j76ML3L3j9k04k4P7j15M5j00kOR9J37j29rj9k9rQ4L8q3M5J56
$$ 172 58 126 56 -120 -116 -83 -50 -69 -273 -297 -220 -335 -290 -390 -392 -386 -287 -150 -279 -288 -307 -336 -345 -261 -223 -306 -261 -105
2539a05O7M9n6pQ0L1J07o2M4J48o4P9K5j18J02o8J01j0K8l9m9J11k13M7R3n6k75
$$ -105 -38 11 -45 -52 28 59 166 104 148 296 232 311 336 218 320 252 353 343 371 332 283 394 181 228 321 265 -10
2566a0K04j93J62j69p8j21l7P1r2m0K02R3k87J27j41K7o8M6KM7K8j5N1l4K5p6
$$ -10 194 1 163 -6 -84 -205 -242 -171 -263 -303 -101 -8 -295 -168 -309 -282 -350 -304 -302 -255 -227 -242 -191 -225 -200 -276
2592b76L5KJ76r9J43N3l4J03k6k9J41j28J83J4m9k5J17j0M0l5j74P7J5J8k0m3
$$ -276 -241 -239 -63 -162 -19 34 0 103 77 48 189 61 244 258 209 184 301 291 331 296 122 199 214 232 212 169
2618A69K06j10k2p2o0Qr1K4q4O4o2j20J68n6j96j1J02j42J59m1o9M6j0j02K3P9
$$ 169 375 265 243 171 111 119 28 52 -32 32 -30 -150 18 -38 -234 -245 -143 -285 -126 -167 -236 -190 -200 -302 -279 -200
2644b00j03L5Q3J30r0R0j45N8q1J19J83k2R3j75J52L3n4J24m6q9R3N6OL1j8N3
$$ -200 -303 -268 -185 -55 -145 -55 -200 -142 -223 -104 79 57 150 -25 127 160 106 230 184 95 188 244 250 281 263 316
2670C16o1l9Jo5Q7j9M0j8n5k93M2L2NJ17k13K9R3j84m1K8m7Qj43J95r2N9l4p6
$$ 316 255 216 217 152 239 220 260 242 187 -106 -64 -32 -27 90 -123 -94 -1 -185 -226 -198 -245 -237 -380 -185 -277 -218 -252 -328
2698c28R2j19J04M3J6PQ1l4P8j2J6o5N4k4J64L0k2k3J27J06q7P3m5M1Qj17O0J63
$$ -328 -236 -355 -251 -208 -192 -185 -104 -138 -60 -72 -56 -121 -67 -91 73 103 81 58 185 291 204 277 232 273 281 164 224 387
2726C87j71j7N7J7M0j18J6k2m8J4Pp8nj86J60j33j08K2K0j84J00o9l7OL1l8JQ9
$$ 387 216 199 256 273 313 195 211 189 141 155 162 84 79 -107 53 -80 -188 -166 -146 -330 -230 -299 -336 -330 -299 -337 -336 -247
2754b47m1%j5J06q6k0PK05l2n2J5P2M9j32J54J3P0J9N4j6K1O6O1q9P2q4P8P2L0
$$ -247 -288 -288 -303 -197 -283 -303 -296 -91 -123 -175 -160 -88 -39 -171 -17 -4 66 85 139 123 144 210 271 182 254 170 248 320 350
2783C50j36K00j10R6k54P6m0j92J10m5J30kj98R9j61j26J18j80J07K6K9r9Q4j70
$$ 350 214 414 304 400 146 222 182 -10 100 55 185 183 -15 84 -77 -203 -85 -265 -158 -132 -103 -202 -118 -288
2807b88N9n1J0n8J1J00J03k9q7n1J20k1O0L5j2R2J1J31r4J2j41J66k2o7K34J7
$$ -288 -229 -280 -270 -328 -317 -217 -114 -143 -230 -281 -161 -182 -122 -87 -99 -7 4 135 41 53 -88 78 56 -11 223 240
2833B40n7K31j26k1k4n3oolJ20j05K3l5o4o8%j0k5kM9or3J8m1n7j31MJ3O4J9m6
$$ 240 183 414 288 267 243 190 184 178 175 295 190 213 178 114 46 46 36 11 9 58 52 -41 -23 -64 -121 -252 -248 -235 -171 -152 -198
2864a98J2j2K6k04Q5J20nK6k2N5M7o8lJ3L4K8J19m3J30kJ08j93j8M7J41m6K4k8
$$ -198 -186 -198 -172 -376 -291 -171 -176 -150 -172 -117 -70 -138 -141 -128 -94 -66 53 10 140 138 246 53 35 82 223 177 201 173
2892A73J49J6q4K8o3j25J35m3j8K0Q7j52j8l1m0n4m7O4o2p9l2J57j31l1j38M7
$$ 173 322 338 254 282 219 94 229 186 168 188 275 123 105 74 34 -20 -67 -3 -65 -144 -176 -19 -150 -181 -319 -272
2918b72P0q6r5mK47j49Q3l8R6l6j29k6J79J28j41P2J19NMN5k3Q9P4j44J27m9J62
$$ -272 -202 -288 -383 -387 -140 -289 -206 -244 -148 -184 -313 -339 -160 -32 -173 -101 18 23 27 82 59 148 222 78 205 156 318
2945C18k19J36m1K16j35Q5k6l4J2p6k8J7p0j1K5ol2M6q0k6j07P8k15k2J19j12
$$ 318 99 235 194 410 275 360 334 300 312 236 208 225 155 144 169 163 131 177 97 71 -36 42 -173 -195 -76 -188
2971a88q9lJ37j47R8j29K9Q9k29K12l6m2j2O5Q1j68P5n6J45m7R1Q2r1O9J50K8
$$ -188 -277 -280 -143 -290 -192 -321 -292 -203 -432 -220 -256 -298 -310 -245 -164 -332 -257 -313 -168 -215 -124 -42 -133 -64 86 114
2997A14mL3l1K18j68O6O7j28Q9Q7p1j12J64m2j4p0M7J9o7k7j8n7R4j07n1j07N1
$$ 114 110 143 112 330 162 228 295 167 256 343 272 160 324 282 268 198 245 264 197 170 152 95 189 82 31 -76 -25
3024b5l5j03J5M4O8j50L9J5j83O2j37J82O2j52K5j1L1PJ4J29j07O2k9M4J36j1
$$ -25 -60 -163 -148 -104 -36 -186 -147 -132 -315 -253 -390 -208 -146 -298 -273 -284 -253 -246 -232 -103 -210 -148 -177 -133 3 -8
3050hL7K4j8QO3p3j1R4Q0o4K21K3k23Q5q2J6O3j35J55k6q0o5J22r1j34J17j10
$$ -8 29 53 35 43 106 33 22 116 196 132 353 376 153 238 156 172 235 100 255 229 149 84 206 115 -19 98 -12
3077a2jl9m1M6j1K13k44l9j32J59j79Q1k0N9R2k07O3K2J6Ln5q4J32J24k3J4J1
$$ -12 -13 -52 -93 -47 -58 155 -89 -128 -260 -101 -280 -199 -219 -160 -68 -275 -212 -190 -174 -171 -226 -310 -178 -54 -77 -63 -52
3104e2n2L2M0O6j2l1K30j89KJ53j04O2PM0pO9R2o6l3L0q8j4j10K0J49j43Q9q5
$$ -52 -104 -72 -32 34 22 -9 221 32 34 187 83 145 152 192 185 254 346 280 247 277 189 175 65 85 234 91 180 95
3132I5j6Ml7j91o4J18p2j3J89j85m7Q4k11O1n7M9k3Q9m3J69j88J30l1o5j4K51
$$ 95 79 83 46 -145 -209 -91 -163 -176 13 -172 -219 -135 -346 -285 -342 -293 -316 -227 -270 -101 -289 -159 -190 -255 -269 -18
3158a8j54J43p3J06j8L1J10l3J25q5k5K00j05M0j17J7K2l2J06n4J22j28J83o5
$$ -18 -172 -29 -102 4 -14 17 127 94 219 134 109 309 204 244 127 144 166 134 240 186 308 180 363 298
3182B98q1j74M2j8j5R4n7R9j12k2j9r7R7j99J71k33J56l1j83J01o0j25P0j9N4
$$ 298 217 43 85 67 52 146 89 188 76 54 35 -62 35 -164 7 -226 -70 -101 -284 -183 -243 -368 -298 -317 -263
3207b63L9K2Rr9J46o6m1N8J92r7j2K05l2n1l4J43m5l5J04j26J67l5j06J38N3j8
$$ -263 -224 -202 -193 -292 -146 -212 -253 -195 -3 -100 -112 93 61 10 -24 119 74 39 143 17 184 149 43 181 234 216
3233B16k8J08L1r4j08J11M4j25J2j21p3O3q4J96n4kj68Q2n1j06N2pj00J03Jl1
$$ 216 188 296 327 233 125 236 280 155 167 46 -27 36 -48 148 94 92 -76 6 -45 -151 -99 -106 -206 -103 -102 -133
3259a33L3o2j09R4j14J21Kn0R9q1J57j85J33p2J90j36j06J19R9j2J03R1o6m8Q0
$$ -133 -100 -162 -271 -177 -291 -170 -168 -218 -119 -200 -43 -228 -95 -167 23 -113 -219 -100 -1 -13 90 181 115 67 147
3284A47jK7N3o4J7J36J00j48q5J13q5r2J02p2p2l8K3J21l05L2M5rQ2j50l7k1J14
$$ 147 146 173 226 162 179 315 415 267 182 295 210 118 220 148 76 38 61 182 -123 -91 -46 -55 27 -123 -160 -181 -67
3311f7n8p4K7j07Q3o5OqJ65k2l0j8J22j36lJ39l9Q6j25K12k24N7J53q4J27M9q2
$$ -67 -125 -199 -172 -279 -196 -261 -255 -263 -98 -120 -150 -168 -46 -182 -185 -46 -85 1 -124 88 -136 -79 74 -10 117 166 84
3338H4N9R8r3k3J48l4l0l4P1j69J10j11qK6J70j57M7q4Om7jL6j46J26j62J24j28
$$ 84 143 241 148 125 273 239 209 175 246 77 187 76 68 94 264 107 154 70 76 29 28 64 -82 44 -118 6 -122
3365a22O5m2PR7j20k20J11R1j9j38J89j09J83j08k9M8l1N7j49Q5Q0K9K8r6J31
$$ -122 -57 -99 -92 5 -115 -335 -224 -133 -152 -290 -101 -210 -27 -135 -164 -116 -147 -90 -239 -154 -74 -45 -17 -113 18
3390A8L6M1o2j2J00J39q1q0J99j06j5R9j22O0K5m4j29L4K4K4q0k9P4J7n8j14N2
$$ 18 54 95 33 21 121 260 179 99 298 192 177 276 154 214 239 195 66 100 124 148 68 39 113 130 72 -42 10
3417A0K9r4n1j7J1o4P2j6k8q3J12j39J14j07J6l5J67j3m0o6J90m4M1l5lQ6N5J8
$$ 10 39 -55 -106 -123 -112 -176 -104 -120 -148 -231 -119 -258 -144 -251 -235 -270 -103 -116 -156 -222 -32 -76 -35 -70 -73 13 68 86
3445H6j31R3O6q6m5K4J82k1o4P2K3o3j2M2l8J68j9j31J42j47J28Lj27M9N0j86
$$ 86 -45 48 114 28 -17 7 189 168 104 176 199 136 124 166 128 296 277 146 288 141 269 272 145 194 244 58
3471E8j43J77m8j41n2J38j20k1j0p5J4P7R3j97P1m2N9r5l4J62Lp2J45n8Q3j5m9
$$ 58 -85 92 44 -97 -149 -11 -131 -152 -162 -237 -223 -146 -53 -250 -179 -221 -162 -257 -291 -129 -126 -198 -53 -111 -28 -43 -92
3498i2ML8qR8K4M9K2m9J54k15R3j6J25Q1r0O8n8j0J2k52J06M1N4O0j87L5pj25
$$ -92 -88 -50 -58 40 64 113 135 86 240 25 118 102 227 308 218 286 228 218 230 -22 84 125 179 239 52 87 80 -45
3526d5J4K6Ko6J10l4L4q4j40k1P8p3n9K01k27KP1K3j15J32j61M7O1N7NM7K8r4
$$ -45 -31 -5 -3 -69 41 7 41 -43 -183 -204 -126 -199 -258 -57 -284 -282 -211 -188 -303 -171 -332 -285 -224 -167 -162 -115 -87 -181
3554a81R7QJ4M9L5m0M0O3J46k00J28O0l8o5J19p8Q8l2kL3k7l7o6J28o7q9N5m2
$$ -181 -84 -76 -62 -13 22 -18 22 85 231 31 159 219 181 116 235 157 245 213 211 244 217 180 114 242 175 86 141 99
3582I9p4n1L6J42k60L8n1J07j01J83j92j6L1m1j20KK6P9p1j05J33L9j74K96j77
$$ 99 25 -26 10 152 -108 -70 -121 -14 -115 68 -124 -140 -109 -150 -270 -268 -242 -163 -234 -339 -206 -167 -341 -45 -222
3607b22O7J29m8%M9k5M2PJ1l8J05J01o1M9o3J00m8R0o0n4J54q9lL2oN4r6l5m3
$$ -222 -155 -26 -74 -74 -25 -50 -8 -1 10 -28 77 178 117 166 103 203 155 245 185 131 285 196 193 225 219 273 177 142 99
3636I9Jo6K1K7j00R4k0J04j47p4Jn2L8j65J72o3PP3j05k1L5l0j8j47K13j05J42
$$ 99 100 34 55 82 -18 76 56 160 13 -61 -60 -112 -74 -239 -67 -130 -123 -50 -155 -176 -141 -171 -189 -336 -123 -228 -86
3663h6O6k90K16qNo8J6R4O0J15KOq5j17K64j86K13j53J13N2n3j25Q9J8j03R8P5
$$ -86 -20 -310 -94 -102 -97 -165 -149 -55 5 120 122 128 43 -74 190 4 217 64 177 229 176 51 140 158 55 153 228
3690B28j76J18q5J3n4p3O2L5j66P9p3L4mK5K1j45N2j3m9lM9P5q4o7R0n4j7J9j9
$$ 228 52 170 85 98 44 -29 33 68 -98 -19 -92 -58 -62 -37 -16 -161 -109 -122 -171 -174 -125 -50 -134 -201 -111 -165 -182 -163 -182
3719a82l1P4J0jqK8R1n1K0k1J24J06j68J64J9P3p2j66P1O5J4K2J0j32J82r6O0
$$ -182 -213 -139 -129 -130 -138 -110 -19 -70 -50 -71 53 159 -9 155 174 247 175 9 80 145 159 181 191 59 241 145 205
3746B05jj19J48j82R1L2l8r5N7j12N1j57J48m8j78L2J27j5j55lJ19j24K2J6m3
$$ 205 204 85 233 51 142 174 136 41 98 -14 37 -120 28 -20 -198 -166 -39 -54 -209 -212 -93 -217 -195 -179 -222
3771b22J45k32J59j3k8L1O8o9%R6Q4R0q4K2P2j90J55N0nL0n5M3L6j6k7N0P2j16
$$ -222 -77 -309 -150 -163 -191 -160 -92 -161 -161 -65 19 109 25 47 119 -71 84 134 129 159 104 147 183 167 140 190 262 146
3799A46J48j38k1J6l8J30k57P3R5k5r7j1K8j7l2q5J07j5j06r2R9j78P0k7Q5L1
$$ 146 294 156 135 151 113 243 -14 59 154 129 32 21 49 32 0 -85 22 7 -99 -191 -92 -270 -200 -227 -142 -111
3825a11n0P8k8l0j2mJk4J89k24M1J94k1j4j71K23r6J24q9p6J80LJ4q6K11q9n5
$$ -111 -161 -83 -111 -141 -153 -157 -156 -180 9 -215 -174 20 -1 -15 -186 37 -59 65 -24 -100 80 83 97 11 222 133 78
3852G8O5p0M3J05k9j50J69n9J36k43j9Q3l7p8J03j00Q7p9QK9r7kk9R9k6n0m6O3
$$ 78 143 73 116 221 192 42 211 152 288 45 26 109 72 -6 97 -3 84 5 13 42 -55 -57 -86 13 -13 -63 -109 -46
3880d6k63R3M4P9K3j0o2n8R5M0m0J26m6k07J67l1M9P7o5J75r3j38R7L2RJ73m5
$$ -46 -309 -216 -172 -93 -70 -80 -142 -200 -105 -65 -105 21 -25 -232 -65 -96 -47 30 -35 140 47 -91 6 38 47 220 175
3907A75r3KJ41M8j52K04j81K8r0N3m7j07J03j27J07j21N3K6qj2%r5P7j1p9q5P9
$$ 175 82 84 225 273 121 325 144 172 82 135 88 -19 84 -43 64 -57 -4 22 14 2 2 -93 -16 -27 -106 -191 -112
3934a12K1j24M2M5NPq2L3q6J10r0J87o8QJ25j23J00j1j7J13o1P3O8n1r0J71r0
$$ -112 -91 -215 -173 -128 -123 -116 -198 -165 -251 -141 -231 -44 -112 -104 21 -102 -2 -13 -30 83 22 95 163 112 22 193 103
3961A03kj4J74j54O3M1r5O7j2k6n8L1L1j42j3O0N9m4p3J10j24r7J26j04MJ8J2
$$ 103 101 87 261 107 170 211 116 183 171 145 87 118 149 7 -6 54 113 69 -4 106 -18 -115 11 -93 -89 -71 -59
3988e9o1p0J27q1R4j88R0j33N0J55lj00k3m1J68N4r1O2K8Nj4L4L8J5r1n6K73j98
$$ -59 -120 -190 -63 -144 -50 -238 -148 -281 -231 -76 -79 -179 -202 -243 -75 -21 -112 -50 -22 -17 -31 3 41 56 -35 -91 182 -16
4016a6R4O1j10P6J22j5j57k2J73j2j27L7m5J55j5j18r1J13M7j80Q6m8%j01O1M0
$$ -16 78 139 29 105 227 212 55 33 206 194 67 104 59 214 199 81 -10 103 150 -30 56 8 8 -93 -32 8
4042HL2j84J38l6m2r0J09j14k9O3j09N2m0J21o7J26o3N7k8J35k07J47R7p1n9J0
$$ 8 40 -144 -6 -42 -84 -174 -65 -179 -208 -145 -254 -202 -242 -121 -188 -62 -125 -68 -96 39 -168 -21 76 5 -54 -44
4068d4O6PP1n6M5k6L0RJ2M9j19J22p0J09Nr9Q3j61J85j3j06m6l3l0j8k8N7k6o3
$$ -44 22 29 100 44 89 63 93 102 114 163 44 166 96 205 210 111 194 33 218 205 99 53 20 -10 -28 -56 1 -25 -88
4097h8ql0J01j26J56p1n8r5J41j17m8J24l5j3J59m8j46O0J44p6N7K6Onj10L9P1
$$ -88 -96 -126 -25 -151 5 -66 -124 -219 -78 -195 -243 -119 -154 -167 -8 -56 -202 -142 2 -74 -17 9 15 10 -100 -61 10
4124A0K4M4j03O2l7R9K9j86P1NJ56p8P2n6KK2J7n2j3L3l4q9N6p0J11j64J41p2
$$ 10 34 78 -25 37 0 99 128 -58 13 18 174 96 168 112 114 136 153 101 88 121 87 -2 54 -16 95 -69 72 0
4152@Lj43J49j32O1n8o3J31j25O4j6k8MM9r8Nj01J58q3N9J03L9KM5n0PK8L8L9
$$ 0 3 -140 9 -123 -62 -120 -183 -52 -177 -113 -129 -157 -153 -104 -202 -197 -298 -140 -223 -164 -61 -22 -20 25 -25 -18 10 48 87
4181H7Q4k4j24O8J00q5J3L1m7N1j06J3O3Q2j40O9pm7o9J58r4N7k2k38J87j09j
$$ 87 171 147 23 91 191 106 119 150 103 154 48 61 124 206 66 135 128 81 12 170 76 133 111 -127 60 -49 -50
4208e0m0J2J4o8J2n2K8J00j45O6j36N7K2n3K8J5P7J30j59n3P3j1J5N0J17o6J67
$$ -50 -90 -78 -64 -132 -120 -172 -144 -44 -189 -123 -259 -202 -180 -233 -205 -190 -113 17 -142 -195 -122 -133 -118 -68 49 -17 150
4235A50j44L9p0j8J06kM3n6J21j27Q3M2k2k5M7k04K86o3q9J1j24J49l2j6m9L4
$$ 150 6 45 -25 -43 63 61 104 48 169 42 125 167 145 120 167 -37 249 186 97 108 -16 133 101 85 36 70
4261G0p6l7L0n4J5n7M3j25J80j31L4j19J9J63l4l0j58J64j03j6L5j8j8K04j40
$$ 70 -6 -43 -13 -67 -52 -109 -66 -191 -11 -142 -108 -227 -208 -45 -79 -109 -267 -103 -206 -222 -187 -205 -223 -19 -159
4286a59j4J23M4qL0n2L7J0L0qQ1j52J04J1ko9J62j5L8o2j2qN2J45j48On4O6j25
$$ -159 -173 -50 -6 -14 16 -36 1 11 41 33 114 -38 66 77 75 6 168 153 191 129 117 109 161 306 158 164 110 176 51
4315E1P1j00j2L9o5J69l07m3K12q5l0Q7j23NJ5J39k98J95k5r3Q6P3r0K0m0KJ8
$$ 51 122 22 10 49 -16 153 -154 -197 15 -70 -100 -13 -136 -131 -116 23 -275 -80 -105 -198 -112 -39 -129 -109 -149 -147 -129
4342a29L3L1j47J90k0J4l7J28L4j65J65K5L1jj15J48j2Oj5ON4q7p8k9J70j85R3
$$ -129 -96 -65 -212 -22 -42 -28 -65 63 97 -68 97 122 153 152 37 185 173 179 164 170 224 137 59 30 200 15 108
4369A08k06K15L0n4o8o6O0p4J0p2QR0j59J7R8P9k09J11J6j9n4L7N7j37M0J20l7
$$ 108 -98 117 147 93 25 -41 19 -55 -45 -117 -109 -19 -178 -161 -63 16 -193 -82 -66 -85 -139 -102 -45 -182 -142 -22 -59
4396e9j04J51j06k5jK42j37k8j%nJ36m9J54l4k7J13j54K9l3L7P3j1n7Qp2J40l1
$$ -59 -163 -12 -118 -143 -144 98 -39 -67 -68 -68 -73 63 14 168 134 107 220 66 95 62 99 172 161 104 112 40 180 149
4424A49jl8j9L9N6k11J0J42q5m3m9NqJ9j8j25J04J7k8n1p2J15j41R8J20j1n4o7
$$ 149 148 110 91 130 186 -25 -15 127 42 -1 -50 -45 -53 -34 -52 -177 -73 -56 -84 -135 -207 -92 -233 -135 -15 -26 -80 -147
4452a47M6mO4j24l1K14j13J73q7lp8J64m9P6J03j76M9m9J54n7p8Q2j4rJ48k15
$$ -147 -101 -105 -41 -165 -196 18 -95 78 -9 -12 -90 74 25 101 204 28 77 28 182 125 47 129 115 106 254 39
4478C9J22J3r1P0n0O2j41L1q0k6O4KPj48R6M3n1j27k8N4R7m2K4j59J38r2P0Q4
$$ 39 161 174 83 153 103 165 24 55 -25 -51 13 15 22 -126 -30 13 -38 -165 -193 -139 -42 -84 -60 -219 -81 -173 -103 -19
4506a9r4Q8j23K4M3J4o3J32l2l9L7o1J14R2j40J11o7nQ9j14k2L07j09N3p0N7j65
$$ -19 -113 -25 -148 -124 -81 -67 -130 2 -30 -69 -32 -93 21 113 -27 84 17 12 101 -13 -35 272 163 216 146 203 38
4533C8pq7K8J06k6j9j3P8o6ok0O2k5N1j10R0J9j45J86j80N6n5j0l3N7p4%l2o7
$$ 38 31 -56 -28 78 52 33 20 98 32 26 6 68 43 94 -16 74 93 -52 134 -46 10 -45 -55 -88 -31 -105 -105 -137 -204
4562b04J77mqoK3jO6j1n2q5Q6Q3O8k15Q1J57j15O5j8J13j00M6j21N6J07r3M9L9
$$ -204 -27 -31 -39 -45 -22 -23 43 32 -20 -105 -19 64 132 -83 -2 155 40 105 87 200 100 146 25 81 188 95 144 183
4590A83j89M7K1r7N8J16k0o7MN2j05J07j14j07J7Q8N5o1n2j02Q2L3o5K0r6J01
$$ 183 -6 41 62 -35 23 139 119 52 56 108 3 110 -4 -111 -94 -6 49 -12 -64 -166 -84 -51 -116 -96 -192 -91
4616i1K4J1J8n3l4p1J18L5k8k1k6J53K2n2j9Q8m9N8j67N4R2j37J60j04J99mj41
$$ -91 -67 -56 -38 -91 -125 -196 -78 -43 -71 -92 -118 35 57 5 -14 74 25 83 -84 -30 62 -75 85 -19 180 176 35
4643C5R2m7MJ48n6L4j42R8l5n2j5m6K1j8q1K8P2q8kok0r8J52j19J57j23j07N4
$$ 35 127 80 84 232 176 210 68 166 131 79 64 18 39 21 -60 -32 40 -48 -50 -56 -76 -174 -22 -141 16 -107 -214 -160
4671a60M3mJ9N2q6Nj1J83o8lp3J62r3N8k6l9Jkm1R2k2j4mJ96k5r8J60j6r7j1k5
$$ -160 -117 -121 -102 -50 -136 -131 -142 41 -27 -30 -103 59 -34 24 -2 -41 -40 -42 -83 9 -13 -27 -31 165 140 42 202 186 89 78 53
4702E3n8K11j19knq2J30J7j34k4K8J9n5k9J2j01J04j7mo0p7J51j41J1K8j5j2L0
$$ 53 -5 206 87 85 80 -2 128 145 11 -13 15 34 -21 -50 -38 -139 -35 -52 -56 -116 -193 -42 -183 -172 -144 -159 -171 -141
4730a41K0J0j24J55PQ7Q1p2l4r1%J14k6N0K0j02Q6n6K1J27p1K4k0o9P0N2R8q4
$$ -141 -121 -111 -235 -80 -73 14 95 23 -11 -102 -102 12 -14 36 56 -46 40 -16 5 132 61 85 65 -4 66 118 216 132
4758A32NM9j14O0k0J1q9J80j35m1l7M5j05J48o9j12j6J8K7r4J55q7k6M6r7Q2j6
$$ 132 137 186 72 132 112 123 34 214 79 38 1 46 -59 89 20 -92 -108 -90 -63 -157 -2 -89 -115 -69 -166 -84 -100
4785a00q6R6m8Q2j48M6M3k1J54r4Q6k1L0k8J09o3j01P0Q3k8j3kJ9Km1L7M6j00
$$ -100 -186 -90 -138 -56 -204 -158 -115 -136 18 -76 10 -11 19 -9 100 37 -64 6 89 61 48 46 65 67 26 63 109 9
4813IK8N3Ql1k9J09k3p3l5K3J6L1j03L5J14j53K1N9k29N9J4r4R7J23K6k24Q4K
$$ 9 37 90 98 67 38 147 124 51 16 39 55 86 -17 18 132 -21 0 59 -170 -111 -97 -191 -94 29 55 -169 -85 -83
4841h3j5J05r1Pj59J35J21o2m3MJ3O2M2k8oM7J11j97J82No1p3J24m9j01J63j79
$$ -83 -98 7 -84 -77 -236 -101 20 -42 -85 -81 -68 -6 36 8 2 49 160 -37 145 150 89 16 140 91 -10 153 -26
4868b6J83q2J64J5j21k3K1j30P2k02O1P7K0p8N4o2%n4J09j1j11J28o8J5j14M8
$$ -26 157 75 239 254 133 110 131 1 73 -129 -68 9 29 -49 5 -57 -57 -111 -2 -13 -124 4 -64 -49 -163 -115
4894a15K7o8L2L0J1m0j36K06j28K06o4J3M4o4J05k04K03Lk12J43K8Q2l3K8Q4k08
$$ -115 -88 -156 -124 -94 -83 -123 -259 -53 -181 25 -39 -26 18 -46 59 -145 58 61 -151 -8 20 102 69 97 181 -27
4920b7N6K03j24N8k0l7M7l8m4J6M0q6J04p5L8m1j27R8j9l9r3J11j1m7pR9j10l7
$$ -27 29 232 108 166 146 109 156 118 74 90 130 44 148 73 111 70 -57 41 22 -17 -110 1 -10 -57 -64 35 -75 -112
4948a12p3JRR9j15P4P2O0K0j17K4k5l6J18o2Q5n9p1K03K2j13l7O6l8j4J09%n9
$$ -112 -185 -184 -175 -76 -191 -117 -45 15 35 -82 -58 -83 -119 -1 -63 22 -37 -108 95 117 4 -33 33 -5 -19 90 90 31
4976C1N3o7J43O8j08Q7n4K8n9p1O2l5P9r0m6Q3j09L7l7J6m7M5pj36J02mq9L0J7
$$ 31 84 17 160 228 120 207 153 181 122 51 113 78 157 67 21 104 -5 32 -5 11 -36 9 2 -134 -32 -36 -125 -95 -78
5005g8L1Lj32R6k2n4n8J14R8m4j80K65j15m4O5J34p4J6J26k50J01m3J47n6L0J18
$$ -78 -47 -44 -176 -80 -102 -156 -214 -100 -2 -46 -226 39 -76 -120 -55 79 5 21 147 -103 -2 -45 102 46 76 194
5031A94j15Kk7O3o8j18J23P0m7R1r1J43j97P9P8r3k8q7P1l7o1J27Ko7j8P9j83
$$ 194 79 81 54 117 49 -69 54 124 77 168 77 220 23 102 180 87 59 -28 43 6 -55 72 74 7 -11 68 -115
5058a15jO5q9o4Q3o5J60m4l8l7q5J86p3oMQ0q8J32n5L5k5J02j33L2J7O8q8R0m4
$$ -115 -116 -51 -140 -204 -121 -186 -26 -70 -108 -145 -230 -44 -117 -123 -119 -39 -127 5 -50 -15 -40 62 -71 -39 -22 46 -42 48 4
5087DQJ51r3M2q8P3ML4j4j11J32J6k9J6M4Nj06Qo9P0j12K6r2R7J9o7j6O6r9n7
$$ 4 12 163 70 112 24 97 101 135 121 10 142 158 129 145 189 194 88 96 27 97 -15 11 -81 16 35 -32 -48 18 -81 -138
5117a38J55j53J38j30N5N8q9J8n5LQ5O6p3k7oJ02j10J45o4k7n5Q8k1K9O4l0R2
$$ -138 17 -136 2 -128 -73 -15 -104 -86 -141 -138 -53 13 -60 -87 -93 9 -101 44 -20 -47 -102 -14 -35 -6 58 28 120
5144A20p3L3j7J9LJ96j64l1j6k1j6J13r3%M0j10q6K47m1j59J48k01k9L6J04rJ4
$$ 120 47 80 63 82 85 281 117 86 70 49 33 146 53 53 93 -17 -103 144 103 -56 92 -109 -138 -102 2 -7 7
5171Gj0p3J2r4J8Pj40J95j5J9O9q9j8M9P9N4o4J5o0m1lP6P0q2m3O3M1k4m4J15
$$ 7 -3 -76 -64 -158 -140 -133 -273 -78 -93 -74 -5 -94 -112 -63 16 70 6 21 -39 -80 -83 -7 63 -19 -62 1 42 18 -26 89
5201H9QM7j11K0K9M1m5l7Q4j06L7k9K4O8M4r1k1L5qjn2M1l4k5l6J16o7r2J06m7
$$ 89 97 144 33 53 82 123 78 41 125 19 56 27 51 119 163 72 51 86 78 77 25 66 32 7 -29 87 20 -72 34 -13
5231a3j14J43r1k7l3QN2M6k3j14l2l8J54O3n4R1j02J14N8nj01J39k2j25R7O6j04
$$ -13 -127 16 -75 -102 -135 -127 -75 -29 -52 -166 -198 -236 -82 -19 -73 18 -84 30 88 83 -18 121 99 -26 71 137 33
5258C3p4L1J20n1rJ3qRo9m2J08l5O2J7j21M5K3Q6j69l2Q5Po1J12j49n6J41o3N9
$$ 33 -41 -10 110 59 50 63 55 64 -5 -47 61 26 88 105 -16 29 52 138 -31 -63 22 29 -32 80 -69 -125 16 -47 12
5287A2j38J4j5l0J44j07J32j75m4J76K6n3J3l0n9M7j0m0J35o8J00Q3k17K19l7
$$ 12 -126 -112 -127 -157 -13 -120 12 -163 -207 -31 -5 -58 -45 -75 -134 -87 -97 -137 -2 -70 30 113 -104 115 78
5312G8j4R3q0n6n0P9K4Q9o1l9oq4k7J19j3Q6q7O2j13rJ66j98J46j25K1K6k2Om7
$$ 78 64 157 77 21 -29 50 74 163 102 63 57 -27 -54 65 52 138 51 113 0 -9 157 -41 105 -20 1 27 5 11 -36
5341c6Q2k08qJ59j08J04R2j38j58K01j13J46o0M5p9J21l1r9l4J25N4qj4n3j02
$$ -36 46 -162 -170 -11 -119 -15 77 -61 -219 -18 -131 15 -45 0 -79 42 11 -88 -122 3 57 49 35 -18 -120
5366a20J39N5Nj24J55m8j8O3p7J53j01m6j14J66k2j57Q9N2J9j08N1o8R2j4n7K2
$$ -120 19 74 79 -45 110 62 44 107 30 183 82 36 -78 88 66 -91 -2 50 69 -39 12 -56 36 22 -35 -13
5392a3n5%L1J25q3r6P2jL0j18o9R8Q6p3J3k9L8K5r5P9j50J42r2J02Q2q1J0l9J4
$$ -13 -68 -68 -37 88 5 -91 -19 -20 10 -108 -177 -79 7 -66 -53 -82 -44 -19 -114 -35 -185 -43 -135 -33 49 -32 -22 -61 -47
5421d7O8m8RO7K0M5k3P0m8m7m1j03J77m9n7P9o2L2o8J2p1J57p5lNK1LQp1m0J7
$$ -47 21 -27 -18 49 69 114 91 161 113 66 25 -78 99 50 -7 72 10 42 -26 -14 -85 72 -3 -6 -1 20 23 31 -40 -80 -63
5452f3kK6o1L3Pq1J12j40J52j13J06l9n1Lj8J51o4m8q3j7R5Q9p8K1L5k2K2Q0p
$$ -63 -65 -39 -100 -67 -60 -141 -29 -169 -17 -130 -24 -63 -114 -111 -129 22 -42 -90 -173 -190 -95 -6 -84 -63 -28 -50 -28 52 45
5481D5L1j14Q0rN7L0o5n6J09r6J3R3j30L9P5R9j48Lo9J01r1J4j14L9L5n6O3N3
$$ 45 76 -38 42 33 90 120 55 -1 108 12 25 118 -12 27 102 201 53 56 -13 88 -3 11 -103 -64 -29 -85 -22 31
5509C1m9m5k2r1O2l8K13j20L7q3J8R5r5O0l5Q6o8j05K3J52j67J02J23q2Rl3N7
$$ 31 -18 -63 -85 -176 -114 -152 61 -59 -22 -105 -87 8 -87 -27 -62 24 -44 -149 -126 26 -141 -39 84 2 11 -22 35
5536C5j5j15J23J90k37K2j7J56k2l9m2J52q1m1p4m8K04r9m8jm6J16N2j86J07q9
$$ 35 20 -95 28 218 -19 3 -14 142 120 81 39 191 110 69 -5 -53 151 52 4 3 -43 73 125 -61 46 -43
5562d3k9Q0j42N7N0O3l2j16J8m7MOmJ47k8kJ4j8P0j85K43m1j32Q2m2P2j12J76
$$ -43 -72 8 -134 -77 -27 36 4 -112 -94 -141 -137 -131 -135 12 -16 -18 -4 -22 48 -137 106 65 -67 15 -27 45 -67 109
5590A09o4j08L1R6o4PJ4J42r9m1n5K02m9o3l8J18j13LM0k0K3j10P0o0O0j5o7L1
$$ 109 45 -63 -32 64 0 7 21 163 64 23 -32 170 121 58 20 138 25 28 68 48 71 -39 31 -29 31 16 -51 -20
5618b0l0L0O0L9k19N7J25p6J11j72N9R6k53J41K4Kl2Q8n9j93J67O7j9j49N0J27
$$ -20 -50 -20 40 79 -140 -83 42 -34 77 -95 -36 60 -193 -52 -28 -26 -58 30 -29 -222 -55 12 -7 -156 -106 21
5644B1k5L3%M1q9J08%ro5l5J13J21k71J35L9lp7J52r0j6r5O0R2j12q9J23k2m5
$$ 21 -4 29 29 70 -19 89 89 80 15 -20 93 214 -57 78 117 114 37 189 99 83 -12 48 140 28 -61 62 40 -5
5672eP5p5j64J58j50R2O3j26Q3lj9M7%r6O6mnj12J6M3O3m1J3n1Q3k5l9J04R7m7
$$ -5 70 -5 -169 -11 -161 -69 -6 -132 -49 -52 -71 -24 -24 -120 -54 -58 -63 -175 -159 -116 -53 -94 -81 -132 -49 -74 -113 -9 88 41
5702D1J3mq2l5J26M3Q6r2n2J6jK3P3J4Nj22j2J03R0j87n7K7j2j2Q0j16J5O9j51
$$ 41 54 50 -32 -67 59 102 188 96 44 60 59 82 155 169 174 52 40 143 233 46 -11 16 4 -8 72 -44 -29 40 -111
5731a11K2R0n5j00J13nJ1l0M5j26J78o3j12J06p2NR0l9j9q3Q9R1n3M1o6O6j4M8
$$ -111 -89 1 -54 -154 -41 -46 -35 -65 -20 -146 32 -31 -143 -37 -109 -104 -14 -53 -72 -155 -66 25 -28 13 -53 13 -1 47
5759D7j92J32J18j01pM5Q9Rk47K15pJ14j27j23J66Rk01K77k58P8K6L9Rj45J33
$$ 47 -145 -13 105 4 -3 42 131 140 -107 108 101 215 88 -35 131 140 -61 216 -42 36 62 101 110 -35 98
5784I8j85L6N3p4J9Q0q6MJ0K8j24LJ04J2o9P9r9KlJ54k70J40pJ1L0N8r0P4o2J98
$$ 98 -87 -51 2 -72 -53 27 -59 -55 -45 -17 -141 -138 -34 -22 -91 -12 -111 -109 -112 42 -228 -88 -95 -84 -54 4 -86 -12 -74 124
5814A24p1p9j08J45n7N2Q0mn1n4M6K5N9q8mp9J15R0q3p0L9m3O9k3R5Kq4R3m4k38
$$ 124 53 -26 -134 11 -46 6 86 82 31 -23 23 48 107 19 15 -64 51 141 58 -12 27 -16 53 30 125 127 43 136 92 -146
5844a46J57j3m2K0kr7N8k9oj7Q4J8k0r1kR0o5r5J78j12K00o5QP8j01p2J23J7n3
$$ -146 11 -2 -44 -24 -26 -123 -65 -94 -100 -117 -33 -15 -35 -126 -128 -38 -103 -198 -20 -132 68 3 11 89 -12 -84 39 56 3
5873CMq0J42LN5l3j20Q0L9j51P1N8J20m6j33LJ52j70J73j13O0j3Qj90J09l9O4
$$ 3 7 -73 69 72 127 94 -26 54 93 -58 13 71 191 145 12 15 167 -3 170 57 117 104 112 -78 31 -8 56
5900E6p1l2J9L2qn4O4o%j08N9q0K9Q0K2pp8n3P7J00j16kK2m4O7j0kM1J8n7M6o0
$$ 56 -15 -47 -28 4 -4 -58 6 0 0 -108 -49 -129 -100 -20 2 -5 -83 -136 -59 41 -75 -77 -55 -99 -32 -42 -44 -3 15 -42 4 -56
5932e6K8R5Lj1n0R7j1Qp1J5O6j22O7op5J44r5o0J0q2J44J5r0lJl1J01k3Q4j82
$$ -56 -28 67 70 59 9 106 95 103 32 47 113 -9 58 52 -23 121 26 -34 -24 -106 38 53 -37 -40 -39 -70 31 8 92 -90
5962i0Ml0k7J34m8m3J81j57m4p4J21l7J19O8j23o4K3P4o0N9r6J94j04Q0n0n2K5
$$ -90 -86 -116 -143 -9 -57 -100 81 -76 -120 -194 -73 -110 9 77 -46 -110 -87 -13 -73 -14 -110 84 -20 60 10 -42 -17
5989a7J0P3k3n3J18n0k2K5J34j70J43j28j05J08rM1q6J17K3j82P7J7kJ2m3J40
$$ -17 -7 66 43 -10 108 58 36 61 195 25 168 40 -65 43 34 75 -11 106 129 -53 24 41 39 51 8 148
6015A48k32K7R9q3K6Pr4P1L5Nj14l4J35k6J01j45l5M8nR0o6p1J27q9R0p2N5O5
$$ 148 -84 -57 42 -41 -15 -8 -102 -31 4 9 -105 -139 -4 -30 71 -74 -109 -61 -66 24 -42 -113 14 -75 15 -57 -2 63
6043F3j8m9pL9L7P8k0m2jo4k3P3l6J00J01j92P0r5J54k93J38L2J24o6m2j69n5
$$ 63 45 -4 -11 28 65 143 123 81 80 16 -7 66 30 130 231 39 109 14 168 -125 13 45 169 103 61 -108 -163
6070a63N6O6K4J11q3k4J1j21P9j9rl6J0p8J11jL4J22j62J36n1K1j51N8Q2k3mQ0
$$ -163 -107 -41 -17 94 11 -13 -2 -123 -44 -63 -72 -108 -98 -176 -65 -66 -32 90 -72 64 13 34 -117 -59 23 0 -4 76
6098G6M8j72J10j8m6J05j4j21J13j11J12O2p9O2j89O8J05j64J30j00pm8J59K7
$$ 76 124 -48 62 44 -2 103 89 -32 81 -30 82 144 65 127 -62 6 111 -53 77 -23 -30 -78 81 108
6122A08o0j64q9J72j0Q7P3j04j45M9n0J6Q6j89J84j2J28j62P4l1l7L6J22j0r0
$$ 108 48 -116 -205 -33 -43 44 117 13 -132 -83 -133 -117 -31 -220 -36 -48 80 -82 -8 -39 -76 -40 82 72 -18
6147a8K0j3oJM9L6L3o8rj1J24r9J09m5r9l9L3P7j2j75J32k1%n6Q3rm6K1K9L4r5
$$ -18 2 -11 -17 -16 33 69 102 34 25 14 138 39 148 103 4 -35 -2 75 63 -112 20 -1 -1 -57 26 17 -29 -8 21 55 -40
6178d0J37q8j34K37m1L6j06k0j5r0J03%K3j3j05K6O4j00L1JO1p5R4O0j48J57m2
$$ -40 97 9 -125 112 71 107 1 -19 -34 -124 -21 -21 2 -11 -116 -90 -26 -126 -95 -94 -33 -108 -14 46 -102 55 13
6205A3o3O6J0n2N4J1J2k4L3p6O9m5L4n1l8j2P5R5j79J48p2l0J29l0j17K15l52
$$ 13 -50 16 26 -26 28 39 51 27 60 -16 53 8 42 -9 -47 -59 16 111 -68 80 8 -22 107 77 -40 175 -177
6232a77K16n8JR8j43K1Q8j16J97k27J8k1J59N3m4n0j47J19j7mo2N2mJ1L5o6K4
$$ -177 39 -19 -18 80 -63 -42 46 -70 127 -100 -82 -103 56 109 65 15 -132 -13 -30 -34 -96 -44 -48 -37 -2 -68 -44
6259d4q1R7P9Mq1j31J91K3M9l6n3n3P0M9J7l3J6Q0o5j3Q9j93J59j42k3R7j54P3
$$ -44 -125 -28 51 55 -26 -157 34 57 106 70 17 -36 34 83 100 67 83 163 98 85 174 -19 140 -2 -25 72 -82 -9
6287iJ30m5K2j19R6q6j4M2j2k8n0N5k5j23R0J05p1K8n0J09p7O6J0r1j0OK0m9J23
$$ -9 121 76 98 -21 75 -11 -25 17 5 -23 -73 -18 -43 -166 -76 29 -42 -14 -64 45 -32 34 44 -47 -57 -51 -31 -80 43
6316D3p7N5p7P9K0N1o7M6L8r9k7M3K2N5j04j3N0R3q6j4p1O1M8L9j8o0k1J9klj7
$$ 43 -34 21 -56 23 43 94 27 73 111 12 -15 28 50 105 1 -12 38 131 45 31 -40 21 69 108 90 30 9 28 26 23 6
6347Fj3M1j14J30J4p8N5J4j36%J43j87Q7l5N6K4j53R7p4J5R4K7j06J40k01J21
$$ 6 -7 34 -80 50 64 -14 41 55 -81 -81 62 -125 -38 -73 -17 7 -146 -49 -123 -108 -14 13 -93 47 -154 -33
6373c3m3P6k9kJ45k41Q1l8J12L4p4N1n8P0JJ4p2J25r6jKoj3Q1p8L3j9K1j44J65
$$ -33 -76 0 -29 -31 114 -127 -46 -84 28 62 -12 39 -19 51 52 66 -6 119 23 22 24 18 5 86 8 41 22 43 -101 64
6403F4Kk6m1no9j6Q5l4N3l9q8Q8l6P7m2j08RM2J3p6O5J42R2j54p8J62j48K0P2
$$ 64 66 40 -1 -6 -75 -91 -6 -40 13 -26 -114 -26 -62 15 -27 -135 -126 -84 -71 -147 -82 60 152 -2 -80 82 -66 -46 26
6432B6k2Oj32J50Q3n7j55J15N8j11P0K9p0J6K82l70J36N1j07N1oJ2Ko8O4m7P0
$$ 26 4 10 -122 28 111 54 -101 14 72 -39 31 60 -10 6 288 -82 54 105 -2 49 43 55 57 -11 53 6 76
6459G6o2J13k09J23qmq3J6J5jN4j13K9N3j15J84j10n0K8l7J06L1r7q7J03K9J0
$$ 76 14 127 -82 41 33 29 -54 -38 -23 -24 30 -83 -54 -1 -116 68 -42 -92 -64 -101 5 36 -61 -148 -45 -16 -6
6486fN6r8L2P0k0j17jO4Q9o5J8l9N9n7N1m0o3O6P9j38J19R9l6m8n1r7O4J81p7
$$ -6 50 -48 -16 54 34 -83 -84 -20 69 4 22 -17 42 -15 36 -4 -67 -1 78 -60 59 158 122 74 23 -74 -10 171 94
6515I4j26L0J98k10Q9o8l9mO5o4L7n0R7j50L7j7l0r2K06n9q6QJ72r9J23k1j36
$$ 94 -32 -2 196 -14 75 7 -32 -36 29 -35 2 -48 49 -101 -64 -81 -111 -203 3 -56 -142 -134 38 -61 62 41 -95
6542i5k2J10M3m8mm3O2K1j9M7q8j7J20o0K4j66K12p1L3J0kLK0m2l0K17j59j79
$$ -95 -117 -7 36 -12 -16 -59 3 24 5 52 -36 -53 67 7 31 -135 77 6 39 49 47 50 70 28 -2 215 56 -123
6570a23J42R6k03R2n1K3QJ1pM2p1j8K1M4n0j9J3l0J53j53NL4m5l6J10j47J56p5
$$ -123 19 115 -88 4 -47 -24 -16 -5 -12 30 -41 -59 -38 6 -44 -63 -50 -80 73 -80 -75 -41 -86 -122 -12 -159 -3 -78
6598g8N3N4j17J14Lk8j08P3j7M0L0l1J79j32O2j13n9J23Q1j5O1Qj25n4K2P0j20
$$ -78 -25 29 -88 26 29 1 -107 -34 -51 -11 19 -12 167 35 97 -16 -75 48 129 114 175 183 58 4 26 96 -24
6625b4N1J7j32O3Q0q8j8J05O6Nj23N5j56J93k16J03L1j38M6O6j4N7j3j20l1L6
$$ -24 27 44 -88 -25 55 -33 -51 54 120 125 2 57 -99 94 -122 -19 12 -126 -80 -14 -28 29 16 -104 -135 -99
6651i9O8Nj1m3K5m9J4J37k02R3J3Q1m8Q8l8q9J2J48n6m7J30r5oj00Q2l0J6KMJ58
$$ -99 -31 -26 -37 -80 -55 -104 -90 47 -155 -62 -49 32 -16 72 34 -55 -43 105 49 2 132 37 31 -69 13 -17 -1 1 5 163
6681A63nj7j68L4J19j92J46j31RJ27Oj30j6J88j47n1n5J41l9l5J2k6Q9Okm8K3
$$ 163 158 141 -27 7 126 -66 80 -51 -42 85 91 -39 -55 133 -14 -65 -120 21 -18 -53 -41 -67 22 28 26 -22 1
6708AP1j63J09p7%J5J43lm2n6l2Mn6J65m1n5J16p2RO7o8q2Q6r1Q0K7op7J52n7
$$ 1 72 -91 18 -59 -59 -44 99 96 54 -2 -34 -30 -86 79 38 -17 99 27 36 103 35 -47 39 -52 28 55 49 -28 124 67
6738F7n4J22j48P8J9j52R6M0m4N3j11m4QJ54j44Q4l7P9r8R9r9k5j7J42j76N3k1
$$ 67 13 135 -13 65 84 -68 28 68 24 77 -34 -78 -70 84 -60 24 -13 66 -32 67 -32 -57 -74 68 -108 -55 -76
6765g6k8J29m6O9LJ5q7k5J74j57O6m8Q5q8J14j0p6j3p3K44j32o8Rl5J05nL1n2
$$ -76 -104 25 -21 48 51 66 -21 -46 128 -29 37 -11 74 -14 100 90 14 1 -72 172 40 -28 -19 -54 51 46 77 25
6793B5m4P6n9j37J63NL3R0j43K1k7o0n7J17r6J36n5J9l1R5j53R8p4pL5J16r0n0
$$ 25 -19 57 -2 -139 24 29 62 152 9 30 3 -57 -114 3 -93 43 -12 7 -24 71 -82 16 -58 -65 -30 86 -4 -54
$$ [...]
8191B3
##END NTUPLES=NMR FID
##END=
