##TITLE=1H_LR-677-BHCR1
 D2O, 8 sc, 
 22.7.2019
##JCAMPDX= 6.0         $$ Bruker NMR JCAMP-DX V2.0
##DATA TYPE= NMR FID
##DATA CLASS= NTUPLES
##ORIGIN= UXNMR, Bruker Analytische Messtechnik GmbH
##OWNER= root
$$ XWIN-NMR		Version 3.5
$$ Mon Jul 22 16:32:57 2019 Russian Standard Time (UT+4h)  she@DPX200
##.OBSERVE FREQUENCY= 200.13155
##.OBSERVE NUCLEUS= ^1H
##.DELAY= (6, 6)
##.ACQUISITION MODE= SIMULTANEOUS
##.ACQUISITION SCHEME= undefined
##.AVERAGES= 8
##.DIGITISER RES= 18
##SPECTROMETER/DATA SYSTEM= spect
##.PULSE SEQUENCE= zg30
##.SOLVENT NAME= D2O
##.SHIFT REFERENCE= (INTERNAL, D2O, 0, 15.7039)
##AUDIT TRAIL= $$ (NUMBER, WHEN, WHO, WHERE, WHAT)
$$ ##TITLE= Audit trail, XWIN-NMR		Version 3.5
$$ ##JCAMPDX= 5.01
$$ ##ORIGIN= Bruker BioSpin GmbH
$$ ##OWNER= she
$$ F:/spectra/data/she/nmr/H-F/1/audita.txt
$$ ##AUDIT TRAIL=  $$ (NUMBER, WHEN, WHO, WHERE, WHAT)
(   1,<2019-07-22 16:31:33.45 +0400>,<she>,<DPX200>,
      <created by zg, POWCHK disabled, PULCHK disabled
       configuration hash MD5:
       00 E9 B6 7A A2 85 ED C7 34 08 36 98 17 FE 4E 26
       data hash MD5: 16K
       D0 7E E1 AB 7D 4C 18 C3 D3 1F EA 5D AD 9A 9F 70>)
$$ ##END=
$$ 
$$ hash MD5
$$ A1 89 2C 2A 80 D5 AB 49 DB 2F 15 5A 68 DE 05 A4
##$RELAX= 
##$RELAX= 
##$RELAX= 
##$RELAX= 
##$RELAX= 
##$RELAX= 
$$ Bruker specific parameters
$$ --------------------------
##$DU= <F:/spectra>
##$EXPNO= 1
##$NAME= <H-F>
##$PROCNO= 1
##$TYPE= <nmr>
##$USER= <she>
##$AMP= (0..31)
100 100 100 100 100 100 100 100 100 100 100 100 100 100 100 100 100 100 
100 100 100 100 100 100 100 100 100 100 100 100 100 100 
##$AQSEQ= 0
##$AQ_mod= 1
##$AUNM= <au_zg>
##$AUTOPOS= <>
##$BF1= 200.13
##$BF2= 200.13
##$BF3= 200.13
##$BF4= 200.13
##$BF5= 200.13
##$BF6= 200.13
##$BF7= 200.13
##$BF8= 200.13
##$BYTORDA= 1
##$CFDGTYP= 0
##$CFRGTYP= 5
##$CHEMSTR= <none>
##$CNST= (0..31)
1 1 145 1 1 1 1 1 1 1 1 1 1 1 1 1 1 1 1 1 1 1 1 1 1 1 1 1 1 1 1 1 
##$CPDPRG= <>
##$CPDPRG1= <>
##$CPDPRG2= <>
##$CPDPRG3= <>
##$CPDPRG4= <mlev>
##$CPDPRG5= <mlev>
##$CPDPRG6= <mlev>
##$CPDPRG7= <mlev>
##$CPDPRG8= <mlev>
##$CPDPRGB= <>
##$CPDPRGT= <>
##$D= (0..31)
0 1.2 0 0 0 0 0 0 0 0 0 0.03 0 0 0 0 0 0 0 0 0 0 0 0 0 0 0 0 0 0 0 0 
##$DATE= 1563798692
##$DBL= (0..7)
120 120 120 120 120 120 120 120 
##$DBP= (0..7)
150 150 150 150 150 150 150 150 
##$DBP07= 0
##$DBPNAM0= <>
##$DBPNAM1= <>
##$DBPNAM2= <>
##$DBPNAM3= <>
##$DBPNAM4= <>
##$DBPNAM5= <>
##$DBPNAM6= <>
##$DBPNAM7= <>
##$DBPOAL= (0..7)
0.5 0.5 0.5 0.5 0.5 0.5 0.5 0.5 
##$DBPOFFS= (0..7)
0 0 0 0 0 0 0 0 
##$DE= 6
##$DECBNUC= <off>
##$DECIM= 24
##$DECNUC= <off>
##$DECSTAT= 4
##$DIGMOD= 1
##$DIGTYP= 9
##$DL= (0..7)
0 120 120 120 120 120 120 120 
##$DP= (0..7)
150 150 150 150 150 150 150 150 
##$DP07= 0
##$DPNAME0= <>
##$DPNAME1= <>
##$DPNAME2= <>
##$DPNAME3= <>
##$DPNAME4= <>
##$DPNAME5= <>
##$DPNAME6= <>
##$DPNAME7= <>
##$DPOAL= (0..7)
0.5 0.5 0.5 0.5 0.5 0.5 0.5 0.5 
##$DPOFFS= (0..7)
0 0 0 0 0 0 0 0 
##$DQDMODE= 0
##$DR= 18
##$DS= 0
##$DSLIST= <SSSSSSSSSSSSSSS>
##$DSPFIRM= 0
$$ [...]
##$SUBNAM2= <"">
##$SUBNAM3= <"">
##$SUBNAM4= <"">
##$SUBNAM5= <"">
##$SUBNAM6= <"">
##$SUBNAM7= <"">
##$SUBNAM8= <"">
##$SUBNAM9= <"">
##$SW= 24.9336996594482
##$SWIBOX= (0..15)
0 0 2 0 0 0 0 0 0 0 0 0 0 0 0 0 
##$SW_h= 4990.01996007984
##$TD= 16384
##$TD0= 1
##$TE= 0
##$TE2= 300
##$TE3= 300
##$TEG= 300
##$TL= (0..7)
0 120 120 120 120 120 120 120 
##$TP= (0..7)
150 150 150 150 150 150 150 150 
##$TP07= 0
##$TPNAME0= <>
##$TPNAME1= <>
##$TPNAME2= <>
##$TPNAME3= <>
##$TPNAME4= <>
##$TPNAME5= <>
##$TPNAME6= <>
##$TPNAME7= <>
##$TPOAL= (0..7)
0.5 0.5 0.5 0.5 0.5 0.5 0.5 0.5 
##$TPOFFS= (0..7)
0 0 0 0 0 0 0 0 
##$TUNHIN= 0
##$TUNHOUT= 0
##$TUNXOUT= 0
##$USERA1= <user>
##$USERA2= <user>
##$USERA3= <user>
##$USERA4= <user>
##$USERA5= <user>
##$V9= 5
##$VALIST= <valist>
##$VCLIST= <CCCCCCCCCCCCCCC>
##$VD= 0
##$VDLIST= <DDDDDDDDDDDDDDD>
##$VPLIST= <PPPPPPPPPPPPPPP>
##$VTLIST= <TTTTTTTTTTTTTTT>
##$WBST= 1024
##$WBSW= 4
##$XGAIN= (0..3)
0 0 0 0 
##$XL= 0
##$YL= 0
##$YMAX_a= 244601
##$YMIN_a= -339669
##$ZGOPTNS= <>
##$ZL1= 120
##$ZL2= 120
##$ZL3= 120
##$ZL4= 120
##$ABSF1= 10
##$ABSF2= 0
##$ABSG= 5
##$ABSL= 3
##$ALPHA= 0
##$AQORDER= 0
##$ASSFAC= 0
##$ASSFACI= 0
##$ASSFACX= 0
##$ASSWID= 0
##$AUNMP= <proc_1d>
##$AZFE= 0.1
##$AZFW= 0.1
##$BCFW= 1
##$BC_mod= 2
##$BYTORDP= 1
##$COROFFS= 0
##$CY= 11.3945322036743
##$DATMOD= 1
##$DC= 2
##$DFILT= <>
##$DTYPP= 0
##$F1P= 18.9103706918063
##$F2P= -1.10871071338519
##$FCOR= 0.5
##$FTSIZE= 0
##$FT_mod= 4
##$GAMMA= 1
##$GB= 0.15
##$INTBC= 1
##$INTSCL= 1
##$ISEN= 128
##$LB= 0.24
##$LEV0= 0
##$LPBIN= 0
##$MAXI= 10000
##$MC2= 0
##$MEAN= 0
##$ME_mod= 0
##$MI= 1.114404
##$NCOEF= 0
##$NC_proc= 0
##$NLEV= 6
##$NOISF1= 3.799351
##$NOISF2= 2.8
##$NSP= 1
##$NTH_PI= 0
##$NZP= 0
##$OFFSET= 15.70392
##$PC= 1
##$PHC0= -8871.076
##$PHC1= 25.00096
##$PH_mod= 1
##$PKNL= yes
##$PPARMOD= 0
##$PSCAL= 0
##$PSIGN= 0
##$REVERSE= no
##$SF= 200.130013532006
##$SI= 16384
##$SIGF1= 3
##$SIGF2= 2
##$SINO= 400
##$SIOLD= 16384
##$SREGLST= <1H.CDCl3>
##$SSB= 0
##$STSI= 0
##$STSR= 0
##$SW_p= 3612.71676300578
##$SYMM= 0
##$S_DEV= 0
##$TDeff= 0
##$TDoff= 0
##$TI= <>
##$TILT= no
##$TM1= 0
##$TM2= 0
##$TOPLEV= 0
##$USERP1= <user>
##$USERP2= <user>
##$USERP3= <user>
##$USERP4= <user>
##$USERP5= <user>
##$WDW= 1
##$XDIM= 8192
##$YMAX_p= 0
##$YMIN_p= 0
$$ End of Bruker specific parameters
$$ ---------------------------------
##NTUPLES= NMR FID
##VAR_NAME=  TIME,          FID/REAL,        FID/IMAG
##SYMBOL=    X,             R,               I
##VAR_TYPE=  INDEPENDENT,   DEPENDENT,       DEPENDENT
##VAR_FORM=  AFFN,          ASDF,            ASDF
##VAR_DIM=   8192,          8192,            8192
##UNITS=     SECONDS,       ARBITRARY UNITS, ARBITRARY UNITS
##FACTOR=    0.0002004,     1,               1
##FIRST=     0,             0,               0
##LAST=      1.6414764,     0,               0
##MIN=       0,             -339669,         0
##MAX=       1.6414764,     244601,          0
$$ Real data points
##PAGE= N=1
##DATA TABLE= (X++(R..R)), XYDATA
$$ [...]
3191a0518L109P470P264L238k527o969p563m030J811O763P782M342j333n498p936
3206d595n124r7N833P711N599M09m931p127o466j498L933P948P042J911l852p141
3222d45o838l001K663O952P718L534k268o628p846l979J596O049P114N036j96
3237I461n722p540n669K3M837Q116N157J025m166p683o145k028L686P764O380
3252G496K787l196p348o433l422K267O617P406L971j780o026p414m643J012N425
3267c281P527N245k29n295p168n411q24M272P342O585J201m383o888o124k218
3282i649L224O652O743L212k658o838o695l796J737O303P408M360j721n589p476
3297d783m513L30N106P301N659J73m516p742n945p78M672O723N649K543l399p097
$$ y = [-10518, -7409, 61, 7325, 10563, 8036, 1067, -6496, -10526, -8715, -1952, 5830, 10172, 8839, 3341, -4595, -9719, -9816, -3983, 3728, 9327, 9736, 4805, -2322, -8788, -10286, -6353, 1595, 8637, 10548, 6696, -445, -7283, -10284, -7621, -669, 7049, 10583, 8315, 1687, -6159, -10138, -8542, -2493, 4621, 9657, 9461, 3739, -3801, -9470, -9447, -4610, 3506, 8663, 9688, 5522, -2161, -8306, -10334, -6648, 1116, 7496, 10283, 7087, -261, -6694, -10116, -7849, -1232, 6174, 10145, 8365, 2339, -5075, -9718, -8706, -3281, 4246, 9491, 9262, 3967, -3201, -8612, -9436, -5164, 2178, 8763, 9964, 5581, -1307, -7431, -9649, -6425, 227, 6970, 10182, 7524, 686, -6009, -9805, -8068, -1765, 5643, 10003, 8282, 2693, -4783, -9296, -8966, -3860, 3441, 9100, 9273, 4757, -2985, -8930, -9708, -5036, 1687, 7336, 9879, 6480, -617]
3313f17o737k526L285O300O603L390k190n723p559m215J809O030O960M551p04
3328H657n685p074m790k49N123O807N064J404m004p448o265r80L794P008O013
3343G375K046k805o711o813k966K591O612O656L486j626o112o988m187P66N457
3358c219P449M608k31n311o352n346m19L936P044N988J196l893p029n556j734
3373h869K495O868O415K427k650o385o385l230J702N859P324L754j699n471o498
3388d343m190k2N177P315M705J94m863o771n564o42M019O532N621K300l867o566
3404i65n774k564L051O221O381K788k059n780p172l388J769N675O486M116p99
3419G986n115o519n045L44M717O745N124M41m287o803n178j491L910O573N822
$$ y = [-617, -7354, -9880, -6595, -295, 6308, 9698, 7508, 1785, -5774, -9989, -8180, -2150, 4810, 9361, 8657, 2972, -4102, -8892, -9141, -4018, 2789, 7853, 9257, 5253, -2195, -8460, -9440, -5646, 1362, 7375, 9421, 6616, -95, -6908, -9874, -7283, -671, 5985, 9471, 7845, 1733, -5255, -9442, -8676, -3219, 4230, 8838, 8607, 3296, -3056, -8402, -8821, -4885, 2159, 8147, 9343, 5450, -1579, -7135, -8869, -6374, 494, 6909, 9336, 6686, 301, -6084, -9314, -7612, -1753, 5571, 9325, 7626, 2155, -4343, -8533, -8555, -3378, 3937, 8642, 8836, 3973, -2798, -8362, -9004, -4985, 1547, 7168, 9468, 5601, -965, -6739, -9303, -6252, -31, 6350, 9138, 7079, 1299, -5873, -9261, -7492, -1817, 4669, 8785, 7986, 2871, -3648, -8693, -8349, -3632, 3113, 8237, 8678, 4391, -2412, -7590, -9081, -5171, 1402, 7224]
3434G224J456k855o185o191k550K519N811O310L392j560n857o567l897Q26N655
3449b469O661M241j96m864o604m980l69M799O179N213R47l741o741n299j439K913
3465e749O218O109K166k811n624o023k868J534N872O268L714j493n509o389l401
3480g986R5N004O677M529q9m859o006n196q50L997O522N017J410l126n952n771
3496f584j848K668O101O001K277j952o163o012k820J724N157O069L684q19m984
3511B499o598m003J67M563O666M492N82m042o353n220j300L972N980N321K027
3526H753l487n750n931k127K284N716O107K742j738n517n908l548J251N470N964
3541D281M073p93m761o149m564N7M401O157M512Q64l644o190m900j778L210N983
$$ y = [7224, 8680, 5825, -360, -6551, -9101, -6582, -771, 5539, 8931, 7371, 1514, -5053, -8950, -8124, -2469, 4192, 8433, 8237, 3373, -3231, -8211, -8580, -3781, 2398, 7611, 8558, 4817, -1924, -7223, -8662, -5749, 469, 6578, 8744, 5933, 309, -5714, -8582, -7048, -1176, 5092, 8806, 7313, 1804, -4585, -7986, -7891, -2887, 3790, 8319, 8230, 3371, -2635, -7831, -8681, -4684, 1838, 6855, 8265, 5139, -813, -6584, -8432, -5764, 337, 6338, 8615, 6663, 500, -5512, -8332, -6608, -1451, 4618, 8302, 7483, 2499, -4099, -8102, -7935, -3372, 3294, 7786, 8368, 4326, -2027, -7247, -8547, -4575, 1405, 6726, 8753, 5266, -484, -6415, -8542, -6258, -542, 5565, 8307, 6569, 1052, -4856, -8404, -7153, -1683, 4281, 8354, 7561, 2800, -3349, -7913, -7856, -3455, 2702, 7214, 8078, 4434, -1756, -6656, -8434, -5224, 759]
3557G59N557K107k380o152n532k627K093N155O270K916j165n561n798l674R46
3572g086M467O131M465l43m393o036m508o39M047N734N289J047l573n555n792
3587f745j112K484N472N676K459k268n695n510l020J441N722N785K915n79n300
3602A725n696l835M78M298O042M230L69l844o053m861o36L202O104M933J446k698
3618E204n885n376k060K444N387N735K467j788n256n670l088J292N126N403L298
3633G233q22m027n798l725l36M572N514M143Q96l680n484n160q79L273N459M659
3649E838K104k482n371n510k616K346M899N702K659j051n160n435l604P09M753
3664b219O025L637o60m169n613l873n21L739N680M416J241l577n772m523j296
$$ y = [759, 6316, 8423, 6043, -109, -5641, -8268, -6175, -1020, 5250, 8166, 7001, 1440, -4358, -8032, -7086, -2619, 3512, 7977, 7634, 3241, -2795, -7303, -7942, -3895, 1839, 7128, 8175, 4602, -953, -6745, -7857, -5373, 99, 5775, 8234, 5966, 271, -5239, -8259, -6818, -1096, 4689, 7604, 7025, 1725, -3971, -7806, -7328, -3030, 3012, 7242, 7611, 3767, -2286, -7147, -7783, -4581, 1523, 6456, 7902, 5204, -681, -6057, -8117, -5673, -286, 5449, 7916, 6128, 872, -4798, -7886, -6594, -1468, 3935, 7233, 6411, 2384, -3414, -7139, -7475, -2903, 2611, 6754, 7650, 3970, -1514, -6674, -7553, -4280, 1179, 5838, 7942, 5460, 89, -5421, -8037, -5691, -792, 4910, 7569, 6518, 1358, -4077, -7681, -6972, -2219, 3806, 7443, 6783, 2614, -2999, -6872, -7393, -3654, 2026, 6442, 7683, 4106, -1666, -6189, -7485]
3679g485K323N754M933K331k157n602n038k632J432M866N678K882q69m674n343
3694c601l432J14M423N636M214l45l918n343m114j146L543N627M759J436l545
3709D308n221n013j624K451N073N058K369j828m797n143l015J101N057N332L104
3724G212o75m208n661l419K16L552N626M001K11l397n143m600j016L236N134M486
3740E555J796k238n432n270j883K382M791M940K380j086m722n387l098R98M496
3755a778N330L019l62l759n603l557j75L835N121M445O31l173n501m553j150L243
3771c987M499M791J825k162m881m929k420K111M619M846K288j176l634n406l032
3786f648M7M449N457L363k86l871m768m124n66L421N397M094J195l068m997m477
$$ y = [-7485, -5162, 592, 5525, 7856, 5699, 97, -4941, -7573, -6141, -1275, 4403, 7285, 6416, 1742, -3601, -7033, -6919, -2496, 3140, 7354, 7009, 3091, -2252, -6366, -7512, -3969, 1658, 6417, 7853, 4308, -913, -5926, -7550, -5099, -26, 5032, 7401, 5573, 776, -4367, -7382, -6281, -1224, 4108, 7212, 6537, 2329, -3332, -6751, -6535, -2983, 2643, 6644, 6855, 3458, -1685, -6285, -7301, -4065, 1069, 5555, 7351, 5113, -319, -5589, -7472, -5090, -299, 4641, 7021, 5935, 1213, -4174, -7272, -6274, -1778, 3552, 6571, 6209, 2450, -3153, -6710, -6885, -3050, 2071, 6516, 7147, 3974, -1527, -6080, -7230, -3987, 512, 5303, 7128, 4966, 85, -4844, -7264, -5153, -534, 4312, 6600, 5424, 1790, -3616, -6648, -6601, -2152, 3305, 6668, 6382, 2511, -2257, -6381, -6947, -3526, 1871, 5965, 7160, 4092, -905, -5382]
3802e382j559K642M382M958J590j211m788n095k571J243M842M971K487m59m010
3817B040n035l649L51L405N683L680j01l229m919m125p59K582N095M724J331k413
3833D661n250m544j577K161M584M449K171j368m073n117l024J111M079N263K885
3848F411o69l654m752l539k18L117N581L913M93l714m423m092j252K938M601M067
3864D808K189k384m960m574j623J732M246M628K424j220l977m908k615M11L800
3879b023N294L069n57l405m904l474k53K851M617M438Q80k568n118m253q66K398
3895c874M357M020K003j707m542m817j788J502M088M584K379n88l916m935k970
3910f204N38L563M417L658J43l428m574l694p14L167M402L946J252k402m934m140
$$ y = [-5382, -6941, -4299, 83, 5041, 6631, 5420, 632, -4463, -7034, -5791, -949, 4022, 6509, 6050, 2040, -2995, -6644, -6293, -2888, 2795, 6475, 6374, 3145, -1774, -5899, -6658, -4076, 1019, 5743, 7074, 4661, -589, -5133, -6710, -4549, 35, 4484, 6655, 5287, 1214, -3903, -6927, -5816, -1737, 3526, 6411, 5742, 2088, -2664, -6203, -6421, -3304, 2277, 6190, 6683, 2969, -1454, -5546, -6798, -3860, 741, 4808, 6997, 4613, -347, -4921, -6544, -4812, -566, 4062, 6486, 5266, 1289, -3619, -6234, -5823, -2023, 3271, 6340, 5783, 2378, -2526, -6000, -6253, -3402, 1215, 5653, 6533, 3965, -1153, -5406, -6272, -3874, 483, 4503, 6506, 4799, 257, -4560, -6348, -4846, -758, 3826, 6205, 5617, 1701, -3234, -6204, -5666, -2103, 2314, 5972, 6115, 2687, -1887, -5581, -6295, -3128, 1274, 5220, 6472, 4070, -864, -5004]
3926e004j596K182M303M409J969j552l977m442k629J224M108M346K838r60l239
3941A980m736l050J8L216M955L334k16k467m427l914j033K766M240M221J262k127
3957D022m299m165j642J641L874M374K134j188m098m121k531O20L859M563K830
3972E873k15l302m739l172r6K808M526L537P93k902m371l406r14J752M360L861
3988D393J940k131m561l574j946J281L459M962K356j008m081m075k679N22L014
4003b128M563L322o6l310m335l514L6K545M139L833Q44k065m819m002r37J848
4019d046L987M239J943j687l905m080k470J115L999M425K029m88l391m167k923
4034e420j52L535M176L174r8k317m513l395l94K013L965M348P32k139l966l705
$$ y = [-5004, -6600, -4418, -115, 4294, 6263, 4711, 734, -3708, -6337, -5113, -1005, 3341, 6179, 5219, 1980, -2756, -5806, -5788, -2572, 2383, 5717, 5501, 3034, -1393, -5307, -6340, -3574, 666, 4887, 6149, 4022, -277, -4442, -6084, -4443, -569, 3805, 5939, 4751, 653, -3468, -5999, -5379, -1520, 3043, 5873, 5658, 2356, -2383, -5555, -5651, -2843, 1683, 5220, 6013, 3111, -1260, -4666, -5580, -3828, 532, 4393, 6333, 4202, -359, -3933, -5879, -4598, -1139, 3823, 6179, 5171, 1090, -2985, -5664, -5142, -2128, 2435, 5757, 5691, 2381, -1954, -5468, -5432, -2887, 1252, 5085, 5929, 3864, -955, -4957, -5894, -4046, -59, 4180, 6123, 4436, 531, -3549, -6019, -4904, -905, 3520, 5549, 5061, 1670, -2497, -5420, -5572, -2037, 2139, 5313, 5215, 2898, -1615, -5010, -5404, -3391, 574, 4922, 5654, 3515, -451, -4156]
4050d156j616J647M179L834J742j082l769m300j762O81L338M256K445m21l170
4065A846m161l238O0K780M555L239O02k686m230l479p09K321L854L613J319k007
4081C679l707l532j908J506L448M073J838j112l591l964k159L89L201M220K953
4096E334j04k891m242k830j99K284L968L765O16k681m281l274j117K366L669L442
4112C825J328j115l629m081j804J075L567L884K313r51l098m117k525K99K913
4127b116L967L275j27k311l970l367o89K559L780L315R62k118l786l421j232J716
4143c563L545L834J471j141l240m177j982P82L226M101K381m80k929m250k468
4158d890k62K977L932K611P26k423l850l374n78K417L389L323J335j592l914l602
$$ y = [-4156, -5772, -4125, 54, 3888, 5630, 4548, 779, -3521, -5283, -4602, -1264, 2992, 5437, 5016, 1846, -2315, -5553, -5493, -2713, 1842, 5081, 5683, 2997, -1233, -4712, -5421, -3100, 754, 4367, 5686, 3679, -28, -3560, -5468, -3962, -514, 3559, 5397, 4285, 694, -3270, -5429, -5040, -1839, 2381, 5334, 5230, 2339, -1903, -4733, -4932, -2648, 1320, 5085, 5701, 3020, -1261, -4535, -5652, -3286, 383, 3825, 5153, 4038, 409, -3672, -5476, -4401, -834, 3050, 5363, 4412, 1314, -2803, -5328, -5029, -2116, 1851, 5126, 4999, 2688, -1282, -4649, -5338, -2779, 1001, 4316, 5278, 3160, -626, -4047, -5279, -3563, -18, 3816, 5287, 4146, 906, -3271, -5253, -4471, -1245, 2856, 5237, 4757, 1828, -2422, -4890, -5152, -2175, 1757, 4368, 5094, 2671, -1179, -4553, -5131, -2714, 675, 3998, 5333, 3741, -173, -3775]
4174c775j458J738K961L876K023j123l108m013k141Q78K591M045K234K25k739
4189B214m279k514l00K586L979K848O67k483l436l192j011J462L706L269J600
4204E116j512l440l761j600J168L315L838J548l48l115l640k230K85K850L548
4219B022K311J96k229m098k522n45K341L674L324N50j884l678l406r64J156L370
4235c82L839J530q90l484l722j992R94L120M048J873n72k752l854k515L27K199
4251b233L924K867Q9k239l727k832q03K259L384L115R55j736l438l007j643J359
4267c706L492L136J844j184k781l281k324P39K868L904K002l87k493l882k389
4282d442j49K384L471L122N08k211l604l060q88J932L197L167J429j324l293l500
$$ y = [-3775, -5233, -3495, -534, 3342, 5365, 4242, 1134, -2879, -5020, -4142, -1551, 2494, 4728, 4953, 2214, -2065, -4579, -4879, -2293, 1686, 4534, 5201, 2718, -718, -3910, -4921, -3459, 247, 3516, 5116, 3604, 164, -3597, -5197, -4029, -714, 3124, 4672, 4324, 1209, -2431, -4661, -4376, -1526, 2022, 4333, 4529, 2300, -1798, -4320, -4865, -2524, 1150, 4474, 5024, 3140, -538, -3944, -4908, -3752, -382, 3457, 4987, 4097, 613, -3109, -5101, -4107, -987, 3061, 4934, 4362, 1610, -2244, -4759, -4432, -2233, 1691, 4558, 4647, 2408, -1319, -4151, -4954, -2695, 689, 3804, 4759, 3023, -415, -3422, -5065, -3706, -214, 2922, 4766, 3582, 801, -2480, -4804, -4065, -1197, 2707, 4709, 4322, 1829, -2053, -4442, -4591, -2207, 1264, 4386, 4894, 2683, -921, -3981, -4869, -2937, 260, 3427, 4856, 3532, 239, -3261]
4298c261j688J409K741L705J712o37k616l672k183L67K362L669K432j15k275l472
4314a522k637j48K210L052L052Q24k158l508k999p88J288L392L315J070r96l032
4330D15l373j572O23L085L215K414p02k861l346k060K8K345L487K456M12k614
4346A952l277k777n03K071L268L074R34j930k863l399j325J487L347K997J578
4361D634j090k824l367j939O60K907L144K475l75k452l537k287l87K456L398K484
4377C900M52j987l299k934n43J626L384K740Q43j164l256k791j516J240L018L161
4393B874J652r76k573l299j786N61K405K915K460j26k393l507k402K47J839L167
4409A058K854L47k056l083k808p64J743L173K887J034j272k845k950j624R26K824
$$ y = [-3261, -4949, -3540, -799, 2906, 4618, 3981, 1365, -2307, -4490, -4123, -1761, 1908, 4340, 4225, 1950, -1522, -4159, -4307, -2097, 955, 4007, 4831, 2673, -835, -3834, -4622, -3334, 58, 3373, 4443, 3447, 415, -2958, -4530, -3907, -822, 2393, 4807, 4105, 1244, -2102, -4162, -4134, -1789, 1698, 4154, 4566, 1952, -1325, -4102, -4605, -2534, 734, 3808, 4742, 2812, -51, -3450, -4775, -3288, 59, 3056, 4634, 3544, 720, -2647, -4586, -3926, -1019, 2125, 4600, 4225, 1773, -1764, -4051, -4438, -1982, 1416, 3900, 4352, 2365, -934, -3868, -4411, -2785, 599, 3339, 4182, 3018, -238, -3029, -4545, -3305, -287, 2874, 4526, 3550, 977, -2322, -4108, -3547, -1142, 1773, 4233, 4107, 1714, -1793, -4195, -3948, -2109, 1058, 3912, 4259, 2203, -880, -3688, -4452, -2709, 464, 3351, 4385, 3113, 268, -2682, -4306, -3380, -556]
4425e56L226J576p00k483l278j656m1K308L577J968K30k393l296k049o37J873
4441b331L184K786P58j669l322k519j319J610K927K806J565j573k332k861j832
4456d122N23K604L312J657l06k550l017k215rK279L237K654k34j821l107k585
4472c700l85J461L243K662R75j481l253k479j318J150K711L343J233q65k679l205
4488b587j368K58K714K900K016l63k190l214j978k52K251L044K550O96k140l339
4504a002k710j53J221L086K555J072j094k988k819j303P12K823L093J863r45k300
4520A111l140k222O24K329K957J909l0k089k915k493o3K512K404K477O36j707
4536B300l073k415q47J230K901K761J040j014k350l035j499O79K651K957J239
$$ y = [-556, 2670, 4246, 3546, 1063, -2215, -3871, -3912, -1604, 1973, 3941, 4171, 1778, -1518, -3567, -4204, -2331, 853, 3639, 4397, 2728, -594, -3113, -4432, -2822, 105, 2911, 4476, 2903, 571, -2290, -4122, -3599, -995, 2317, 3974, 3668, 1118, -1899, -4114, -4123, -1844, 1393, 4047, 3813, 1992, -1115, -3700, -4085, -2624, 619, 3281, 4256, 2775, -478, -2957, -4275, -3125, -414, 2929, 4162, 3297, 618, -2587, -3955, -3697, -983, 1917, 3933, 3570, 1380, -1834, -3812, -4064, -1813, 1231, 3781, 4477, 2337, -1002, -3712, -3865, -2644, 442, 2997, 4069, 2975, -13, -2832, -4135, -3423, -600, 2493, 4356, 3411, 1111, -2029, -4251, -3627, -1298, 1659, 3568, 3538, 1449, -1466, -3959, -4022, -1510, 894, 3371, 4007, 2300, -773, -3188, -4035, -2805, 96, 2857, 3897, 2883, 533, -2502, -4001, -3322, -671, 2286, 3525]
4551C525o9k435k947j804K04K364K564K011N46k474k403k540m78K144K728K501
4567C437K37j267k608k664j095J122K653K984J107p19k898k515j451L59K276L241
4583B199J300L32k523l167j552n33K334K767K020P20j961k608k504o32J209L131
4599E32K658N02r65k912k658j071J032K446K901J086k25k897k303k097O45K034
4615a292L086J846j18k131k863j785n16K011K521K357O16j747k663k569n19J273
4631b493K759K496J062j052k610k509j733R09K553K983J601o72k315k869k009
4646c899O13J938K857K288n90j986k361k270j13J476K763K520O03j513k591k626
4662b891p12R08K555K558J590p95k857k698j391R36K330K763J112j82k187k744
$$ y = [3525, 3456, 1021, -1926, -3730, -3526, -1162, 1402, 3413, 3959, 1485, -918, -3458, -3936, -1792, 936, 3437, 3674, 2407, -201, -2865, -3960, -2838, -185, 2799, 3906, 3187, 289, -2226, -3677, -3318, -1042, 2199, 3499, 3831, 1308, -1859, -3411, -3944, -1610, 1157, 3177, 3897, 1936, -672, -3176, -3808, -2599, 532, 3190, 3692, 2727, -185, -2843, -3914, -2882, -436, 2465, 3551, 3326, 429, -1874, -3971, -3326, -1292, 1794, 3640, 3522, 1391, -1472, -3257, -3773, -1762, 759, 3116, 3732, 1985, -678, -3247, -3766, -2493, 266, 2762, 3824, 2772, 162, -2347, -4080, -3171, -618, 2365, 3966, 3294, 979, -1890, -3899, -3286, -1348, 1509, 3797, 3207, 1221, -1140, -3410, -3523, -2047, 716, 3236, 3839, 2326, -265, -2891, -3603, -2695, -140, 2418, 4008, 3213, 356, -2342, -3733, -2797, -467, 2296, 3408, 3226, 1039, -1705]
4678a705j779K82J774K656K248q9j766k500j807r55J572K769K107P55j402k398
4694b38k626q27J036K561K045J627p49k288k792j791Q96K567J900J929l56j331
4710A563k926j965k15K004K521K197M67j791k455k430o11J440K549K467P00j186
4726B329k436k144j090O16K249K546J563o66k190k612j714M99K194K580J576j22
4742C178j865k676j725j50J480K549K057P64j757k309k495m47J183K382K518R46
4758C633j199k318k314j092M67K150K626J324m57j832k506j822L55J557K752J656
4774B980M17j660k513k285k51J519K404K354K79q67k851k323q79J325J859K743
4790B251J284r67k365k309j258N86J877K947J021J13k117k546j938K56J570K879
$$ y = [-1705, -3484, -3202, -1428, 1228, 3476, 3387, 1621, -879, -2686, -3641, -2069, 700, 2807, 3562, 2160, -238, -2864, -3691, -2655, -94, 1951, 3578, 2829, 541, -2251, -4042, -3146, -579, 1321, 3250, 2894, 1563, -1363, -3328, -3543, -1539, 982, 3179, 3646, 1855, -600, -3030, -3641, -2201, 348, 2815, 3515, 2329, -107, -2251, -3341, -2725, -476, 2070, 3633, 2967, 777, -1835, -3549, -3050, -856, 1724, 3300, 3178, 1313, -1363, -3088, -3238, -1758, 791, 2848, 3612, 1855, -454, -2949, -3396, -2213, 169, 2687, 3633, 2434, 116, -2198, -3290, -2823, -673, 1953, 3277, 2820, 988, -1518, -3340, -2985, -1428, 1324, 2980, 3397, 1737, -776, -3061, -3312, -1793, 611, 2965, 3244, 2377, -474, -2797, -3676, -2351, -492, 2251, 3535, 2568, 203, -2106, -3364, -2778, -901, 2046, 3067, 3180, 1063, -1483, -3421, -3165, -1595, 1284]
4806A284J787P6j348k323k383k23R08K473K671M39j176k520k179j136Q73K566
4822b11K112J304m16k045k792q63K08J849K415J308M5j734k487j606m17J701K221
4839E92K428L95j776k270k014m39O97K860K137O04p90k102k655q88P28K183K347
4856B037J199n95j672k770j241J07J850K667J729j99j852k214k005k40J219K962
4872I82K089k7j340k169j959q92J160K136K483P89q72j981k554j348J075K212
4888b16J819J703l26k068k346j455J44J376K491J889Jj568k512j819k44J554K100
4905E23K200K92q01k411k227q18R71K063K090J325q01k093k168j085L67J346K665
4922A438J682l54j506k825j301r1J584K562J982n5j707j846j960p13J208K196
$$ y = [1284, 3071, 3147, 1799, -524, -2907, -3130, -2222, 251, 2922, 3361, 2185, -335, -2514, -3650, -2777, -211, 1901, 3205, 2789, 744, -2048, -2911, -2703, -854, 1561, 2869, 2914, 1180, -1307, -2913, -3330, -1629, 592, 3020, 3415, 1639, -631, -2645, -3084, -2387, 473, 2610, 3214, 2424, 322, -2333, -3221, -2493, -310, 2037, 3236, 2641, 969, -1801, -3042, -2935, -1085, 1582, 3311, 3112, 1260, -954, -2959, -3199, -1980, 982, 3071, 3044, 1704, -465, -2424, -3316, -2156, -20, 2463, 3252, 2380, 399, -2155, -3503, -2428, -216, 1603, 3306, 2980, 912, -1434, -2889, -2745, -1369, 1122, 3011, 3012, 1444, -1068, -2887, -3131, -1577, 523, 2723, 3015, 2214, -197, -2424, -3242, -2271, -208, 1882, 3207, 2406, 313, -1855, -2940, -2573, -1227, 1438, 3120, 2766, 1260, -1565, -2866, -2957, -1373, 1189, 3171, 3116, 1409, -437, -2397, -3110, -1902, 294]
4938B94K413N19j081k229k064q76R21K005J899J009k89j905k195j571L31J888
4954i31K634R42K11j799k148j674j48J373K283K029p2o95k426j827r45J423K033
4971B63K208O27p77k204j945j564Q18K404J685J401jk120k169j543Q3J652K605
4988A423J263mj336k187j917j33J386K250J715M22j064j963k023q84J124J989
5004F1K073Q95o84j983k018j238M32J683K601J153m32j657k161j433o7J596K446
5021A267J254J73j379j978j795m69J146K071K065L63q29j965k171p51P81K140
5037g7K166Q99n21k199j943j248O30J575K116J406l53j575j778j828k35J476K312
5054H23J464K84q96k154j731m75R65K029J747R26j188j457k187j263Q21K013K251
$$ y = [294, 2707, 3226, 2145, -84, -2148, -3024, -2103, -98, 1801, 2810, 2521, 616, -1579, -3150, -2819, -931, 1703, 2645, 2856, 1057, -1091, -2765, -2913, -1540, 743, 2772, 2700, 2005, -421, -2248, -3193, -1770, 263, 2471, 3098, 2321, 117, -1828, -3392, -2574, -170, 1515, 2916, 2915, 795, -1374, -2917, -2834, -1182, 1423, 2686, 2682, 1346, -841, -2758, -2891, -1505, 745, 2460, 2882, 1818, -145, -2168, -3052, -1928, 61, 2134, 3029, 2345, 362, -1656, -2894, -2462, -779, 1822, 2975, 2543, 886, -1275, -2708, -2775, -1179, 1267, 2521, 2694, 1315, -663, -2458, -2927, -1781, 290, 2355, 2718, 1889, -76, -2247, -2998, -2217, -77, 2089, 2988, 2467, 268, -1675, -2923, -2293, -718, 1398, 2804, 2451, 876, -902, -2730, -2965, -1489, 823, 2287, 2571, 1675, -479, -2210, -2685, -1720, 309, 2056, 2982, 1794, 337, -1850, -3113, -2292, -279, 1972]
5071A972Q19l95k227j743j167K88J812J796J298M23j732j833j658o42J742J869
5087F22J822N8r34k139j447p49R91J878J709J061q49j822k104j119R61J506K092
5104A537J417q98j403j809j318j60J857J833J297J25j060k177j218o21J014J884
5120C00J771P79j303j904j811o13P48J994J926J125p15j786k219j191Q07J671
5136d21J560J505j59j588k030j491O9J349J992J563J65j115j836j974n34J399
5152a546J856J785O43p67j799k037o09L72K145J738R75p25j261k261j246M58J463
5169h16J978J210K13j528k303j248O5J351J643J922l3q44j916j700q51J200J875
5186B18J924M99j005j694j791o03M69J557K001J370q63j613k006o40k01J170K228
$$ y = [1972, 2791, 2396, 169, -1574, -2741, -2453, -641, 1155, 2453, 2876, 1144, -689, -2347, -2989, -1247, 622, 2444, 2502, 1568, -571, -2018, -2767, -1776, 102, 1811, 2872, 2023, 201, -1903, -3022, -2061, -555, 1537, 2954, 2056, 653, -1156, -2474, -2634, -777, 1056, 2353, 2478, 1418, -759, -1977, -2598, -1584, 300, 2071, 2850, 1547, -357, -2168, -2781, -2033, -39, 1887, 3012, 2297, 511, -1708, -2899, -2092, -421, 1139, 2644, 2485, 897, -1133, -2624, -2555, -1206, 786, 2349, 2514, 1399, -437, -2411, -2945, -1546, 310, 2095, 2738, 1971, 172, -1865, -2474, -2102, 43, 1781, 2756, 2031, 770, -1491, -2737, -2279, -816, 1162, 2372, 2585, 1057, -1246, -2494, -2429, -1078, 565, 2487, 2454, 1610, -306, -2006, -2857, -1657, 218, 2142, 2641, 1636, -58, -1849, -2452, -1983, -426, 1575, 2945, 2082, 469, -1537, -2177, -2378, -1208, 1020]
5203A020J207J46j364j829j395l25J362K001J649j54j029j433j522q09O59J768
5219d8J986P52q62j779j662o53PJ531K090R83k58j239j476j888Q4J416J756J480
5237B220K16j200k053j484j81J204J670J458N53r04j835j493o75N76J855J707
5253A634R48l61j975j990q32M21J345K177Q75N4j657j453j402k43J407K052J338
5270B338k4j141j449j552n27R13J880J251O27o29j357k194o49N19J489J888J332
5287B715p57j415j953j119M68J298J789J070K30j326j771j497r0J065J944J448
5303B099N1m29j971j628n10P33J838J470N03l73j599j509j065O86J622J233J425
5320B576m29j658j592j362K27J119K210J366k38j287j713j236l13J069J973J292
$$ y = [1020, 2227, 2373, 1009, -820, -2215, -2540, -1178, 823, 2472, 2318, 1289, -144, -1666, -2475, -1816, -48, 1938, 2690, 1828, 49, -1613, -2266, -2259, -728, 1362, 2345, 2087, 848, -628, -2516, -2432, -1016, 740, 2220, 2436, 1236, -817, -2301, -2482, -1278, 392, 1850, 2403, 1499, -336, -1829, -2504, -1928, -73, 1634, 2582, 2221, 246, -1744, -2576, -2155, -810, 1367, 2242, 2296, 639, -814, -2216, -2459, -1052, 1000, 2338, 2314, 1173, -276, -1828, -2355, -1442, 438, 1689, 2316, 1687, 330, -1864, -2513, -1994, -505, 1383, 2715, 1958, 543, -1410, -2529, -2061, -763, 1026, 2096, 2326, 1000, -771, -2268, -2358, -1293, 651, 2099, 2150, 1721, -250, -1878, -2388, -1655, 183, 1653, 2156, 1783, 184, -1325, -2390, -1704, -82, 1151, 2576, 2147, 489, -1103, -2465, -2238, -1119, 1091, 2457, 2219, 932, -781, -2017, -2330, -1261, 712, 2004]
5336B004L57r61j584j437q52Q96J746J702N03p29r82k038j127L17J596J731J178
5353B320j63j616j593j201J81J217J387J624K69j395j730j309k76R74J766J388
5369A843M45q48j818j246n10L02J703J563R66o56j319j824r48P4J381J951J431
5386B490m71j005j599j524n2J162J473J412K79q74j801j690R5Q34J610J244P24
5403B307n36j850j337n88L7J690J484J055j95j456j873j017L6J440J993Q07qr33
5421A056j711j318n1Q13J759J319J53p61j572j180p77N33J879J439O19m54j650
5438I6j559q98N68J423J370J045J35j563j535r33k60J243J761J186j14r94j487
5455e16j313l60Q95K000J266J85p34j484j685m62L69J698J911M01l48j402j624
$$ y = [2004, 2361, 1400, -184, -1621, -2473, -1577, 169, 1871, 2374, 1645, 663, -1375, -2502, -2185, -589, 1142, 2320, 2157, 541, -1052, -2253, -2072, -855, 532, 2156, 2425, 1030, -700, -2009, -2285, -1311, 455, 1843, 2288, 1440, -378, -1624, -2134, -1832, -129, 1434, 2400, 1744, 425, -1399, -2347, -2273, -892, 1059, 2490, 2019, 1014, -585, -2109, -2161, -999, 474, 1886, 2165, 1291, -510, -2200, -2105, -1271, 339, 1583, 2307, 1771, -79, -1416, -2004, -1967, -277, 1207, 2262, 2067, 611, -1262, -2279, -2243, -803, 1190, 1997, 1989, 1056, -655, -1973, -2024, -1211, 548, 1867, 2020, 1259, -313, -1493, -2270, -1737, 142, 1581, 2200, 1746, 96, -1463, -2361, -1793, -370, 1000, 2045, 2180, 617, -918, -1851, -2111, -868, 893, 2079, 1965, 971, -516, -1829, -2189, -1294, 706, 1972, 2157, 1423, -61, -1746, -2208, -1839, -141, 1770, 2171, 1823, 421, -1203]
5472a203j010J60J523J524J060N4j391j571j210q2J073J843J160J36n98j953j307
5489a792k74N93J330J556Q01o02j493j762m35K01J828J318R63l16j613r32j514
5506b143K38J591J025J463l23j083j401j098k69R25J697J251K46r81j426j490
5522a778m26Q73J508J331O78n09j421j644r06P45J282J312J322p97j006j696o89
5539a821oP86J748J177N8j023j333j453J8O50J340J698L26r50j154j679n44Q26
5557a336J233J343P78o76j003j771o00M64J362J072Q58k1q95j643j150k8R47J594
5575E28J149K41p42j772j256l42R93J204J707N46o97j540j545n73N45J345J087
5592H78J133n50r51j580j042M34J116J406J165k74j091j113j492J4J037J362J317
$$ y = [-1203, -2213, -2053, -530, 994, 2054, 2108, 717, -854, -2064, -2146, -1073, 770, 1930, 2066, 1468, -485, -1792, -2066, -1473, -143, 1413, 2214, 1612, 119, -1643, -2078, -1877, -49, 1269, 2232, 1916, 303, -629, -2143, -1905, -314, 711, 2174, 1851, 768, -633, -1731, -2000, -1075, 622, 1873, 2119, 1138, -288, -1778, -2204, -1331, 177, 1508, 2186, 1677, 256, -1388, -2294, -1549, -267, 1045, 2367, 1570, 564, -1132, -1821, -1827, -1041, 707, 1884, 1942, 919, -414, -1867, -1849, -1199, 141, 1839, 2165, 1215, 61, -1618, -2162, -1336, -103, 1240, 2018, 1342, 339, -1432, -2032, -1568, -206, 866, 1724, 1703, 808, -835, -1985, -2013, -1066, 528, 1677, 1918, 1176, -596, -1852, -2194, -1201, 3, 1710, 2256, 1559, 19, -1526, -2099, -1554, -209, 878, 2011, 1461, 510, -1070, -2112, -1678, -562, 844, 2009, 1735, 644, -469, -1961, -1947, -910, 452, 1769]
5609A769J64o52j834j097k55O79J238J508K54o44q66j691n98M60J311J467Q85
5626B098j74j410j298j007N9J042J600J045k67j036j223j153k32R06J156J687
5642A793K56q55j560j256l89P49J357J224R47r65j162j431p83K17J582J306O32
5659A662R8j249j486q50k2R94J709J036p2p25j524p70p58R72J415J035N40o19
5677A386j195j677n27N76J393J375M83k30j313j462o76n4J484J414Q89p4j236
5694E56j312r13r5R56J437J284J57j233j416p80m51M30J446J525L31n86j499j083
5712a246q19P52J013J506O26k35j326j028j237K85J095J409R50M9j042j486q39
5729a573m56J017J390R41P91q07j297j510m86R17J184J507o6j02j155j673o13
$$ y = [1769, 1933, 1281, -553, -1650, -1905, -1226, 12, 1520, 1774, 1130, 264, -1427, -2025, -1565, -254, 1213, 2098, 1924, 514, -784, -1791, -1732, -690, 910, 1955, 1688, 652, -571, -1724, -1956, -1050, 106, 1793, 2049, 1194, -366, -1622, -2011, -1262, 95, 1319, 2266, 1301, 139, -1292, -2075, -1858, -276, 1030, 1662, 1760, 511, -975, -1825, -1847, -853, 856, 1892, 1820, 1095, -429, -1199, -1957, -985, 430, 1465, 2005, 1386, 191, -1486, -2013, -1437, -44, 1331, 1814, 1584, 271, -1191, -1867, -1921, -437, 977, 1866, 1792, 556, -756, -1669, -1764, -808, 629, 1913, 2070, 837, -579, -1359, -1810, -1380, 66, 1591, 1922, 1336, -163, -1246, -2065, -1313, -300, 1206, 1832, 1597, 271, -757, -1994, -1709, -614, 795, 1745, 1794, 752, -734, -1573, -2029, -1012, 378, 1319, 2110, 1303, 6, -1504, -1990, -1073, 111, 1618, 1552, 1450, 295, -1378, -1991]
5746a991O72J204J377O06k77r58j562r39r0J314J564P14J12j250r56j123k62P55
5764a090J369J358J38n46j311j309m01O44R48J324L66q9j185j196q65J22J400
5781c23J479Q30j83j256j015q76k69J100R79J113M27j027j257j307n90J069J309
5798B03J221K11m58j344j237m29M55J218J384N63j63j044j653q46L10R34J567
5815H92Q82P8j152j178j258K4J028J139J279k02l93j274j604O8P77R23J268M75
5833A772k88j641r08r00L21J587J348J31m3q21j676o58L53M95J892O01K10j010
5851G65j256r81j58N67J593Q88N07r59j511n56q26J025R35J324N98p01j056j054
5869h56j095M99J019J351Q99k75j164j058q11N1O48J282J221kq25j346j032m3
$$ y = [-1991, -1319, -115, 1262, 1868, 1591, 633, -929, -1868, -1958, -644, 920, 1634, 1746, 496, -460, -1583, -1845, -1090, 279, 1637, 1775, 1229, -82, -1391, -1792, -1148, -200, 1124, 1490, 1401, 216, -980, -1845, -1723, -323, 1156, 1986, 1803, 547, -468, -1344, -1613, -513, 466, 1579, 2006, 979, -278, -1585, -2175, -1106, 203, 1424, 1635, 1177, -167, -1404, -1833, -1378, -160, 1224, 1787, 1624, 580, -1073, -1919, -1609, -675, 892, 1774, 1852, 700, -478, -1736, -1712, -684, 455, 1734, 1532, 1139, -135, -1739, -1671, -894, 29, 1297, 1772, 1484, -157, -1065, -1965, -1644, -57, 1291, 1422, 1379, 558, -1118, -1776, -1423, -928, 964, 1565, 1775, 765, -491, -1472, -1630, -1063, 530, 1418, 1925, 966, -545, -1101, -1927, -902, 33, 1357, 1955, 1254, 198, -856, -1951, -1452, -433, 918, 1817, 1542, 378, -680, -1491, -1440, -792, 490, 1711, 1709, 884, -462, -1494, -1537]
5887a537N06J149J643mo93j441q77k71J95J123J429O91m21j553j239k87K9J189
5905c69J111R94k74r86j130q37k05Q49J419J170n3q09j232r54m86O93J283J092
5923A276L97p82j172j010k69J27J369J001P62l12j223j014q31J14R33J356O90
5940A412o8r41j112j112J60R14J001J076N60p28j504j168j51L83J546J131K92
5957A691m41j013j405l24J85R63J322Q64n14j012j029q89j33J340J025Q39K95
5974A764q44j407j205p2R32J196J072K98n02j145j321o42O56J184J355K66k29
5991A356j272j082n17K51R27J320O64k32r06j434o10l34J551Q96J035Q0q96j025
6009b28r83n36Q87J061J264K10o40r13j272n56O51J041J183M02n06q70j189l40
$$ y = [-1537, -1031, 118, 1761, 1757, 1064, -377, -1254, -1525, -1330, -207, 1222, 1913, 1492, -61, -1300, -1587, -1558, -369, 742, 1736, 1462, 476, -654, -1491, -1696, -847, 572, 1742, 1689, 880, -352, -1306, -1792, -1099, 184, 1276, 1673, 891, -281, -1291, -1560, -1433, -64, 937, 1699, 1387, 164, -850, -1681, -1567, -634, 722, 1412, 1344, 403, -709, -1821, -1661, -747, 254, 1330, 1890, 1162, -342, -1510, -1661, -1278, 268, 1399, 1691, 1250, 237, -1168, -1492, -1307, -344, 978, 1842, 1328, 316, -713, -1602, -1735, -395, 630, 1469, 1764, 920, -487, -1692, -1764, -832, 364, 1436, 1734, 1232, 87, -1234, -1876, -1220, -36, 1319, 1585, 1356, 84, -998, -1515, -1264, -337, 983, 1647, 1415, 509, -925, -1535, -1869, -318, 578, 1613, 1693, 797, -228, -1211, -1747, -860, 201, 1465, 1675, 1035, 122, -1150, -1706, -1055, -14, 1169, 1571, 1065, 195, -994, -1334]
6027a334K00Q38J171P49m41o42j312n49l04O51J547O11L00q25j121j093o5M82
6045a137J425P67P85m72j356j332k55R6J235J248M79M4j128j356l54m0O66J398
6063G13P29J06o08j421j166J14P79J043P61N57q34j043r89k39M49R00J243O09
6081A703o06q38j349n04K91J153J312O91p45m46j199r40mQ93J363Q72j05r16j236
6100f10q27l57J249J236L23M28k00j246j366l46M26J185J085N56j87j187j074
6117i12p68J90J586N25R11l28o66j347r35L61R96R61N96K08p08j123p87j52M74
6136i18Q79Q87P99l25j170j394k50Q6J411R21N39k88q45r24r48L91N59J798O5
6155A273J13j139p03j021l44J024J169Q66J84p87j008r77J4L06O46J439N84m72
$$ y = [-1334, -1134, -296, 875, 1624, 1183, 541, -771, -1320, -1624, -973, 574, 1185, 1485, 660, -461, -1554, -1619, -1137, 288, 1055, 1840, 1368, 12, -1320, -1575, -1479, -244, 1004, 1483, 1527, 399, -957, -1311, -1351, -685, 713, 1442, 1548, 940, -481, -1647, -1533, -754, 289, 1050, 1607, 773, -270, -1259, -1498, -1049, -149, 1094, 1703, 1097, 259, -1090, -1594, -1303, -150, 1162, 1853, 1108, 662, -537, -1477, -1481, -588, 775, 1647, 1542, 626, -610, -1437, -1794, -545, 691, 1014, 1442, 1242, -4, -1370, -1716, -1290, -105, 980, 1536, 1349, 162, -912, -1680, -1490, 96, 621, 1532, 1204, 538, -809, -1744, -1383, -387, 574, 1170, 1378, 670, -453, -1240, -1392, -918, -39, 848, 1647, 1322, 152, -1242, -1492, -1406, 5, 926, 1465, 1177, 332, -592, -1540, -1149, -590, 1208, 1273, 1386, 247, -456, -1477, -1821, -797, 372, 1238, 1422, 635, -373, -1350, -1336, -1030, -384, 1055, 1639, 1167]
6173A167j282r97l51K53J024J097O64k84j130r23q95M15Q63J180P08j92q04j194
6191f81q53j6N71J353R70j1n41n48j399m94P38Q24J006O22l81r06j150m34M02
6210i28P45R83O25J25j127j121q07j3J014Q37J257k17m89j421o31j7M36J216N17
6229I84L77J41j365j360n37P34Q18Q65O88m92n28j150n99K71O53J176O15J2p08
6248E95j211q06k1P75J063R69J89o76j105q78n98Q17J014J009M98o37r91r27n43
6267a464M57N80J395L50k19q05r47p07J8Q52J119P30k95l00j129j138n5N09J193
6286A44J255l00k25j041j012j3R0J144J080M60k28j416p12l88OR10J142M98j72
6305A222q59j088p00M53L98J128N57K82o80j295r10L34N54R99P79J77m49p80j061
$$ y = [1167, -115, -1112, -1463, -1210, -186, 911, 1575, 1291, 161, -762, -1657, -1242, -379, 801, 1509, 1317, 513, -681, -1534, -1550, -979, 374, 1344, 1333, 792, 244, -1155, -1649, -911, -87, 919, 1541, 1160, 254, -896, -1330, -928, -183, 800, 1425, 1550, 423, -698, -1505, -1518, -504, 333, 1590, 1373, 884, -537, -1168, -1185, -749, 467, 984, 1361, 1502, 137, -1223, -1760, -1026, -208, 657, 1345, 853, 325, -825, -1424, -1153, -500, 676, 1291, 1303, 595, -616, -1422, -1443, -668, 395, 1364, 1553, 877, -228, -1106, -1704, -887, 127, 1136, 1634, 997, 6, -921, -1464, -1007, -427, 968, 1318, 1099, 294, -653, -1360, -1342, -490, 629, 1359, 1064, 764, -365, -1503, -1558, -1049, 144, 1399, 1099, 874, -167, -1179, -1192, -1102, 42, 1122, 1582, 1354, -62, -774, -1162, -1156, -246, 896, 1394, 1222, 363, -725, -1425, -972, -574, 554, 1111, 1393, 713, -582, -1492, -1158, -604, 395, 1174, 1351, 902, 122, -939]
6324i39k46J28J142R82N53l93j082j394k85L37Q85R63R12k66j104q64k81j90Q58
6343b84P43P32K71q73p45j110k25O64J085P47K61m69n48j053p88Q13M23J199P39
6362A582o05j017p20n28J62N21J376R45o80q19j035l96KO08J040Q68N7o19j006
6381b64p59q6R6J264N28O86l69j070p89p19O58P05P54P01l70p20p43o80m8R63
6401b62P61O78J87p34j118p45P5N00J006O73J8l94q86q47k07N51P61Q47L92k93
6421I63r80o77n82PJ268O70O82k15p25j198m93Q2O81R58P37J63j025o63r81J00
6441a228J53J143M24Q95m93r98r23m79N86Q56J193N0L0j017r91m63O2Q65O88R09
6461A262j96p10j048m33k41O70J150N98M35r76o37r34j23O59L55J291K6N5j002
$$ y = [-939, -1185, -1057, 85, 1067, 1620, 1227, 145, -1249, -1534, -1197, -312, 651, 1563, 1297, 193, -671, -952, -1142, -284, 459, 1191, 1462, 589, -156, -1266, -1491, -827, 258, 1005, 1266, 797, 249, -804, -1592, -779, -356, 843, 1582, 977, -40, -760, -1288, -1126, -605, 771, 1716, 1036, 217, -818, -1214, -1212, -604, 436, 1304, 1361, 742, -264, -1023, -1109, -1013, 251, 779, 1465, 1096, 26, -763, -1482, -824, -119, 635, 1336, 966, 246, -497, -1177, -1225, -262, 499, 1177, 1364, 630, -488, -1233, -1158, -658, 348, 1021, 1039, 645, -241, -1088, -1295, -744, 17, 864, 1256, 963, -17, -694, -1276, -1269, -1, 669, 1351, 1136, 411, -787, -1280, -1198, -517, 441, 1178, 1341, 316, -347, -1328, -1228, -1075, 68, 492, 1387, 894, -104, -1027, -1506, -920, -64, 1129, 1179, 1209, 192, -799, -1262, -1200, -335, 353, 1262, 1066, 356, -692, -1125, -1366, -696, 454, 1052, 1487, 511, -126, -1060, -1183, -524, -169, 1122, 1148, 1203, 201]
6480B01j096n53L98P39J011P40k29j178o28n56m7Q87O12Q18J5o83o24p44j03M80
6500e40O77R40K3n07q97j027K43R5J166Q21N3l32p11p34n04K39Q48Q94L66l16
6520G97o40n49q17K41N24J055K86J07j28j294o54M6O57M92J010%l36j093n97m52
6540a345P90M81Q02P21l29r52q69n83J94Q81O82R50m07m67q63n89k6L01Q81P39
6560I92J96n94q78p29q4M05P39P56M72n37j006m93n99O55M80Q32Q31n94n17q00
6580d73n78K61M36J155N64o14l35m97j225K0P98R32O65K77r80m57r88m3M04Q33
6600A55R30r6L1j132m17q10L46Q96Q35L48P4r57o90n51j25Q09P87P92j06p95o74
6621c50n37l53M47J101Q53j53l08j004l41l97K22Q65R05j4j85n91r61j35r6P54
$$ y = [201, -895, -1448, -1050, -311, 700, 1440, 1211, 33, -595, -1151, -1198, -311, 301, 1119, 1134, 451, -173, -917, -1020, -540, 137, 1077, 1100, 593, -304, -1331, -1088, -993, 173, 994, 1047, 715, 4, -730, -1234, -995, -147, 747, 1113, 797, 157, -392, -1209, -968, -444, 611, 897, 1004, 876, -418, -1072, -1026, -369, 123, 1133, 1133, 797, -296, -893, -1345, -555, -74, 728, 1449, 1120, 168, -701, -1284, -1090, -209, 473, 1423, 1016, 549, -314, -903, -929, -628, 253, 992, 1188, 594, -284, -1013, -1097, -692, 47, 803, 1275, 738, -268, -761, -1360, -705, -225, 607, 1438, 844, 327, -473, -1051, -790, -354, 801, 1365, 751, 416, -81, -1306, -1286, -488, 444, 1109, 1386, 406, -51, -1039, -1082, -678, 155, 1085, 989, 1020, -112, -529, -1339, -993, -97, 738, 1086, 1160, 203, -487, -1038, -1163, -354, 433, 1225, 1119, 324, -350, -887, -1240, -793, 308, 1161, 1008, 700, -304, -645, -1042, -820, 45, 950, 936, 751, 160, -801, -936, -1032, -278]
6641b78J081M73q0j347l25q72R8M40J164O80Q0n22r64m18j39K06N98J315j12l12
6661G66j102l11m25L33O10O52O77o16m60j151J52j42M34J061N38j9o98m24p06
6680h31j59N23P79N62L19m22j137n39p3K53R44N52M16k84j000q10j22M44N06P01
6700F22K57Oq23o43n18m7N30J229K23P4l32r41p09J4M01J017M65R0j34r80l63
6721e62k13j62R69O13L96k09j088j41o39K14N48Q58Q56o20l40j073m59K55N85
6740b12O53N24J41p51n24q41J26L69O97P38l4k17r06m57l04M20M59Q14K69k96
6760F68l95j285J23L29L81L91O51o5n49p84k30k00N64N72P30L41p07q85o50o1
6780a061K39R33M28N33k25r28o22m15K07P64P67K28o2m53p44n94K29O10N57O71
$$ y = [-278, 803, 1276, 1196, -151, -476, -1348, -1250, -810, 354, 1034, 1114, 592, -372, -790, -929, -723, -125, 1190, 1078, 766, -336, -647, -1072, -739, -129, 523, 1200, 584, 124, -1027, -875, -1017, -583, 478, 1016, 997, 299, -125, -831, -990, -467, 312, 874, 1193, 771, -366, -905, -978, -725, 219, 771, 1187, 903, -97, -907, -1029, -585, -79, 622, 879, 885, 62, -581, -1099, -1146, -616, 613, 836, 910, 578, -363, -1072, -1058, -657, 360, 825, 915, 781, -199, -562, -775, -937, 32, 645, 1041, 832, -256, -397, -1036, -822, -274, 584, 1440, 820, 480, -593, -1052, -797, -212, 441, 965, 1106, 355, -169, -1010, -884, -515, 182, 920, 886, 669, -237, -694, -998, -578, -119, 695, 964, 668, 273, -1012, -889, -560, -179, 212, 863, 798, 249, -535, -765, -965, -401, 171, 901, 1242, 535, -350, -1000, -1061, -822, 111, 539, 1072, 847, -81, -703, -1118, -911, -147, 620, 848, 786, 333, -411, -1005, -776, -166, 391, 1062]
6800A062l01k43r35m26k82M43P98P57J84j51j011o47j49J17J001N63L62k99n44
6819B99r20o29N89L71P09N56j68p74n90m73m6P66O55P77j02n90p97o98K01N74
6839b90O00L55J25j0r51o17m30O63N32O71Q35r64n22r73p4L88M17P83L98Kp78
6860A60o63l93l47O66Q04N92J79n04r56m98m7O67K59R81M73p22p29o70k34J05
6880h77R04L88P18m73k73j024m72J36M10Q01N16jm71n87n32j71O16R02M33J04
6900A047k97q99o64P0J44P84R4P36k31o83r59l85M77O16R58J95K0q64n03m63K33
6921e74j97R40Q72m09k48n14q96J26K64R03L97l6l81L4q67n03K25P02N94L70n3
6942G49n68n16o82P9O71O28O29J73n66r35n98r2P59N87M54K32o59p93l33K26l65
$$ y = [1062, 761, 518, -417, -843, -1125, -682, 116, 873, 1057, 906, -105, -752, -901, -784, 217, 780, 1142, 843, 299, -621, -1250, -661, -290, 419, 975, 807, 33, -557, -1030, -1076, -310, 345, 1122, 1020, 430, -367, -1065, -864, -290, 310, 665, 790, 780, -171, -788, -1218, -555, -23, 648, 1483, 519, -3, -976, -1050, -662, -245, 538, 936, 938, 160, -503, -896, -1243, -577, 227, 819, 998, 494, -462, -960, -1007, -340, -81, 900, 1373, 651, -78, -748, -982, -877, 27, 415, 1133, 660, 387, -637, -1109, -973, -563, 238, 754, 753, 282, -305, -837, -1008, -392, 510, 943, 1047, 750, -149, -813, -743, -599, 185, 279, 1015, 784, 101, -858, -1243, -766, -150, 808, 1003, 1023, 159, -344, -807, -574, -771, 169, 1041, 632, 384, -130, -1026, -900, -636, 267, 664, 628, 247, 281, -586, -1089, -864, -162, 432, 802, 749, 181, -335, -1017, -938, -267, 361, 990, 1163, 597, -338, -936, -1028, -269, 318, 772, 1004, 345, -448, -781, -555, -920]
6963i20J194P54l43J00m30j170q1M70L39M93Q8M27o00n04n81k06O03R17K59J0
6983H19n18n40n48n1L39J079KJ11k35m77p30n0L09L98O58L80k63o24n07o16K45
7004h19Q46N48Q1Kl09q48l15J09M69L56P89L85q88q10k67l21P85N47M31p0q2o72
7026e3n27j4Q8M86O26L06o15j88o68j96J06M91O45L05j32l49o15m14p1L47O76
7047B34P33L31j121o08k11l10M23N08Q08K31l76p55o25j37O4Q16M81M52j58m01
7067C79q18l76J72O76L50L87j62l41l94q00J5P10M47M53L52p63m65o68K86J19
7087d41O98L12L72n68l91n37j58j83R19K90O97j02r59l46j10m60O38P31N62l96
7107E68l05p21j87j25O47L43P36r5m65n40p43J01L1J069K00L02n3l07j114r5K64
$$ y = [-920, 274, 1028, 685, 785, 355, -815, -896, -426, -87, 406, 494, 921, 321, -183, -764, -970, -367, 550, 809, 819, 301, -239, -787, -838, -499, 580, 582, 693, 458, -19, -749, -799, -490, -92, 566, 946, 683, 59, -448, -1064, -819, 27, 575, 656, 658, 349, -499, -814, -705, -236, 120, 909, 1294, 406, -404, -671, -992, -207, 340, 771, 701, 619, -53, -580, -594, -506, -20, 606, 912, 297, 109, -559, -755, -649, -158, 487, 792, 660, 311, -304, -718, -789, -442, 234, 967, 1298, 177, -431, -642, -952, -529, -21, 787, 1018, 642, -113, -738, -875, -811, 5, 486, 938, 780, 379, -439, -815, -643, 33, 383, 770, 608, 267, -127, -927, -912, -202, 245, 698, 1050, 287, -178, -846, -560, -441, 257, 569, 941, 373, -18, -555, -713, -896, 23, 313, 1010, 908, -51, -397, -507, -967, -329, 402, 964, 568, 263, -458, -645, -770, -123, 220, 956, 861, 396, -144, -887, -786, -755, 314, 514, 816, 763, 456, -658, -753, -489]
7128d89O03L02O55k60p76m62m81N76k6O81N79J48n24p02p17K14M04m5Q22J28k16
7149D14j87q15l43J37P10N69L61j01o79n07J07l39N13O36J57r4k72o90m27M06
7169d44M3N77M58K99m79l65r07o8lJ104K31L30m21l85n16k99L48K81P88L85j38
7190H19p25m39k83j27L16O43N15m5k37p78m69p0O12O08N04k67j41n22n86l67N29
7211e10N48N68K62m60m89m10l44M51J61O20J35o9k94m32k55Rm1Q88O97l19n70
7232A46n42k09n9L19M31O97O1n96k63n22J45j82N05M64N11o64L4q38l53J15M18
7253c82J021K3L03p88k11p77J20L34P53K66N4l70m96l42k78K0J066J67N21p07
7273B97k72o54m94N85M84O16n2J99p28k80q79O39L57N62M43j86m99n27k30J03
$$ y = [-489, 114, 416, 1071, 811, 35, -427, -908, -332, -358, 323, 902, 1050, 526, -176, -893, -679, -275, -320, 502, 630, 414, 227, -588, -931, -794, -84, 485, 846, 745, 66, -441, -334, -673, -160, 476, 633, 539, 267, -423, -850, -444, -401, 176, 634, 933, 454, 89, -818, -886, -889, 215, 446, 776, 355, -30, -546, -845, -497, -216, 572, 957, 819, 94, -345, -628, -755, -439, 204, 719, 674, 437, -341, -810, -880, -268, 340, 844, 577, 436, -86, -672, -1039, -510, 38, 606, 868, 408, -81, -491, -835, -384, -223, 397, 532, 463, 169, -263, -518, -509, -550, 338, 1035, 716, 146, -396, -605, -664, -345, 86, 783, 844, 248, -15, -537, -392, -574, -69, 395, 906, 242, 276, -562, -915, -800, -382, 639, 662, 965, 177, -34, -811, -691, -357, 396, 662, 716, 346, -150, -492, -770, -750, 316, 483, 1004, 297, 25, -629, -1123, -538, -54, 562, 510, 709, -19, -299, -1178, -539, -182, 380, 823, 637, 138, -389, -619, -516]
7293e16K04M76Q45r9n24o53l83k65N63P07M95N4k22n63n67k56j42R03L25J24L07
7314H13o09n10l77OO28O30j4K16m91m20l78q3N13K40M32N7k63p42k80m05N86M08
7336d3O22L19m86m30n59j15L61M50M39M6L9m29m80m07K78L8L72Q50j86j85m03
7357I1o82r3O18J59M97J86k31m58n63j69J68K81O50K54r7n91n88k86L60M70J99
7378A75O91j51l99p68n24L80K23N26M55K13m63j70r00K1L6O69N00K62m03j30o63
7399d20n18K55M79N88K08k6o3j168J05J10K36P50M17l18n47m38l22J91J76M72
7419A67N61J39l90o98l06k29J72P80K76O3j37k13p59o7Q3N79L15LK25m87l05l93
7441f21j23O56K73O25K08p31o75j05p07P16O96O08j32j15m90m58j22k35Q22N21
$$ y = [-516, -312, 164, 1009, 910, 386, -267, -650, -915, -352, 355, 850, 904, 682, 119, -448, -704, -846, 57, 382, 506, 813, 204, -306, -683, -677, -49, 581, 567, 783, 292, -128, -506, -589, -76, 164, 596, 653, 390, -352, -632, -1037, -451, -43, 579, 898, 412, -18, -577, -692, -331, 119, 558, 604, 643, 214, -266, -673, -395, -357, 15, 865, 679, 494, 91, -591, -684, -66, 93, 590, 776, 545, 87, -476, -645, -477, -196, 454, 708, 611, 20, -568, -854, -494, -24, 175, 866, 715, 316, -452, -976, -596, -373, 153, 608, 821, 358, 188, -712, -691, -655, 14, 514, 776, 373, 243, -420, -938, -683, -204, 384, 592, 566, 503, -665, -560, -450, -214, 536, 953, 635, 88, -350, -672, -481, -305, 167, 728, 867, 477, -221, -527, -756, -584, 196, 472, 535, 398, 185, -574, -641, -558, 21, 336, 339, 564, 77, -228, -621, -744, -88, 185, 810, 1018, 287, -388, -493, -1200, -484, 212, 820, 688, 573, 83, -375, -497, -732, 90, 611]
7461F11j16Q2m87l64k51k09O12N23L73m38r9n99j97P2N85L9N9M65l65k33o06J07
7483d36qM12O01J84j31m30n24k89J53P05J92J50J23m06o91j49m02N76Q81O3J54
7504G28m25o95j96J73K22K97J65L24k5o22l34M3k0J13O21K92j18o81j9p12M88
7525c81K25P40K93n05k27m26k66k55K93O00N02j70l09j94j76l44K20M15M67J37
7545F39n75o0l63j27L49j40O34K03q0m35m65j03P6Q8O31L43M2l07l76l38m10M50
7567c24N96L75l2k29m50m34p7l8O29R7Q11m14o69j52l68L98N03J94M57m85l70
7588A8m27l23%K72M78N75k73K14o43n03MM54L27L79j20m6n12l63j33J63L09N10
7610C60K57k86m00j63k79N9M28K53J6J11m25K1m03K0N89J97J44J96j99p62l2j88
$$ y = [611, 495, 577, 90, -274, -525, -734, -122, 401, 774, 336, 237, -362, -559, -487, 98, 137, 196, 661, 296, 63, -543, -436, -444, -32, 569, 753, 622, 192, -332, -621, -468, 237, 429, 579, 702, 296, -395, -544, -946, -370, 511, 574, 728, 303, -392, -588, -415, -193, 104, 269, 593, 568, -54, -388, -345, -365, -252, 369, 661, 543, -138, -157, -869, -381, -156, 584, 877, 372, 145, -281, -547, -802, -509, 91, 593, 423, 114, -80, -256, -600, -380, 35, 502, 639, 64, 4, -359, -486, -137, -277, 357, 560, 480, 45, -420, -523, -447, -359, 272, 615, 657, 350, -26, -364, -774, -324, 272, 647, 615, 386, -64, -498, -575, -613, 16, 113, 924, 510, -159, -311, -679, -281, 222, 416, 873, 388, 18, -409, -732, -732, -460, 18, 593, 320, 534, -109, -612, -608, -154, 173, 552, 432, 386, -126, -489, -622, -459, -150, 360, 617, 331, -69, -232, -511, -452, -24, 229, 245, 356, -69, -48, -451, -431, 158, 355, 499, 695, 496, -266, -298, -486]
7632d86K92K47M90R5m63j93l49k59L81L5N66N36o26j30k23n12r5O64J87K38K75
7653F70m12m36l51k46Q18L15K58J39m10k22o57J41N0O78j05R4N5m87m38j04N37
7674a13l7N41M50n01l2o35l6k76M60K69M17P8n19l01j46j15K08P72J86j06j20
7695D44l64m37m02J95O12J95O00m91j74m55j37r9O49P0K54j11j7m98l16j5M53
7716d4L68L64j49m39j54n54K97q7K18N25P5k98P9n36j98k0L82M03O31m36n70k18
7738c61l8k5M00K18L37L27o07m44k66J76l1L32K50M32l60m44m48L5K95J87N76
7759E41m2p7k43p30L2mL80M63K77o1m26m05l67K82J43M42L73k63j34l31l36k4
7781e10J3L12O14M4l22l48q8l78J62N78J26M17k53m97j27L2j1M0P55R7m21j50
$$ y = [-486, -194, 53, 543, 638, 175, -18, -367, -626, -245, -210, 356, 892, 266, 136, -87, -599, -694, -30, 157, 395, 670, 258, -178, -529, -775, 43, 358, 616, 755, 345, 123, -534, -393, -343, 335, 230, 324, 379, -108, -546, -650, -113, -150, 391, 841, 340, 308, -327, -363, -639, -179, 90, 507, 585, 66, -235, -381, -496, -288, 484, 670, 564, 444, 80, -357, -759, -564, 48, 243, 843, 352, 178, -277, -414, -513, 136, 206, 460, 349, 332, -166, -482, -497, -44, 324, 688, 539, 100, -54, -608, -311, -398, -180, 345, 420, 122, 201, -335, -533, -553, -171, 232, 863, 427, -143, -361, -399, -424, -24, 194, 531, 858, 251, -193, -459, -283, -314, 18, 268, 700, 340, -104, -552, -517, -222, -35, 541, 499, 422, 179, -551, -519, -523, -143, 320, 597, 536, 110, -295, -662, -380, -237, 205, 578, 315, 181, -150, -486, -510, -497, -185, 429, 473, 151, -197, -285, -663, -501, 77, 203, 620, 367, -130, -257, -225, -236, -196, 559, 656, 235, 85]
7803H5k49k77o5K07M40M08j6n1n89n17K52J97M20j41N97n39Q0o31k01k22R98J95
7825C81K19l8o21j54j06J0R9N04j51M42n44Kn74J06M43L86M8J23l71l55p3k27
7847d51J50J54O86n9j19o48j09k6J63K05J59L78k20R8n77q4K06o5K03J78K70k95
7869A97o20j7K2J8N96O9N30l57p73M4k30L20L88J57J70K8o26l94o0K25K14J63
7891F4L86k73m5m67J1k22O04L72k90N72o53k70n0j14K87J36L06P4l38k1k82o0
7913b73L16Q9K69K09m77k67k67J66l03L76N72k92K22k29l1o07L84j79M65L34k36
7934B41o6r8l97N0N5M8N39O6r4m30l19m6qO62M6L22r8o70l14K27j21J64L36K45
7958C40L9j45n74j20j96N75K50kK63q4m99j73j99M11J24K13K73j93k50j75l63
$$ y = [85, -164, -441, -506, -299, 141, 549, 533, 482, -107, -624, -372, -175, 245, 104, 701, 162, 242, -389, -590, -812, 186, 381, 600, 562, -59, -213, -319, -309, -210, 294, 143, 585, 41, 43, -531, -425, 18, 404, 452, 575, 204, -151, -224, -451, -301, -147, 539, 480, 361, -287, -396, -422, -259, -54, 105, 483, 263, 361, -216, -300, -94, -159, 44, 222, 492, 197, -423, -440, -418, -400, 196, 265, 795, 438, -335, -291, -521, -201, 187, 344, 514, 542, -84, -478, -538, -313, -99, 64, 450, 177, 132, -335, -324, -546, 58, 430, 140, 712, 59, -211, -261, -375, -88, 48, 354, 428, 90, 69, -213, -273, 43, 132, 401, 610, 133, -134, -401, -235, -538, -162, 410, 118, 340, 111, 80, -527, -143, -322, 143, 477, 241, 175, 77, -320, -270, -215, -167, 372, 438, 344, -86, -405, -451, -459, 203, 249, 571, 473, -197, -511, -284, -405, -241, 95, 340, 379, 234, -340, -460, -656, -81, 169, 167, 430, 346, -153, -326, -525, -114, 10, 223, 496, 303, 53, -122, -485]
7979d85J67K16M33M31o16k51qo2k20L16n6N39j94K49o44j55P6N0K65M1K22k65
8001D9m0l00l44K05N42P56q57L91j99n53j81K52O7L60P8J00j71l92j66r8M48M64
8023D11K02j42l84K2l23k1j54L04N53j58o3k61o34k4L87J05N47J90l49M1k60n99
8045f10K42K41J17M32p9k24l50k07M3N7O00O7J91l51n79L53l24K13K13p0N24j22
8067C77o12k64O1k47P87O6J34j82j62k34J24k30N3O39J85m15j48j81k43m3M21
8088a14K94L91k08m53q0r5k94J84M08J38J85j00l76Q9k53k43M19K41K57k04Q7
8109B73m73K9k22K49K60pM10j74n93j11o5K66J46K58K63k33k0n25l05j33N25L57
8131A75N0j98J51k76m47L25M33L03j00p6k94l02j88j12M66K90K11k63K45o31j0
$$ y = [-485, -318, -102, 331, 762, 146, -105, -113, -175, -395, -79, -135, 404, 210, 459, -185, -340, -264, -214, 51, 92, 314, 49, 9, -291, -635, -430, 112, 868, 11, 402, 203, -350, -531, -279, -212, 148, 226, 326, 155, -237, -403, -501, -53, 411, 613, 471, 87, 109, -214, -235, -389, -85, 468, 310, 247, -14, -648, -672, -285, -180, 367, 557, 208, 249, -11, -610, -368, -127, -10, 422, 343, 119, -231, -438, -395, -338, 262, 329, 520, 169, -410, -57, -381, -168, 45, -25, 499, 377, -235, -499, -438, -685, 102, 168, 302, 120, -42, -276, -152, -382, -329, 310, 495, 80, -68, -249, -492, -535, -114, 180, 571, 363, -90, -170, -265, -559, -375, 33, 171, 356, 256, -120, -31, -284, -527, -108, 133, 390, 186, 273, -200, -171, -393, -144, 116, 109, 519, 345, -248, -359, -424, -158, -12, 246, 509, 276, 256, -269, -574, -707, -182, 175, 225, 27, 178, -98, -545, -220, 213, 516, 416, 340, 46, -256, -444, -556, -90, 200, 411, 148, 393, -238, -248]
8152b48J43q1jN58j46Nl59J99l62J17J45L32J75l46j16k47N0j81M11J90J11m40
8174i1K73k92N4j24j55M08K49k61m1k10k10j88NN29K82J49J90
$$ y = [-248, -105, -186, -187, 371, 225, 230, -129, 70, -292, -175, -30, 302, 477, 131, 15, -232, -182, -363, 48, 238, 349, -91, 182, -110, -56, -180, -335, 73, 322, 61, 20, -190, -400, -588, -583, -54, 228, 377, 567]
8191E67
$$ Imaginary data points
##PAGE= N=2
##DATA TABLE= (X++(I..I)), XYDATA
0@%%%%%%lJ1j6J6j6K4l2L2m0M8n6O9p7R1j08J25j48J71j96K24k53K89l29L71m20
31b23M71n28N93o60P35q18R08j010J120j241J374j519J683j864K065k296K557
48A347k857L205l612M104m707N465o450P795r751J2863j8614L2752j29675k31534
62c39669J95129K05772M0414m3651O8273L3612j48686k30859l9775J67234J94045
73A01839O9049k2931o8534r0209j04436o2208K5411J27778J59799Q1669o6553
84A50674j55725j32278m0095M3857J01584J18509P8965o337q6509j33133j21166
95a81654k4399J23174J86142Q9662n5850r7562o2284o8544q6964R665J72532J93221
107A97139K1104j41421j37239n1257j4811RP3071J47263J07965l2298j47062j47974
$$ y = [0, 0, 0, 0, 0, 0, 0, -3, 8, -8, 8, -8, 16, -16, 16, -24, 24, -32, 37, -40, 51, -57, 68, -80, 91, -105, 119, -134, 155, -174, 197, -223, 248, -280, 313, -347, 388, -430, 478, -532, 588, -653, 721, -798, 885, -979, 1086, -1210, 1347, -1510, 1695, -1917, 2187, -2520, 2945, -3505, 4290, -5461, 7402, -11212, 21540, -108135, -339669, -144540, 61232, 101646, 57995, 126268, 159880, 11194, -219665, -259440, -92206, 101839, 170888, 147957, 79423, -10786, -115222, -177430, -152019, -24241, 135558, 217227, 150674, -5051, -137329, -177424, -133567, -31983, 86526, 165491, 159154, 72645, -60488, -181654, -206053, -82879, 103263, 192925, 137075, 39513, -22771, -91315, -178279, -168614, 3918, 197139, 218243, 76822, -60417, -111674, -126485, -126476, -53405, 93858, 201823, 169525, 22463, -125511]
119a25511n9368M9100J13583J07693N4290j649n4920j14432j31504l9081J14623
130h7176J76349Q6873l8676q2094p1599p8447o8493K3898J40806J53869L9578
141A94888q7999j29055r0551l0810K8772Q4942J14222Q3827j0919j11165j42035
152i5883p5238L2228J02847J07620O8385M633o9867j19517r9408j6090P5652J22048
164C7410J01689K3131p2919j23450r2832j7829M5996Q8238J07043P1526l1578
175A36425j29876j29315l8061N3513Q8808Q8199O7100O339q3457j32541q8448
186a61314J6817R7881J12064O7920J316o3989j03111r3683k6585O3435J18121
197B8872R8880K2504o0632j04029r4436l8611L9250R9529J06313N0348l2662r6290
$$ y = [-125511, -184879, -135779, -22196, 85497, 139787, 138138, 83218, -31214, -162718, -201799, -87176, 89173, 176046, 137370, 55276, -16323, -94770, -163263, -139365, 1441, 155310, 194888, 106889, -22166, -112717, -143527, -114755, -29813, 84409, 168236, 157317, 46152, -95883, -171121, -138893, -36046, 71574, 139959, 144592, 74725, -44792, -144200, -160290, -84638, 37410, 139099, 162230, 89311, -34139, -126971, -144800, -98804, -10566, 96477, 168003, 136425, 6549, -122766, -160827, -107314, -18506, 69693, 136793, 143132, 59675, -72866, -161314, -144497, -46616, 65448, 133368, 134684, 70695, -32416, -126099, -152684, -89249, 28872, 127752, 150256, 89624, -14405, -108841, -147452, -108202, -8673, 97640, 147988, 115326, 19036]
209A9036j07073o0115K0557R1406J09856O5051j3904q0780j02061p2711o085O8527
221f8296J10741Q8463J0586p2905j07048p8366j5397M8978R2929R5397M3672m3790
233A04964j08942j02050l3580M3709Q8024Q9010N2769j3562q4441j10797o5634
244a40530K0905Q7453R7550N8852k536o4602j00821q1586q115P0262J02809P5269
256A14910J3313n2988r4733q8793k9515N0439R8046Q7268L2299l5036q5519r5136
268h5445m9889K8056R0505R6273M8822j9744p5086r3124o2249M303P1607R9326
280E3355O9971j1o8380r6019o9730r099N3494Q8915Q1764K7377m9779r8203q5135
293a01480k3532M1768Q1439Q3686M3924k6591q6212r2981m5492K2408P5812R1017
$$ y = [19036, -88037, -148152, -127595, -36189, 73667, 138718, 124814, 44034, -58027, -130738, -136823, -68296, 42445, 130908, 141494, 68589, -38459, -116825, -132222, -83244, 9685, 105082, 148754, 104964, -3978, -106028, -139608, -95899, -7875, 81135, 133904, 120342, 35901, -74896, -140530, -119625, -32172, 65378, 124230, 121694, 57092, -43729, -125315, -133430, -63168, 39641, 114910, 128223, 75235, -19498, -108291, -137806, -87367, 10679, 97947, 130246, 95210, 9691, -85445, -135334, -107278, -16773, 79500, 128322, 108578, 33492, -59632, -121881, -117578, -45971, 53355, 123326, 123315, 54935, -41084, -110814, -119913, -66419, 22496, 104260, 131637, 81858, -16345, -101480, -125012, -83244, -1805, 81881, 125805, 99214, 13002, -79979, -125471, -103063, -27251, 63766]
305F3766N6543j2771p3740q9307n6931j309N9353R4831P5222L895o5886q8136
317c4470o3839j7330L9979Q8464Q8031K5967n0456q5896p3220l3255K4138P9968
329a1919R2463M2348l0212p5840p9721n0432P324P2034R4407N3578j3042o0930
341D0058p9524o7247j0986O3160R4732O2911K711m4181p5114p8958l1963M8208
353g6193R4166P2219J8059l0620o6925q3271m8824K8852Q4334Q0302L5256j4996
365I2359o1501q6707n8140J3063P0120P8785N1752N980n2343r1325p0234K28N9243
378d8720P3106O0026K6069l4987q9192q1868j6865M5533O9736O6582L9809j9123
390I0106q0123q6351l3045K7440O2052P2756N3907n318p1312q6794m5176J0076
$$ y = [63766, 120309, 107538, 33798, -55509, -112440, -113749, -54396, 40435, 115657, 119552, 53666, -34470, -98309, -115639, -75660, 12804, 100835, 126802, 76346, -9550, -82770, -116025, -91887, -11919, 80544, 122892, 92680, 16840, -62881, -113313, -105989, -33955, 60452, 114030, 100988, 40058, -39466, -106713, -117699, -54539, 40193, 103104, 105815, 61634, -13480, -92438, -124401, -76193, 17973, 90192, 108251, 77631, 10706, -72565, -121389, -92537, -8203, 72099, 107355, 92359, 30858, -55849, -113989, -100926, -30806, 47979, 99731, 105711, 53368, -37957, -108191, -107963, -48720, 24386, 84412, 110481, 75494, -13698, -95566, -112431, -66898, 2838, 69420, 109229, 90106, 9983, -76368, -109413, -81973, -19921, 52835, 106742, 101424, 30112, -56682, -101858, -91782]
402i1782N0145P4168O7231J0934o0321q6116n6272o564L6912P2105P6090K7296
414A13826m6043q1230o3623k3120K1722O6587Q1830M2290l0347p4046o8607l6834
426i7595P429N7877Q4263N4064j2740o3240p1219n0925p246M9103Q3849O2746
438I6366L469m8384o9030o2397k5462L7268Q1927P0275J6583l3775o2141o8393
450f3694m0839K0876P5589P6869L0617k0581n5784p0390n1659M632O3184P9139
462D7959M6932m880m9170p2467n9175q359M8952P4162N8476J5493l6664p3675
474a2416o8951j9412L7784O6999O1595L1174j8611o6901p7561l6018K6091O3873
486a2354O4759L8888n285n4025p6177n1127M848N5340P2478N1403L238m7219p0481
$$ y = [-91782, -41637, 32531, 99762, 110696, 50375, -35741, -92013, -98577, -61665, 10440, 86530, 113826, 67783, -13447, -77070, -100190, -78468, -11881, 69949, 112239, 81892, 7846, -60761, -97595, -90166, -32289, 51974, 106038, 93298, 30058, -41161, -92086, -99332, -50229, 33620, 96366, 99835, 51451, -17579, -79976, -105438, -68170, 13757, 84032, 100615, 66840, 4699, -63694, -104533, -83657, -8068, 68801, 99418, 78837, 23053, -47337, -98996, -94364, -31180, 47959, 94891, 90011, 40841, -31626, -90801, -99160, -50208, 23954, 82430, 97923, 61259, -12416, -81367, -100779, -62995, 4004, 65599, 96773, 78162, 11261, -66300, -102318, -76227, -12354, 52405, 91293, 86008, 31983, -44194, -95321, -90473, -35133, 37345, 88748, 91986, 44767, -25714]
499b5714n5323j3182L6672O9569O6460K1215l8776p2060o0178k0980K4462N8246
511i589O8347L8434j9157o6433p1490l4382J6545N4478O5991M5604k608n1549
523C4191p2177n1243l28M8114O9209N3965R253m0700o8411n8131j5452L4202O5224
536G716O1710K4885k7148o5937o5906k7991K4803N9259O2578L4936j0735n4618
548B3552p1005m4440R772N6677O6750M1675n01m2502o6091n5261r175M3727O9737
561B2915N4187J0837l4974o2595n8589k1854K9267O3613O0473K5561k1377n8064
573I400o5304l4800J8940N8756O3089L3317q433m5894o4744m9720n56N2854P0150
586C7055M3810j897l8259n7250n3530j9179L4124P1209N9440J1264l5820n6496
$$ y = [-25714, -81037, -94219, -57547, 12022, 78482, 99697, 60921, -11139, -71317, -92297, -67835, -9589, 58758, 97192, 78035, 11602, -59888, -94270, -77725, -23247, 42744, 88348, 85740, 34191, -37986, -89229, -89557, -41443, 27766, 81731, 90984, 50284, -18127, -76258, -91710, -57508, 7716, 69426, 94311, 67163, 1226, -64680, -92671, -67868, -8609, 53969, 88905, 78170, 23552, -47453, -91893, -82121, -25444, 41306, 82981, 82480, 39978, -26113, -81374, -90549, -46822, 22915, 77102, 87939, 52965, -9630, -68219, -90073, -60806, 2807, 63280, 88841, 67464, 9400, -55904, -90704, -71764, -13008, 50081, 83398, 74965, 29071, -35673, -85393, -85949, -33095, 37055, 80865, 78968, 40709, -16541, -70071, -89250, -55126, 16083, 75523, 86787, 50967, -5529]
598e529n1298k6615J5958N8379O8604L1776k5251n8717n6009k9786N257M4920
610b8311O6596M8304o418n4932o3154l6999j224L3053N9997N7308J4053m3522
622D4751o7736m6525q160K5666N2056N9351K9916k7914o5306n6153j9420J7971
634f1503M6890O0021L9936j2215n7286o1416l0926O585L9862O0025M8658K674
646H1305m7225o3468m2657l668L3922N5911N1162J7237l0247o1706n6838j6979
658h3251L1026N6220M8778K2187j2289m7964o5025l8502K1003O0573N3346K2945
670F9047m390l3010o0272n2613P26N4731O0868L1952K429k6010n5000n7254j4574
683h3370M1440O1176M1292J1869j7968m9519o1101k8225K8023N9579M9344J9897
$$ y = [-5529, -56827, -83442, -67484, -9105, 59499, 91275, 66024, 7307, -48702, -78488, -73231, -28311, 38285, 86589, 80171, 25239, -37915, -74914, -76138, -43085, 16912, 74220, 88273, 44751, -22985, -69510, -77670, -52004, 52, 59403, 89319, 61405, -3901, -60054, -79474, -61503, -14613, 45408, 85344, 73129, 15843, -45573, -76499, -69914, -30052, 29973, 78631, 81305, 34080, -29388, -72045, -75713, -41791, 14120, 65282, 82519, 52272, -9434, -66272, -83251, -52225, 3995, 52773, 74960, 62671, 14707, -50318, -88820, -67817, -7244, 46102, 69047, 64657, 31647, -28625, -81238, -80512, -25781, 35087, 67039, 69468, 43458, -11542, -68796, -83370, -41930, 19246, 60538, 72407, 54439, 4920, -56181, -84406, -56383, 3196, 52540, 72437]
695G2437j1952m1951n8189l8692Q236N1547N8488L3931o393m1579n3871l8964
707f6952m813L2501N7058N0689J0240l8821n9768m1946p385K2411M5915N3180
719E2309K8703k3262o0146n3191j7197J8785M2716N1973L4390r760m8772n4914
731c8366l1154L390L8263N8093M3041l286m3811n0721l3647r840K2710N5840N5922
744F6434J1821l8248n4674l9407j4171J6311M6945N4800K5613k1007m9754n0579
756d5916k7769J1818M8235N4435K6881r962l5228m8502m2177n561M3425O1620
768C1299L5460m678l0988m4038m2813j7045K7687N7192M7707J1261k5441m8529
780b926m7482k0385K0821M7355M6801K4371r670m3666n5663l1636J3012M4973
$$ y = [72437, 60485, 18534, -39655, -78347, -70111, -18564, 39924, 73855, 67462, 25883, -27988, -66952, -71765, -39264, 17794, 68483, 78723, 39902, -19866, -61812, -69197, -46786, -871, 52309, 81012, 57750, -2396, -55587, -72784, -53999, -11283, 40690, 75080, 65320, 16548, -38366, -69520, -66130, -27867, 30226, 73267, 69981, 26170, -24551, -58198, -68038, -45328, 10512, 66434, 78255, 40007, -14667, -54074, -68245, -51934, -4989, 49811, 75424, 54417, 4663, -45916, -73685, -61867, -13632, 40803, 67684, 57722, 22494, -26008, -68185, -73746, -30321, 31299, 66759, 62081, 31093, -12945, -55758, -72803, -45116, 12076, 59783, 71044, 45603, -2926, -50408, -70793, -49972, -2617, 44184, 68555, 58885, 15219, -40444, -72080, -59068, -14095]
792a4095M7873K9223j012l3829n2702m0162k106L5248N1729M0503P064l0828n0865
805a3959m1343j0381K2650M4971M7713K2880k0731n2729m8823j6645J8063L9234
817i100M5290L0536n455m3220n4246l0940Q676L8704M7936L3413J202l2894m9978
830b0076l8899n562K9020M9607M2892J0849k8300m9527m1524j3136K0095M2984
842a577M6168K3789j5861m7436m9431k2272J4786M0395M4634K8301l424l6118
854B1954n1370l5255K805L7969M8425L2926K069k7806m6066m0987j0942K7729
866c8549N0162M0958J0970k2736m3772m2787j9692J7042M4400M6867K1832j3678
878E1017m1053m6213k6364P544L7746M7968L0831l533l5974m7077l3035j394L0476
$$ y = [-14095, 33778, 63001, 61989, 28160, -24542, -64704, -66810, -31562, 20167, 60670, 67734, 36906, -13959, -55302, -65683, -43033, 1938, 49651, 72531, 51800, -929, -49752, -66397, -48334, -9100, 36190, 66726, 61271, 18051, -36195, -67135, -58459, -19755, 28181, 61594, 62796, 29902, -20076, -58975, -64537, -35517, 14090, 56982, 67831, 39531, -9996, -51520, -64656, -44561, -1577, 44591, 68380, 52519, 5083, -44348, -66620, -51834, -11439, 33195, 61496, 58072, 21954, -29416, -64671, -61866, -23897, 24528, 57454, 59523, 31717, -14349, -55336, -66278, -38549, 11613, 52571, 63541, 40805, -2967, -45754, -65446, -48404, -4004, 42863, 64695, 51017, 9964, -36249, -62613, -55069, -17323, 30645, 61476, 57943, 21969, -25108, -58143, -59537, -29061]
891b9061M6787L7243P181k7130m7546m0111j0658K4715M4489M0736J5603j7547
903D4701m2756m4645k1549J5649M2629M4122K2470r249l6556m5579k9621M256
915e6128L6327M6937L0997q84l1592m5336l4961m902K8187M5462L7690R594k4267
928C7124m4482m0088j3837J9759M2542M2460J8949j6583m1464m2206k1516R602
940d9740L6994M5898K7688p408l7512m4142k7602J310L0224M4759L4646L134k9824
953B8425m4522l5341q216K5252M4829L8356R679k1452l9482l8982j9306J4185
965d6575M3509M5405J7920j6634l6231l8492k4794L123L5181M7803K8792o687
977E2320l3703m1797k9139k721K8003M4162L4701N378k5619m2746l7229j0338
$$ y = [-29061, 17726, 54969, 62150, 35020, -12526, -52637, -63295, -38580, 5909, 46645, 62248, 44701, 1945, -42700, -64249, -48600, -5971, 38151, 60621, 51372, 14816, -30763, -60384, -56128, -19801, 27136, 58133, 57249, 25657, -19679, -54640, -59542, -31355, 14107, 51797, 61391, 37124, -7358, -47446, -61283, -41524, 1018, 43478, 62427, 45844, 4380, -37826, -59342, -49740, -12746, 33152, 60840, 53432, 15920, -28222, -55824, -54514, -24290, 20469, 55115, 58249, 28425, -16097, -51438, -59654, -34402, 10427, 48783, 58462, 37010, -2472, -41454, -60760, -46575, -3066, 42339, 60259, 43625, 7394, -31098, -55892, -52769, -17588, 30215, 59007, 52320, 18617, -23180, -52319, -55040, -27037, 17125, 51826, 57204, 31585, -11161, -48390, -58728]
989e8728K2921M2201L7033J3565j5825l9098m2254j9250J4671L9349L9582K1245
1001E5412o479l4592m4782k7255P472L4464L9449K6795L148k6605m5403l6121
1013e4497j625L0796L9783L0962R252j8769m1385m0213j2554K1197L8830L7364
1025C9141J7886j3868l9640m0759j7139J0889L1472L9773K8537l439l8311m4347
1037b9805k2835N627K6314L6849L3439P108k8972m5438l1235l340K1764L8068
1049G544L6621J2589k1720l9815l4618j4150J1831L7215M2309J9546j5639l6998
1061D715l5350k0207L467L0835M3635K8138o199l2716l8382k6451k718K6073M1764
1074A6604L1861L184k3741l7429l4055j1935K1178M1858L4985R429j6566l3159
$$ y = [-58728, -35807, 6394, 43427, 56992, 41167, 2069, -40185, -59435, -44764, -5415, 34167, 55412, 48933, 14341, -30441, -57696, -50224, -15760, 23689, 50484, 53632, 27027, -18376, -54497, -56122, -25326, 14457, 45419, 54671, 35902, -5483, -45696, -58250, -37053, 1777, 39141, 57027, 43159, 3519, -37240, -54379, -43490, -12018, 27755, 56292, 52853, 14542, -29805, -52640, -47013, -20699, 16150, 49589, 56697, 27725, -17713, -48948, -52288, -30524, 7544, 44165, 56754, 35034, -4781, -39399, -53549, -41718, -4503, 37806, 57352, 41713, 4715, -30635, -50842, -47375, -16540, 27095, 55233, 49034, 16318, -22064, -48515, -51233, -25160, 16604, 48465, 51649, 27908, -9521, -43576, -55511, -34333, 7525, 42510, 51939, 35373, 2214]
1086B214l6969k0827J2624L8692L9095J6864r488k9779l8507k6670M464L3293
1098a4994L9673K3737j060k4386l8995l2687m263K8187L9592K8214O677j7926
1110C1769l6715l6504j2971K0009L7521L4585J3679j2613l4275l7078j9181R958
1122d1816L2596L8143K2358n866l1606l9257k2905K858K5945L6783K9748M548
1134E1529k6768m0711k8707l201K1070L4014L2491J2718j7712l8868l5005j1200
1146e0350J5712L2859L4165J7783r801l3296l7413j9856P674L0320L7360K3115
1158D8272l886k8019l6722k5593r57K3927L7745K9623M178k3134l6619k9864p675
1171d8724J8430L4574L3174J2373j5279l4660l4842j5146J3215L3040L3804J7300
$$ y = [2214, -34755, -55582, -42958, -4266, 34829, 51693, 42205, 12426, -26081, -52751, -48287, -14994, 24679, 48416, 47356, 22970, -16025, -48712, -52975, -24788, 14804, 43018, 49695, 31769, -4946, -41450, -54421, -34412, 3109, 37694, 51373, 38760, 4485, -32593, -51774, -41816, -9220, 28923, 51281, 45415, 13809, -25448, -48353, -45495, -19550, 17233, 46981, 51529, 24761, -15950, -44657, -47858, -26788, 7226, 39717, 52435, 34723, -4145, -39150, -50350, -34638, -1779, 32386, 50169, 40368, 7072, -30341, -50197, -42523, -12203, 25157, 48272, 44386, 16367, -20355, -45948, -46905, -22978, 14767, 44390, 48568, 25434, -11185, -41049, -48724, -30294, 4280, 37454, 49827, 34548, -112, -34954, -50100, -36885, -3845, 29959, 47259]
1183D7259p134k8562l6808k4282M675L1394L7362K1172k615k2842l3506k8841
1195d2728o386K3483L9308K9155L521k0624l2574k9205j1758J3950L4665L4584
1207C5391J4119j4833l3422l2093j5946Q579K9404L4931K0851o242k8069l4640
1219b1970k3236J326K5904L6987K5838p26k3900l2784k6053o552J7327L5406L2650
1232D0217Q990k0779l4915k7796r011J1608K8511L2834J9015r188l4353l5502
1244c0369j5678J0188K7086L0113K1736n42k5409l6819k5338J867K4852L3844
1256A5531K4975L378k0697l3342k7098p489J6331L2448L1616J1780j6081l4590
1268c238l0256j0191J1659K6963L1006J9210n633k9846l6211j9641P515K8173
$$ y = [47259, 40125, 11563, -25245, -49527, -44852, -13458, 23904, 45076, 42461, 19619, -13887, -42728, -49114, -25631, 13677, 42832, 46353, 25729, -6845, -36050, -47808, -33858, 807, 35391, 49510, 34677, 1255, -30838, -46784, -38205, -8801, 26130, 46981, 40739, 12670, -21970, -45206, -43880, -17976, 19011, 44849, 44123, 20223, -12561, -38614, -45166, -27839, 7567, 40217, 49207, 28428, -6487, -34283, -43294, -31686, -3175, 29659, 48674, 39486, 5133, -30369, -46047, -35859, -8773, 21340, 43076, 42534, 17125, -19694, -45032, -43165, -18313, 15531, 40506, 43884, 23187, -10155, -37253, -44742, -28411, 4037, 35653, 47433, 31352, -3238, -33494, -43685, -32026, -5063, 25943, 45153, 39520, 9674, -26537, -46178, -38663, -10490]
1280a0490L1567J8774n69j9796l2910k8143m768K4202L7095K4784J407j8291k8559
1293e697k7251j2038J3525L3342L2278J1386j4757l0169k9982j4290R174K7441
1305g038L1035J8266m168k6183l4083k2298M811K6510L1384K0088Q46j9002l1763
1318a1595k7519n060K1489L2978K5737O053j5735l0363k8764j0569J4852K8457
1330c9K8715J4358q810k8916l3125j5647J0083K6899K7933J7668m54k3432l4035
1343a8802k3029K573K3998L0716K1416L265j8879l1118k5885n478J6710K9982
1355E469K7808R872j5424l1109k6741r798R918K5322L1035J7320r536k8931k9227
1368b4022j5379L976K3198L1991K1113l554k3577k8950k0889l533J8516L3868
$$ y = [-10490, 21077, 39851, 39282, 19486, -13424, -41567, -46335, -22133, 14962, 39746, 41153, 22862, -5697, -32948, -44986, -31461, 1881, 34159, 45545, 30788, 619, -29363, -43653, -34479, -7038, 23997, 42263, 38095, 11912, -22171, -44469, -39658, -13148, 18236, 38324, 39170, 20168, -11595, -39114, -44174, -22685, 10293, 36030, 42083, 26348, -4015, -32779, -43348, -28496, -39, 28676, 43034, 34224, 5308, -27817, -43464, -33381, -6482, 21451, 39119, 38665, 15233, -18802, -41831, -39258, -15260, 15456, 36872, 40137, 21258, -9860, -35745, -41223, -24513, 5469, 33277, 43149, 27725, -3384, -30125, -39923, -30005, -4683, 26352, 43672, 34136, 5205, -24022, -39401, -35425, -12227, 19764, 40877, 37323, 13746, -15204, -36093, -39626, -21110, 12758]
1380A2758K6080J247k0884k6788k2268j0471J0975L2125L1075Q444j6407k6766
1392h80k4436j3755N499K6857L2246J6542r438k5336k7603j7523J142K2072L1713
1405A7100K1542j050k1956k9095k2045l158J7996K9173K4877O495j5357l0070
1417e548k6798p629J4437K6455K5730J2783q335k6530l1036j4577R854K5600K6469
1430B0875J6268k221k1927l1724k0868L274K2850K7960J9876L055j7505l0580
1442a0667k4308l442J7786K6946K3572R078j2277k9377k7833q394J2443K5333
1454a140K5319J4146o349k5703k9650j5582O990K3566K7057J7922j517k1357k8737
1467a5035k0659o35J9889K8411K1960L309j6956k7602k3643p083J4501K7786K5300
$$ y = [12758, 38838, 40085, 19201, -7587, -29855, -40326, -29351, 2774, 33849, 42293, 25886, -880, -25316, -39071, -33572, -6715, 25531, 42073, 32635, 7299, -20304, -37827, -36685, -14613, 17100, 38642, 37592, 15636, -13459, -35504, -38662, -20666, 8507, 33384, 39879, 24522, -5548, -32346, -39975, -25538, 917, 26647, 39430, 31095, 4565, -26471, -41048, -31194, -5594, 20875, 37143, 34922, 12995, -18729, -39597, -36323, -13473, 14487, 34363, 37418, 19913, -10667, -34975, -38417, -20631, 6315, 29887, 38965, 26688, -2689, -30522, -38916, -26473, -1140, 24179, 38325, 31976, 6273, -23377, -38959, -31969, -8403, 18654, 36576, 35059, 13702, -15035, -35694, -36329, -16440, 11971, 33931, 37240, 20284, -7318, -30961, -38044, -23543, 4243, 29543]
1480B9543Q828j2556k6033k5194j2385Q571K5077K8099J3980p358k3486k6438
1492a9352j6392K144K1530K8655J9160j449j9965k6914k0675k549J6889K8048
1504I130K2539M954j4773k7510k3944p235J2760K5672K5169R733r605k4248k6295
1517b3653j3306P315K4051K6246J5182m959k0946k6770j7754O85K0837K7850J9235
1530C4013J94j8074k6325k1357m159J5786K7035K2566O402j3610k5247k4036r176
1543c5988J0318K4720K5658J1474q722k3233k5459j3530M873K1292K6344J7495
1555C5242l285k0899k6852j6900L69J7461K5407K0330L945j6111k6860k2163m776
1568c5092J4653K5619K1841P272j0604k3320k4827j1862R251K4615K5630J1407
$$ y = [29543, 38371, 25815, -218, -25412, -37797, -29226, -4149, 23950, 37930, 30572, 7086, -19352, -35744, -33600, -12070, 16585, 35745, 34296, 14331, -12583, -33258, -35807, -18918, 9130, 31669, 36623, 21850, -5660, -29604, -36839, -24079, 1593, 26762, 36495, 26890, 2642, -23653, -36959, -29644, -5593, 20653, 35835, 30876, 9930, -16840, -34594, -33909, -13072, 14778, 34013, 34207, 16133, -10192, -31549, -35708, -19922, 7113, 29679, 36081, 22471, -2776, -26812, -35988, -25670, -950, 24708, 36182, 27460, 4227, -21232, -34762, -29889, -8597, 17747, 35242, 31957, 11058, -15794, -32694, -32325, -14864, 10543, 30873, 34818, 18707, -8153, -30316, -35092, -20439, 5180, 27021, 34293, 23689, 369, -24458, -36320, -27069, -2454, 23176, 34583]
1580C4583p270k1364k4225j4977K370J9913K6629J8426j733k0270k5433j7542
1592c0893j272J5788K4366K1019N634j4757k5635k2288o165J2524K4434K2168
1604B4923Q886r668k1736k4078j2641O156K2835K6050J3392o287k0319k3226j5736
1617c1449N97J7994K6300J8768j9j8004k4800j8836k959J4814K4112K0772N532
1630C2822j1557k3960k3018q853J1382K4061K2494R347p677k0676k4083j3104
1642c2822N183K0747K4413J4999l245j9424k5061j5773J983J6084K2457J8640
1654B8181M932j5029k7469k0318j335J4141K0628J9703Q995q707k4813k3932p768
1667c2791J0033K1162K1203J1945m958k0707k4421j2848M171J8504K3038J6754
$$ y = [34583, 27313, 5949, -18276, -33253, -30883, -10970, 15659, 34085, 32352, 12082, -13351, -30893, -32165, -16377, 7989, 29008, 34642, 19885, -5750, -28038, -34203, -21679, 2755, 24923, 33809, 24141, 2405, -21673, -34314, -28158, -5323, 20727, 34119, 27832, 7513, -15713, -31449, -30852, -12858, 13442, 32210, 32191, 14187, -10613, -29449, -32408, -17594, 6518, 27290, 32822, 21265, -2695, -25713, -34566, -23184, 877, 23371, 32718, 25041, 4365, -19718, -32822, -27639, -6892, 17521, 32520, 29275, 9851, -15210, -30983, -29000, -12916, 9541, 28181, 33113, 18084, -9385, -29703, -31038, -16897, 3731, 23434, 32429, 23722, -1091, -25023, -32791, -22758, -1596, 19607, 31552, 26594, 5887, -18534, -31382, -27211, -8707, 14331, 31085]
1679C1085j202j8455k4204j6107m04J4521K2775J9474M688j4280k3769k0424n053
1692c1355J1567K2439K1065P716r381k0756k1618j1568N903K1835K3884J1455
1704C1186o553j7791k0928j5321l8J7801K5643J6270k193j6090k1130j7274m580
1717c0998J3060K4949K0028L032j2782k0359j9237q851Q851K2846K2291P451q153
1730B2128j9267k0976j2362M465J9822K3235J2673l177j7301k2647j5787J031
1742b8163J6691K1984J6261K253j3438k3160j9180l475J3676K1167J7864P231
1754B9711r083k1621k1427q372R611J9990J9819J0701m858j9485k2527j2079M862
1767b4758J7675K0371J4790qj6888k3672j5072M34J4532K0741J6849M509j2641
$$ y = [31085, 29883, 11428, -12776, -28883, -29287, -14766, 8009, 27483, 32171, 17891, -5878, -26302, -31355, -19788, 2651, 23716, 31432, 22051, 1295, -20323, -31891, -25988, -4153, 19731, 31186, 24633, 6842, -14086, -29407, -29445, -11644, 13999, 30269, 28076, 11986, -9144, -26418, -30998, -17938, 7011, 27039, 30071, 17289, -3070, -22307, -31158, -22307, 539, 22830, 30281, 22128, 2861, -18115, -30477, -26012, -6190, 17045, 29718, 26541, 9240, -13407, -29194, -28163, -11472, 10512, 26773, 29026, 15588, -7572, -26752, -30227, -16551, 4616, 22480, 29711, 20628, -993, -22420, -30792, -21181, -1191, 18628, 29329, 24471, 4986, -17541, -29620, -24758, -7083, 13288, 28078, 28070, 11182, -12490, -27562, -27128, -12596, 8145, 24994, 29503, 16862]
1780A6862k2557j8847m603J1495K0257J8981P960q490k0568j9963r682O611J9160
1793c384K1277J1292n239j7421k0676j3597J897J6097K2455J4693l96j5281k0721
1806i004j6005l420J3612K1724J7509L306j0885j9971j8232p530Q708K0891K0339
1819B1042P414p937j8695j9224j0444L961J7909K1992J2534m026j7329k0452j2962
1832b6217Q23J3932K0530J6667J870j4249k1368j6570k522J1663J9406J7663N925
1845B7553q936k0145j9550p566Q818J9016J9176Q734n735j6634k0263j2159L694
1858b3997J6654K0963J2911j720j6240j9817j3484q61J3081J9957J6665L424j2782
1871A4754k0995j6789l664J0578J8464J7507P365p294j9339j9589r102P467J8527
$$ y = [16862, -5695, -24542, -29145, -17650, 2607, 21588, 29548, 21058, 490, -19473, -29155, -22544, -3384, 17893, 29185, 23946, 6525, -14151, -27748, -25851, -9754, 12701, 27394, 26998, 11717, -9004, -25009, -28429, -14817, 6907, 24416, 27722, 16837, -3134, -21366, -28896, -20188, 703, 21042, 28456, 20519, 1824, -17400, -27844, -23883, -5974, 16018, 28552, 24526, 7197, -13255, -26217, -25394, -11462, 9068, 25735, 27605, 13356, -8012, -24582, -27104, -15441, 3965, 21628, 27553, 18617, -1528, -21078, -28644, -19826, -810, 18366, 27100, 21365, 4731, -15532, -27691, -23997, -7343, 13620, 26531, 24811, 8571, -11246, -24730, -25591, -12510, 7447, 24112, 27536, 14754, -6241, -23030, -26694, -16116, 2348, 19855, 27220, 19926, 587, -19002, -28104, -20637, -2110]
1884b110J8994R465m232j5856j9447j2764J179J5617K1379J4179j177j4985j9142
1897h900j4417j943J1435J9419J7137M286j0787k0299j7168n032R136J7859J7888
1910A8614P609o161j7418j9758r918N503J7340J9388J0526l400j5057j8863j2871
1923b4466L27J3981J9887J4968J001j3425k0111j4610j989J0488J7663J6617O098
1936B6429q871j9293j8528o387Q882J8098J6495P476m134j5399j9491j2403L776
1949b3350J7847J9534J0001k424j2718j7772j4941j567J3465K0403J4646J216
1961B4340j1477j7862j6109m116J0098J7925J6085O183o830j7792j8833p744P341
1974a8791J7106J7175Q866l427j5183j8880j1802K155J5097J9057J2938j472j3763
$$ y = [-2110, 16884, 26349, 22117, 6261, -13186, -25950, -24771, -9154, 12225, 26404, 25227, 10242, -8900, -23317, -25260, -13825, 5594, 22731, 27017, 16230, -4069, -21237, -26269, -17133, 726, 18614, 26223, 20062, 2644, -17114, -27032, -21529, -4189, 15199, 25725, 22325, 7268, -11595, -24466, -24139, -10158, 9729, 24697, 25698, 12273, -7838, -22448, -24437, -13949, 3714, 20331, 26429, 17558, -1735, -20263, -26650, -17768, 330, 16825, 24301, 20167, 4768, -14723, -27126, -23350, -5503, 14031, 24032, 21608, 8890, -8882, -23823, -25390, -11925, 8478, 23124, 24340, 12863, -4999, -21108, -25224, -15126, 2799, 18884, 25067, 18237, 445, -18388, -26132, -18791, -1685, 15490, 24356, 20929, 5746, -13134, -24936, -22781, -7684, 11373, 24311, 22839, 9076]
1987I076j7581j3058k145J0116J8825J7075L288j1821j8732j4079m351O728J6318
2000c41J8352Q101p675j8217j6382p255L851J4840J8130J2066l663j6052j7543
2013a1788j0691O71J1797J8789J4714O52j3510j8076j2761k793Q977J7558J6343
2026A9882N288r662j8060j6122n067O733J6215J6620Q333n043j5338j8143j0272
2039b4636M008J5901J7209J0219j584j2519j7333j4090m43J3175J8598J2787J205
2052B2497j0027j6929j5281m186R931J7367J4491N443o860j6063j7774o974O749
2065a7616J5897J6132P997k894j3882j8309j1440L595J4116J6819J0897K18j1568
2078I962j8202j3264j027J1359J7070J3575L692r390j7583j5438l599Q222J6061
$$ y = [9076, -8505, -21563, -23708, -13592, 5233, 22308, 25596, 13775, -4957, -19036, -23387, -16659, -341, 18011, 26112, 18437, 220, -16162, -23417, -19566, -4726, 13404, 25470, 21807, 5755, -11788, -22479, -21808, -10011, 8778, 23492, 24144, 10634, -7442, -20203, -22996, -14019, 3539, 19882, 25170, 15508, -2552, -18674, -23741, -17008, -793, 15827, 24160, 19117, 3779, -14364, -24636, -20628, -4727, 12482, 22701, 21117, 8598, -8735, -22825, -23268, -10093, 8505, 21292, 22497, 12470, -4459, -19740, -23926, -13995, 3372, 17863, 23306, 16446, 383, -17391, -24365, -17616, -1719, 14413, 22410, 19516, 5634, -12675, -24115, -20520, -6404, 10415, 21312, 21530, 9962, -8240, -21504, -22531, -11172, 5898, 19473, 23165, 13775, -3808, -19246, -22845, -14623, 1438]
2091A438J5089O716n868j6401j6477p754N003J4661J6796R575k906j4154j6773
2104a1055j0418Q92J1866J7584J2788J64j2337j6608j2439k467R384J6338J5090
2117A8782M497q874j6766j4851n667O803J5304J6375P311n392j4796j6049q640
2130b1963K967J3890J6942J0071j791j3023j6307j1589j13J1321J7199J2807R91
2143B1402r937j6796j3746l427R077J6533J4245M705p201j5283j5574o978O011
2156a6969J5125J5880P837l921j3557j6305j0255K868J3214J5848J0779j42j1824
2169H578j6590j2153q67J1107J6230J2262K648r181j5018j4270n077Q028J6056
2182A753J4700N354o659j3893j4854q115M010J4284J6312Q962l426j3530j5914
$$ y = [1438, 16527, 23243, 17375, 974, -15503, -23257, -18254, -3593, 13203, 22778, 19872, 5718, -11055, -21473, -20581, -8715, 8869, 21657, 21821, 9484, -7124, -19563, -22030, -12646, 3692, 18782, 23279, 14405, -2361, -17212, -22879, -16076, -772, 15603, 22914, 17522, 2726, -13323, -21963, -18996, -5106, 11836, 21907, 20116, 7093, -9214, -20803, -20916, -9595, 7604, 20411, 21402, 11465, -5331, -19077, -22504, -13427, 3106, 17351, 22056, 14855, -428, -16002, -22980, -16969, -1844, 14036, 21873, 17952, 4395, -11910, -22165, -19297, -6083, 9765, 20544, 20402, 8578, -8012, -20165, -21032, -9925, 6305, 18567, 21215, 12034, -2984, -17254, -22331, -14303, 1753, 16453, 21807, 15148, 1255, -13599, -21714, -17704, -3420, 12892, 21854, 18428, 4898, -11016]
2195a1016r539J108J1620J6351J1294K36j0634j6241j2313k097R617J6627J2966
2208A7979L237q241j4931j3939n509O040J5139J5637O349o015j3916j4443p464
2221b0077K549J2582J5935R896j695j3270j6191r233Q16J0312J5080J2257J865
2234B0826j0635j5480j2958k222Q368J4859J4011M375p736j4378j3890n719N111
2247a5468J3538J5430Q067m506j4144j5043p655L064J1166J4693J0416L41j1939
2260G960j6899j0954Q12J1036J3602J0765L576p177j5929j4592l670R025J5184
2273B739J1857M791n233j3084j4936p769N379J3821J4634P476k904j2368j4773
2286a0370r572K220J1454J4569J0223P58j0090j6059j2165r23J0568J4276J1615
$$ y = [-11016, -20555, -19447, -7827, 8524, 19818, 20054, 9420, -6821, -19134, -21231, -11614, 5013, 17979, 21216, 12975, -1956, -15895, -21404, -15364, -225, 15412, 21761, 15746, 1830, -12613, -20077, -17528, -4946, 10989, 20885, 19190, 5920, -10271, -19504, -18688, -8376, 6704, 18961, 20826, 10191, -5289, -18247, -20469, -12101, 2758, 16769, 21144, 13408, -970, -14860, -20579, -15468, -1930, 13500, 21567, 17061, 2917, -12126, -19781, -16717, -5551, 9142, 19558, 19899, 7960, -8939, -19893, -19081, -8045, 5557, 16322, 19898, 12721, -3208, -17800, -21470, -12445, 2739, 14596, 19387, 14154, 1070, -13866, -21635, -16256, -2435, 12199, 19675, 16771, 4403, -10370, -19942, -17722, -6268, 8301, 18524, 19282, 9192, -6867, -19032, -19955, -9387, 4889, 16504]
2299A6504K745o634j3911j4085n786P234J5418J3186N081n384j2443j3380q107
2312a9562K511J2566J6135Q724l358j2435j3750q561O9R120J5084J2295O86j0310
2326I214j5145j0760k232P739J4211J2534M127p358j3276j2622n995M598J3946
2339a019J4920O318n628j2633j2249p676J187J1204J5351J0057k247j1959j4337
2352h711q654k71Q874J4004J1667K264q711j4684j2366l051Q301J3930J1388M013
2366A7993m898j2351j3877o970N030J3887J3499O315l608j1274j3535r017J855
2379a6951J1215J3782J0148k91j0038j4673j0742k12R216J2629J1275L210o592
2392A1976j4680j3359l300P748J2791J1519N178l965j2181j4096p072M353J2274
$$ y = [16504, 19249, 12615, -1296, -15381, -21167, -13933, 1485, 14671, 19752, 14368, 1925, -11455, -19562, -17051, -4485, 11650, 20374, 17016, 4581, -9169, -17730, -17661, -8541, 6543, 18838, 19524, 9214, -5931, -16691, -18923, -11184, 3027, 15561, 19688, 12330, -946, -13568, -19563, -14965, -1019, 13901, 20219, 14591, 1958, -10291, -17967, -16780, -5576, 9775, 19832, 17585, 5626, -8711, -17365, -17636, -8762, 5242, 16909, 19173, 10462, -4222, -16588, -19639, -11338, 2592, 13980, 17993, 13095, 744, -13133, -20103, -15073, -1186, 12313, 18628, 15020, 3746, -9789, -18806, -16951, -5736, 8046, 18194, 17903, 7865, -6808, -17550, -17762, -8546, 4083, 15358, 18568, 11976, -2704, -16063, -19363, -11615, 1176, 12695, 17873, 13908, 1727, -12369, -19441, -15088, -2814]
2405b814J3195P601k171j0956j3817q719M86J0199J3908J0504P41r637j4231j0203
2419a5914j813P921J2700J1933M220p098j3476j2265m195N319J2227J2820O090
2432A8469m255j2020j2836p297K737J0686J3968Q574j778j0862j2882q726j092
2445a7314R067J4093J0678J338q608j3262j0958k967P078J2908J2046L785n514
2458A2370j2337j2878n637N208J2354J2199O231l070j0329j3487q299J506J1180
2471d989J3914P944r22r215j2604r795j717Q451J3830J0722K001q009j2663j0829
2485a3881l711O017J2395J1998N011m985j2354j2071o023L675J1561J2407P597
2498A7636k819j0911j2484q034Q43R241J3295R822K79r282j3204r348j345O902
$$ y = [-2814, 10381, 17982, 15811, 4855, -8962, -17681, -17195, -6996, 6912, 17416, 18157, 8520, -5711, -15914, -17727, -9806, 2894, 14827, 19047, 11949, -1527, -13792, -17987, -12668, -441, 12379, 18469, 14214, 2194, -10642, -17939, -15202, -4516, 9452, 18026, 16248, 5386, -7496, -16222, -17314, -8247, 5846, 16524, 17862, 9254, -4008, -14966, -17933, -10855, 2053, 14099, 17884, 12370, 33, -12845, -18482, -13274, -920, 11279, 17510, 14440, 4111, -9376, -17675, -16169, -4989, 8925, 16869, 15947, 6732, -5872, -15667, -17384, -8933, 4897, 15619, 17620, 9611, -3052, -13881, -17592, -11575, 820, 12818, 17829, 12844, 490, -11581, -17604, -13929, -2368, 10039, 17636, 14817, 3906, -8578, -16612, -15769, -6528, 6767, 16589, 16868, 7586, -5618, -14966, -16311, -9409]
2512i409J2434J1206L511o907j3363j1017l327N480J1121J1472O229l799j1945
2525A686j2869o145L602J0567J1635Q188j388r800j3230q712Q55R369J1871R293
2539A4922J456p248j3312j0542j939P469J1848J0045L765m795j1736j2381m805
2552a7253M953J1797J1381N505l172r874j2312p627J563J0951J2373P725j192
2565A4818q734j1980r230j096Q437J2650R396J428o902j1308j0603l720O533J2529
2579B218J0717L313n045j0224j1338o477L406J1525J2326N913l189r146j1972
2592g973p526O90Q784J3032Q719n87q781j1917q591j246O914J1794J0287K729
2606A6328o627j1782j0513l553N043J1452J0949N072m517j0350j1530n813K318
$$ y = [-9409, 3025, 14231, 17742, 10835, -2528, -13545, -16872, -11392, -271, 11201, 17430, 13631, 1686, -11183, -17328, -13726, -3159, 8476, 16664, 15276, 5476, -7754, -16466, -15611, -6242, 5629, 14922, 16378, 9130, -4182, -14724, -16663, -9194, 2654, 12699, 16464, 11669, -67, -12448, -17253, -12300, -503, 10878, 16383, 13211, 3337, -8975, -16602, -15039, -4088, 8285, 16010, 14818, 6084, -5896, -15126, -16222, -7785, 4865, 14261, 15689, 8787, -2521, -13124, -16844, -10311, 2218, 12935, 16248, 11203, 979, -10359, -16836, -13430, -1905, 10421, 16334, 13145, 3999, -7973, -15499, -14809, -6025, 7007, 15726, 15139, 6358, -5559, -14150, -15396, -8482, 3312, 13599, 16328, 9701, -2081, -12594, -16147, -11104, 348, 11297, 16369, 11852, 1502, -10028, -15841, -13523]
2619a3523J0247J1985P428k111j0055j1498o972L17P414J2067R608J116q098j2760
2633d835r176r73O358J0737R910M029n256j2104j0945l489M608J0108J1026N568
2647A5566l247r963j1451o421J871R133J2044P718j435q968j1346p389l07P051
2661g144J1523R082K098p480j1302r531k455N805J1101J0140L254m091j0523j0844
2675a0367n850L947J0992J1245N012k744r042j0595p312P41Q972J2134P344o26
2689A3851p977j0990q626q63P157J1124R026K184n690j1086j0277k937N472J0704
2703A072R375M474l643r913j0933n804L486R539J0821O106j817q663j1161p245
2717a4306J075P860J0247Q769J182p638j1611q919n85O146J0063Q915L653n066
$$ y = [-13523, -3276, 8709, 16137, 14026, 3971, -7527, -14499, -14182, -6768, 5299, 14907, 16023, 7925, -4835, -14011, -14984, -8626, 2111, 12021, 16050, 10794, -1310, -12255, -15744, -11136, -1028, 9998, 15566, 12319, 2356, -9095, -15516, -13645, -4512, 7532, 15250, 13815, 4847, -6499, -13888, -14195, -7144, 4379, 13461, 15559, 8079, -3223, -12754, -15209, -9404, 1697, 11837, 15091, 11000, 477, -10367, -16217, -12270, -1278, 9967, 14979, 12235, 3193, -7402, -14714, -13973, -5001, 7133, 14477, 13851, 5874, -5116, -13742, -14605, -7448, 3676, 12702, 14886, 9196, -1890, -12167, -15104, -9632, 1072, 10447, 14921, 11278, 1365, -9568, -15372, -11886, -2347, 8474, 14580, 12763, 4100, -7061, -14306, -13231, -5371, 4876, 13645, 14827, 7189, -4422, -13341, -13926, -7780, 2283, 11198, 14851, 9785]
2731I785j1041j0258l518M869J0032R834M872k872r848j0769n431K184Q558J1070
2745G467O823j236q697j0490p203j17P403J0556Q502J078o433j0986q931j959
2759a4223N904J0404Q978L053m338r476j0320m686L466J0074J0355M687k914q624
2773B340r359o774Q71Q530J0780P276q07p820j0017p818p22O985J0238Q564J294
2788A3561n457r985r320l048N120J0462R223L288m025r156r621m960K465R379
2802b074J0603N634k459q569r756o574N83P623J0494P637K21p940r591p535j522
2817a3225N790J0141Q772K134m817j0373r174k835L885R476R557M577l468r219
2831A221r452m858J743Q459R716O675j161q220j0485o310M95O520R813Q014J130
$$ y = [9785, -1256, -11514, -15032, -10163, -131, 9703, 14575, 11703, 1855, -8914, -14345, -12161, -3603, 7467, 14290, 13054, 4357, -6133, -13336, -13453, -6050, 4506, 13008, 14086, 7653, -3333, -12264, -14223, -8319, 2085, 11063, 14116, 9778, 302, -10018, -14704, -11238, -1164, 9191, 13878, 10964, 2340, -7019, -13793, -12922, -4392, 6388, 13664, 12857, 5037, -4980, -12798, -13520, -6535, 3703, 12267, 13561, 8104, -1881, -11201, -14249, -9129, 1333, 10556, 13844, 9819, 663, -8958, -13918, -11453, -2074, 8529, 14163, 11704, 3135, -6621, -13195, -12612, -4989, 5505, 13142, 13363, 5423, -4168, -11703, -13225, -7435, 2706, 11478, 13612, 8795, -1578, -10752, -13587, -9702, -226, 9331, 13908, 10440, 1221, -8231, -13089, -11346, -2887, 6829, 13504, 12343, 4123, -6362, -12672, -12177, -5657, 4156, 12170, 13300]
2846A3300o628j0413q134j194N396R239Q826L563m888r630r385l507L768Q455
2860a232R652M837k391q294j0243n564K262P748R517N907k65o773j0163p205l20
2875a2527O716R640P418J871n642r450q776k582N357R281Q322L160l538q600r490
2890h840m372L136Q300R425M915j912p611r602o005O86P848R718O455l6o686r267
2906c848p670j030N727R961P805J794n200q828q621k963M068Q691R338L563l042
2921I745q527r014m773J986Q123R588N836k040p481q914o612J55P354R007O964
2936A1397O71n845r461p548j910N318R299Q139K541m505q993q231l334L307Q162
2951i93R046M987l041q217r006m526J479O979Q755O285o9p334r544o535M54N869
$$ y = [13300, 6672, -3741, -11875, -13069, -7673, 1566, 10392, 13955, 9067, -563, -9948, -13455, -9687, -1232, 8420, 13257, 10866, 2572, -7671, -13235, -10973, -3225, 6292, 12199, 11934, 5161, -5002, -12207, -12527, -5811, 3829, 11247, 13118, 7476, -1974, -10750, -13332, -7975, 1306, 9628, 12788, 9250, 650, -8840, -13212, -10076, -1776, 7649, 12564, 10652, 3041, -6561, -12566, -11880, -4032, 5686, 12141, 12105, 5419, -3848, -11518, -12548, -6821, 3140, 10945, 12739, 7539, -1289, -9910, -12873, -8805, -114, 9224, 12787, 9745, 1218, -7796, -12569, -10583, -2460, 7128, 12964, 10924, 3443, -5471, -12083, -11928, -4574, 4433, 11397, 12068, 6223, -3238, -10786, -12696, -7378, 1921, 10060, 12601, 8096, -897, -9128, -12462, -9155, -993, 8053, 13040, 9999, 1782, -7224, -11750, -10271, -3292, 5463, 11748, 11679, 4345, -5199, -11734, -11280, -5411]
2967e411R001P383P91n153q678p996k363M438R288Q236K601l683q629p913l945
2982a2033K613P674R084N018k122p756r172m915J053O697R071O225j41n989r317
2997d010p243o63N890R608O487J772m895q141q333k875M090Q821Q284L296l255
3012H833q019q117m520K325P166Q778N467j113p314r544n824J257O647Q414N844
3027A0280J195n241r465p150j547N710Q725O721K466l812q346p984l377L686Q179
3042D0P825L693k347p663q562m942J967O725R026N421l99o958q718o270J78N803
3058e181Q413O926P87n117q374p540j092M201Q282P327K747l994p385p469m080
3073a1549K413P908Q461M122k440p208p780m651P68O146R012N829j04o772q294
$$ y = [-5411, 3590, 10973, 11764, 6611, -2067, -10063, -12426, -7988, 1300, 9536, 12137, 8454, -175, -8088, -12033, -9420, -1746, 7338, 12356, 10234, 2478, -6694, -11609, -10556, -3859, 5212, 11437, 11296, 5307, -4010, -11253, -11916, -6026, 3582, 10069, 11841, 6946, -1195, -9528, -12403, -8313, 508, 8792, 12088, 8833, 814, -7303, -11823, -9498, -2332, 6446, 11913, 10800, 3486, -6058, -11882, -10625, -3978, 4436, 10280, 11475, 6234, -3231, -10381, -11928, -6218, 2507, 9228, 11694, 7882, -464, -8448, -11825, -8139, 40, 7865, 11558, 9211, 1548, -7014, -11956, -9989, -3264, 5762, 11183, 10784, 3826, -4892, -11162, -10984, -5181, 3232, 10158, 10945, 5828, -2546, -10086, -11178, -6977, 1305, 8632, 11379, 7385, 0, -7469, -11549, -9136, -1228, 7233, 11355, 8915, 1707, -6073, -10724, -9956, -3810, 5202, 11031, 10927, 4155, -4139]
3088d139n812o71M767Q477P285J329m641q481p443k250L937Q046P726K681k662
3103H149p352p820m110J951P429Q077M717j712o417p909n456M35N817Q280O076
3118A0155R26n908q557o204j022N199P392O511K301l238p947q040k694L925P386
3133A85P282L305k260o778q481m525J732P256Q129M595n17o456p907n677k33N816
3149d534Q274N959O92m658q130o814j569M693P350O943K406l073p419p901l278
3164a1059K475Q184P578L176j667o342q143m489N11O456Q752N176j245n672p179
3179c488n827r83M938Q144O574J226m805p690o619j714L038P885P035K886l118
3194G482p062p297l786K450O925P659L975j545o056p563n182O35N706P703N972
$$ y = [-4139, -9951, -10622, -5855, 2622, 9907, 11236, 6595, -1886, -9329, -11579, -7642, 404, 8130, 10811, 8149, 797, -7023, -11133, -9182, -1753, 6324, 11041, 9329, 2912, -4997, -10453, -10018, -4201, 4079, 10155, 11081, 5173, -3384, -9588, -10610, -5411, 1981, 8492, 10793, 7555, -392, -8432, -11126, -7201, 185, 7467, 10772, 8512, 1734, -6747, -11272, -9540, -2284, 5845, 10440, 9923, 3467, -4440, -10117, -10350, -4534, 3740, 9699, 10391, 5733, -2397, -9211, -10780, -6087, 1263, 8206, 10612, 7539, 120, -7781, -11059, -8584, -400, 7178, 10354, 8687, 2345, -5798, -10287, -9776, -3320, 5432, 10608, 9363, 3691, -3488, -9315, -10298, -5360, 2784, 9358, 10584, 5779, -1911, -8530, -10244, -7206, 679, 7714, 10600, 7482, 420, -6877, -10663, -8213, -1288, 6371, 10346, 8801, 2745, -4818, -10000, -9365, -3659, 4044, 10016]
3209A0016O2n674p694n672j044M456P528O526K080m377p414o775j810K707O885
3224b00P068L526k384o946p251m171J969O349P267M963j223n685p546n480J65
3239i579N207P888N787N82m943p771n948j111M036P458O221K423l412p151p168
3254g481k880K920O987O634M047j867o702p422m138J452N942P416M787l82n649
3269C664p647n205k57N063P454N373J440m775o766o510j422L351P028O751K347
3284I889k793o849o949l195J853O965O816M187j693n983o978m877O86N822P339
3299D240M931K24n224p269n842l35M388P367N670J272l767o571o823k198K969
3314f968P299O629K452k287o319o743m008J748O686P013L880q77n910p009n000
$$ y = [10016, 10078, 4404, -3290, -8962, -10006, -5550, 1978, 8504, 10584, 6207, -1207, -7982, -9792, -7085, -200, 6868, 10394, 8010, 1064, -6187, -10358, -8389, -2040, 5227, 10190, 8967, 3282, -4264, -9744, -9579, -4372, 3516, 9303, 9885, 4942, -2829, -8777, -9888, -5852, 1606, 7827, 10250, 6838, -313, -7481, -10361, -7441, -454, 6180, 10227, 8360, 1658, -5764, -9902, -8450, -2508, 4908, 9695, 9313, 3664, -3983, -9188, -9445, -4382, 3072, 8445, 9885, 5110, -1656, -8166, -9588, -6237, 791, 7542, 9889, 7096, 247, -6702, -9897, -8044, -1079, 5737, 9924, 8231, 2248, -4730, -9607, -8921, -3099, 4240, 9171, 9395, 4171, -3098, -8940, -9275, -4887, 2480, 8150, 9422, 5655, -916, -7739, -9937, -6968, 331, 6960, 9412, 7125, 806, -5937, -9945, -8197, -1511, 5502, 9382, 8505, 2595, -4414, -9414]
3329i414M43N157P154N669L49m852o819n871j400M145P052O205J401l126o214
3344a21o894k546K597O624O727L087k266n928o546l811J287N322P337M411n06
3359H774n603p087m710K2M340P042N622R38m333o819n929j730L943O275O243K359
3375I347k982o571o236k720K080O264O875L054j158o270o606l790P60N049O680
3390C776N270k22n170p109m917n92M448O492O367R62m177o606n983j497L200N907
3406A49O575K599k593o355o290l366J804O152O679L466j195n218o602m646N46
3421h295N180O903M716j6m802n913n484j264L994O829N484J615l344o279o115
3436f791k266K886O061O024L062k079n530o640l548J341N785O291L852o37n050
$$ y = [-9414, -8971, -3814, 3340, 9009, 9358, 4506, -2313, -8184, -9584, -5439, 1613, 7818, 9219, 6093, -121, -7015, -9561, -6964, -340, 6387, 9474, 7208, 1280, -5266, -9077, -7790, -2468, 4869, 9280, 8774, 3171, -3916, -8626, -8604, -4264, 2778, 8400, 9338, 5005, -1814, -7743, -9473, -5530, 745, 6988, 9347, 6365, -206, -6442, -9162, -7082, -818, 6057, 9111, 7953, 1683, -4923, -8713, -7953, -2904, 3776, 9046, 8824, 3654, -3455, -8372, -8964, -4516, 1976, 8343, 9305, 5128, -1478, -7461, -8958, -5758, 149, 6724, 9323, 6730, 375, -5915, -9281, -7477, -1325, 5354, 8820, 7625, 2407, -4195, -8841, -8295, -3115, 3788, 8504, 8488, 3686, -2227, -7711, -8975, -4981, 1848, 7332, 8947, 5603, -676, -6791, -9057, -6171, -110, 5914, 8976, 6897, 1367, -5273, -8821, -7480, -1695, 4596, 8448, 7811, 2761]
3451B761o493m765Q8M884O456M570R82m048o585n484r40L416O247N789K352l348
3467E882o070o153k473K369N340O592L230j694n197o812l230P04M882O785M426
3482H581q53m753o311m791m2M043O388N078J486l948o625n544j196K706O231N911
3498F361K271k521n499o346l023K222N522N839L590j218n315o109m129O75M867
3513b813O459M052K66m268o124n256n68L769O005N886P39l183o157n396j840K471
3529e958O377N394K587k076n296o311l099J690M836O779L314r50m573o270m357
3544g913J13M604O123M652J29l805n908n179j176L511O158N247J596k607o082
3559e37n527k245K378N783N692K992j798n572o070l033Q71M799O141M358p23m683
$$ y = [2761, -3732, -8497, -8409, -3525, 2931, 7501, 8483, 4435, -2150, -7634, -8574, -5158, 1089, 6878, 9230, 5882, -188, -6341, -8814, -6445, -1105, 5487, 8717, 7023, 1826, -4986, -8216, -7512, -2630, 4155, 8581, 7728, 2975, -3336, -8127, -8169, -4126, 2262, 7340, 8826, 4878, -1747, -7291, -8487, -5781, 450, 6361, 8632, 6111, 612, -5734, -8757, -6535, -1013, 4826, 8416, 7198, 1883, -4226, -8355, -7680, -2813, 3646, 7698, 7964, 3696, -2428, -7684, -8252, -4483, 1522, 7408, 8147, 4964, -1193, -6589, -8429, -5958, 419, 5813, 8400, 6324, 1028, -5283, -8382, -6692, -1856, 4923, 8237, 7287, 2714, -3556, -7913, -7800, -3196, 2927, 7579, 7708, 3903, -2005, -7184, -8360, -4849, 1309, 6556, 8152, 5545, -537, -6064, -8309, -5931, -148, 5544, 8536, 6738, 1166, -4904, -7937, -7066, -2267, 3874, 8232, 7509, 2826]
3575B826o075m082l00L949O154M724Q62l697o047m910j477L235N697N175K370
3590H404k767n804n270k800K221N155N977K786j540m504o256l270M21M524O304
3605C581M034l80l984n921m495m26L595N867N266R43l444n747n106j737K729N477
3621B52N519K241k118n246n773k895J461N180N960L404j268m305o155l856K77
3636g322M228N907M274N37m122n533m896n01L241N746M763J390k790n242m979
3651e299k724K563N637N237K242j464m917n625l324J028M807O179L001n71m369
3666B401n672m170L5L949N987M259Q21l511o221m142j034L185N050M834K212k491
3682E492n622n735j616J851M880N598K589j075m712n928l102R53M074N755L729
$$ y = [2826, -3249, -7331, -7631, -3682, 2472, 7196, 8058, 4361, -1686, -6596, -8073, -4838, 859, 6034, 8404, 5637, -167, -5437, -8237, -6016, -861, 5116, 7902, 6362, 1858, -4398, -7668, -7247, -2723, 3581, 7615, 7235, 3251, -2670, -7165, -7591, -3996, 1871, 7137, 8080, 4636, -1111, -6217, -7954, -5225, 252, 5771, 8012, 5894, 648, -5125, -8020, -6559, -1379, 4581, 7985, 6717, 2412, -3743, -7599, -7322, -3094, 2813, 7087, 7624, 3502, -2031, -6927, -7428, -4187, 1559, 6322, 7712, 4922, -320, -5299, -8023, -5460, 177, 5414, 7656, 6192, 1275, -4350, -7674, -6646, -1839, 4340, 7341, 6770, 2401, -3271, -7441, -7406, -3457, 2530, 6789, 7610, 4099, -2122, -6264, -7298, -4113, 937, 5771, 7983, 5492, -130, -5865, -7481, -5630, -750, 4848, 7437, 6362, 1650, -4278, -7380, -6427, -2353, 3402, 7131]
3697G131K5m099n964l652n50L432N420M538J418l433n825m953o61K468N465M732
3713E492K109k126n400m855k982K061M957N228K512q86m356n268l790Q09L857
3728b638N824L849j31l602n602m535n35L296N896M272J021k714m911n137j824
3743g471K276N416M938J963k038m360n173k622J045M497N711K895q05m124n206
3758c058l737K80L432N565L721M00k875n425m373r17K872N494M492J356k566m676
3774a5n324j997J950M895N185K235j557m406m492l412Q52M204N264L334l18l915
3790B483n463k852r97L647N056M147N01k570n233m155j384K419N146M443J848
3805G036k493m595m747j929J254M722N122K549j173m320n020k950K90M278M706
$$ y = [7131, 7156, 3057, -2907, -6559, -7109, -3677, 1743, 6281, 7699, 4266, -1559, -6512, -7173, -4705, 760, 5492, 7601, 5475, 75, -4780, -7762, -5701, -744, 4484, 6996, 6110, 1754, -3514, -7304, -6495, -2638, 3186, 7035, 6904, 3302, -2300, -6835, -7370, -4074, 1822, 6094, 7115, 4401, -510, -5647, -7471, -5195, 221, 5159, 7122, 5084, 724, -4449, -7071, -6026, -1529, 4182, 7077, 6272, 2148, -3058, -6795, -6515, -3083, 2482, 6203, 6603, 3728, -1697, -6070, -6987, -4115, 1379, 5871, 7227, 4661, -15, -5339, -7336, -5386, -491, 4694, 6929, 5372, 966, -3526, -6938, -6086, -1882, 3382, 6716, 6398, 2483, -2980, -5832, -6829, -3182, 1874, 6021, 6522, 3952, -1281, -5436, -6820, -4401, 745, 5188, 7036, 4543, -52, -4799, -6728, -5474, -752, 4370, 6919, 5746, 1426, -3594, -6544, -6254, -1976, 2730]
3820B730L862l06l458n436l415m67K792N346L823Q97k491m759m467j189K361M684
3836E07M285K227k148m463m702k316R55M209N500K586p57m228m931k794o6L448
3852b688N038L879L67l476n243l448o30K779M313M178J733k485m863m489j751
3867f786K105M654M443K166j294m197m860k911J177L875N010L189m14m087m574
3882b504l625L68K859M883L780L76k526n006m120q94K740M344M297J233j568m596
$$ y = [2730, 6592, 6286, 2828, -2608, -6023, -6490, -3698, 1648, 5471, 6368, 3877, -882, -5349, -6538, -4177, 507, 4792, 7019, 4871, 408, -4294, -6610, -5655, -1446, 4054, 6640, 5883, 1655, -3276, -6070, -6136, -2688, 2350, 6229, 6596, 3120, -2123, -5571, -6201, -3422, 891, 5069, 6802, 4317, -546, -5035, -6786, -4681, -27, 4416, 6582, 5288, 1091, -3769, -6680, -5503, -1628, 3382, 6571, 6157, 2070, -2504, -6129, -5761, -2902, 1981, 5761, 6137, 3611, -1395, -5515, -6409, -3669, 675, 4972, 6205, 4637, 41]
$$ [...]
8191c88
##END NTUPLES=NMR FID
##END=
