##TITLE=1H_LR-676-H3M
 CDCl3, 8 sc, 
 23.7.2019
##JCAMPDX= 6.0         $$ Bruker NMR JCAMP-DX V2.0
##DATA TYPE= NMR FID
##DATA CLASS= NTUPLES
##ORIGIN= UXNMR, Bruker Analytische Messtechnik GmbH
##OWNER= root
$$ XWIN-NMR		Version 3.5
$$ Tue Jul 23 15:42:25 2019 Russian Standard Time (UT+4h)  she@DPX200
##.OBSERVE FREQUENCY= 200.13155
##.OBSERVE NUCLEUS= ^1H
##.DELAY= (6, 6)
##.ACQUISITION MODE= SIMULTANEOUS
##.ACQUISITION SCHEME= undefined
##.AVERAGES= 8
##.DIGITISER RES= 18
##SPECTROMETER/DATA SYSTEM= spect
##.PULSE SEQUENCE= zg30
##.SOLVENT NAME= CDCl3
##.SHIFT REFERENCE= (INTERNAL, CDCl3, 0, 15.7039)
##AUDIT TRAIL= $$ (NUMBER, WHEN, WHO, WHERE, WHAT)
$$ ##TITLE= Audit trail, XWIN-NMR		Version 3.5
$$ ##JCAMPDX= 5.01
$$ ##ORIGIN= Bruker BioSpin GmbH
$$ ##OWNER= she
$$ F:/spectra/data/she/nmr/H-F/1/audita.txt
$$ ##AUDIT TRAIL=  $$ (NUMBER, WHEN, WHO, WHERE, WHAT)
(   1,<2019-07-23 15:41:10.96 +0400>,<she>,<DPX200>,
      <created by zg, POWCHK disabled, PULCHK disabled
       configuration hash MD5:
       00 E9 B6 7A A2 85 ED C7 34 08 36 98 17 FE 4E 26
       data hash MD5: 16K
       BC 14 A0 D6 40 9A AF A3 1D ED 35 9D 4A 67 88 74>)
$$ ##END=
$$ 
$$ hash MD5
$$ DD 17 0B 11 43 B1 00 07 8E 8C 65 1F 6C 6C 62 D2
##$RELAX= 
##$RELAX= 
##$RELAX= 
##$RELAX= 
##$RELAX= 
##$RELAX= 
$$ Bruker specific parameters
$$ --------------------------
##$DU= <F:/spectra>
##$EXPNO= 1
##$NAME= <H-F>
##$PROCNO= 1
##$TYPE= <nmr>
##$USER= <she>
##$AMP= (0..31)
100 100 100 100 100 100 100 100 100 100 100 100 100 100 100 100 100 100 
100 100 100 100 100 100 100 100 100 100 100 100 100 100 
##$AQSEQ= 0
##$AQ_mod= 1
##$AUNM= <au_zg>
##$AUTOPOS= <>
##$BF1= 200.13
##$BF2= 200.13
##$BF3= 200.13
##$BF4= 200.13
##$BF5= 200.13
##$BF6= 200.13
##$BF7= 200.13
##$BF8= 200.13
##$BYTORDA= 1
##$CFDGTYP= 0
##$CFRGTYP= 5
##$CHEMSTR= <none>
##$CNST= (0..31)
1 1 145 1 1 1 1 1 1 1 1 1 1 1 1 1 1 1 1 1 1 1 1 1 1 1 1 1 1 1 1 1 
##$CPDPRG= <>
##$CPDPRG1= <>
##$CPDPRG2= <>
##$CPDPRG3= <>
##$CPDPRG4= <mlev>
##$CPDPRG5= <mlev>
##$CPDPRG6= <mlev>
##$CPDPRG7= <mlev>
##$CPDPRG8= <mlev>
##$CPDPRGB= <>
##$CPDPRGT= <>
##$D= (0..31)
0 1.2 0 0 0 0 0 0 0 0 0 0.03 0 0 0 0 0 0 0 0 0 0 0 0 0 0 0 0 0 0 0 0 
##$DATE= 1563882070
##$DBL= (0..7)
120 120 120 120 120 120 120 120 
##$DBP= (0..7)
150 150 150 150 150 150 150 150 
##$DBP07= 0
##$DBPNAM0= <>
##$DBPNAM1= <>
##$DBPNAM2= <>
##$DBPNAM3= <>
##$DBPNAM4= <>
##$DBPNAM5= <>
##$DBPNAM6= <>
##$DBPNAM7= <>
##$DBPOAL= (0..7)
0.5 0.5 0.5 0.5 0.5 0.5 0.5 0.5 
##$DBPOFFS= (0..7)
0 0 0 0 0 0 0 0 
##$DE= 6
##$DECBNUC= <off>
##$DECIM= 24
##$DECNUC= <off>
##$DECSTAT= 4
##$DIGMOD= 1
##$DIGTYP= 9
##$DL= (0..7)
0 120 120 120 120 120 120 120 
##$DP= (0..7)
150 150 150 150 150 150 150 150 
##$DP07= 0
##$DPNAME0= <>
##$DPNAME1= <>
##$DPNAME2= <>
##$DPNAME3= <>
##$DPNAME4= <>
##$DPNAME5= <>
##$DPNAME6= <>
##$DPNAME7= <>
##$DPOAL= (0..7)
0.5 0.5 0.5 0.5 0.5 0.5 0.5 0.5 
##$DPOFFS= (0..7)
0 0 0 0 0 0 0 0 
##$DQDMODE= 0
##$DR= 18
##$DS= 0
##$DSLIST= <SSSSSSSSSSSSSSS>
##$DSPFIRM= 0
$$ [...]
##$SUBNAM2= <"">
##$SUBNAM3= <"">
##$SUBNAM4= <"">
##$SUBNAM5= <"">
##$SUBNAM6= <"">
##$SUBNAM7= <"">
##$SUBNAM8= <"">
##$SUBNAM9= <"">
##$SW= 24.9336996594482
##$SWIBOX= (0..15)
0 0 2 0 0 0 0 0 0 0 0 0 0 0 0 0 
##$SW_h= 4990.01996007984
##$TD= 16384
##$TD0= 1
##$TE= 0
##$TE2= 300
##$TE3= 300
##$TEG= 300
##$TL= (0..7)
0 120 120 120 120 120 120 120 
##$TP= (0..7)
150 150 150 150 150 150 150 150 
##$TP07= 0
##$TPNAME0= <>
##$TPNAME1= <>
##$TPNAME2= <>
##$TPNAME3= <>
##$TPNAME4= <>
##$TPNAME5= <>
##$TPNAME6= <>
##$TPNAME7= <>
##$TPOAL= (0..7)
0.5 0.5 0.5 0.5 0.5 0.5 0.5 0.5 
##$TPOFFS= (0..7)
0 0 0 0 0 0 0 0 
##$TUNHIN= 0
##$TUNHOUT= 0
##$TUNXOUT= 0
##$USERA1= <user>
##$USERA2= <user>
##$USERA3= <user>
##$USERA4= <user>
##$USERA5= <user>
##$V9= 5
##$VALIST= <valist>
##$VCLIST= <CCCCCCCCCCCCCCC>
##$VD= 0
##$VDLIST= <DDDDDDDDDDDDDDD>
##$VPLIST= <PPPPPPPPPPPPPPP>
##$VTLIST= <TTTTTTTTTTTTTTT>
##$WBST= 1024
##$WBSW= 4
##$XGAIN= (0..3)
0 0 0 0 
##$XL= 0
##$YL= 0
##$YMAX_a= 522065
##$YMIN_a= -1013783
##$ZGOPTNS= <>
##$ZL1= 120
##$ZL2= 120
##$ZL3= 120
##$ZL4= 120
##$ABSF1= 10
##$ABSF2= 0
##$ABSG= 5
##$ABSL= 3
##$ALPHA= 0
##$AQORDER= 0
##$ASSFAC= 0
##$ASSFACI= 0
##$ASSFACX= 0
##$ASSWID= 0
##$AUNMP= <proc_1d>
##$AZFE= 0.1
##$AZFW= 0.1
##$BCFW= 1
##$BC_mod= 2
##$BYTORDP= 1
##$COROFFS= 0
##$CY= 11.3945322036743
##$DATMOD= 1
##$DC= 2
##$DFILT= <>
##$DTYPP= 0
##$F1P= 18.9103706918063
##$F2P= -1.10871071338519
##$FCOR= 0.5
##$FTSIZE= 0
##$FT_mod= 4
##$GAMMA= 1
##$GB= 0.15
##$INTBC= 1
##$INTSCL= 1
##$ISEN= 128
##$LB= 0.24
##$LEV0= 0
##$LPBIN= 0
##$MAXI= 10000
##$MC2= 0
##$MEAN= 0
##$ME_mod= 0
##$MI= 1.114404
##$NCOEF= 0
##$NC_proc= 0
##$NLEV= 6
##$NOISF1= 3.799351
##$NOISF2= 2.8
##$NSP= 1
##$NTH_PI= 0
##$NZP= 0
##$OFFSET= 15.70392
##$PC= 1
##$PHC0= -8860.429
##$PHC1= 11.20096
##$PH_mod= 1
##$PKNL= yes
##$PPARMOD= 0
##$PSCAL= 0
##$PSIGN= 0
##$REVERSE= no
##$SF= 200.130013532006
##$SI= 16384
##$SIGF1= 3
##$SIGF2= 2
##$SINO= 400
##$SIOLD= 16384
##$SREGLST= <1H.CDCl3>
##$SSB= 0
##$STSI= 0
##$STSR= 0
##$SW_p= 3612.71676300578
##$SYMM= 0
##$S_DEV= 0
##$TDeff= 0
##$TDoff= 0
##$TI= <>
##$TILT= no
##$TM1= 0
##$TM2= 0
##$TOPLEV= 0
##$USERP1= <user>
##$USERP2= <user>
##$USERP3= <user>
##$USERP4= <user>
##$USERP5= <user>
##$WDW= 1
##$XDIM= 8192
##$YMAX_p= 0
##$YMIN_p= 0
$$ End of Bruker specific parameters
$$ ---------------------------------
##NTUPLES= NMR FID
##VAR_NAME=  TIME,          FID/REAL,        FID/IMAG
##SYMBOL=    X,             R,               I
##VAR_TYPE=  INDEPENDENT,   DEPENDENT,       DEPENDENT
##VAR_FORM=  AFFN,          ASDF,            ASDF
##VAR_DIM=   8192,          8192,            8192
##UNITS=     SECONDS,       ARBITRARY UNITS, ARBITRARY UNITS
##FACTOR=    0.0002004,     1,               1
##FIRST=     0,             0,               0
##LAST=      1.6414764,     0,               0
##MIN=       0,             -1013783,        0
##MAX=       1.6414764,     522065,          0
$$ Real data points
##PAGE= N=1
##DATA TABLE= (X++(R..R)), XYDATA
$$ [...]
2230h71q4L15J363M65l26j496l78J56R83M26K84J47k1K7J86K97p66p95j88O54
$$ -871 -955 -640 723 1188 862 -634 -1012 -856 127 553 837 984 963 990 1176 1473 707 -88 -276 378
2250C78J580P48n41q46p68K45K11j86n41l39L48Q93J289m94j142j687n29N33Q32
$$ 378 1958 2706 2165 1319 551 796 1007 821 280 -59 289 1182 2471 1977 835 -852 -1381 -848 -16
2269a6O50m29q49l3O66m0o58j289p62k0J774J200rq02j375m75P73P35j66j094
$$ -16 634 205 -644 -677 -11 -51 -709 -1998 -2760 -2780 -1006 194 185 -617 -1992 -2467 -1694 -959 -1125 -2219
2289b219K01M58J634P98p56j462j054mJ850J232L15q91q78Q31J269L70j529j297
$$ -2219 -2018 -1560 74 872 116 -1346 -2400 -2404 -554 678 993 102 -776 55 1324 1694 165 -1132
2307a132k2J423K163O05n09j635r27M21J170N04p24j499N17J585J788r90k029
$$ -1132 -1154 269 2432 3037 2528 893 -34 387 1557 2061 1337 -162 355 1940 3728 2738 709
2324G09j264l90J010J469O01j113j232k17R83R34q74k191j043J034J764J233p49
$$ 709 -555 -945 65 1534 2135 1022 -210 -427 556 1490 616 -1575 -2618 -1584 180 1413 664
2341F64j296j204o9R48O3J70j311m61J387J694M23j630j753k71N47J531Q39L55
$$ 664 -632 -1836 -1905 -957 -894 -724 -2035 -2496 -1109 585 1008 -622 -2375 -2646 -2099 -568 271 626
2359F26r66p01N77L07R41r05j403oJ498J766O0n85j096n02J07P87M78J04p69j35
$$ 626 -340 -1041 -464 -157 784 -121 -1524 -1530 -32 1734 1794 1209 113 -389 -282 505 983 1087 318 183
2379A83J177J087m16j091j461q2K48J127P05J79m81r98K78k4J66j084o64J13J154
$$ 183 1360 2447 2031 940 -521 -603 -355 772 1477 1656 1175 177 455 431 597 -487 -1151 -1038 116
2398A16J276j50q21q22j009M2K47J267J42r04n7Q12O06q33n10j122J20M02Q85
$$ 116 1392 1242 421 -401 -1410 -1368 -1121 146 288 -616 -673 139 745 -88 -598 -1720 -1600 -1198 -313
2417c13J027k60m69r85o8R83jj75p88J61J278J056r2o97r23o30k20J051Q76O17
$$ -313 714 454 -15 -1000 -1068 -85 -86 -261 -1049 -888 390 1446 1354 657 -266 -896 -1116 -65 811 1428
2437A428p90p66O37N85m01j307l22M94O80R98P21q56r07r62j77J214L84m39o39
$$ 1428 638 -128 509 1094 693 -614 -936 -442 238 1236 1957 1101 194 -768 -945 269 653 214 -425
2456d25L3J074M60m72o65j110l61J48J344O73l52p00n06Q35N45m77j112n29L90
$$ -425 -392 682 1142 670 5 -1105 -1466 -1318 26 699 347 -353 -859 -24 521 44 -1068 -1597 -1207
2475a207J260J133j6l79j535r91P04P40M28k53l87N13L50M26n43j033p89L17N00
$$ -1207 53 1186 1170 791 -744 -1735 -1031 -291 137 -116 -503 10 360 786 243 -790 -1579 -1262 -762
2494g62J734j64M4j373M8M60O53m54j284P1O75J196N16r8j168q88J24N98P61k61
$$ -762 972 808 852 -521 -473 -13 640 186 -1098 -1027 -352 844 1360 1262 94 -794 -670 -72 689 428
2514D28j63P7N32O21J88j344q98o08Q73J009M58K95o70n17O8Q1l39j87p15K06
$$ 428 265 342 874 1495 1683 339 -559 -1167 -294 715 1173 1468 798 281 349 430 91 -96 -811 -605
2534f05J326P11m96q46q08l42K70K53N7K3k00K81K82po51p94k11O0O73O63K44
$$ -605 721 1432 936 90 -718 -1060 -790 -537 -480 -457 -657 -376 -94 -101 -752 -1546 -1757 -1697 -1024 -361 -117
2555a17k58l59k26K46m94m70k24N00J158M39M17m90q44j05q0P7N15J97O57L67
$$ -117 -375 -734 -960 -714 -1208 -1678 -1902 -1402 -244 195 612 122 -722 -827 -907 -830 -315 -118 539 906
2575I06K85J25m27o58k46K67R44K02M51K72m59N6l67J70o43l58K39P30M40r2p5
$$ 906 1191 1316 889 231 -15 252 1196 1398 1849 2121 1662 1718 1351 1521 878 520 759 1489 1929 1837 1762
2596A762n40K18j010m09Q1K33p3M48l0O2n97j010o46j3K84L94mK32k47l43j94
$$ 1762 1222 1440 430 21 102 335 262 710 680 742 145 -865 -1511 -1524 -1240 -846 -850 -618 -865 -1208 -1402
2617a402l72m69k94%K79R29K04k64m40k15k7J0j14M21L47O08N12L05po42l19J81
$$ -1402 -1774 -2243 -2537 -2537 -2258 -1329 -1125 -1389 -1829 -2044 -2071 -2061 -2175 -1754 -1407 -799 -287 18 11 -631 -950 -769
2639g69K37R74J20K61K60P07%m49l63J0L27Q8P24O02j40m01j27m63K3J49k58m3
$$ -769 -532 442 562 823 1083 1790 1790 1341 978 988 1315 1403 2127 2729 2589 2188 2061 1598 1621 1770 1512 1469
2661A469P09O32m58p01l56k92l46q3J65r8j28k76J44j3l16q76r02k15J068r8k16
$$ 1469 2178 2810 2352 1651 1295 1003 657 574 739 641 513 237 381 368 52 -824 -1726 -1941 -873 -971 -1187
2682a187P8K89o41o35n35J74k08M2O05M53P03o52o01o43M43N43j14M42N71M31
$$ -1187 -1109 -820 -1461 -2096 -2631 -2457 -2665 -2623 -2018 -1565 -862 -1514 -2115 -2758 -2315 -1772 -1886 -1444 -873 -442
2702d42p9J30L9k75j97j60O54Q54N92J5m83Q66k52k28k30J89K56K32N16K25N84
$$ -442 -521 -391 -352 -627 -824 -984 -330 524 1116 1131 648 1514 1262 1034 804 993 1249 1481 1997 2222 2806
2723B806n91o63l04L84O5o5j39J78Q09l31o72l09j44j68q90Q13L49K9k53r63l07
$$ 2806 2215 1552 1248 1632 1697 1632 1493 1671 2480 2149 1477 1168 1024 856 -34 779 1128 1157 904 -59 -366
2744c66L67j93q83l9N31N58m67k57M0k00q84k64j00O71o3r0PQ32n14k44p36M75
$$ -366 1 -192 -1075 -1114 -583 -25 -492 -749 -709 -909 -1793 -2057 -2157 -1486 -1549 -1639 -1632 -800 -1314 -1558 -2294 -1819
2766a819O7k30J46J077M72o45l07o0M40m29k59P40Q59N92k74k65P21l42o46J24
$$ -1819 -1752 -1982 -1836 -759 -287 -932 -1239 -1299 -859 -1288 -1547 -807 52 644 370 105 826 484 -162 -38
2786c8O55K30P68n55K22L20J06p68nL18Q9K53k25R27k0k53n09l33M48M3n34j01
$$ -38 617 847 1615 1060 1282 1602 1708 940 935 1253 1342 1595 1370 2297 2277 2024 1515 1182 1630 1673 1139 1038
2808A038M14J76l16l3m23j39r16n4L31N97j77l50j79j76J99j239M3k46P38k93
$$ 1038 1452 1628 1312 1279 856 717 -199 -253 78 675 498 148 -31 -207 -8 -1247 -1204 -1450 -712 -1005
2828a005K13j79J47p22o27j10N52K07j90m1K02K69j14j93k9l1j81p0O68Q35m1
$$ -1005 -792 -971 -824 -1546 -2173 -2283 -1731 -1524 -1714 -1755 -1553 -1284 -1398 -1591 -1620 -1651 -1832 -1902 -1234 -399 -440
2849d40j72m35L84M62j38k63L20P80j94J033k56K54n35n80P6J034M93o28L61J68
$$ -440 -612 -1047 -663 -201 -339 -602 -282 498 304 1337 1081 1335 800 220 296 1330 1823 1195 1556 1724
2869A724K31O0l42l17k55p4L32Q07k70q2q08o1R2M89k74p36k35K91J89M87m60
$$ 1724 1955 2015 1673 1356 1101 1027 1359 2166 1896 1814 1006 945 1037 1526 1252 516 281 572 761 1248 788
2890G88o28r82p4K81L80k59n28oK11L44n11n66l38j50K93L58P09o70m16j09K14
$$ 788 160 -822 -896 -615 -235 -494 -1022 -1028 -817 -473 -984 -1550 -1888 -2038 -1745 -1387 -678 -1348 -1764 -1873 -1659
2911a659K33K4k86j15M81L89N54m29r7o1K2L52K18K75Q8p7O8L02N46n80J89l33
$$ -1659 -1426 -1402 -1688 -1803 -1322 -933 -379 -808 -905 -966 -944 -592 -374 -99 -11 -88 -20 282 828 248 437 104
2933A04J61N76L32M9j94n4m3j83K19J92j59l27M15N15J83n02m68j80J00j22J91
$$ 104 265 841 1173 1222 1028 974 931 748 967 1159 1000 673 1088 1603 1786 1284 816 636 736 614 805
2954H05R2L8n1k07k2P0o37l12J63K95q0K80m09p0o4m07J08j13q5M63l68n0K52
$$ 805 897 935 884 677 655 725 88 -224 -61 234 154 434 25 -45 -109 -516 -408 -521 -606 -143 -511 -561 -309
2977c09j33r5k62m12N12j50O5L1K93K8k01l05k0J99n6o5qM53K5j45j11J47n0J17
$$ -309 -442 -537 -799 -1211 -699 -849 -784 -753 -460 -432 -633 -938 -958 -759 -815 -880 -888 -435 -410 -555 -666 -519 -569 -452
3001d52o6J90K25k86j37K06K26r3j09m8K11P37m91K75J19K19l36p5J4M82p5j89
$$ -452 -518 -328 -103 -389 -526 -320 -94 -187 -296 -344 -133 604 113 388 507 726 390 315 329 811 736 547
3023E47J89J63K59k06l17N1O56l86k5M11j15O5Om53L53Pp16j04N24j91K12l08
$$ 547 736 899 1158 952 635 686 1342 956 931 1342 1227 1292 1298 845 1198 1205 489 385 909 718 930 622
3045F22P5m29l22l16L44o8j63j70j77L7K70m12o06N8j19r1L1l0K22k44j49l58
$$ 622 697 268 -54 -370 -26 -94 -257 -427 -604 -567 -297 -709 -1315 -1257 -1376 -1467 -1436 -1466 -1244 -1488 -1637 -1995
3067a995O49r6m86oL70L55J66l27L1J29J10J18J36L46P8K29k52N33K11N6k21K58
$$ -1995 -1346 -1442 -1928 -1934 -1564 -1209 -1043 -1370 -1339 -1210 -1100 -982 -846 -500 -422 -193 -445 88 299 355 134 392
3089C92L20M02r4l55M03K63N9K6P7J73k58N2N74p0P2o80K3K32J82m8m01J09n00
$$ 392 712 1114 1020 665 1068 1331 1390 1416 1493 1666 1408 1460 2034 1964 2036 1356 1379 1611 1793 1745 1344 1453 953
3112I53N22o94J74l19k89l51J7N93o25j59m0l01k23m5l65P6p7j43j86j80K18l8
$$ 953 1475 781 955 636 347 -4 13 606 -19 -178 -218 -519 -742 -787 -1152 -1076 -1153 -1296 -1482 -1662 -1444 -1482
3134a482m89j94K48M15j78l47J80qL66k11k36N79K74k16K58K32L36j89j25O85
$$ -1482 -1971 -2165 -1917 -1502 -1680 -2027 -1847 -1855 -1489 -1700 -1936 -1357 -1083 -1299 -1041 -809 -473 -662 -787 -102
3154a02K03o4k75L76L57L22k3k03M05J02K15n0K8K68M6r4J73L71J20p71q9J89
$$ -102 101 37 -238 138 495 817 794 591 996 1098 1313 1263 1291 1559 1605 1511 1684 2055 2175 1404 1315 1504
3176A504L85o2l94m69M91k90o5k8l03L15m83j95n6J19j23m90l12J59R9l42j25
$$ 1504 1889 1827 1433 964 1455 1165 1100 1072 769 1084 601 406 350 469 346 -144 -456 -297 -198 -540 -665
3197f65J47j75m51j8K81j37k87k17j30N77k69Q8j54j21M07m89P2P0L22j57r5L23
$$ -665 -518 -693 -1144 -1162 -881 -1018 -1305 -1522 -1652 -1075 -1344 -1256 -1410 -1531 -1124 -1613 -1541 -1471 -1149 -1306 -1401 -1078
3219a078J02k39J39J78J02K66J37j48LN32K82k47N5N30j73K8l3P24p9j70j5L96
$$ -1078 -976 -1215 -1076 -898 -796 -530 -393 -541 -538 -6 276 29 84 614 441 469 436 1160 1081 911 896 1292
3241A292L72k88N5j58K20J31l06K70Q5l34m8m18M01J08K7j42k04r1ml79q3j48
$$ 1292 1664 1376 1431 1273 1493 1624 1318 1588 1673 1339 1291 873 1274 1382 1409 1267 1063 972 968 589 506 358
3263C58Lm1K10j10n57J64k10m22j47p9j05L8L6j56k21q8k50J41k70J89p1N7J29
$$ 358 361 320 530 420 -137 27 -183 -605 -752 -831 -936 -898 -862 -1018 -1239 -1327 -1577 -1436 -1706 -1517 -1588 -1531 -1402
3286a402nj50k10K21N9j72O03P8Q2j60L49K07J38l3m4Q8K69L46N26j66k34R6K59
$$ -1402 -1407 -1557 -1767 -1546 -1487 -1659 -1056 -978 -896 -1056 -707 -500 -362 -395 -439 -351 -82 264 790 624 390 486 745
3309G45L86k97K71Q3j69O91Q0j28q3j89J19j08K53N9j15k68K91r7R0p16L0Pl60
$$ 745 1131 834 1105 1188 1019 1710 1790 1662 1579 1390 1509 1401 1654 1713 1598 1330 1621 1524 1614 898 928 935 575
3332E75J89j3l55o6k11l74J61j91o0n60L81M1j83o4n81j9l3j85n1l0K21j59P2
$$ 575 764 751 396 330 119 -255 -94 -285 -345 -905 -524 -483 -666 -730 -1311 -1330 -1363 -1548 -1599 -1629 -1408 -1567 -1495
3355a495jK34j21nn33O00M88j08K77J11l11J90p0K09N37j92J01L71J71K57p4k98
$$ -1495 -1496 -1262 -1383 -1388 -1921 -1321 -833 -941 -664 -553 -864 -674 -744 -535 2 -190 -89 282 453 710 636 338
3377C38M62j62LK11M40k78J38K1j6K00k69k47J95P1K61j25o7l56L78o44k86K22
$$ 338 800 638 641 852 1292 1014 1152 1173 1157 1357 1088 841 1036 1107 1368 1243 1176 820 1198 554 268 490
3399D90j15J29m49J60L3k02j83q23O25n6j96J79r1K14n10j23L3M05m35k22M62
$$ 490 375 504 55 215 248 46 -137 -960 -335 -391 -587 -408 -499 -285 -795 -918 -885 -480 -915 -1137 -675
3420f75k7O1j87N8K93l54J08q7nO35k37Q1L0O78l96j63J90k87N17n3m8N61l2p5
$$ -675 -702 -641 -828 -770 -477 -831 -723 -810 -815 -180 -417 -336 -306 372 -24 -187 3 -284 233 180 132 693 661 586
3444E86l3l80J17K09p3J37pJ75j14M2k70k19O8q2K6M9k12K3J2K0l27K55k17O5
$$ 586 553 173 290 499 426 563 556 731 617 659 389 170 238 156 182 231 19 42 54 74 -253 2 -215 -150
3468a50j42j1K40m7k35j07J41j86j15M43L8m5K26Pj97j82M13k78k15J00N91K11
$$ -150 -292 -303 -63 -110 -345 -452 -311 -497 -612 -169 -131 -176 50 57 -140 -322 91 -187 -402 -302 289 500
3490E00k32j93j06L35J46q4j20k6N7K39o3J28j20n53J68J60J97k46j0J81k01J95
$$ 500 268 75 -31 304 450 366 246 220 277 516 453 581 461 -92 76 236 433 187 177 358 157 352
3512C52k33J88m19k13j98J00K26r4j6l9J14j84n10M34n5j29J7J57M16j47k26m92
$$ 352 119 307 -112 -325 -523 -423 -197 -291 -307 -346 -232 -416 -926 -492 -547 -676 -659 -502 -86 -233 -459 -951
3534i51K22K63j20K37rK53M9j85m1n5J51o1L55K5L38j28j87R2K08k8K7N3J9R6
$$ -951 -729 -466 -586 -349 -358 -105 -56 -241 -282 -337 -186 -247 108 133 471 343 156 248 456 428 455 508 527 623
3558F23J30k07M33j7k86K3j09k5O8k27M4M96j59p08L59j43l21K74J49Q8k99l31
$$ 623 753 546 979 962 676 699 590 565 633 406 450 946 787 79 438 295 -26 248 397 485 186 -145
3580a45P4L9k19J23o49J50M07l0l55M42n11J54j87k9L2k46L27J56J12l1On95J40
$$ -145 -71 -32 -251 -128 -777 -627 -220 -250 -605 -163 -674 -520 -707 -736 -704 -950 -623 -467 -355 -386 -380 -975 -835
3603h35J90j03L76j42M43n6k0J64qrj77L8O6N17o0J5k78j06M08k55L17l10K58
$$ -835 -645 -748 -372 -514 -71 -127 -147 17 9 0 -177 -139 -73 444 384 399 121 15 423 168 485 175 433
3626D33P6o1M69p5j42k60M8K5L4k62K68k21j7N0K39l59Q0m3n0Q3P3L2k28j98R4
$$ 433 509 448 917 842 700 440 488 513 547 285 553 332 315 365 604 245 325 282 232 315 388 420 192 -6 88
3651H8l65Q9n2j47N65k65lK1m40J27n5J48k65K57j59M2n5j63p3L2O8n1J7j7K57
$$ 88 -277 -188 -240 -387 178 -87 -90 -69 -509 -382 -437 -289 -554 -297 -456 -414 -469 -632 -705 -673 -605 -656 -639 -656 -399
3676c99K47m47J90j74L54j35J62l44K01J98oL96n18K20QK15j55J21M4k51N44%
$$ -399 -152 -599 -409 -583 -229 -364 -202 -546 -345 -147 -153 243 -275 -55 -47 168 13 134 178 -73 471 471
3698D71j52K48Oj56p9J81L32j47k44L53j33L4k57N1J98o2r7P6k4k93M25o74L81
$$ 471 319 567 573 417 338 519 851 704 460 813 680 714 457 508 706 644 547 623 599 306 731 57 438
3721D38j85l67J41j09M59k05m0l53P5j11k44rJ38J39l38J25J92k79K39o16PK56
$$ 438 253 -114 27 -82 377 172 132 -221 -146 -257 -501 -510 -372 -233 -571 -446 -254 -533 -294 -910 -903 -647
3743f47K75k41K12m2j04k77J70o2OR6K14K78J40K52m19m23R8M27j03J79L1N74
$$ -647 -372 -613 -401 -443 -547 -824 -654 -716 -710 -614 -400 -122 18 270 -149 -572 -474 -47 -150 29 60 634
3765F34m37j86L37R4K35j86L3j7K66r7rp5L45l60j12K1K26j51j38K56j1j03n6
$$ 634 197 11 348 442 677 491 524 507 773 676 667 592 937 577 465 486 712 561 423 679 668 565 509
3788E09k22n07K87P3J50m9j66k00j95p2JK16k40j4J97l10J84M3l66J13Q5r4n6
$$ 509 287 -220 67 140 290 241 75 -125 -320 -392 -391 -175 -415 -429 -232 -542 -358 -315 -681 -568 -483 -577 -633
3811f33K47k7j30K33J04M1k77l07K96L19J66k10R4K87m53K18j26J46K35j32K22
$$ -633 -386 -413 -543 -310 -206 -165 -442 -749 -453 -134 32 -178 -84 203 -250 -32 -158 -12 223 91 313
3832C13J60J11j89p3l69M27n0J18r2M3nK4Ml44N43n27j58j0qN05l9k11lJ49l25
$$ 313 473 584 395 322 -47 380 330 448 356 399 394 418 422 78 621 94 -64 -74 -82 423 384 173 170 319 -6
3857fp7P1j39N2j25J77J7K17m67J23l79L15k53N2L24M4K14k53k16M50p7m38O7
$$ -6 -83 -12 -151 -99 -224 -47 -30 187 -280 -157 -536 -221 -474 -422 -98 -54 160 -93 -309 141 64 -374 -307
3880c07J82O04k45l14l20O12j89P7j14r7L50m69J39L46m4j73l19J48K82O3M0k5
$$ -307 -125 479 234 -80 -400 212 23 100 -14 -111 239 -230 -91 255 211 38 -281 -133 149 212 252 227
3902B27l73L61l47K04k15K17n37J62L46J79J2o11J42K38m26J15J53J72p6k8p3
$$ 227 -146 215 -132 72 -143 74 -463 -301 45 224 236 -375 -233 5 -421 -306 -153 19 -57 -85 -158
3923a58K73j09k98n9J05N64j86j97J82J3k14L88Rm4k05k5K59J59J2j19l10M6J1
$$ -158 115 6 -292 -351 -246 318 132 -65 117 130 -84 304 313 269 64 39 298 457 469 350 40 86 97
3946I7K0l4K81k25K55qj39N8m15O1pj34M17l18K22k61k77J81K07Rk95J26j9k9
$$ 97 117 83 364 139 394 386 247 305 -110 -49 -56 -190 227 -91 131 -130 -407 -226 -19 -10 -305 -179 -198 -227
3970b27k14q9k8r0J02n2PK00k17K79O2k91L32q0j88K46J90j55K55O7N2K2j27K73
$$ -227 -441 -530 -558 -648 -546 -598 -591 -391 -608 -329 -267 -558 -226 -306 -494 -248 -58 -213 42 109 161 183 56 329
3994C29l74L64l6j73L69k44L07k37j38L13j98M6k0K52j98J04l87J73J24l13J62
$$ 329 -45 319 283 110 479 235 542 305 167 480 282 328 308 560 362 466 79 252 376 63 225
4015B25j30J40J58j97K37k51j12j6j88j39K32k45JK61j4m88RR5Q9j71m9L46l61
$$ 225 95 235 393 196 433 182 70 54 -134 -273 -41 -286 -285 -24 -38 -526 -517 -422 -333 -504 -553 -207 -568
4038e68J1N3N2K73k15j60J03J56j33jM41k79J48Q1m4J61k04K63n7K09J22Q0M3
$$ -568 -557 -504 -452 -179 -394 -554 -451 -295 -428 -429 12 -267 -119 -38 -82 79 -125 138 81 290 412 492 535
4061E35k30O3mM8K54j71l4J48K6m20j04J89j10jN6R8J61j53j49K2j20kl74J98
$$ 535 305 368 364 412 666 495 461 609 635 215 111 300 190 189 245 343 504 351 202 224 104 102 -272 -74
4085g4L57k23l09K30L43n41p8j74M56o5k63K69l02J08j6R9m31M90k22O6K26P1
$$ -74 283 60 -249 -19 324 -217 -295 -469 -13 -78 -341 -72 -374 -266 -282 -183 -614 -124 -346 -280 -54 17
4107A7j44j32J6j4MO8J81R4k34l28O07O3k07J91l63J17O2J3J33j09J47o2K9j22
$$ 17 -127 -259 -243 -257 -253 -185 -4 90 -144 -472 135 198 -9 182 -181 -64 -2 11 144 35 182 120 149 27
4131B7J30R7k7l07J61P1J02j35lJ06r7K25j40k80L11l9m5J0j04k1o6r6N5K92k56
$$ 27 157 254 227 -80 81 152 254 119 116 222 125 350 210 -70 241 202 157 167 63 42 -24 -120 -65 227 -29
4156b9j25N07n81K12L45n48L95l44O0J28K49j24k31j44J73J65k6m44J35K86j12
$$ -29 -154 353 -228 -16 329 -219 176 -168 -108 20 269 145 -86 -230 -57 108 82 -362 -227 59 -53
4177e3Ol02J82j80j25M00P7M0l53K78K5j35n8j53J75J70j80O7K61r3P0j82q7L97
$$ -53 -47 -349 -167 -347 -472 -72 5 45 -308 -30 -5 -140 -198 -351 -176 -6 -186 -119 142 49 119 -63 -150 247
4201B47k98K72j54j5L57j19J05k33j1J36k43N6L06l30j22L20Q3J39r7k98J55P2
$$ 247 -51 221 67 52 409 290 395 162 151 287 44 100 406 76 -46 274 357 496 399 101 256 328
4223C28j96K66m46L61p8m1k63L59k36l05M80l90K47K4k52K1J78j46kL9r5k90N36
$$ 328 132 398 -48 313 235 194 -69 290 54 -251 229 -161 86 110 -142 -121 57 -89 -91 -52 -147 -437 99
4246I9n61LJ20l10K94n5L0j34J86J7L4mj82j84P04j23k32L19J4M1k28P7J34L51
$$ 99 -462 -459 -339 -649 -355 -410 -380 -514 -328 -311 -277 -281 -463 -647 57 -66 -298 21 35 76 -152 -75 59 410
4270D10m53M5R3J02L08k55k17L94k79N3J07mJ87J2J00j28j98L52k33N8K09j05
$$ 410 -43 2 95 197 505 250 33 427 148 201 308 304 491 503 603 475 277 629 396 454 663 558
4292E58l73j62L45j05o6k92L1K24K44n07O7jJ01k56l1%q0k88J13j28N00j84m3
$$ 558 185 23 368 263 197 -95 -64 160 404 -103 -36 -37 64 -192 -223 -223 -303 -591 -478 -606 -106 -290 -333
4315c33l68j13J62J21K06n5k80L51K9J91j93j50J14K37o2j3o3L21k6L8q0K26j37
$$ -333 -701 -814 -652 -531 -325 -380 -660 -309 -280 -89 -282 -432 -318 -81 -143 -156 -219 102 76 114 34 260 123
4338A23J71k12L21K90k02l04L12l9K39l77rJ51j9j32J01j4Mp6k52J1J68l6J2j74
$$ 123 294 82 403 693 491 187 499 460 699 322 313 464 445 313 414 400 404 328 76 87 255 219 231 57
4362E7L53j55k18Nj62J38k19j34k48L53n0j13L60m88j3L28R7j48k70k7L08J3M2
$$ 57 410 255 37 42 -120 18 -201 -335 -583 -230 -280 -393 -33 -521 -534 -206 -109 -257 -527 -554 -246 -233 -191
4385a91o8o9k20N18l94K94l7J08K90j22J45j54n5L6K36j17J36r7M0k5J71k25J1
$$ -191 -259 -328 -548 -30 -424 -130 -167 -59 231 109 254 100 45 81 317 200 336 239 279 254 425 200 211
4408B11j81J08K98J34k55j51J3oj14K44j05j26P0oQ3l30Q2o4J19lr6j68J81N5
$$ 211 30 138 436 570 315 164 177 171 57 301 196 70 140 134 217 -113 -31 -95 24 21 -75 -243 -62 -7
4432gj69Rl4j27J54j1k29N0J87j24J41k88K26M01m66Q0oK06J68l41m1K45j46J22
$$ -7 -176 -167 -201 -328 -174 -185 -414 -364 -177 -301 -160 -448 -222 179 -287 -207 -213 -7 161 -180 -221 24 -122 0
4456@l4K0J5n6P6K82k11K78m13R6L80l80J20M1K3J90k55K47k17l08J10J56O6j72
$$ 0 -34 -14 1 -55 21 303 92 370 -43 53 433 53 173 214 237 427 172 419 202 -106 4 160 226 54
4480E4j08J36J81j66J5R6l97R9L53m63J25M62l37l59O05l68j87K0k09L33J0k05
$$ 54 -54 82 263 97 112 208 -189 -90 263 -200 -75 387 50 -309 296 -72 -259 -239 -448 -115 -105 -310
4502c10J70J77j33J0P5ol50M36k52o7J14O7k61l5K22K10m8P2j53j13rJ09P2j13
$$ -310 -140 37 -96 -86 -11 -17 -367 69 -183 -250 -136 -69 -330 -365 -143 67 19 91 -62 -175 -184 -75 -3 -116
4526a16N10m16R6j3J68k18J01j44P7O5p4K40l09L93l44J19K98n65L33j03j35K66
$$ -116 394 -22 74 61 229 11 112 -32 45 110 36 276 -33 360 16 135 433 -132 201 98 -37 229
4548B29k06N9K14l45L0L01j68K44J18k63l98J13K20K8j41M8RNk46N7L1k72K11
$$ 229 23 82 296 -49 -19 282 114 358 476 213 -185 -72 148 176 35 83 92 97 -149 -92 -61 -333 -122
4571a22o2J01p2j91j84J82j39J52J67j31k42L79J6l12Q5j7j65N45r9k40J24L8
$$ -122 -184 -83 -155 -346 -530 -348 -487 -335 -168 -299 -541 -162 -146 -458 -373 -390 -555 -10 -109 -349 -225 -187
4593a87J03Ml07J57L75l68K85m04N02j02J53j49j24L05J84J3r9k00L40j99J88
$$ -187 -84 -80 -387 -230 145 -223 62 -342 160 58 211 62 -62 243 427 440 341 141 481 282 470
4614D70l05K62p0R7L1J12k14%j18O3L7j53M3P8J85j57n3j99j39K60k60l37L13
$$ 470 165 427 357 454 485 597 383 383 265 328 365 212 255 333 518 361 308 109 -30 230 -30 -367 -54
4637e4j83L8K4m9j70J4k14o2K70j80Q0J85j90J43l42J75J86j15k26J85J91k36
$$ -54 -237 -199 -175 -224 -394 -380 -594 -656 -386 -566 -486 -301 -491 -348 -690 -515 -329 -444 -670 -485 -294 -530
4659e30J10j84L61j47K00OM6l3K39Qj33L39k54N6J15J49koJ89J7l21K49J12J10
$$ -530 -420 -604 -243 -390 -190 -184 -138 -171 68 76 -57 282 28 84 199 348 346 340 529 546 225 474 586 696
4683F96l7J09j08J5j06j77L1m7M7k54L2M05n52J73k54J18r4L9L4l47K98k26Q3
$$ 696 659 768 660 675 569 392 423 376 423 169 201 606 54 227 -27 91 -3 36 70 -277 21 -205 -122
4706a22l83L88l74L37Ro29pL95j02m2R0j42K76k24K48k12J20K07j8k77j05L34
$$ -122 -505 -117 -491 -154 -145 -774 -781 -386 -488 -530 -440 -582 -306 -530 -282 -494 -374 -167 -185 -462 -567 -233
4728b33%o8p6J25J6J98L23m02K47j24j98K57K71j98l00O82m41K01l6J34K01l5
$$ -233 -233 -301 -377 -252 -236 -38 285 -117 130 6 -192 65 336 138 -162 520 79 280 244 378 579 544
4750E44j47l39L3M2J15p5J57k67j58M12p7j03l1L9k12K08J7j11k29k4K43m6Jk02
$$ 544 397 58 91 133 248 173 330 63 -95 317 240 137 106 145 -67 141 158 47 -182 -206 37 -9 -8 -210
4774b10J71J07r1j63J37j73J24O0p7M0r5J50n4j12k8K47j39J07q1k86L61J27l78
$$ -210 -39 68 -23 -186 -49 -222 -98 -38 -115 -75 -170 -20 -74 -186 -214 33 -106 1 -80 -366 -5 122 -256
4797b56K15O6l65Q3J15O4K7l30J04J71L48j85j66J95j20j26J6L58q4q5l20J84
$$ -256 -41 25 -340 -257 -142 -78 -51 -381 -277 -106 242 57 -109 86 -34 -160 -144 214 130 45 -275 -91
4819i1J56j04J87n6M2j64K37J56j96j51j60K84p7J95l5P3j48K16k80R3k88K49
$$ -91 65 -39 148 92 134 -30 207 363 167 16 -144 140 63 258 223 296 148 364 84 177 -111 138
4841A38q1K62k9j32J64m2j1Mj41J20n02K30m5J19p6L42j84k93n8J00J11M0k81
$$ 138 57 319 290 158 322 280 269 273 132 252 -250 -20 -65 54 -22 320 136 -157 -215 -115 -4 36 -245
4864b45k06J82j33J64k93m0K51L8j16K69k81J81l72J99M59l31N6k85Q4K15j67
$$ -245 -451 -269 -402 -238 -531 -571 -320 -282 -398 -129 -410 -229 -601 -402 57 -274 -218 -503 -419 -204 -371
4885c71K13j45L7K75j08J34k44J34J98q5j6L2M24l78j8kpL78k37J32K00r9p4K22
$$ -371 -158 -303 -266 9 -99 35 -209 -75 123 38 22 54 478 100 82 80 73 451 214 346 546 447 373 595
4909E95k64J94l20R5k7rQ9O7j03j95J1k02P6P9Jj86O7k8J4lJ95k63j58jJ11M5
$$ 595 331 525 205 300 273 264 353 420 317 122 133 -69 7 86 87 -99 -32 -60 -46 -49 146 -117 -275 -276 -165 -120
4935a20m8k17o9J69j98j97L10q1J40p4o8K71j37o5M0Q4J30K10j14k02o1L35Lk67
$$ -120 -168 -385 -454 -285 -483 -680 -370 -451 -311 -385 -453 -182 -319 -384 -344 -260 -130 80 -34 -236 -297 38 41 -226
4959b26K47l61K41Q1J40j61P3J02J13L6k35q0J82j07K81K92k28k53q7M55j60p1
$$ -226 21 -340 -99 -18 122 -39 34 136 249 285 50 -30 152 45 326 618 390 137 50 505 345 274
4981B74Q5Ro7K6k58K96k68K59j15p5m4J35J15j3l21M3l7o8k7o9j13K93k36J96
$$ 274 359 368 301 327 69 365 97 356 241 166 122 257 372 359 38 81 44 -24 -51 -120 -233 60 -176 20
5005B0j60j96K2N3k50J47M7K96K4m54K98J12m66J74J04R9k33M7J55m04j39O17
$$ 20 -140 -336 -314 -261 -511 -364 -317 -21 3 -451 -153 -41 -507 -333 -229 -130 -363 -316 -161 -565 -704 -87
5027h7j11k09J16j0l5M00j09k97K40M65q00J55M26m06L31jk18J49L79j01k15K51
$$ -87 -198 -407 -291 -301 -336 64 -45 -342 -102 363 -437 -282 144 -262 69 68 -150 -1 378 277 62 313
5049C13k18J43m6j00N30k19j76J00l8j3m06L77L6P8p8o3j17j26L11j51R5R0p0
$$ 313 95 238 192 92 622 403 227 327 289 276 -130 247 283 361 283 220 103 -23 288 137 232 322 252
5072B52P4k97K9j57K32n7m2l10J44M0k45J30k07L29n37J76K5j65M97l24Q2j34
$$ 252 326 29 58 -99 133 76 34 -276 -132 -92 -337 -207 -414 -85 -622 -446 -421 -586 -89 -413 -331 -465
5094d65r4R1K1J89k90L30l03j34L11k05L28k60K66j60J73M61m45n8J74R4j69M58
$$ -465 -559 -468 -447 -258 -548 -218 -521 -655 -344 -549 -221 -481 -215 -375 -202 259 -186 -244 -70 24 -145 313
5116C13j95P5l5j17N5Q3L64ql27M08m2j01j66J64L1J42q6O1m7k8k23J36%j99L67
$$ 313 118 193 158 41 96 179 543 535 208 616 574 473 307 471 502 644 558 619 572 544 321 457 457 258 625
5141F25k94M0k23j41q6J88k93K33m48K19N9k91J71j51L4L6k7j20j43l51N03k84
$$ 625 331 371 148 7 -79 109 -184 49 -399 -180 -121 -412 -241 -392 -358 -322 -349 -469 -612 -963 -460 -744
5163g44n8R4l4nk4j23L14J29P1j42K22k53K85J2J22O2P7q7J75K96n25L02l3J91
$$ -744 -802 -708 -742 -747 -771 -894 -580 -451 -380 -522 -300 -553 -268 -256 -134 -72 5 -82 93 389 -136 166 133 324
5187C24M2J61N1P3l27L6K50k13QJ00L18m1k4j46k73J08J28K57m04k28L6j3J64
$$ 324 366 527 578 651 324 360 610 397 405 505 823 782 758 612 339 447 575 832 428 200 236 223 387
5210C87l81K80k1j04j38n3K73m72J00l0K1n17L12K91m59K0j87K36k47J76J34k52
$$ 387 6 286 265 161 23 -30 243 -229 -129 -159 -138 -655 -343 -52 -511 -491 -678 -442 -689 -513 -379 -631
5232f31j40k3L92k26L00m2j26k1K92j8o4j89K03l7J20R7j41M36j02j67QK44O4
$$ -631 -771 -794 -402 -628 -328 -370 -496 -517 -225 -243 -307 -496 -293 -330 -210 -113 -254 182 80 -87 -79 165 229
5255B29K97j96j15L75n1q0k41M21n03L87M4j82m0r7K19J25r2l85L13k38O5J68
$$ 229 526 330 215 590 539 459 218 639 136 523 567 385 345 248 467 592 500 115 428 190 255 423
5277D23j96k7q0J28k17j61K36jm00K24L4j65R1q2k68L26JL3k22r4N5J13m8o1J79
$$ 423 227 200 120 248 31 -130 106 105 -295 -71 -37 -202 -111 -193 -461 -135 -134 -101 -323 -417 -362 -249 -297 -358 -179
5302a79j0j56r5J50j56k3K13o1l7q6M1J42m0L2M2l9J32J61r0L4k90K17K10m5K9
$$ -179 -189 -345 -440 -290 -446 -469 -256 -317 -354 -440 -399 -257 -297 -265 -223 -262 -130 31 -59 -25 -315 -98 112 67 96
5327I6P8No2j22K70J70n9Kj82K72j2l6l6K25j0ok73O8n4P2k03O9J02l05J39j93
$$ 96 174 179 117 -5 265 435 376 378 196 468 456 420 384 609 599 593 320 388 334 406 203 272 374 69 208 15
5353A5J92j04K45p5l58K01j1m57K11nK2j95J76L1q9o8Jk8q6Q3J39k31Q1m8m29
$$ 15 207 103 348 273 -85 116 105 -352 -141 -146 -124 -319 -143 -112 -201 -269 -268 -296 -382 -299 -160 -391 -310 -358 -787
5378g87N72J1o2m7L22r8k75K22k56M9J99k22L30q2J62M4j49J13Rk23L77j14L6
$$ -787 -215 -204 -266 -313 9 -89 -364 -142 -398 -349 -150 -372 -42 -124 38 82 -67 46 55 -168 209 95 131
5401A31K76R8m95L15O4j83K63j20j54J58J79p9J60l05j18J17j4q6J44K39k90n6
$$ 131 407 505 10 325 389 206 469 349 195 353 532 453 613 308 190 307 293 207 351 590 300 244
5423B44O1L8m52L6L41l61K10k33j09J16k81L03O4p8k66m2p5J76m15M94j67j01
$$ 244 305 343 -109 -73 268 -93 117 -116 -225 -109 -390 -87 -23 -101 -367 -409 -484 -308 -723 -229 -396 -497
5445d97J60k7j86J53K89j52k0j70K79K19q9k88J45j61K67J65p6oJ88j59ON1M95
$$ -497 -337 -364 -550 -397 -108 -260 -280 -450 -171 48 -41 -329 -184 -345 -78 87 11 5 193 34 40 91 586
5468E86l82m23K3M30L07k34Lk4J46k5k13K21j87K52k00j9J1m5m9j70qj39K56j
$$ 586 204 -219 -196 234 541 307 310 286 432 407 194 415 228 480 280 261 272 227 178 8 0 -139 117 116
5492A16j24J88k09o8k65K30O6p0k01M9J01k82J0K34r5J25l66L17l9r9N77m19n
$$ 116 -8 180 -29 -97 -362 -132 -66 -136 -337 -288 -187 -469 -459 -225 -320 -195 -561 -244 -283 -382 195 -224 -229
5515b29k77J58J74K2J8J37l5L35l6n80K87J7M4k78J73L32l99K50k6K09qj42j39
$$ -229 -506 -348 -174 -152 -134 3 -32 303 267 -313 -26 -9 35 -243 -70 262 -137 113 87 296 288 146 7
5538GJ01Q6J40j28M3J91l74K57J14l31L3L28m93K13k13q5K92k56J53q7M8k18O15
$$ 7 108 194 334 206 249 440 66 323 437 106 139 467 -26 187 -26 -111 181 -75 78 -9 39 -179 436
5561D36p19L05j40N86q01M18k78K77l28J24j68j2k4J37p3L01K5l83K61R1k67R8
$$ 436 -283 22 -118 468 -333 85 -193 84 -244 -120 -288 -300 -324 -187 -260 41 66 -317 -56 35 -232 -134
5583a34K43n46M62Nk95p1L82J91j24k09J10L3P1l48K15K4l4k20K93j67qJ31K7
$$ -134 109 -437 25 30 -265 -336 46 237 113 -96 14 47 118 -230 -15 9 -25 -245 48 -119 -127 4 31
5606C1J19K3j9r7j65jM8n2J51K70k65J77Po8j75j21p5L44l5m21P18l92q6L77m80
$$ 31 150 173 154 57 -108 -109 -61 -113 38 308 43 220 227 159 -16 -137 -212 132 97 -324 394 2 -84 293 -187
5631a87J93L10p7r6k20J52k5k24L52k42J08j53j71K73N8J30n87M54n3k00P4j6
$$ -187 6 316 239 143 -77 75 50 -174 178 -64 44 -109 -280 -7 51 181 -406 48 -5 -205 -131 -147
5653a47j35K54j09j41J08k55K22K26j21l64J61K41j90P3K11l33j65N12k44j38
$$ -147 -282 -28 -137 -278 -170 -425 -203 23 -98 -462 -301 -60 -250 -177 34 -299 -464 48 -196 -334
5673c34J20R6L58k32j36l13M65N6k73L83j10rQ6N4q4n0j15K54j84l7L39j67K6
$$ -334 -214 -118 240 8 -128 -441 24 80 -193 190 80 71 157 211 127 77 -38 216 32 -5 334 167 193
5696A93K80m08r1J48K25l92L68J1j48k10K24k23J59K50m21J12j40M3k9m1k85J36
$$ 193 473 65 -26 122 347 -45 323 334 186 -24 200 -23 136 386 -35 77 -63 -20 -49 -90 -375 -239
5718b39J9L74l91J15j31P0q9K94Nm44J31K92k72j10J28j3o3J54k14K80k0l3k6
$$ -239 -220 154 -237 -122 -253 -183 -272 22 27 -417 -286 6 -266 -376 -248 -261 -324 -170 -384 -104 -124 -157 -183
5741a83j18L75j01J31J79j44q9L5J78k76K27j0n4j32L6L20r2j38J28k35J96j79
$$ -183 -301 74 -27 104 283 139 50 85 263 -13 214 204 150 18 54 374 282 144 272 37 233 54
5763E4K87j04l13K89K1jk49n8J81K18k88J91j93j65k28K16n5J0M40l14k12J04
$$ 54 341 237 -76 213 234 233 -16 -74 107 325 37 228 35 -130 -358 -142 -197 -187 253 -61 -273 -169
5785a69P8R6J85n81L58j22p2o0k2J01N3k14J56L26k31R1O5l47K59J63k30L0L0
$$ -169 -91 5 190 -391 -33 -155 -227 -287 -309 -208 -155 -369 -213 113 -118 -27 38 -309 -50 113 -117 -87 -57
5808e7M2l51M06J34J43p0m41K32J0j5j10K34m4L28j44l3m0r6J08M1m08L36n5Q4
$$ -57 -15 -366 40 174 317 247 -194 38 48 33 -77 157 113 441 297 264 224 128 236 277 -131 205 150 234
5832B34n1m4Q4k55J87p9J18k9q4J82j27r2n61L75J95j51l9K57j54L39l76k3j80
$$ 234 183 139 223 -32 155 76 194 165 81 263 136 44 -517 -142 53 -98 -137 120 -34 305 -71 -94 -274
5855b74k2n5L43j03j76K50%L1j19p1L28m05L35J54j94J21r6j29n4J20j64Km1K75
$$ -274 -296 -351 -8 -111 -287 -37 -37 -6 -125 -196 132 -273 62 216 22 143 47 -82 -136 -16 -180 -178 -219 56
5879E6j84n7k2K75l24M38j31q3m7J5J97j18m4r3k48L82j3K47k19p1k7J15M8J04
$$ 56 -128 -185 -207 68 -256 182 51 -32 -79 -64 133 15 -29 -122 -370 12 -1 246 27 -44 -71 44 92 196
5903A96q8J10j95k54J78L25j22j5Q1j1J33m00Q7j26O32k02j87k01L13l83J92K2
$$ 196 108 218 23 -231 -53 272 150 135 216 205 338 -62 25 -101 531 329 142 -59 254 -129 63 85
5925H5j72k7K35n5M2m01r4J94K75l87J55J62k42k03K07J29k19J9j57RM50j89j00
$$ 85 -87 -114 121 66 108 -293 -387 -193 82 -305 -150 12 -230 -433 -226 -97 -316 -297 -454 -445 5 -184 -284
5948b84k4j82L60j84M17k29pJ05j20j34L76k33J59J09r9O5k14J94J34j65N0P6
$$ -284 -308 -490 -130 -314 103 -126 -133 -28 -148 -282 94 -139 20 129 30 95 -119 75 209 44 94 170
5970A70%O8J31l56J73J26J16m47K97M5K18k5l32Q0M53l89J52k04k6k48M37m09
$$ 170 170 238 369 13 186 312 428 -19 278 323 541 516 184 264 717 328 480 276 250 2 439 30
5992C0j53K70J78m86K53j57r4k56K54K6Jm2l11k25K39L15j43K30k80K0Q9L7r3
$$ 30 -123 147 325 -161 92 -65 -159 -415 -161 -135 -134 -176 -487 -712 -473 -158 -301 -71 -351 -331 -242 -205 -298
6015b98J04J03k17l4L37l69J12j8J42K12j38K24k13PpL8K18n3n0k96M30j20J36
$$ -298 -194 -91 -308 -342 -5 -374 -262 -280 -138 74 -64 160 -53 -46 -53 -15 203 150 100 -196 234 114 250
6038B50Nj04j00L55j90O1L9p8j68L6N6L6jJ22j08k6j54J33P6j28j73m1l5J68R
$$ 250 255 151 51 406 216 277 316 238 70 106 162 198 197 319 211 185 31 164 240 112 -61 -102 -137 31 40
6063D0o7k30J71r8O6o8P8l7M6j7j96K53j49J17L7J90l79pj18J71J11J39j50k26
$$ 40 -27 -257 -86 -184 -118 -186 -108 -145 -99 -116 -312 -59 -208 -91 -54 136 -243 -250 -368 -197 -86 53 -97 -323
6087c23N5j0M5J21J01K09l43K22L6n9J06J83j49m26L70k3L6J26j01o2J3j13J91
$$ -323 -268 -278 -233 -112 -11 198 -145 77 113 54 160 343 194 -232 138 115 151 277 176 114 127 14 205
6110B05k42K35K03m88K29r8R4Kj26n5j54N29k02k8k0k94N9J22j38mp3M34k06R6
$$ 205 -37 198 401 -87 142 44 138 140 14 -41 -195 334 132 104 84 -210 -151 -29 -167 -171 -244 190 -16 80
6134H0l38Q4kK24j35j5j33o2MJ35J66j05j2L08m00K83k91j55M06k49K20k97L22
$$ 80 -258 -174 -176 48 -87 -102 -235 -297 -293 -158 8 -97 -109 199 -201 82 -209 -364 42 -207 13 -284 38
6157C8l0k9J9K11j71l2k3l41L56J42k70o4J08J72k55J14r5K77p5m8j57K77o2J03
$$ 38 8 -21 -2 209 38 6 -17 -358 -2 140 -130 -194 -86 86 -169 -55 -150 127 52 4 -153 124 62 165
6181A65n3j66J33L0J15k03J73k5k41K45j60L8j38J9K43J55j61jk8j70M4j12O3
$$ 165 112 -54 79 109 224 21 194 169 -72 173 13 51 -87 -68 175 330 169 168 140 -30 14 -98 -35
6204c5R6J16k21J22j20J29k64J57j62J62j95N5J23j91l0M2Q0j84K17j35o8J31
$$ -35 61 177 -44 78 -42 87 -177 -20 -182 -20 -215 -160 -37 -228 -258 -216 -136 -320 -103 -238 -306 -175
6226a75L01o13K52j48K7L41m31J26n5K93L33k79K01p4P9R4j26j25J54p7n02K15
$$ -175 126 -487 -235 -383 -356 -15 -446 -320 -375 -82 251 -28 173 99 178 272 146 21 175 98 -404 -189
6248a89K07k06K27L24j62l65M60Q0Mk74K88l21J12p0j59K91j82K67j3k38r2m1
$$ -189 18 -188 39 363 201 -164 296 376 380 106 394 73 185 115 -44 247 65 332 319 81 -11 -52
6270e2o9n5j5Q0l1L30j55K1Q4k57l5L4m8R2j99J68j12K6J56n9R2m80K71P6J36
$$ -52 -121 -176 -191 -111 -142 188 33 54 138 -119 -154 -120 -168 -76 -275 -107 -219 -193 -37 -96 -4 -484 -213 -137 -1
6295aj84L16j59J00k53N9J2P3m2K02n8J42l55M71l10k0L7K13j94j01L58l7Q3k18
$$ -1 -185 131 -28 72 -181 -122 -110 -37 -79 123 65 207 -148 323 13 -7 30 243 49 -52 306 269 352 134
6319A34J93j7l54L30m6R6k12NJ57j60%J18k70M83l24j26J74m1p6R7j98L29j20
$$ 134 327 310 -44 286 240 336 124 129 286 126 126 244 -26 457 133 7 181 140 64 161 -37 292 172
6342A72j24r6p1J42j41j37j5Q7J69K15m11J10L0k13k0J68j53j03L64j37J99j45
$$ 172 48 -48 -119 23 -118 -255 -270 -183 -14 201 -210 -100 -70 -283 -303 -135 -288 -391 -27 -164 35 -110
6364a10j75J09J85k88L17J6j81J27R5j83Q5o2j73J94l1R7L3R8k31J09P7l6Q0J00
$$ -110 -285 -176 9 -279 38 54 -127 0 95 -88 -3 -65 -238 -44 -75 22 55 153 -78 31 108 72 152 252
6388B52q9pJ04pj56L0lJ70k06j96M09j69Qj68oK7J36l4j80J56O0k4k95L36l08
$$ 252 163 156 260 253 97 127 124 294 88 -108 301 132 140 -28 -34 -7 129 95 -85 71 131 107 -188 148 -160
6413a60M12m53N42l46j48L18l96K87O3j05n8k64K38J96j34K15k34J47k40j46K51
$$ -160 252 -201 341 -5 -153 165 -231 56 119 14 -44 -308 -70 126 -8 207 -27 120 -120 -266 -15
6434a5Nk21K47k95K11J45j69r4n0m7L06m3l3l5J70Oj78n0K81j92Q7Jq5L21k36
$$ -15 -10 -231 16 -279 -68 77 -92 -186 -236 -283 23 -20 -53 -88 82 88 -90 -140 141 -51 36 37 -48 273 37
6459C7l45Q3N75j28j67P4rj99L21J90j91j67J25k50L9Q3K94L1M5k85j10J37J86
$$ 37 -308 -225 350 222 55 129 120 -79 242 432 241 74 199 -51 -12 71 365 396 441 156 46 183 369
6482C69o2J76l12j88J06J8pJ71m76J60j27P3J39p6jJ72j46J4o6j81k9J12o9K09
$$ 369 307 483 171 -17 89 107 100 271 -205 -45 -172 -99 40 -36 -37 135 -11 3 -63 -244 -273 -161 -230 -21
6506b1j2r9N1J68k32Kj2j92R1J14J44j10L45k40P6l00K55k70K63l1n2j35K98L5
$$ -21 -33 -132 -81 87 -145 -143 -155 -347 -256 -142 2 -108 237 -3 73 -227 28 -242 21 -10 -62 -197 101 136
6530A36n2N7j13K32Q4m03J22K33j89nM3m7Q5Q1m1P9J92k89k86L18m0n1Q9m68K89
$$ 136 84 141 28 260 344 -59 63 296 107 102 145 98 183 264 223 302 494 205 -81 237 197 146 235 -233 56
6555E6j15L85k91q1q0K80m37L64q6o1NJ37l12j3K5K86l82R9R6O3q1N5K1l48M37
$$ 56 -59 326 35 -46 -126 154 -283 81 -5 -66 -61 76 -236 -249 -224 62 -320 -221 -125 -62 -143 -88 -67 -415 22
6580B2m25K10k30K23P3j59O9K60j95O3kPJ1j08O22n87J36Oj13J65k4K10j2j54
$$ 22 -403 -193 -423 -200 -127 -286 -217 43 -152 -89 -91 -84 -73 -181 441 -146 -10 -4 -117 48 24 234 222 68
6604F8K18J9l20N45k88k9p0Q6J93k05j82J01K48l47J45R6m09L72k85J41j06J18
$$ 68 286 305 -15 530 242 213 143 229 422 217 35 136 384 37 182 278 -131 241 -44 97 -9 109
6626A09j04l61K63R7j06L03k41k57j05L73j15K7l32J20J71m9L6k4N5J09q9k10
$$ 109 5 -356 -93 4 -102 201 -40 -297 -402 -29 -144 -117 -449 -329 -158 -207 -171 -195 -140 -31 -120 -330
6648c30j85J96J95l4J2l71L40N9q0K40k37MO1n5J21j71L39K2j26j10J49J9jL29
$$ -330 -515 -319 -124 -158 -146 -517 -177 -118 -198 42 -195 -191 -130 -185 -64 -235 104 126 0 -110 39 58 57 386
6672C86K1p8p8l29K53J89k09K00p3M9j73k0j97j3K49j80J14Q0j71J74k7J08k85
$$ 386 407 329 251 -78 175 364 155 355 282 331 158 138 -59 -72 177 -3 111 191 20 194 167 275 -10
6695a0J02j88J94jr2k01J62j20K72k1O7N0k01k70K45j62r0J50l0Q4K24k10k48
$$ -10 92 -96 98 97 5 -196 -34 -154 118 97 164 214 13 -257 -12 -174 -264 -114 -144 -60 164 -46 -294
6718b94J56K49m67O8K79p7k1J19l16K82R8K18m25j59L63k4j8n6J10j00ko8J05
$$ -294 -138 111 -356 -288 -9 -86 -107 12 -304 -22 76 294 -131 -290 73 49 31 -25 85 -15 -17 -85 20
6741B0P5j57j90K73l9O8j10J41R4m8k05K03j40J09j05J45K1j03K01l77N4K67M2
$$ 20 95 -62 -252 21 -18 50 -60 81 175 127 -78 125 -15 94 -11 134 155 52 253 -124 -70 197 239
6764B39j38K49p2J49n35P6k82J83M16Nj77k40Q6k30O2N9R0j27J55j06m15M32q1
$$ 239 101 350 278 427 -108 -32 -314 -131 285 290 113 -127 -41 -271 -209 -150 -60 -187 -32 -138 -553 -121 -202
6787b02J06P4m17j19K52qK54k91J09n5j11J83L42k86o7O5o9J26l35J94J68P5q2
$$ -202 -96 -22 -439 -558 -306 -314 -60 -351 -242 -297 -408 -225 117 -169 -236 -171 -240 -114 -449 -255 -87 -12 -94
6810i4K21n3o0J00j47K91n2J7j23l7K62q9K16p3j52Or6K26J90l2l40J05j17K8
$$ -94 127 74 14 114 -33 258 206 223 100 63 325 236 452 379 227 233 137 363 553 521 181 286 169 197
6834A97k92N03l00j28K07j56Qj63J74j8l44J01p4J09k24L06k9k04L29K9l01M6
$$ 197 -95 408 108 -20 187 31 39 -124 50 32 -312 -211 -285 -176 -400 -94 -123 -327 2 31 -270 -224
6856b24m1J55k14K18j06P1l41J35J12P0j22j56N07l29N9J67k61P2P9L43m46M49
$$ -224 -265 -110 -324 -106 -212 -141 -482 -347 -235 -165 -287 -443 64 -265 -206 -39 -300 -228 -149 194 -252 197
6878A97j34k46N8R1n6K56j00R6j40K8J33k71L16Q9k14Q3m64L38J29q2Q1r7l59
$$ 197 63 -183 -125 -34 -90 166 66 162 22 50 183 -88 228 317 103 186 -278 60 189 107 188 91 -268
6901b68M03p6n3Q3o9J23K0k14J74J23k71RK18k69K0mJ1r0k9o2K92j24j05N0L3
$$ -268 135 59 6 89 20 143 163 -51 123 246 -25 -16 202 -67 -47 -51 -40 -130 -159 -221 71 -53 -158 -108 -75
6926g5l19K08J71l53l9K85K19Nj60j12%K92k36P0j01QK05j83K98l16K01j54R1
$$ -75 -394 -186 -15 -368 -407 -122 97 102 -58 -170 -170 122 -114 -44 -145 -137 68 -115 183 -133 68 -86 5
6949Ej87L00j36J32J1J16P5l88J57p7J77J24l82J96j97N27m06j15K78l64M16L2
$$ 5 -182 118 -18 114 125 241 316 -72 85 8 185 309 -73 123 -74 453 47 -68 210 -154 262 294
6971B94m19J30R5L31l79k3o2N3j77M1K64rj34l21K32J08J59j05q8l41M34m1q3
$$ 294 -125 5 100 431 52 29 -33 20 -157 -116 148 139 5 -316 -84 24 183 78 -10 -351 83 42 -41
6994d1J56PJ10j55K1j55k81J68M26n34K52J18j13K98k76j68O5R4O8l21K04q9K69
$$ -41 115 122 232 77 98 -57 -338 -170 256 -278 -26 92 -21 277 1 -167 -102 -8 60 -261 -57 -146 123
7017A23n6J62Oj98n8j50K45J4o6P7K99l48L7l77L5K77J03k65N00j66j21r3r1N25
$$ 123 67 229 235 37 -21 -171 74 88 22 99 398 50 87 -290 -255 22 125 -140 360 194 73 -20 -111 414
7041D14k28n08K19K96k06k0K45k05K42l61O8J35j62J22q5K37k42N0j7L6j98j06
$$ 414 186 -322 -103 193 -13 -33 212 7 249 -112 -44 91 -71 51 -34 203 -39 11 -6 30 -168 -274
7063b74K72p8J9K43j64k42j0J17J42lj34J81q3o9j6k15K35L31l29R5k2k49J26
$$ -274 -2 -80 -61 182 18 -224 -234 -117 25 22 -112 69 -14 -83 -99 -314 -79 252 -77 18 -4 -253 -127
7086a27J59j74L59k83j67J77L21m35k5K60j37J87J18K3k85k2J14p0K28k01M2J86
$$ -127 32 -142 217 -66 -233 -56 265 -170 -195 65 -72 115 233 256 -29 -51 63 -7 221 20 62 248
7108B48j18l0K3k80M7K23J75j57R1j42m7K4K5k36J04O6K6l4J00k54M50k46J44
$$ 248 130 100 123 -157 -110 113 288 131 222 80 33 57 82 -154 -50 16 42 8 108 -146 304 58 202
7131B02n43M66p6j70Q4m2J56k25n8J97k47%M5K77m7k81J05j59K34k38J10J37k80
$$ 202 -341 125 49 -121 -37 -79 77 -148 -206 -9 -256 -256 -211 66 19 -262 -157 -316 -82 -320 -210 -73 -353
7154c53K04J41K7l45mJ80O4K9j46M37j94n8j67R3L44m07J50J85r9N0K2k25L07
$$ -353 -149 -8 19 -326 -330 -150 -86 -57 -203 234 40 -18 -185 -92 252 -155 -5 180 81 131 153 -72 235
7177B35l9N3O9k45r9K05l19J89J4R9l54M95k07j23k36K60q8J88p9o2k58L64l16
$$ 235 196 249 318 73 -26 179 -140 49 63 162 -192 303 96 -27 -263 -3 -91 97 18 -44 -302 62 -254
7200b54L45l25o0O37l49k18M06l49N8L69m00J46j38k2M6n3J00J34k29L51j99l4
$$ -254 91 -234 -294 343 -6 -224 182 -167 -109 260 -140 6 -132 -154 -108 -161 -61 73 -156 195 -4 -38
7222c8o7K8J92j1J2n0J52j25l72J24J99j21K71k31L96l31P2o0q7J50l85K08K49
$$ -38 -105 -77 115 104 116 66 218 93 -279 -155 44 -77 194 -37 359 28 100 40 -47 103 -282 -74 175
7245A75l10k01K88K5PJ85M7k13j08M53k16j23j05J32L8m5J32j60p2P4k90L96j46
$$ 175 -135 -336 -48 -23 -16 169 216 3 -105 348 132 9 -96 36 74 29 161 1 -71 3 -287 109 -37
7268c7k15M26k0Q2j75N8O5k21q3P5j29L96m04L13P5k24k88M55j9j28J91j76p0
$$ -37 -252 174 154 236 61 119 184 -37 -120 -45 -174 222 -182 131 206 -18 -306 149 130 2 193 17 -53
7291e3K36k34L00l68K7K55j80l4Nj03J77L1o0P2O4Rk51L50k11J16j74j10N06l04
$$ -53 183 -51 249 -119 -92 163 -17 -51 -46 -149 28 59 -1 71 135 144 -107 243 32 148 -26 -136 370 66
7315F6Q2Np9r5L61k96k60N12k25O7l6o1J30k34J46K7k57J1K32k0n5l4k01M90j87
$$ 66 148 153 74 -21 340 44 -216 296 71 138 102 41 171 -63 83 110 -147 -136 96 76 21 -13 -214 276 89
7340H9K8O0N6k51J38k10L24k66J95j06L7O7l00J01J40j54Q1k27J96j47J39k16
$$ 89 117 177 233 -18 120 -90 234 -32 163 57 94 161 -139 -38 102 -52 29 -198 -2 -149 -10 -226
7362b26L2j0r3J21Q8K00j94J09n02J28J57M2N51p65O10o9l56J11m5J47j3N4k14
$$ -226 -194 -204 -297 -176 -88 112 -82 27 -475 -347 -190 -148 403 -362 248 179 -177 -66 -111 36 23 77 -137
7385a37K82k43P3K15L4m6k21M0K40k76R0l18L35J70m49L27k22Q6j3L01j49l14
$$ -137 145 -98 -25 190 224 178 -43 -3 237 -39 51 -267 68 238 -211 116 -106 -20 -33 268 119 -195
7407a95M10j47l7K83m60J69O7k55J5J72j54Q5j71K19J16k02p4k43N48m85M86l34
$$ -195 215 68 31 314 -146 23 90 -165 -150 22 -132 -47 -218 1 117 -85 -159 -402 146 -339 147 -187
7429a87j65K55J24R7j90J16m8l0p1l63K07L50J4p0K74J46k44j84k29M25j6k7j50
$$ -187 -352 -97 27 124 -66 50 2 -28 -99 -462 -255 95 109 39 313 459 215 31 -198 227 211 184 34
7452C4l5j59M09k70K27R4j96R0k57K45l24P1J50l51J07O7o6L01kk25m4J52q0L2
$$ 34 -1 -160 249 -21 206 300 104 194 -63 182 -142 -71 79 -272 -165 -98 -164 137 135 -90 -134 18 -62 -30
7476c0O1j09O7Pk51K32J36l13l8L1L33l3m16J68R4k29K75L52m24n7J63k38J16
$$ -30 31 -78 -11 -4 -255 -23 113 -200 -238 -207 126 93 -323 -155 -61 -290 -15 337 -87 -144 19 -219 -103
7499a03j6J28KJ89j30Kj62r8M0K05O9n3Q9j86J33l42K68m3L32k09P0l39K18k6
$$ -103 -119 9 11 200 70 72 -90 -188 -148 57 126 73 162 -24 109 -233 35 -8 324 115 185 -154 64 38
7523C8O1k82K97r4l3J94k39L06m05o9k90K62k34M01K58k24J3J98l91K22J13j19
$$ 38 99 -183 114 20 -13 181 -58 248 -157 -226 -516 -254 -488 -87 171 -53 -40 158 -233 -11 102 -17
7545a7q0k00O2J67j37M6J56j52J03L8J91j58k5l43K69j0K31J01j54J69m58M5J63
$$ -17 -97 -297 -235 -68 -205 -159 -3 -155 -52 -14 177 19 -6 -349 -80 -90 141 242 88 257 -201 -156 7
7568GQ0j35k23K57j24N7O0m6P8J33q7m5R2p2J87j91j95J99k3J82L2k34j03K02
$$ 7 87 -48 -271 -14 -138 -81 -21 -67 11 144 57 12 104 32 219 28 -167 32 9 191 223 -11 -114 88
7592H8k3J70J35n51j13K56J29j81K03p4K19l33j22L12j39k3Q0J7j29J10J18l06
$$ 88 65 235 370 -181 -294 -38 91 -90 113 39 258 -75 -197 115 -24 -47 33 50 -79 31 149 -157
7614a57N51n44K49L15l03j40j16j0K44Qj06o6J01l80N15j8n52J54J91M0L9J14
$$ -157 394 -150 99 414 111 -29 -145 -155 89 97 -9 -75 26 -354 161 143 -409 -255 -64 -24 15 129
7636A29k49j01M05m44K15K93l41J01j66L30k6p3m6l39L33q6j46K90j50N5m0qK97
$$ 129 -120 -221 184 -260 -45 248 -93 8 -158 172 146 73 27 -312 21 -65 -211 79 -71 -16 -56 -64 233
7659B33l6k57K67m40K36l2K9k56N65k81j0L16l32L18n1j98j4j79R3k14K32J22
$$ 233 197 -60 207 -233 3 -29 0 -256 309 28 18 334 2 320 269 71 57 -122 -29 -243 -11 111
7681A11J49l87M12k13k6k29M04K1j74j4k37l24K42K81k67K87j42R7l51l6M03j37
$$ 111 260 -127 285 72 46 -183 221 242 68 54 -183 -507 -265 16 -251 36 -106 -9 -360 -396 7 -130
7703a30P2M3n5k36J14K19m01j19K57R5J5Q2L5K33l26J35p3P7K1J71p8j79J27K22
$$ -130 -58 -15 -70 -306 -192 27 -374 -493 -236 -141 -126 -44 -9 224 -102 33 -40 37 58 229 151 -28 99 321
7727C21k40j03J69m40P00j39k50J52j85k95L53L38k59o3QK35j81K75o42O95n45
$$ 321 81 -22 147 -293 407 268 18 170 -15 -310 43 381 122 59 67 302 121 396 -246 449 -96
7748i6K06K26n51K46r5J1j0L9k93L23j60l3r4K04K1Jk77L21l77O04l59J7j40K60
$$ -96 110 336 -215 31 -64 -53 -63 -24 -317 6 -154 -187 -281 -77 -56 -55 -332 -11 -388 216 -143 -126 -266 -6
7772fq6L79n60J67M3L1L5J64j47k70J84o7M76M8j33j59O3j99j06K04Q4P2R9j89
$$ -6 -92 287 -273 -106 -63 -32 3 167 20 -250 -66 -133 343 391 258 99 162 -37 -143 61 145 217 316 127
7796A27l03J75k5N8K41o4j59j20L31J08l26k12K59j45L17j20k24K63j98M15m63
$$ 127 -176 -1 -26 32 273 209 50 -70 261 369 43 -169 90 -55 262 142 -82 181 -17 398 -65
7817f5R1J01k9J78l21j36K02M5J78l61J69j5q8J41l08L91o3k82j16L18J58k74
$$ -65 26 127 98 276 -45 -181 21 66 244 -117 52 37 -51 90 -218 173 110 -172 -288 30 188 -86
7839h6j76o2R9K12K2K8j64K18j92O2k37L27%m6j64K32l47M22j47K19k10j36P6
$$ -86 -262 -324 -225 -13 9 37 -127 91 -101 -39 -276 51 51 5 -159 73 -274 148 1 220 10 -126 -50
7862e0O1j07J03r7k64L03o0l7J81J14o8m3R9L91n07L45n25J57L0J18j76q1J27
$$ -50 11 -96 7 -90 -354 -51 -111 -148 33 147 79 36 135 526 19 364 -161 -4 26 144 -32 -113 14
7885A4J60j95N2J23J15j2j19K94k80k98J17K25j22k3j04K66j99j20j6O8k1J02
$$ 14 174 -21 31 154 269 257 138 432 152 -146 -29 196 74 51 -53 213 14 -106 -122 -54 -75 27
7907B7q9k26N8K2O7J8O1k8j89l0J68K90j45l52K3J52l2L51k75M3k00K06J45q4
$$ 27 -62 -288 -230 -208 -141 -123 -62 -90 -279 -309 -141 149 4 -348 -325 -173 -205 146 -129 -86 -286 -80 65 -19
7931a9N3q0j1J84j60J55q2MK27k46q2J33k38J31J73j93K17j49P3K0J12k60J55
$$ -19 34 -46 -57 127 -33 122 40 44 271 25 -57 76 -162 -31 142 -51 166 17 90 110 222 -38 117
7954A17K31l50J61j17K71j58K8J27k57q3n1n9L39j20l30K20K1K52p5k2r3l52N11
$$ 117 348 -2 159 42 313 155 183 310 53 -30 -81 -140 199 79 -251 -31 -10 242 167 145 52 -300 211
7977B11j81j36j16K52k65J56j51O3q6n3Q0J38K7J50k37L12j28j24j94K32l68J42
$$ 211 30 -106 -222 30 -235 -79 -230 -167 -253 -306 -226 -88 -61 89 -148 164 36 -88 -282 -50 -418 -276
7999b76J31o5J29J7J41j74K57j70J48Nl39J24k54L5K43m1K8M99n17L71p6r6J00
$$ -276 -145 -210 -81 -64 77 -97 160 -10 138 143 -196 -72 -326 -291 -48 -89 -61 438 -79 292 216 120 220
8022B20j22N8J83m23O9K71j64Rq1L34k92J03l58J01R2%L67k84l64K18q9J27r0
$$ 220 98 156 339 -84 -15 256 92 101 20 354 62 165 -193 -92 0 0 367 83 -281 -63 -152 -25 -115
8045a15J83l38K60j17J70j14K6K0N9j94k21L51J99j65n8oK13k82j80O4n2K67O6
$$ -115 68 -270 -10 -127 43 -71 -45 -25 34 -160 -381 -30 169 4 -54 -60 153 -129 -309 -245 -297 -30 36
8068C6p7K01j5j99j0J93j57QK06j42k1o3J62l15K67j00l09K29K32kK2K79k36k23
$$ 36 -41 160 145 -54 -64 129 -28 -20 186 44 23 -40 122 -193 74 -26 -335 -106 126 124 146 425 189 -34
8092c4J51j84K41Q3k74M5K24q6l7j49M03m49J44r1r9J30k20J74R3k61K46J01k43
$$ -34 117 -67 174 257 -17 28 252 166 129 -20 383 -66 78 -13 -112 18 -202 -28 65 -196 50 151 -92
8115i2K73k19R0P3m06K58k25M10k81q1L3j42K39j66R7J52k51N2K15q0j97L23K1
$$ -92 181 -38 52 125 -281 -23 -248 162 -119 -200 -167 -309 -70 -236 -139 13 -238 -186 29 -51 -248 75 96
8138I6q2J48k09n4J74L0k14r8Q4J70J68q0K1j53N0j13R1j43J68o1j45J34J80p1
$$ 96 14 162 -47 -101 73 103 -111 -209 -125 45 213 133 154 1 51 -62 29 -114 54 -7 -152 -18 162 91
8162I1m30M36j33k7K00k37K03k06Q9L5j30M00j10k9J77QQk80n0O9J86k59j65J34
$$ 91 -339 97 -36 -63 137 -100 103 -103 -14 21 -109 291 181 152 329 337 345 65 15 84 270 11 -154 -20
8186b0M6j08R9o0j15
$$ -20 26 -82 17 -43 -158
8191a58
$$ Imaginary data points
##PAGE= N=2
##DATA TABLE= (X++(I..I)), XYDATA
0@%%%Qj6QrK5l2L7n1O2p3R0j13J42j72J99k37K85l28L81m45N13n89O77p74Q77
$$ 0 0 0 0 8 -8 0 -9 16 -16 21 -30 32 -41 49 -64 78 -94 105 -132 153 -175 206 -239 274 -315 362 -412 465
28D65r93J123j267J426j597J789j998K223k474K750l051L382l747M151m593N086
$$ 465 -528 595 -672 754 -843 946 -1052 1171 -1303 1447 -1604 1778 -1969 2182 -2411 2675
44B675n637O250o944P733q635R687j0926J2408j4225J6509j9481K3535k9421L8782
$$ 2675 -2962 3288 -3656 4077 -4558 5129 -5797 6611 -7614 8895 -10586 12949 -16472 22310
58B2310n6050R8414l89256o89201N30035M94805o2995l57738P9615K29056n8448
$$ 22310 -33740 64674 -324582 -1013783 -483748 11057 -51938 -409676 -330061 -101005 -159453
69a59453k54062K6422Q2177k34391l09906K64947O42107K04226m71846l89696
$$ -159453 -413515 -387093 -304916 -539307 -849213 -584266 57841 262067 -209779 -599475
79e99475J85333L40409p5756k75448J3849K72842J43317N091R9703J14865j68577
$$ -599475 -414142 -73733 -149489 -424937 -411088 -138246 5071 10162 109865 224730 56153
90E6153l20370p458L72423K60649j28052j83759J34081K66244K179k45678j46479
$$ 56153 -264217 -271675 100748 361397 233345 49586 183667 449911 452090 206412 59933
101E9933O7844J01186M7547J02146J43409j0062j93695j38967N6095P2447r4480
$$ 59933 127777 228963 276510 378656 522065 512003 318308 179341 235436 307883 213403
112B13403j29427O1843K01176Q9424j02404j44206q1627o9969q6150k5531O5045
$$ 213403 83976 145819 346995 436419 334015 189809 108182 38213 -47937 -73468 -8423
123h423O2549o374j8418J7332j9103j27687j60430o1122M7010N6529K0781K3167
$$ -8423 54126 47752 29334 46666 27563 -100124 -260554 -321676 -274666 -218137 -197356 -174189
135a74189L8939L971o1552q8496o2650k4544R913N1245Q3634O8431J0773l4177
$$ -174189 -135250 -131279 -192831 -281327 -343977 -368521 -358608 -307363 -223729 -155298 -144525 -178702
147a78702l2200q805q642j8270O860O7098J01693O8976O650k1227j6753j4695
$$ -178702 -210902 -219707 -228349 -246619 -239759 -172661 -70968 -1992 4658 -16569 -33322 -48017
159d8017j4260J9338O6657P0878L4686J7814L4185K1847l5682o4050j5790M6488
$$ -48017 -62277 -42939 23718 94596 129282 147096 181281 203128 167446 103396 87606 134094
171A34094N1259K8793L9392N1387O01p2761p4756j2358J9750m139q622L5427N5169
$$ 134094 185353 214146 253538 304925 305526 232765 158009 145651 165401 161262 152640 188067 243236
184B43236O906m7510n2819m4658o3785o1189O104P6316N5887k9328o5041k7202
$$ 243236 250142 202632 149813 105155 41370 -19819 -13715 62601 118488 89160 24119 -3083
196c083L97l7633p7758n3467P718M2727M0497K7980k29n1661q1569m4593K1019
$$ -3083 -2686 -40319 -118077 -171544 -163826 -121099 -80602 -52622 -52851 -104512 -186081 -230674 -209655
209b09655L2651j1766k7147K7375P8951M9411l4220q0254n2209P232M8534N7932
$$ -209655 -177004 -188770 -215917 -188542 -109591 -60180 -94400 -174654 -226863 -219631 -171097 -113165
221a13165L9619N836j1903R585M0810K4481l6963o5352n464Q9384J12112M1775
$$ -113165 -73546 -67710 -79613 -70028 -29218 -4737 -41700 -107052 -112516 -23132 88980 130755
233A30755m0978n4739r416L0354L0209N537j2703m131L2714O7881N2407k3917
$$ 130755 89777 35038 25622 55976 86185 91722 79019 74888 107602 175483 227890 203973
245B03973r4191p5218J7607P8910M9043j7823l5362J424K9752R834l8114p1584
$$ 203973 109782 34564 52171 131081 180124 162301 126939 128363 158115 167949 129835 58251
257E8251o2585o280O0823P9116J9677o0528p6276k1553K0245m965n4461n1884
$$ 58251 -4334 -10614 50209 129325 149002 88474 12198 -9355 10890 5925 -48536 -100420
269a00420P838O1720N9619P692n3816q3614n8831L952M5965K6379k0707k3537
$$ -100420 -92582 -30862 28757 36449 -17367 -100981 -159812 -155860 -109895 -83516 -104223 -127760
281a27760K5624N6198J7138n3905p8584l6276K6553O1291N5098K0561j5756k2210
$$ -127760 -102136 -45938 -28800 -82705 -161289 -197565 -171012 -109721 -54623 -34062 -49818 -72028
293g2028K525K1766k191l8466k9783L0901Q0837O7302J1167l1951l5937j6687
$$ -72028 -69503 -47737 -49928 -88394 -118177 -87276 -6439 60863 72030 40079 4142 -12545
305a2545M072J6513J6402R165J5668L9347M8905J3250m4736o6451k9903K2569
$$ -12545 -8473 8040 24442 33607 49275 88622 137527 150777 106041 39590 9687 32256
317C2256L9911K6956J2907J1354N318q599j9729k7646l6445l1370M060M6588M9199
$$ 32256 72167 99123 112030 123384 128702 120103 100374 72728 36283 4913 8973 55561 104760
330A04760P604l1309l3096k0404k1939k9100j7407Q898K1045J7418J3587O787
$$ 104760 112364 81055 47959 27555 5616 -23484 -40891 -31993 -10948 6470 20057 26844
342B6844k0511n1785m9571j0729K0763J8963Q118J1940J7861N31k3110k9475j8245
$$ 26844 6333 -45452 -95023 -105752 -84989 -66026 -57908 -45968 -28107 -27576 -50686 -80161 -98406
355i8406j2522p351J6248M6680M5265N552k9026k6546o105j629o449M697K4251
$$ -98406 -110928 -118279 -102031 -55351 -10086 -4534 -33560 -60106 -66211 -67840 -74289 -69592 -45341
368d5341L1418K2764J7161J1209j3630m0977l2323J3540M5237L2814L872J150
$$ -45341 -13923 8841 26002 37211 23581 -17396 -49719 -36179 9058 41872 45744 46894
380D6894J5952J3698j0789k8520k4623p933J1863L3258M2914J9325k3662l9691
$$ 46894 62846 76544 65755 37235 12612 4679 16542 49800 92714 112039 88377 48686
392D8686j4757J3360K017k5187k1460J6966M4700K9724j0336l8437m3062k6834
$$ 48686 33929 47289 49306 24119 2659 19625 64325 94049 83713 45276 2214 -24620
404b4620J918K6060J9342q859k0173M927L0257R734m2117o2576k6423K7096M6455
$$ -24620 -22702 3358 22700 13841 -6332 -1405 28852 38586 -3531 -66107 -92530 -65434 -18979
417a8979K4540n474k1713j7956p42R174l872l0461l1522Q941N5714N3345Q83m5665
$$ -18979 5561 87 -21626 -39582 -40324 -31150 -35022 -65483 -97005 -88064 -32350 20995 21878 -23787
431b3787m1682k479K3481J5457o101j2609N553L1949L8957J1987l1591n1435k3092
$$ -23787 -65469 -67948 -44467 -29010 -35111 -47720 -42167 -10218 28739 40726 9135 -42300 -65392
444f5392K7797M9554K4525j3441j9721O392K7997J5420k0886m0328k2352K1247
$$ -65392 -37595 11959 36484 23043 3322 9714 37711 53131 32245 -8083 -30435 -9188
456i188M7949L6811k060l0841k6950L13J7270O094j7013k2377M265L6073L6374
$$ -9188 38761 75572 73512 42671 15721 16034 33304 39398 22385 8 4273 40346 76720
469G6720r90l9536m1602j0352J8309J8896J242r429m956Q309J3300J765k2761
$$ 76720 75730 36194 -5408 -15760 2549 21445 22687 13258 8302 16611 29911 31676 8915
482H915l6575k1281J4124L5109J9847j1722k2291p453O529K82j4531j5446k591
$$ 8915 -27660 -48941 -34817 292 20139 8417 -13874 -21327 -14798 -14516 -29047 -44493 -47084
495d7084J0321J7367J6466L883j6106k5963j0595J1491J3481k020n199J0560J9845
$$ -47084 -36763 -19396 -2930 953 -15153 -41116 -51711 -40220 -26739 -28759 -33958 -23398 -3553
508c553O898j2584j5336o079q90K955J3331J9337J0865n528p280L364K911j0258
$$ -3553 3345 -9239 -24575 -30654 -31544 -28589 -15258 4079 14944 9416 2136 5500 8411 -1847
522a847j2660N526K1344J6748K597p70L36n557j3930p603P871J1241J743O38J0736
$$ -1847 -14507 -8981 12363 29111 31708 30938 31274 25717 11787 4184 12055 23296 25039 25677 36413
537C6413J1240n566k0889j3731J911M874Q22L524J0666M905r528j3204k743r06
$$ 36413 47653 42087 21198 7467 9378 14252 15074 18598 29264 34169 24641 11437 8694 7788
551G788j1359j2866M948J9975J1530r467j5579p036l198n858m553L336M402q57
$$ 7788 -3571 -16437 -11489 8486 20016 10549 -5030 -12066 -15264 -21122 -25675 -22339 -17937 -18794
565a8794O24R610P477j2424k6726j3291J3553K2640O770q650m933M698O156N79
$$ -18794 -18170 -8560 -1083 -13507 -40233 -53524 -39971 -17331 -10561 -19211 -24144 -19446 -13290 -12711
579a2711m587q981j1207o62K1525L0493R798k1459k5459P68K1992J1990r596j3561
$$ -12711 -17298 -26279 -37486 -38148 -16623 13870 23668 2209 -23250 -22482 -490 11500 1904 -11657
593a1657K950J9642K0835Q100j1549k4830j7446Q077K9607K1214r485k4749n315
$$ -11657 -8707 10935 31770 39870 28321 3491 -13955 -5878 23729 44943 35458 10709 5394
606E394K2840K2604q124l2918k3713P693L0053K4900m68k4021k5608m093J9040
$$ 5394 28234 50838 42714 9796 -13917 -6224 23829 48729 48261 24240 -1368 -5461 13579
619A3579J7741j0379l1359j6880K0190L6430J2367k6294l9319j6382J5272K5224
$$ 13579 31320 20941 -10418 -27298 -7108 29322 41689 15395 -23924 -40306 -25034 190
631A90Q375j4619k0542m196J7602K0529l331k9784k9643K083L1815K8954k721
$$ 190 8565 -6054 -26596 -30792 -13190 7339 4008 -25776 -55419 -53336 -21521 7433 4712
644D712k6091j8851P655K1309Q249j3198k0228m586J8586K8737J2830j3832k6080
$$ 4712 -21379 -40230 -32575 -11266 -3017 -16215 -36443 -41029 -22443 6294 19124 5292 -20788
657b0788j1336J3819K2349P805j1262j1414O446K0357J5370n462k1457j6845M579
$$ -20788 -32124 -18305 4044 11849 587 -10827 -4381 15976 31346 25884 4427 -12418 -7839
670g839K2102J9277M77j3130q420N250J0414J026j1003j2084j034J2030J5799
$$ -7839 14263 33540 34017 20887 12467 17717 28131 29157 18154 6070 5036 17066 32865
683C2865N472q833j6858r295N018P819j141r362n074O787R572j58r471j1148p646
$$ 32865 38337 29504 12646 3351 8369 16188 15047 5685 611 7398 16970 16812 7341 -3807 -11453
698a1453l463L372Q849M217o275q970J109O313m055j3677q608P444J1124K406
$$ -11453 -14916 -11544 -2695 1522 -4753 -13723 -12614 -6301 -10356 -24033 -32641 -25197 -14073 -11667
712a1667j759J655j432r825q759L711J0596K072n541K542J2545N769r173j1030
$$ -11667 -13426 -11771 -13203 -23028 -31787 -28076 -17480 -15408 -20949 -18407 -5862 -93 -9266 -20296
726b0296R44O414R17K61J0004J2267r63r691k007Q335J466j0143l574J2870J6113
$$ -20296 -19352 -12938 -12021 -11760 -1756 10511 9548 -143 -2150 6185 7651 -2492 -6066 6804 22917
741B2917K902o135j793R26n473o419M307J0245J176n853L427J2988L012j6043
$$ 22917 25819 19684 17891 18817 13344 6925 11232 21477 22653 16800 20227 33215 36227 20184
755B0184j7443k5J1053N891j466L26Q40l611o260j169O43p703j2569Q76J5915
$$ 20184 2741 2716 13769 19660 18194 18520 19360 15749 9489 8320 8963 1260 -11309 -10433 5482
770E482J1334q620j6814o742M021K053m795n204j185J907M585P412J716j2297
$$ 5482 16816 8196 -8618 -15360 -11339 -9286 -14081 -19285 -20470 -18563 -13978 -6566 -4850 -17147
784a7147j7935m294J3504J4051j954j0452j962R844Q458l524j0464p090P7Q002
$$ -17147 -35082 -39376 -25872 -11821 -13775 -24227 -26189 -16345 -7887 -11411 -21875 -28965 -28888 -20886
798b0886J4641J2485j764j3649p664R600J5156j160j5389m680J7184K1079L924
$$ -20886 -6245 6240 4476 -9173 -16837 -7237 7919 6759 -8630 -13310 3874 24953 28877
811B8877j0028q703k756M74N597J0611L877r041q064J1863J9414o89k4718j8096
$$ 28877 18849 10146 7390 7864 13461 24072 27949 18908 10844 22707 42121 41432 16714 -1382
825a382R433J9352M734q126n609l12j975j853L210p50j4618j5140P035K4861Q523
$$ -1382 8051 27403 32137 24011 18402 18090 16115 14262 17472 16722 2104 -13036 -6001 18860 27383
840B7383k1297k4461O07J4658J783j2781o653M703L070o25L513M049j1071k2184
$$ 27383 6086 -18375 -17768 -3110 -1327 -14108 -20761 -16058 -12988 -13613 -10100 -6051 -17122 -39306
854c9306m051K1075J7035r212j7651K799J7511M783j3639j0234K714M548J680
$$ -39306 -43357 -22282 -5247 -14459 -32110 -29311 -11800 -7017 -20656 -30890 -28176 -23628 -21948
867b1948R630J4342J344j5533q483J2743J4248o558j4991K976K1167J3042m104
$$ -21948 -12318 2024 3368 -12165 -20648 -7905 6343 -215 -15206 -12230 8937 21979 17875
880A7875n784P18j837o983J567J2938Q387o432n965R325J2440m864j6812p331
$$ 17875 12091 12809 10972 3989 5556 18494 26881 20449 14484 23809 36249 31385 14573 7242
894G242P679Q329o71p88M111J55p926o943J030J979o455p930K942J1000L173q594
$$ 7242 14921 23250 22579 21791 25902 26057 18131 11188 12218 14197 7742 -188 2754 13754 16927 8333
910H333j0323l540m78l988k668K811L689k075l797J03K014m340j0787o501N094
$$ 8333 -1990 -5530 -6008 -9996 -12664 -9853 -6164 -8239 -12036 -11933 -9919 -14259 -25046 -31547 -26453
925b6453R200L622k102j548o59k468k954j31K119J317o50M575R441N307m936r384
$$ -26453 -17253 -13631 -15733 -17281 -17940 -20408 -23362 -23493 -21374 -20057 -20707 -16132 -6691 -1384 -6320 -15704
941a5704j896O357P461J928K24K587M443L281O99o05l765l413J450R350J0338
$$ -15704 -17600 -11243 -3782 -1854 -1630 957 5400 8681 9380 8775 5010 1597 3047 12397 22735
956B2735J687o843n138L367N412n68o149l710L799P335N045l78o021r006n516
$$ 22735 24422 17579 12441 15808 21220 20652 14503 10793 14592 21927 26972 26594 20573 11567 6051
971F051L050P141J633o890o135K868P599q49r627j1712l035M964O829K419l713
$$ 6051 9101 16242 17875 10985 4850 7718 15317 14468 4841 -6871 -9906 -4942 1887 4306 593
986E93p384n337P18M337n26q876p913L251J1455O484n231j0694o126K430N565
$$ 593 -6791 -12128 -11410 -7073 -7599 -16475 -24388 -21137 -9682 -3198 -8429 -19123 -25249 -22819 -17254
1001a7254L352j103m040j282N882Q735K066q296r753l17J0229J0738K322m372
$$ -17254 -13902 -15005 -19045 -20327 -14445 -5710 -3644 -11940 -21693 -22010 -11781 -1043 1279 -3093
1015c093l573J588O070L837j558n816k667O472J1917P170m041q903l548M307O905
$$ -3093 -6666 -5078 992 4829 3271 -2545 -5212 1260 13177 20347 16306 7403 3855 8162 15067
1030A5067J765k894k799J889N912N218j753q228p637RP706O311j576o397l782
$$ 15067 16832 13938 11139 13028 18940 24158 22405 14177 6540 6549 14255 20566 18990 12593 8811
1045H811K350K708j196n631o535k502K899O402L154m823q818m502J505K375j845
$$ 8811 11161 13869 12673 7042 507 -1995 904 7306 10460 5637 -3181 -7683 -6178 -3803 -5648
1060e648m570k388K750L774R25k974n823o068j297L677N167J497k605j738K005
$$ -5648 -10218 -12606 -9856 -6082 -5157 -8131 -13954 -20022 -21319 -17642 -12475 -10978 -13583 -15321 -13316
1075a3316K046j493m080k162J866M499L987L706J199k249k851K35L376J998j235
$$ -13316 -11270 -12763 -16843 -19005 -17139 -12640 -8653 -4947 -3748 -5997 -8848 -8613 -5237 -3239 -4474
1090d474M7M957O603K683j498k690q57j151L82L932N327K009p94K00K742J211
$$ -4474 -4427 530 7133 9816 8318 5628 4771 3620 4002 7934 13261 15270 14476 14676 17418 18629
1106A8629m815n725l10M103M381J272O05p95l177m387j720J542q57m142k115M241
$$ 18629 13814 8089 7779 11882 16263 17535 18140 17345 14168 9781 8061 9603 8746 4604 2489 6730
1122F730N004j503o979n777j006Q3o68m87k21j338j680J234K500j772p474p054
$$ 6730 11734 10231 3252 -2525 -3531 -3448 -4116 -4603 -4824 -6162 -7842 -6608 -4108 -5880 -13354 -20408
1138b0408R79P373M883j925m833j523J965J535r31j800k352R5M236P587M352l548
$$ -20408 -19429 -12056 -7173 -9098 -13931 -15454 -13489 -11954 -12885 -14685 -17037 -16942 -12706 -5119 -767 -4315
1154d315p870k129N978P135L72l806o60N283O754K154k281m517k860J512O769
$$ -4315 -12185 -14314 -8336 -1201 -829 -4635 -5295 -12 6742 8896 6615 2098 -762 750 7519
1169G519O698L07n295l327N180P513l16p938o939K038P939N660n10n177m246k295
$$ 7519 14217 14524 9229 5902 11082 18595 18279 10341 3402 5440 13379 19039 18529 13352 9106 6811
1185F811K182L309l10o942n339L062P919K952p579j0133k495M625L969o44l794
$$ 6811 8993 12302 11992 5050 -289 2773 10692 13644 6065 -4068 -6563 -1938 2031 1387 -2407
1200b407l633j405J514L077R2o477o823L01P171N675k942p198k706L676L670J08
$$ -2407 -6040 -7445 -5931 -2854 -2762 -9239 -16062 -15761 -8590 -2915 -5857 -13055 -15761 -12085 -8415 -8307
1216h307k811k938J23L798N177K392k909n503j191M713N278N93k891n46L687M874
$$ -8307 -11118 -14056 -13933 -10135 -4958 -2566 -5475 -10978 -12169 -7456 -2178 -1585 -4476 -5022 -1335 3539
1232C539J626k664l878j73L414M566L045q09k141o64K055K789k5k753k325J197
$$ 3539 5165 2501 -1377 -1550 1864 6430 9475 8666 6525 5861 7916 10705 10680 7927 5602 6799
1248F799M332K616j487m163j341J803K096q05k426k211J30J046J090j26k068l826
$$ 6799 11131 13747 12260 8097 6756 8559 10655 9850 7424 5213 5343 6389 7479 7353 5285 1459
1264A459k146J553K934j336m040k627J712K141k363l010j324M68L9j6R18K0k912
$$ 1459 -687 866 3800 2464 -1576 -4203 -2491 -350 -2713 -5723 -7047 -6579 -6540 -6556 -5638 -5618 -8530
1281h530l439O62L881J472l267k800K694L027l35k256n37K228k25K31K533K756
$$ -8530 -11969 -11307 -7426 -5954 -9221 -12021 -9327 -6300 -6635 -8891 -9428 -7200 -7425 -7194 -4661 -1905
1297a905j005l553M39M921L677k555k676J280M115J499k04P58L93q85j266K223
$$ -1905 -2910 -6463 -6024 -1103 2574 19 -2657 -1377 2738 4237 4033 4791 5184 4299 3033 5256
1313E256M967O76m519k082L497M452p89m420r93J017J905P41P40n6l259m455Q03
$$ 5256 10223 10899 6380 4298 7795 12247 11458 7038 6045 7062 8967 9708 10448 10392 7133 2678 3481
1330C481M573K078m970n827P63M707J723m154m467j898M74R62J797N23l065n872
$$ 3481 8054 10132 5162 -665 98 4805 6528 2374 -2093 -3991 -3517 -2555 -758 -235 -3300 -9172
1346i172j039N107M305l678p715k586N073N287p21l350k792K29Q71K589K530j107
$$ -9172 -10211 -5104 -799 -4477 -12192 -14778 -9705 -4418 -5139 -8489 -11281 -11052 -10181 -7592 -5062 -6169
1362f169m970k225O033P724M96o854m224L262O953K562k114j718k29J399K809
$$ -6169 -11139 -13364 -7331 393 889 -5965 -10189 -6927 26 2588 474 -1244 -1473 -74 2735
1377B735L942J170l972l991K323Q195L574m936n530O63N742K845j846k609j253
$$ 2735 6677 7847 3875 -116 2207 10402 13976 9040 3510 4173 9915 12760 10914 8305 7052
1392G052L99Q68K541J209k963n209j109M135L580l631n481j371L316J861k296
$$ 7052 7451 8319 10860 12069 9106 3897 2788 6923 10503 6872 1391 20 3336 5197 2901
1407B901k826k230q38n89O87J623j370m205j934K097K584j852m667j182K919K100
$$ 2901 75 -2155 -2993 -3582 -2895 -1272 -2642 -6847 -8781 -6684 -4100 -5952 -10619 -11801 -8882 -6782
1423f782j319j974o9L62O99N15J582m61j662m86K773L515j88k050m98K883K313
$$ -6782 -8101 -10075 -10144 -9782 -9083 -8568 -6986 -7447 -9109 -9595 -6822 -3307 -3495 -5545 -6043 -3160 -847
1440h47L47p43K16J265J618J402J887j68j165k30K308L187j01k199n37J710J604
$$ -847 -500 -1243 -1027 238 1856 3258 5145 4977 3812 3582 5890 9077 8976 6777 6240 7950 9554
1457I554L05j172K6l34k71O1J607p52k013k056J106K024q52k458k189N1M8l98
$$ 9554 9859 8687 8713 8379 8108 8169 9776 9024 7011 4955 6061 8085 7233 4775 2586 2637 2685 2287
1475B287m33o57j285k227q79J115L12j952k077m65J109K06j308r84l68n45j220
$$ 2287 1854 1197 -88 -2315 -3194 -2079 -1767 -3719 -5796 -6261 -5152 -4946 -6254 -7238 -7606 -8151 -9371
1492i371N56J665M37j752j563J438K665N38j749r66J183R00P73J195J831k70j359
$$ -9371 -8815 -7150 -6713 -8465 -10028 -8590 -5925 -5387 -7136 -8102 -6919 -6019 -5246 -4051 -2220 -2490 -3849
1509c849M16L014K257j053k108pL851K826k98r94k40N64N82R16J441M8j618o24
$$ -3849 -3433 -419 1838 785 -1323 -1330 2521 5347 5049 4055 3815 4379 4961 5877 7318 7366 5748 5124
1527E124K099L011m79l470k310J988K552o22j295r82j6m29j29M52n45k325k663
$$ 5124 7223 10234 9755 6285 3975 5963 8515 7893 6598 5616 5600 5171 5042 5494 4949 2624 -39
1544c9J088K706J78l070k819L16J244j96k315j119j45O39l2l99j76j923j771J07
$$ -39 1049 3755 3933 863 -1956 -1640 -396 -592 -2907 -4026 -4171 -3532 -3564 -3963 -4139 -6062 -7833 -7726
1562g726J903Q83j709j853R91K411J43j692j667N36J589Q65N03N04J40j104Q23
$$ -7726 -5823 -4940 -6649 -8502 -7511 -5100 -4957 -6649 -8316 -7780 -6191 -5326 -4823 -4319 -4179 -5283 -4460
1579d460K024O73j193j018J367L615J911j488j245O29J917J363m53j88O4O68J571
$$ -4460 -2436 -1763 -2956 -3974 -2607 1008 2919 1431 186 815 2732 4095 3642 3454 3518 4186 5757
1596E757J800O03j828k243M48K835K035j267k485j16J763J525j242k069j495o00
$$ 5757 7557 8160 6332 4089 4537 7372 9407 8140 5655 5539 7302 8827 7585 5516 4021 3421
1612C421R21J618Q16k001l245j486J815J311j424l199j689J466J705l50j769k216
$$ 3421 4342 5960 6776 4775 1530 44 1859 3170 1746 -1453 -3142 -1676 29 -321 -2090 -4306
1628d306j605l53Q38J381q56k513r84J170K342l77k321k366M98K352J390J78n21
$$ -4306 -5911 -6264 -5426 -4045 -4901 -7414 -8398 -7228 -4886 -5263 -7584 -9950 -9452 -7100 -5710 -5532 -6053
1645f053n61o1O16J859N75j040j152J761L417K126j021k089L12J171K213P03J155
$$ -6053 -6614 -6675 -6059 -4200 -3625 -4665 -5817 -4056 -639 1487 466 -1623 -1311 -140 2073 2776 3931
1662C931j67o37Q46K255J719q54k488j056K305K983K46j118j581O84K18J60K00
$$ 3931 3764 3127 3973 6228 7947 7093 4605 3549 5854 8837 9083 7965 6384 7068 7286 7446 7646
1679G646q68j780j168J205L061j43l365l306q18K064O01j780j421j130K41K31
$$ 7646 6778 4998 3830 5035 8096 7953 4588 1282 464 2528 3129 1349 -72 -1202 -961 -730
1695g30L15q26k623l198n22K938K782j268l921j851J944J805m06j914j472L27
$$ -730 -415 -1241 -3864 -7062 -7584 -4646 -1864 -3132 -7053 -8904 -6960 -5155 -5561 -7475 -8947 -8620
1711h620J532J696J690p32k840j764K057L972J186k410j720J888L942J672j520
$$ -8620 -7088 -5392 -3702 -4434 -7274 -9038 -6981 -3009 -1823 -4233 -5953 -4065 -123 1549 29
1726B9k009m50J147K435K712J314j379k207N92L724K034k313l491j02L977L798
$$ 29 -1980 -2430 -1283 1152 3864 5178 3799 1592 2184 5908 7942 5629 2138 2036 6013 9811
1742I811o90k347k301p4L83J762P23j347k434r14K159L002q36m776l369J498K504
$$ 9811 9121 6774 4473 4399 4782 6544 7267 5920 3486 2572 4731 7733 6897 2121 -1248 250 2754
1759B754R48k054j609j021K99L38M46j140k291k857O42L881J727k883l319n42
$$ 2754 3702 1648 39 -982 -683 -345 101 -1039 -3330 -6187 -5545 -1664 63 -2820 -6139 -6681
1775f681J567J564j029j145r0P96J66J188O14m38k722p77K868K931K09j956n26
$$ -6681 -5114 -3550 -4579 -5724 -5814 -5018 -4852 -3664 -3050 -3488 -6210 -6987 -4119 -1188 -979 -2935 -3461
1792c461J454J083k51m33L72J094l54O19K236J194j233k118L25K011J273j048
$$ -3461 -2007 -924 -1175 -1608 -1236 -142 -496 123 2359 3553 2320 202 527 2538 3811 2763
1808B763l34J012J131k31p71N51L76j463k063J222K440J183j726j223J15n6r69
$$ 2763 2429 3441 4572 4341 3570 4121 4497 3034 971 2193 4633 5816 4090 2867 2982 2926 1957
1825A957p56P25O90j000q55J069J243o89l103j512J208J514k58r61j52l12n74
$$ 1957 1201 1926 2616 1616 761 1830 3073 2384 -719 -2231 -1023 491 233 -728 -880 -1192 -1766
1842a766o67J084J38j344j639K46K822J022j520k451l82J122N40N4K05nk56K17
$$ -1766 -2433 -1349 -1211 -2555 -4194 -3948 -1126 -104 -1624 -4075 -4457 -3335 -2795 -2741 -2536 -2541 -2797 -2580
1860b580P94J375j045k703p24J982K852Q00p13p76Q6l21L00O86N24o60o34J334
$$ -2580 -1786 -411 -1456 -4159 -4883 -2901 -49 751 38 -738 -652 -973 -673 13 537 -123 -757 577
1878E77K518J028j680k155j99J011J197Q40k65r9p52L60Q00R33p51k518r69J706
$$ 577 3095 4123 2443 288 89 1100 2297 3137 2872 2773 2021 2381 3181 4114 3363 845 -124 1582
1896A582K021P94j085j746p12J10N13K58o46j163q93J594K011M9k644l024m84
$$ 1582 3603 4397 3312 1566 854 964 1477 1735 1089 -74 -967 627 2638 2687 43 -2981 -3465
1913c465J811J800O94j091j736n42K48J418L60k467j922o4L190K697n50k549j742
$$ -3465 -1654 146 840 -251 -1987 -2529 -2281 -863 -503 -2970 -4892 -4956 -1766 931 381 -2168 -3910
1930c910K8J605J303k84r14q66P83K271K248j297l266j742J457L338J089m67j622
$$ -3910 -3882 -2277 -974 -1258 -2172 -3038 -2255 16 2264 967 -2299 -4041 -2584 754 1843 1376 -246
1947b46M99J095J112j25j374j910n86K265L664P66k573k557K14J724J165j074
$$ -246 253 1348 2460 2335 961 -949 -1535 730 4394 5160 2587 30 244 1968 3133 2059
1963B059j168l27L24J684R26j15k827k149L39K224J645j137j876l46J373M46p13
$$ 2059 891 564 888 2572 3498 3383 556 -1593 -1254 970 2615 1478 -398 -744 629 1075 362
1980C62j152j336l49P50J932J282q90k642m91J316L74r10j162O17J272J133L23
$$ 362 -790 -2126 -2475 -1725 207 1489 599 -2043 -2534 -1218 -844 -1754 -2916 -2299 -1027 106 429
1997D29m82j200j146o18J233J568K81n46p4Q88J026q57j357m38O24O50O42J042
$$ 429 -53 -1253 -2399 -3017 -1784 -216 65 -481 -555 333 1359 502 -855 -1293 -669 -19 623 1665
2015A665k58j43m67k23L77n07p71j43J122J385L97j232o79m79N1k30J15R0M79
$$ 1665 1407 1264 797 574 951 444 -327 -470 652 2037 2434 1202 523 44 95 -135 -20 70 549
2034E49K23J36K3m67o50j354J46P36P21Q26j128k83K52J62o60p31K12P12r5N37
$$ 549 772 908 931 464 -186 -1540 -1394 -658 63 889 -239 -522 -270 -108 -768 -1499 -1287 -575 -670 -133
2054a33J046p0r47j232J40P08L71k36l6N01J035j21m14n67l70p22L23J070J339
$$ -133 913 843 -104 -1336 -1196 -488 -117 -353 -389 112 1147 1026 612 45 -325 -1047 -724 346 1685
2073A685j42j107r6R00J14j251j312M16J277P47k58K39R1r70q01J67P32J04q98
$$ 1685 1543 436 340 1240 1354 103 -1209 -793 484 1231 973 1212 1303 333 -468 -301 431 535 -363
2092c63m96J388J433j223j463o24N15K78Q1M83J81j04r63L72N92Q9j583p49R42
$$ -363 -859 529 1962 739 -724 -1348 -833 -555 -474 9 190 86 -877 -505 87 176 -1407 -2156 -1214
2111a214J498L69n52n49j11Rn31O8P76K21m41L15J446K68j629j527M04J419N62
$$ -1214 284 653 101 -448 -559 -550 -1081 -1013 -237 -16 -457 -142 1304 1572 -57 -1584 -1180 239 801
2130H01p79J3N79L55j51m20l3l79p29l25J628J300p80j079j6L19K42j034m85N08
$$ 801 22 35 614 969 818 398 365 -14 -743 -1068 560 1860 1080 1 -15 304 546 -488 -973 -465
2150d65J250j13k38K46l48m61q43N01Q32K03j005P1J452J54j180r57J47M73N8
$$ -465 785 672 434 680 332 -129 -972 -471 361 564 -441 -370 1082 1236 56 -901 -754 -281 -223
2169b23L24J48R64p19k15l31K90k89j115L33J005J051k46p83m78J85m88n91K61
$$ -223 101 249 1213 494 279 -52 238 -51 -1166 -833 172 1223 977 194 -284 -99 -587 -1178 -917
2188i17P17O14j41k29P84l91j163p54J06P36O40p49L01M41O44q74o10q64N73r8
$$ -917 -200 414 273 44 828 437 -726 -1480 -1374 -638 2 -747 -446 -5 639 -235 -845 -1709 -1136 -1234
2208a234O28P61L06l59m80j45N23l96r64k20J334J263L53l90n90l17M1j51K76
$$ -1234 -606 155 461 102 -378 -523 0 -396 -1360 -1580 -246 1017 1370 980 390 73 114 -37 239
2227B39N31j04J63N33M97Q5q96j096k14R35J043J28m10l57J26j31l54l04l67m36
$$ 239 770 666 829 1362 1859 1944 1048 -48 -262 673 1716 1844 1434 1077 1203 1072 718 414 47 -389
2247c89L24R00J040n19q41j256m84nN25j84j54K10K93K72O78j138j350j184O14
$$ -389 -65 835 1875 1356 515 -741 -1225 -1230 -705 -889 -1043 -833 -540 -268 410 -728 -2078 -3262 -2648
2266b648J462N63M11o72o15k49J038l26m17j013K17J176J653N18n89j076r93P04
$$ -2648 -1186 -623 -212 -884 -1499 -1748 -710 -1036 -1453 -2466 -2249 -1073 580 1098 509 -567 -1560 -856
2284h56J134L17l0o58N4J294J280n32j314j371K08J171J587Q79j146r90m78R38
$$ -856 278 595 565 -93 -39 1255 2535 2003 689 -682 -474 697 2284 3163 2017 1027 549 1487
2302A487R24o75j618o52O50K116R69o91j578j589n49J246J080N0j485r33J065
$$ 1487 2411 1736 118 -534 116 2232 3201 2510 932 -657 -1206 40 1120 1170 -315 -1248 -183
2319a83J227L48j618j977q46J178J660P91k77j359j143O04P87N20j277j463J59
$$ -183 1044 1392 -226 -2203 -3049 -1871 -211 580 303 -1056 -2199 -1595 -808 -288 -1565 -3028 -2869
2336b869K155J600K60j434j636l55L72J240J014o52j057M41J503J269n65j850
$$ -2869 -714 886 1146 -288 -1924 -2279 -1907 -667 347 -305 -1362 -921 582 1851 1286 -564
2352e64j157N79J907J074M11n31j071j033J248K09L44j153o79P21J683N52q23
$$ -564 -1721 -1142 765 1839 2250 1719 648 -385 863 1072 1416 263 -416 305 1988 2540 1717
2369A717j073j178M9P88N26L60k38r00k63J190N46j327j238o21N62J069O82q6
$$ 1717 644 -534 -485 303 829 1189 951 51 -212 978 1524 197 -1041 -1662 -1100 -31 651 565
2387E65j45j303l14k92N62L65q82N0J353P39p5n50r52o91J7L31Q91R64k23o71
$$ 565 420 -883 -1197 -1489 -927 -562 -1444 -1394 -41 698 623 73 -879 -1570 -1553 -1222 -331 633 410 -261
2407b61j27L93L74l39r86j51P08R01P35K95q37o05o90j5R87N34p10k96O00P86
$$ -261 -388 5 379 40 -946 -1097 -389 512 1247 1542 705 100 -590 -605 382 916 206 -90 510 1296
2427A296K89m53j254q68K39N23J261P28m65p09j003N96K50m54q88j61J158N39
$$ 1296 1585 1132 -122 -990 -751 -228 1033 1761 1296 587 -416 180 430 -24 -912 -1073 85 624
2445F24M94j27q07j326l69L64J021R40j142k47J16P49L48o45j024k12K67O20R69
$$ 624 1118 991 184 -1142 -1511 -1147 -126 814 -328 -575 -459 290 638 -7 -1031 -1243 -976 -356 613
2464F13M66q09o51m41M82M00k34o93j47O73J197O94l77j238j208l24J232J329
$$ 613 1079 270 -381 -822 -340 60 -174 -867 -1014 -341 856 1550 1173 -65 -1273 -1597 -365 964
2482I64l1p51n41P61L82j63o85j107J87R38Q53O49j83r44q79M90N60L61o06p35
$$ 964 933 182 -359 402 784 621 -64 -1171 -984 -46 807 1456 1273 329 -550 -60 500 861 255 -480
2502d80K70J034P69n05o08q83r95R16N34O38j50j70m21O39O95j040j263o93Q49
$$ -480 -210 824 1593 1088 480 -403 -1398 -482 52 690 540 370 -51 588 1283 243 -1020 -1713 -864
2521h64Q74Q80L01q75r24k48J01L34m56k06J05P20O37k84m55p63n24K34P63K25
$$ -864 10 890 1191 316 -608 -856 -755 -421 -877 -1083 -978 -258 379 95 -360 -1123 -1647 -1413 -650 -425
2541d25k53K11j18K88J63j76l95q44O3R28P10N16j60m47m4J71l19J93Q4J48L34
$$ -425 -678 -467 -585 -297 -134 -310 -705 -1549 -1486 -558 152 668 508 61 17 188 -131 62 146 294 628
2562F28R56L52o39m12o91K73K32O58L53R2j82M51m23n28l03p11N59L47K75J95
$$ 628 1584 1936 1297 885 194 467 699 1357 1710 1802 1620 2071 1648 1120 817 106 665 1012 1287 1482
2582A482m03j70n03l05k65k24k80k3L43M78M0m23m96r19m8k77J7L19N67K19j56
$$ 1482 1079 909 406 101 -164 -388 -668 -691 -348 130 170 -253 -749 -1668 -1716 -1993 -1976 -1657 -1090 -871 -1027
2603a027k68l8p73n24J40M49J090J77j33r5K39n76r5N0j63Q48L23M03O96Q5n66
$$ -1027 -1295 -1333 -2106 -2630 -2490 -2041 -951 -774 -907 -1002 -763 -1339 -1434 -1384 -1547 -699 -376 27 723 808 242
2624B42l05L39J73M00QN62N02K69k67r3l48l0j20j06N58O01K60l98j1km55q03
$$ 242 -63 276 449 849 857 1419 1921 2190 1923 1830 1482 1452 1332 1226 1784 2385 2645 2247 2236 2234 1779 976
2646I76m87K00Q17k26K99P8o01q37n49J8j10O2k3m36N56P6o93p91n66L33k19K48
$$ 976 489 689 1506 1280 1579 1657 1056 219 -330 -312 -422 -360 -383 -819 -263 -187 -880 -1671 -2237 -1904 -2123 -1875
2668a875KM27k43k96j56J25K9q28m0N62O31O52k41j57MOJ62m98N03P10K75M11
$$ -1875 -1873 -1446 -1689 -1985 -2141 -2016 -1987 -2815 -2855 -2293 -1662 -1010 -1251 -1408 -1404 -1398 -1236 -1734 -1231 -521 -246 165
2690A65P45K11p84o62r6J022L87L98R6N41J04l9n04kjo3R5N62N78r8n92m27L53
$$ 165 910 1121 337 -325 -421 601 988 1386 1482 2023 2127 2088 1584 1582 1581 1518 1613 2175 2753 2655 2063 1636 1989
2713A989k33m47l66o1L43J38M6J28k78r07q28j07L39L42n00J11M03k57p99q86
$$ 1989 1756 1309 943 882 1225 1363 1409 1537 1259 352 -476 -583 -244 98 -402 -291 112 -145 -944 -1830
2733a830KJ79m77M11QQ96l2p87o49jL37N5k39K35P78Q7j60n09L06k1o29N71J97
$$ -1830 -1828 -1649 -2126 -1715 -1707 -811 -843 -1630 -2279 -2280 -1943 -1888 -2127 -1892 -1114 -1027 -1187 -1696 -1390 -1411 -2040 -1469 -1272
2756a272J084k71j71O38L7k60m25K4O12K76J77M44N35K53p55j35j56O89k43l5
$$ -1272 -188 -459 -630 8 45 -215 -640 -616 -4 272 449 893 1428 1681 926 791 635 1324 1081 1046
2776A046M77N03L09m52n31J43J36p08RN03O95l27n43K11k87j0o12l17N92L9l72
$$ 1046 1523 2026 2335 1883 1352 1495 1631 923 932 1435 2130 1803 1260 1471 1184 1174 562 245 837 876 504
2797E04j4J68k50o31p39L87L43m51k87j14L39J45l99m02l40N9m87L06O79L47k18
$$ 504 490 658 408 -223 -962 -575 -232 -683 -970 -1084 -745 -600 -999 -1401 -1741 -1682 -2169 -1863 -1184 -837 -1055
2818a055o10j81M4K38n32J5L85R55n41K41K77j34o78L45L63M28N03l01P0M41L22
$$ -1055 -1665 -1846 -1802 -1564 -2096 -2081 -1696 -741 -1282 -1041 -764 -898 -1576 -1231 -868 -440 63 -238 -168 273 595
2839E95mn42J36N32j34N18O49K94p70O9k30L79L04l19K0k6L05K37J34j61n77m80
$$ 595 591 49 185 717 583 1101 1750 2044 1274 1343 1113 1492 1796 1477 1497 1471 1776 2013 2147 1986 1409 929
2861I29l41N17O53N4p80k60J12J2m9n25o78m02N27%O99n89p70n81J74L06L5l69
$$ 929 588 1105 1758 1812 1032 772 884 896 847 322 -356 -758 -231 -231 468 -121 -891 -1472 -1298 -992 -957 -1326
2883a326l39j5M02L06k56l16n89l39M92L32M23K27n44J96K06N2j99m38p6O69P02
$$ -1326 -1665 -1680 -1278 -972 -1228 -1544 -2133 -2472 -1980 -1648 -1225 -998 -1542 -1346 -1140 -1088 -1287 -1725 -1801 -1132 -430
2904d30P33j8l48m78K17K21N30j4R4O5J35K46K59K35n61j92L65K14N17j20k22
$$ -430 303 285 -63 -541 -324 -103 427 413 507 572 707 953 1212 1447 886 694 1059 1273 1790 1670 1448
2925A448j35m23P14k05j77q14M24N35J29r0l04o0m72k86K14j39j78q7K09j32J39
$$ 1448 1313 890 1604 1399 1222 408 832 1367 1496 1406 1102 1042 570 284 498 359 181 94 303 171 310
2946C10m41K0o73l00P02K4Q9L1n34m52K23K45m1m34J65n1M68J70K3n11j22j87
$$ 310 -131 -111 -784 -1084 -382 -358 -269 -238 -772 -1224 -1001 -756 -797 -1231 -1066 -1117 -649 -479 -456 -967 -1089 -1276
2968a276R1K53O21m16r0J71K70j70J19j33l37K70L98K57m14J78J89Ok23j93K79
$$ -1276 -1185 -932 -311 -727 -817 -646 -376 -546 -427 -560 -897 -627 -229 28 -386 -208 -19 -13 -236 -429 -150
2989a50Q1J42j28P44n1j22m14l5L37J45J82l38L00L06P3l59j19K10N2k80J28M27
$$ -150 -69 73 -55 689 638 516 102 67 404 549 731 393 693 999 1072 713 594 804 856 576 704 1131
3011A131J80k03j82L00m74J3k83J00L73j32m40J88J95nk30o41J12J32j61O6N1
$$ 1131 1311 1108 926 1226 752 765 482 582 955 823 383 571 766 761 531 -110 2 134 -27 39 90
3032I0J56k95m68N4O4k77l49J02J20L30k38l91k05R8m41K34J37K22j54k22p4K54
$$ 90 246 -49 -517 -463 -399 -676 -1025 -923 -803 -473 -711 -1102 -1307 -1209 -1650 -1416 -1279 -1057 -1211 -1433 -1507 -1253
3054a253J72k74k17N30M9L47j73J57K67q1n2J09O05K04l60K43M83M12r5m73R5
$$ -1253 -1081 -1355 -1572 -1042 -993 -646 -819 -662 -395 -476 -528 -419 186 390 30 273 756 1168 1073 600 695
3075F95M94PJ12o6L23j06K20N4K05j98k99j65L86N23j34n62n2j39j01j66m4j51
$$ 695 1189 1196 1308 1242 1565 1459 1679 1733 1938 1740 1441 1276 1662 2185 2051 1489 1437 1298 1197 1031 987 836
3097H36R6o34K00o2J44l72p93m28N56k14M7p11O8K25m76%R2l16p0j32J79J63j61
$$ 836 932 298 498 436 580 208 -585 -1013 -457 -671 -624 -1335 -1267 -1042 -1518 -1518 -1426 -1742 -1812 -1944 -1765 -1602 -1763
3120a763l81l5O13J07m37q5O96l0q1J00o8O09%j43N61M78l02j15K23K63M94J4
$$ -1763 -2144 -2179 -1566 -1459 -1896 -1981 -1285 -1315 -1396 -1296 -1364 -755 -755 -898 -337 141 -161 -276 -53 210 704 718
3142G18k28J39O03J84k41L18J07J03j41J40K12M3r6p2P0M7k67j97r4J75n5K4m87
$$ 718 490 629 1232 1416 1175 1493 1600 1703 1562 1702 1914 1957 1861 1789 1859 1906 1639 1442 1348 1523 1468 1492 1005
3165A005P3r0q5k18k48L61o35l85j68J41Jk43m16k77M70m27k26K07k0l07j50N54
$$ 1005 1078 988 903 685 437 798 163 -222 -390 -249 -248 -491 -907 -1184 -714 -1141 -1367 -1160 -1180 -1487 -1637 -1083
3187a083k63K18p52n0O3M71P3m07L35r4L19k06R2M28j28L7j08P00K79K9k68k66
$$ -1083 -1346 -1128 -1880 -1930 -1867 -1396 -1323 -1730 -1395 -1489 -1170 -1376 -1284 -856 -984 -947 -1055 -355 -76 -47 -315 -581
3209e81K39O28k00qL01N64j27j32M35l06j05R2L99K45J7k59K44l21N93l78K24
$$ -581 -342 286 86 78 379 943 816 684 1119 813 708 800 1199 1444 1461 1202 1446 1125 1718 1340 1564
3230A564m51K59j36L2M92l24l20k29n7K81k44k39k15k44J50j3l20K12o07M4k48
$$ 1564 1113 1372 1236 1268 1760 1436 1116 887 830 1111 867 628 413 169 319 306 -14 198 -409 -365 -613
3251f13K6J09M7j29l30j27j7m1q0j80J9J84n03L38j03n1k71n8L80n7j51K21J75
$$ -613 -587 -478 -431 -560 -890 -1017 -1034 -1075 -1155 -1335 -1316 -1132 -1635 -1297 -1400 -1451 -1722 -1780 -1400 -1457 -1608 -1387 -1212
3274a212r1m5L82J2K09l8j6L67m7L97rJ10R6R7O8P8K93M0Q9K71K76k22O5J23K91
$$ -1212 -1303 -1348 -966 -954 -745 -783 -799 -432 -479 -82 -91 19 115 212 280 358 651 691 780 1051 1327 1105 1170 1293 1584
3299A584l48L40L69m18J55j18j76M0k27RN4q5n2l21K11J32n00l44q4rl4P1l82
$$ 1584 1236 1576 1945 1527 1682 1564 1388 1428 1201 1210 1264 1179 1127 806 1017 1149 649 305 221 212 178 249 -133
3322a33j33m36Q8j24No54k45M85m04K16r5m0j94r0L90o2j29R2j09L72j67N04l93
$$ -133 -266 -702 -614 -738 -733 -1387 -1632 -1147 -1551 -1335 -1430 -1470 -1664 -1754 -1364 -1426 -1555 -1463 -1572 -1200 -1367 -863 -1256
3345a256j28J99j63M64L41J36K16J82K6J84j20j51M96j24K97L87k26N43m82K81
$$ -1256 -1384 -1185 -1348 -884 -543 -407 -191 -9 17 201 81 -70 426 302 599 986 760 1303 821 1102
3365A102k4J81L76j99K45m68K66R9Rl03k27j80J5K32j58K07p41N5K4p5J01n24
$$ 1102 1078 1259 1635 1436 1681 1213 1479 1578 1587 1284 1057 877 892 1124 966 1173 432 487 511 436 537 13
3387A3j46l71M20J29l03k69k78N9o8l45L41J09p9j95J86p6k42k93K09r1K36M09
$$ 13 -133 -504 -84 45 -258 -527 -805 -746 -814 -1159 -818 -709 -788 -983 -797 -873 -1115 -1408 -1199 -1290 -1054 -645
3409f45j3K05m13L22k82N1J66N34j65o7L81M39m94k29M42j87J71J56L56j18J71
$$ -645 -658 -453 -866 -544 -826 -775 -609 -75 -240 -307 74 513 19 -210 232 45 216 372 728 610 781
3430G81j34J20J49j29m54K26P3K5J48k02R7j27m07m23M93l6k9J84k09j62L33l73
$$ 781 647 767 916 787 333 559 632 657 805 603 700 573 166 -257 236 200 171 355 146 -16 317 -56
3452e6p3l40L58R0k26O0K27j78K97k76m17O4K49k4o1NJ66J06o0n1k54j42N09m3
$$ -56 -129 -469 -111 -21 -247 -187 40 -138 159 -117 -534 -470 -221 -245 -306 -301 -135 -29 -89 -140 -394 -536 -27 -70
3476g0J39J75pn1K20l72N8p9J01K08l8J44J36k06m07Q9J8J38qK56l48K02P6m79
$$ -70 69 244 237 186 406 34 92 13 114 322 284 428 564 358 -49 40 58 196 188 444 96 298 374 -105
3500a05J35l13k52J81J08R1Q8j39j9j13j30j75J06j63J08K65K8J76J28j80k1m74
$$ -105 30 -283 -535 -354 -246 -155 -67 -206 -225 -338 -468 -643 -537 -700 -592 -327 -299 -123 5 -175 -196 -670
3522f70L11O1P2Q4J85O3J46J36l02O0j91K9L02R3J41k22M07k1m37N04n56J6K48
$$ -670 -359 -298 -226 -142 43 106 252 388 86 146 -45 -16 286 379 520 298 705 684 247 751 195 211 459
3545D59J80j16M54p05J74N4j83K78k40o0O5J71k56K73m00n3m08J10J16N1j22j09
$$ 459 639 523 977 272 446 500 317 595 355 295 360 531 275 548 148 95 -313 -203 -87 -36 -158 -267
3567b67K11l05n0l21L8l4k42L89J34K89l88k88j02L07M2N7J82L1K52%l06k61J66
$$ -267 -56 -361 -411 -732 -694 -728 -970 -581 -447 -158 -546 -834 -936 -629 -587 -530 -348 -317 -65 -65 -371 -632 -466
3590d66K67j28R2K21N8K75o73M45l0j12j59L06k67O68L40k35K12l32J93l01o4
$$ -466 -199 -327 -235 -14 44 319 -354 91 61 -51 -210 96 -171 497 837 602 814 482 675 374 310
3611C10M54j97J2N9N68l84l1n44J13K69Oj01K3j38J23m40K2K13l02m19L49j51
$$ 310 764 567 579 638 1206 822 791 247 360 629 635 534 557 419 542 102 124 337 35 -384 -35 -186
3633a86M69m17J70n2O9j90j03k10rO5l45L15r3M9k39J17k47J02O26m96M55m0j57
$$ -186 283 -134 36 -16 53 -137 -240 -450 -459 -394 -739 -424 -517 -468 -707 -590 -837 -735 -109 -605 -150 -190 -347
3656c47J19j94l05J2L90R7j89L10K8j59Q6J00K83l94n4K44K83p2P3j6J69l7m64
$$ -347 -228 -422 -727 -715 -325 -228 -417 -107 -79 -238 -152 -52 231 -163 -217 27 310 238 311 295 464 427 -37
3679c7M00J45Nmk1K68Q6o3l97j44K01q8J41K70j98K37k60N5j96Qj70j79KN67m30
$$ -37 363 508 513 509 488 756 842 779 382 238 439 351 492 762 564 801 541 596 400 408 238 59 61 628 198
3704A98J08j94%k20K50l69K60m03M35K0n96K82P5l99n7K67k50j12J55j02M3K31
$$ 198 306 112 112 -108 142 -227 33 -370 65 85 -511 -229 -154 -553 -610 -343 -593 -705 -550 -652 -609 -378
3726c78n19J97n6J33l8J60M2K6J91l48K62Q5k60J06K3N45p0n7K00n7Mp5j76R1
$$ -378 -897 -700 -756 -623 -661 -501 -459 -433 -242 -590 -328 -243 -503 -397 -374 171 101 44 244 187 191 116 -60 31
3750C1P61l83J94j07K43l30k9K06J8J46J40km5j18pm22J05J93k23q0Q1Q5J67j56
$$ 31 792 409 603 496 739 409 380 586 604 750 890 888 843 725 718 296 401 594 371 291 372 457 624 468
3774D68l79k02K01k20r3K5NP8j84m6j00K26n97mJ05J37K50j58k53K34n5k84ML10
$$ 468 89 -113 88 -132 -225 -200 -195 -117 -301 -347 -447 -221 -818 -822 -717 -580 -330 -488 -741 -507 -562 -846 -842 -532
3798e32P3q3n3M57r8L8l97L48p4J41K04j01L3K43j80J59J47J34m02J12l7L7K95
$$ -532 -459 -542 -595 -138 -236 -198 -595 -247 -321 -180 24 -77 -44 199 19 178 325 459 57 169 132 169 464
3821D64L75l45J98m80rJ88N7j09J04J46l4o0m27j1rK11R8j26j72L04m54K26j80
$$ 464 839 494 692 212 203 391 448 339 443 589 555 495 68 57 48 259 357 231 59 363 -91 135 -45
3844d5q6N7k29l71M67J42l2k7l44l0MK40k33L21L8P1j25l7j4K41k76m5N23k47
$$ -45 -131 -74 -303 -674 -207 -65 -97 -124 -468 -498 -494 -254 -487 -166 -128 -57 -182 -219 -233 8 -268 -313 210 -37
3868c7k59M97j89Q5J65m52j69N64j57p5L9M3K35n24J82j14J52p1M73l93L07l44
$$ -37 -296 201 12 97 262 -190 -359 205 48 -27 12 55 290 -234 -52 -166 -14 -85 388 -5 302 -42
3890d2j50R7K09O6j7l56j28M27j16R9r8Lj21J14j83K95J20k90n8L02K44m94j67
$$ -42 -192 -95 114 180 163 -193 -321 106 -10 89 -9 -6 -127 -13 -196 99 219 -71 -129 173 417 -77 -244
3913b44j37J78J4J21L3j00J32k5j18K68J7q9Q7J61K83l32n1L1j45k77L65j51L54
$$ -244 -381 -203 -189 -68 -35 -135 -3 -28 -146 122 139 50 137 298 581 249 198 229 84 -193 172 21 375
3936C75k18J87j06k16K57R9m27n5j27K38k07J62N3k19J08l78J76l16L30L2K08
$$ 375 157 344 238 22 279 378 -49 -104 -231 7 -200 -38 15 -204 -96 -474 -298 -614 -284 -252 -44
3957d4j82N0J2l61J6J65l43L27J28J62p1j08M8J25k25J50o3J67M62k60l45K70
$$ -44 -226 -176 -164 -525 -509 -344 -687 -360 -232 -70 -141 -249 -201 -76 -301 -151 -214 -47 415 155 -190 80
3979H0R4K32j9n30N13l94M69m3J55q0q7L1j45M21k42l6l68K25j9J16K47k59j53
$$ 80 174 406 387 -143 370 -24 445 402 557 477 390 421 276 697 455 419 51 276 257 373 620 361 208
4002B08Mm9k2k09K80k92j57J61j64q2k12L70J78j60j51K03j05j73M0k6N0P7m36
$$ 208 212 163 141 -68 212 -80 -237 -76 -240 -322 -534 -164 14 -146 -297 -94 -199 -372 -332 -358 -308 -231 -667
4025f67Q3Q2K58j04J05n7pK05q0J30n5j40J47N0j06J68k15O54k42J52Q8J51k54
$$ -667 -584 -502 -244 -348 -243 -300 -307 -102 -182 -52 -107 -247 -100 -50 -156 12 -203 451 209 361 449 600 346
4048C46j07K88J08k28j6Q2j10J44l36L34L6m13j42J37Q4m0p9Q1K23k66J68j83
$$ 346 239 527 635 407 391 473 363 507 171 505 541 128 -14 123 207 167 88 169 392 126 294 111
4070A11l52K94k79J69j41M4K00m04k45L08R8k13N6J61J41j70p7k7J14Oj45K51
$$ 111 -241 53 -226 -57 -198 -154 46 -358 -603 -295 -197 -410 -354 -193 -52 -222 -299 -326 -212 -206 -351 -100
4092a00P3j69K47l87L13l26L59q8K12p8n8J2J61K77j08j19k28J11l3K22kr9L98
$$ -100 -27 -196 51 -336 -23 -349 10 -78 134 56 -2 10 171 448 340 221 -7 104 71 293 291 192 590
4115E90m49J07K52k00r5k36L85k1Pj36q7J84k28j73J89m7L19l29K01k45j2J65
$$ 590 141 248 500 300 205 -31 354 333 340 204 117 301 73 -100 89 42 361 32 233 -12 -24 141
4137A41k43l3J13J80q4k63j96K72j13l06J84J68L9j4J05k89N25l79K20l24K43
$$ 141 -102 -135 -22 158 74 -189 -385 -113 -226 -532 -348 -180 -141 -155 -50 -339 186 -193 27 -297 -54
4158e4k99n2K39k2j15L03o1J01j32k28L2K78r8J4qJ86O2j52j71l4K65k14J68K57
$$ -54 -353 -405 -166 -188 -303 0 -61 40 -92 -320 -288 -10 -108 -94 -102 84 146 -6 -177 -211 54 -160 8 265
4182B65R0j12l03l7M69k5j62k7j08N1q6L20k37M42k51k39K08J4oo9j49j60L34
$$ 265 355 243 -60 -97 372 347 185 158 50 101 15 335 98 540 289 50 258 272 266 197 48 -112 222
4205B22o2j26K2N3j24M44l32K25k91o9o7K46P5k54k0J95j19l52L96J8j23j74k27
$$ 222 160 34 56 109 -15 429 97 322 31 -38 -105 141 216 -38 -58 137 18 -334 62 80 -43 -217 -444
4228d44j35K44M00m94K58Oq2r0P9q2m3O4j23M72l33l17N96k11j01M8j22K60r9
$$ -444 -579 -335 65 -429 -171 -165 -247 -337 -258 -340 -383 -319 -442 30 -303 -620 -24 -235 -336 -288 -410 -150 -249
4251b49N47o7O3k37J10j14O4M07n06M19j7O8k51N33l28J29J3l00K02k20J19RP1
$$ -249 298 231 294 57 167 53 117 524 18 437 420 488 237 770 442 571 584 284 486 266 385 394 465
4274D65j77M73o1l15m0j48j2m2j48J02l29J33M56o51J59k41L42j95QP8Q5l76j81
$$ 465 288 761 700 385 345 197 185 143 -5 97 -232 -99 357 -294 -135 -376 -34 -229 -221 -143 -58 -434 -615
4297f15K31O7j0k34J1J3n8K11L64m49L50j48L5p6J12J57k64J41j18J34l1L89k77
$$ -615 -384 -317 -327 -561 -550 -537 -595 -384 -20 -469 -119 -267 -232 -308 -196 -39 -303 -162 -280 -146 -177 212 -65
4320f5L2J62J06K66r2j97kL75j44j3k64K07r3J60p8L9P8l9k57L54j1k80P0j33
$$ -65 -33 129 235 501 409 212 210 585 441 428 164 371 278 438 360 399 477 438 181 535 524 244 314 181
4344A81j03J63l10k0j72L79j75k3j79R6l87J21K67Q6r2m54N50l58J6J23J01p8
$$ 181 78 241 -69 -89 -261 118 -57 -80 -259 -163 -550 -429 -162 -76 -168 -622 -72 -430 -414 -291 -190 -268
4366b68J94k77Q8q8M05o62M74k85J91r2L26l0p0N4K39rk02J96L11l23j25J66Q1
$$ -268 -74 -351 -263 -351 54 -608 -134 -419 -228 -320 6 -24 -94 -40 199 190 -12 184 495 172 47 213 294
4389B94J37k50K74j63L26j86k99K87j32j76M75k44n3J41m29J50k69m7p9n8L49
$$ 294 431 181 455 292 618 432 133 420 288 112 587 343 290 431 2 152 -117 -164 -243 -301 48
4410D8j30J25j30k13L37j10j32K01k31o3K29j4j67k27J68P8N2J7o5j74M28k6j88
$$ 48 -82 43 -87 -300 37 -73 -205 -4 -235 -298 -69 -83 -250 -477 -309 -231 -179 -162 -227 -401 27 1 -187
4433a87J26j43M74m17J97J17l96J86K23k77J82L21n87K05K38j17j20p4O5R4J36
$$ -187 -61 -204 270 -147 50 167 -229 -43 180 -97 85 406 -181 24 262 145 25 -49 16 110 246
4454B46j05J17P0K0n1j54J85m3R4o5j34K8k79l5M10mk36L8K9j13p6K73j4l00j42
$$ 246 141 258 328 348 297 143 328 285 379 314 180 208 -71 -106 304 300 64 102 131 18 -58 215 201 -99 -241
4479b41J25L0M9m6l2q5j53K20q7n3L9K17kk21rL26j93j84n4J90J42j1P3r9n9P2
$$ -241 -116 -86 -37 -83 -115 -200 -353 -133 -220 -273 -234 -17 -19 -240 -249 77 -116 -300 -354 -164 -22 -33 40 -59 -118 -46
4505d6k50L38j18K50j40j14K04l17K00k08J80J94J22o3l31L70j22k94M48k81K41
$$ -46 -296 42 -76 174 34 -80 124 -193 7 -201 -21 173 295 232 -99 271 149 -145 303 22 263
4526B63L7j0k42J0K94j77j25j93L36j42K80j43o1L8p7m49L25Q5j29J30k05o6l
$$ 263 300 290 48 58 352 175 50 -143 193 51 331 188 127 165 88 -361 -36 49 -80 50 -155 -221 -224
4549b24J44nJ40r9K32m40J19n9j68J1L76l48m0M0J56M8k03j71J68J13j23K64l67
$$ -224 -80 -85 55 -44 188 -252 -133 -192 -360 -349 27 -321 -361 -321 -165 -117 -320 -491 -323 -210 -333 -69 -436
4572d36l8K33j93J92M69j13l66J80j89K83Q5k4K05J5j89M3Q4Qk30L24N2l4j63
$$ -436 -474 -241 -434 -242 227 114 -252 -72 -261 22 107 83 288 303 114 157 241 249 19 343 395 361 198
4595A98N2K85k23J10j63R6j7k3K49k38N9M1kk42n3J08J24j44o4r5J38j61k19P4
$$ 198 250 535 312 422 259 355 338 315 564 326 385 426 424 182 129 237 361 217 153 58 196 35 -184 -110
4619a10K89k79O7r2l74J41K23J91m45J18k72K63o5j73j59J19o0L73k40Jn2L62
$$ -110 179 -100 -33 -125 -499 -358 -135 56 -389 -271 -543 -280 -345 -518 -677 -558 -618 -245 -485 -484 -536 -174
4641a74r0l70N35k36rj00N29k01J3Q0J41o5j0N0K06j8j05l4L8n2L54Q5l3k4rL53
$$ -174 -264 -634 -99 -335 -344 -444 85 -116 -103 -23 118 53 43 93 299 281 176 142 180 128 482 567 534 510 501 854
4667H54l04j3q4j03k7K35k77J82j47l2J52j25j10k51M72m97K15j81K79k53j54
$$ 854 550 537 453 350 323 558 281 463 316 284 436 311 201 -50 422 -75 140 -41 238 -15 -169
4688a69m0j99J86j46l27J99L01N6j56j42P5N2m19J53N3m30M39J18Q5n9J82k98
$$ -169 -209 -408 -222 -368 -695 -496 -195 -139 -295 -437 -362 -310 -729 -576 -523 -953 -514 -396 -311 -370 -188 -486
4710d86P7L00L3k16j06L43%j95M9M01l24M9M50k26K40Op8l71M94l95K43k10J14
$$ -486 -409 -109 -76 -292 -398 -55 -55 -250 -201 200 -124 -75 375 149 389 395 317 -54 440 45 288 78 192
4733A92L24l87J81OK44k24m6J6J09l3r4j5PJ99r4n41J74j12J69L27l75J59m79
$$ 192 516 129 310 316 560 336 290 306 415 382 288 273 280 479 385 -156 18 -94 75 402 27 186 -293
4756b93L74j67p5N1k7J33j64J82j77j19q2K05l27L57n5N3n9J69k14j87J88j35
$$ -293 81 -86 -161 -110 -137 -4 -168 14 -163 -282 -364 -159 -486 -129 -184 -131 -190 -21 -235 -422 -234 -369
4778c69J38j57J63n4K77jj09L7j45j01K71J54p5j86K32j7k12M03m03N80j14l12
$$ -369 -231 -388 -225 -279 -2 -3 -112 -75 -220 -321 -50 104 29 -157 75 58 -154 249 -154 426 312 0
4800@J05J30j56j04J37l70M05N6l35K20J49j96J79o3QJ76j3j84J92j54k45K38
$$ 0 105 235 79 -25 112 -258 147 203 -132 88 237 41 220 157 165 341 328 144 336 182 -63 175
4822A75L0qo9J10l7j98K06j78J46O5l5k35J72J41n27L28l21R3J85l2O1j52K66
$$ 175 205 197 128 238 201 3 209 31 177 242 207 -28 144 285 -242 86 -235 -142 43 11 72 -80 186
4845A86l26k12j7J89j17P0k01K61K16k98j14j27K81j77k7K61o1r1LJ85k75K0L50
$$ 186 -140 -352 -369 -180 -297 -227 -428 -167 49 -249 -363 -490 -209 -386 -413 -152 -213 -304 -301 -116 -391 -371 -21
4868b1j8k31j30J43j6J84L61m95J26K02k8J76m6m4L97n9k36o0K16k19J04j05L72
$$ -21 -39 -270 -400 -257 -273 -89 272 -223 -97 105 77 253 207 163 560 501 265 205 421 202 306 201 573
4891E73Lj08m33K11K15q9j37J63k23J24K42k53J01j72k16K09j99J93k05r0l43
$$ 573 576 468 35 246 461 372 235 398 175 299 541 288 389 217 1 210 11 204 -1 -91 -434
4912d34L74J99n69M09j60j74R4j63JK5jK9L8k45n3J88J12K13r6r6k61K84j58Q
$$ -434 -60 139 -430 -21 -181 -355 -261 -424 -423 -398 -399 -370 -332 -577 -630 -442 -330 -117 -213 -309 -570 -286 -444 -436
4936d36K29qj21QN7J75NL2l1K68k17L08j06o2J42M8P0k71L11k4j10j24K23m6J72
$$ -436 -207 -215 -336 -328 -271 -96 -91 -59 -90 178 -39 269 163 101 243 291 361 90 401 377 267 143 366 320 492
4961D92pr3n17P71l85M0k45L23l3k73Q7J59j40j74j65J30kJ20J22j36k4m6l79
$$ 492 485 392 -125 646 261 301 56 379 346 73 160 319 179 5 -160 -30 -32 88 210 74 50 4 -375
4984c75J93K09J3j39l98L82J41l81J8pK28l36Q3K02l65N59m88M00r0K16m45m20
$$ -375 -182 27 40 -99 -497 -115 26 -355 -337 -344 -116 -452 -369 -167 -532 27 -461 -61 -151 65 -380 -800
5006h00R33m97J74L26j28k57N6K3o6K76j73n7L50L5k3R1m07L07O5Q5l99J11J5
$$ -800 133 -364 -190 136 8 -249 -193 -170 -236 40 -133 -190 160 195 172 263 -144 163 228 313 -86 25 40
5029D0J55j13N02o13L63p9q8q4M03K99n72J44j43j98N19j16q1%j93J64K44k61
$$ 40 195 82 584 -29 334 255 167 83 486 785 213 357 214 16 535 419 338 338 145 309 553 292
5051B92o9L9n01M49j14k5n4M5P4j36l23M0j57M00j62k5K71l37J05p6l5l0Pj34
$$ 292 223 262 -239 210 96 71 17 62 136 0 -323 -283 -440 -40 -202 -227 44 -293 -188 -264 -299 -329 -322 -456
5075d56j50J28M03j09l67J65j27K30L9l09N22k66o7j2M42j68k14Q9K36Q5P4j24
$$ -456 -606 -478 -75 -184 -551 -386 -513 -283 -244 -553 -31 -297 -364 -376 66 -102 -316 -227 9 94 168 44
5097D4K3N9j62L98r4k3l4Q9k15K99l0r2R9J10L2k04L59k58J32K28j14k85K01j43
$$ 44 67 126 -36 362 268 245 211 300 85 384 354 262 361 471 503 299 658 400 532 760 646 361 562 419
5121D19p0p8J04N5j38L2k18j29j66r5K89p9j66j18j20K72j13j73j10J54j14QL08
$$ 419 349 271 375 430 292 324 106 -23 -189 -284 5 -74 -240 -358 -478 -206 -319 -492 -602 -448 -562 -554 -246
$$ [...]
8191d6
##END NTUPLES=NMR FID
##END=
