##TITLE=1H_LR-676-R2-H1
 CDCl3, 8 sc, 
 2.7.2019
##JCAMPDX= 6.0         $$ Bruker NMR JCAMP-DX V2.0
##DATA TYPE= NMR FID
##DATA CLASS= NTUPLES
##ORIGIN= UXNMR, Bruker Analytische Messtechnik GmbH
##OWNER= root
$$ XWIN-NMR		Version 3.5
$$ Tue Jul  2 15:13:22 2019 Russian Standard Time (UT+4h)  she@DPX200
##.OBSERVE FREQUENCY= 200.13155
##.OBSERVE NUCLEUS= ^1H
##.DELAY= (6, 6)
##.ACQUISITION MODE= SIMULTANEOUS
##.ACQUISITION SCHEME= undefined
##.AVERAGES= 8
##.DIGITISER RES= 18
##SPECTROMETER/DATA SYSTEM= spect
##.PULSE SEQUENCE= zg30
##.SOLVENT NAME= CDCl3
##.SHIFT REFERENCE= (INTERNAL, CDCl3, 0, 15.7039)
##AUDIT TRAIL= $$ (NUMBER, WHEN, WHO, WHERE, WHAT)
$$ ##TITLE= Audit trail, XWIN-NMR		Version 3.5
$$ ##JCAMPDX= 5.01
$$ ##ORIGIN= Bruker BioSpin GmbH
$$ ##OWNER= she
$$ F:/spectra/data/she/nmr/H-F/1/audita.txt
$$ ##AUDIT TRAIL=  $$ (NUMBER, WHEN, WHO, WHERE, WHAT)
(   1,<2019-07-02 15:12:18.84 +0400>,<she>,<DPX200>,
      <created by zg, POWCHK disabled, PULCHK disabled
       configuration hash MD5:
       00 E9 B6 7A A2 85 ED C7 34 08 36 98 17 FE 4E 26
       data hash MD5: 16K
       03 21 0E 27 C3 54 55 A3 01 4F CB 0E 82 55 4B AC>)
$$ ##END=
$$ 
$$ hash MD5
$$ 43 D3 BF AE E2 14 66 A3 28 2F B8 B7 17 D9 DD E6
##$RELAX= 
##$RELAX= 
##$RELAX= 
##$RELAX= 
##$RELAX= 
##$RELAX= 
$$ Bruker specific parameters
$$ --------------------------
##$DU= <F:/spectra>
##$EXPNO= 1
##$NAME= <H-F>
##$PROCNO= 1
##$TYPE= <nmr>
##$USER= <she>
##$AMP= (0..31)
100 100 100 100 100 100 100 100 100 100 100 100 100 100 100 100 100 100 
100 100 100 100 100 100 100 100 100 100 100 100 100 100 
##$AQSEQ= 0
##$AQ_mod= 1
##$AUNM= <au_zg>
##$AUTOPOS= <>
##$BF1= 200.13
##$BF2= 200.13
##$BF3= 200.13
##$BF4= 200.13
##$BF5= 200.13
##$BF6= 200.13
##$BF7= 200.13
##$BF8= 200.13
##$BYTORDA= 1
##$CFDGTYP= 0
##$CFRGTYP= 5
##$CHEMSTR= <none>
##$CNST= (0..31)
1 1 145 1 1 1 1 1 1 1 1 1 1 1 1 1 1 1 1 1 1 1 1 1 1 1 1 1 1 1 1 1 
##$CPDPRG= <>
##$CPDPRG1= <>
##$CPDPRG2= <>
##$CPDPRG3= <>
##$CPDPRG4= <mlev>
##$CPDPRG5= <mlev>
##$CPDPRG6= <mlev>
##$CPDPRG7= <mlev>
##$CPDPRG8= <mlev>
##$CPDPRGB= <>
##$CPDPRGT= <>
##$D= (0..31)
0 1.2 0 0 0 0 0 0 0 0 0 0.03 0 0 0 0 0 0 0 0 0 0 0 0 0 0 0 0 0 0 0 0 
##$DATE= 1562065938
##$DBL= (0..7)
120 120 120 120 120 120 120 120 
##$DBP= (0..7)
150 150 150 150 150 150 150 150 
##$DBP07= 0
##$DBPNAM0= <>
##$DBPNAM1= <>
##$DBPNAM2= <>
##$DBPNAM3= <>
##$DBPNAM4= <>
##$DBPNAM5= <>
##$DBPNAM6= <>
##$DBPNAM7= <>
##$DBPOAL= (0..7)
0.5 0.5 0.5 0.5 0.5 0.5 0.5 0.5 
##$DBPOFFS= (0..7)
0 0 0 0 0 0 0 0 
##$DE= 6
##$DECBNUC= <off>
##$DECIM= 24
##$DECNUC= <off>
##$DECSTAT= 4
##$DIGMOD= 1
##$DIGTYP= 9
##$DL= (0..7)
0 120 120 120 120 120 120 120 
##$DP= (0..7)
150 150 150 150 150 150 150 150 
##$DP07= 0
##$DPNAME0= <>
##$DPNAME1= <>
##$DPNAME2= <>
##$DPNAME3= <>
##$DPNAME4= <>
##$DPNAME5= <>
##$DPNAME6= <>
##$DPNAME7= <>
##$DPOAL= (0..7)
0.5 0.5 0.5 0.5 0.5 0.5 0.5 0.5 
##$DPOFFS= (0..7)
0 0 0 0 0 0 0 0 
##$DQDMODE= 0
##$DR= 18
##$DS= 0
##$DSLIST= <SSSSSSSSSSSSSSS>
##$DSPFIRM= 0
$$ [...]
##$SUBNAM2= <"">
##$SUBNAM3= <"">
##$SUBNAM4= <"">
##$SUBNAM5= <"">
##$SUBNAM6= <"">
##$SUBNAM7= <"">
##$SUBNAM8= <"">
##$SUBNAM9= <"">
##$SW= 24.9336996594482
##$SWIBOX= (0..15)
0 0 2 0 0 0 0 0 0 0 0 0 0 0 0 0 
##$SW_h= 4990.01996007984
##$TD= 16384
##$TD0= 1
##$TE= 0
##$TE2= 300
##$TE3= 300
##$TEG= 300
##$TL= (0..7)
0 120 120 120 120 120 120 120 
##$TP= (0..7)
150 150 150 150 150 150 150 150 
##$TP07= 0
##$TPNAME0= <>
##$TPNAME1= <>
##$TPNAME2= <>
##$TPNAME3= <>
##$TPNAME4= <>
##$TPNAME5= <>
##$TPNAME6= <>
##$TPNAME7= <>
##$TPOAL= (0..7)
0.5 0.5 0.5 0.5 0.5 0.5 0.5 0.5 
##$TPOFFS= (0..7)
0 0 0 0 0 0 0 0 
##$TUNHIN= 0
##$TUNHOUT= 0
##$TUNXOUT= 0
##$USERA1= <user>
##$USERA2= <user>
##$USERA3= <user>
##$USERA4= <user>
##$USERA5= <user>
##$V9= 5
##$VALIST= <valist>
##$VCLIST= <CCCCCCCCCCCCCCC>
##$VD= 0
##$VDLIST= <DDDDDDDDDDDDDDD>
##$VPLIST= <PPPPPPPPPPPPPPP>
##$VTLIST= <TTTTTTTTTTTTTTT>
##$WBST= 1024
##$WBSW= 4
##$XGAIN= (0..3)
0 0 0 0 
##$XL= 0
##$YL= 0
##$YMAX_a= 308772
##$YMIN_a= -598362
##$ZGOPTNS= <>
##$ZL1= 120
##$ZL2= 120
##$ZL3= 120
##$ZL4= 120
##$ABSF1= 10
##$ABSF2= 0
##$ABSG= 5
##$ABSL= 3
##$ALPHA= 0
##$AQORDER= 0
##$ASSFAC= 0
##$ASSFACI= 0
##$ASSFACX= 0
##$ASSWID= 0
##$AUNMP= <proc_1d>
##$AZFE= 0.1
##$AZFW= 0.1
##$BCFW= 1
##$BC_mod= 2
##$BYTORDP= 1
##$COROFFS= 0
##$CY= 11.3945322036743
##$DATMOD= 1
##$DC= 2
##$DFILT= <>
##$DTYPP= 0
##$F1P= 18.9103706918063
##$F2P= -1.10871071338519
##$FCOR= 0.5
##$FTSIZE= 0
##$FT_mod= 4
##$GAMMA= 1
##$GB= 0.15
##$INTBC= 1
##$INTSCL= 1
##$ISEN= 128
##$LB= 0.24
##$LEV0= 0
##$LPBIN= 0
##$MAXI= 10000
##$MC2= 0
##$MEAN= 0
##$ME_mod= 0
##$MI= 1.114404
##$NCOEF= 0
##$NC_proc= 0
##$NLEV= 6
##$NOISF1= 3.799351
##$NOISF2= 2.8
##$NSP= 1
##$NTH_PI= 0
##$NZP= 0
##$OFFSET= 15.70392
##$PC= 1
##$PHC0= -8498.674
##$PHC1= 12.40097
##$PH_mod= 1
##$PKNL= yes
##$PPARMOD= 0
##$PSCAL= 0
##$PSIGN= 0
##$REVERSE= no
##$SF= 200.130013532006
##$SI= 16384
##$SIGF1= 3
##$SIGF2= 2
##$SINO= 400
##$SIOLD= 16384
##$SREGLST= <1H.CDCl3>
##$SSB= 0
##$STSI= 0
##$STSR= 0
##$SW_p= 3612.71676300578
##$SYMM= 0
##$S_DEV= 0
##$TDeff= 0
##$TDoff= 0
##$TI= <>
##$TILT= no
##$TM1= 0
##$TM2= 0
##$TOPLEV= 0
##$USERP1= <user>
##$USERP2= <user>
##$USERP3= <user>
##$USERP4= <user>
##$USERP5= <user>
##$WDW= 1
##$XDIM= 8192
##$YMAX_p= 0
##$YMIN_p= 0
$$ End of Bruker specific parameters
$$ ---------------------------------
##NTUPLES= NMR FID
##VAR_NAME=  TIME,          FID/REAL,        FID/IMAG
##SYMBOL=    X,             R,               I
##VAR_TYPE=  INDEPENDENT,   DEPENDENT,       DEPENDENT
##VAR_FORM=  AFFN,          ASDF,            ASDF
##VAR_DIM=   8192,          8192,            8192
##UNITS=     SECONDS,       ARBITRARY UNITS, ARBITRARY UNITS
##FACTOR=    0.0002004,     1,               1
##FIRST=     0,             0,               0
##LAST=      1.6414764,     0,               0
##MIN=       0,             -598362,         0
##MAX=       1.6414764,     308772,          0
$$ Real data points
##PAGE= N=1
##DATA TABLE= (X++(R..R)), XYDATA
$$ [...]
1909A182P74J073q2j774j075O47J106J005k65j187n49k25Q66J57l14j255q45N01
1927b60J692N64j350j685p34Q58R85N9p37p77m91P21J146J31j179j613l36J388
1945a618J233M5j059o36L50Q24O03k73r93p58N90J451J250m83j186r22P85R53
1963A56P07k50r74j52P42J009K27o31j289N7P07J354P4q66n25pN51N90m51n49
1983D80m88m8P96O93J4j168k90P6K47J26l34n69K64L01M03J90m61p09l10l3O78
2004a42L03l59j89K25K60j58o7o15J51j1R7N24L19m08l66r7P39%m23l49K12N57
2026B03J5O4j81j10l00J1J91j5mJ9J2N43k3n68rm01J39M42J45k5l43J31j6n2n6
2051a88L3r7p4O1M90L85l23n51k23N11J43J25o12J92L82K69oM6k85o54L50J08
$$ y = [1182, 1956, 3029, 2947, 1173, 98, 745, 1851, 2856, 2591, 1404, 855, 630, 1496, 1653, 1339, 84, -761, -260, 1432, 1996, 646, -1039, -1773, -915, 70, 129, -608, -1385, -1876, -1155, -9, 122, -1057, -2670, -3006, -1618, -385, -340, -1399, -2035, -1685, -861, -258, -531, -1524, -2282, -1692, -241, 1009, 526, -660, -1582, -797, 156, 863, 613, -361, -513, 229, 1238, 1465, 834, -455, -398, 309, 1663, 1737, 871, 346, 339, 890, 1480, 1029, 480, -8, -56, 740, 1433, 1447, 279, -11, 65, 312, 438, 104, -465, -201, 100, 503, 693, 232, -477, -787, -820, -142, 161, -198, -387, -162, 98, -60, -127, -742, -591, -602, -505, 19, 338, -70, -436, -533, 206, 206, -217, -566, -354, 203, 218, 282, 101, -9, -309, -298, -107, -122, -126, -107, -95, 448, 425, -143, -152, -553, -414, 28, 173, 148, -195, -64, -80, -132, -188, -155, -252, -326, -265, 225, 610, 287, -264, -487, 24, 167, 292, -320, -128, 254, 523, 517, 563, 278, -376, -26, 82]
2073H2M24L90p27k97L10O01n3o24m36R4M80M2J18P6m13m39J40N34K35o42o06K78
2095d33P52J77o29n25j0L04m3K70J49j41o18K0N48N62o78n70J76P91M44k05o37
2116b96k0L54k36j7M85p0j05m93O95N77m16o73k65O46N57k15o20K65K02J32l85
2137A02L55k41j63l99M38N11K02q72l45J64O51k89m59j91K13J92p1J35J23k63
2157b07o47J90L09J99k48k58L65N93J9o67j32K10R0N0lK74J1j80Q2K40K47l96
2179A41m15L30N27M21n10k59N29p7k80l92J72K70q9Q7K83qm5o70k34N48l7m00
2201a08j97M77K53n0m54m12rn4j42O4L28k60k01N0N64k0o14n20L33M36J23R9j57
2224d71p1j51PJ82J05m8k11K41O05O02m85m36l79K69N59J49J29p6Q3k49M30M62
$$ y = [82, 506, 896, 169, -128, 182, 783, 730, 106, -330, -236, 244, 286, 404, 480, 67, -372, -232, 302, 537, -105, -711, -433, 319, 496, -133, -658, -668, -364, -407, -137, 12, -129, -747, -727, -179, 383, -295, -865, -689, 102, 546, 341, -296, -316, 38, -198, -215, 270, 200, 95, -398, 297, 874, 458, -215, -480, 166, 723, 508, -112, 153, 355, 487, 102, 457, 216, 53, -346, 92, 603, 805, -67, -412, -248, 403, 114, -345, -536, -323, -131, -202, -67, 56, -207, -854, -664, -355, -156, -404, -662, -297, 296, 315, -352, -484, -274, -184, -134, -137, 137, 148, -32, 50, 290, 537, 141, -274, 56, 583, 1004, 494, 235, 764, 687, 407, 15, 187, 457, 368, 455, 738, 730, 685, 15, -219, 329, 292, -108, -305, 172, 425, 375, -79, -491, -500, -554, -696, -632, -304, -564, -765, -715, -151, -171, -785, -1305, -972, -536, -413, -314, -471, -542, -693, -686, -504, -399, -447, -658, -417, 188, 790, 305, -131, -510, -241, 318, 467, 596, 520, 603, 354, 784, 1246]
2246A246l26m59m09M57O90K78k38o92l8q1L15m4j76m07k21M22O77K10p37q23k62
2267f18R1P46pl53k90j00L83J12k37m80q25j26J117P48l3q61m06K6M56Q4L27n52
2289g98p14N21Q53P88l10p25n66j06R53N55P0n35l07L28P44L82o59p82n02P26
2309h4J108O04m58r21l49M1P25J73k67q29m7P12J121l45p70j086p4M14J050J98
2329I16p00p35P7P60M73l60r89n92L31P89N72J60p71m82k02O75J35j84n75l39
2349a041O64R09M50m81r42o05j3Q45L77L06n52m11K42O13J77n59o77l05O85P05
2369C87K23p6p09l00LL52N66n15n16j39O19Q22M9p45m87j06R0J83L80K57j33m14
2391b09j90P11m7n53l90K43O85N67l73K27l74l28n46L42Q84p0o30j89N86N36k07
$$ y = [1246, 920, 461, 52, 509, 1199, 1477, 1239, 547, 509, 428, 743, 699, 523, 116, -105, 317, 994, 1204, 467, -356, -618, -527, 219, 212, -141, -431, -531, -148, -36, -273, -753, -1578, -1704, -587, 161, 128, -733, -1139, -1113, -657, -573, -246, -798, -1512, -991, -138, 650, 340, -385, -951, -1057, -104, 451, 521, -14, -321, 7, 751, 1133, 474, -308, -810, -84, 1024, 1628, 1170, 249, -100, -59, 666, 839, 572, -257, -304, 408, 1529, 1184, 414, -672, -746, -332, 718, 916, 216, -519, -442, 318, 791, 431, -558, -1150, -819, -30, 542, 702, -69, -551, -753, -78, 57, -127, -702, -1041, -377, 532, 982, 501, -441, -1046, -1059, -214, 163, 469, -83, -494, -252, 361, 538, -21, -698, -1003, -318, 387, 610, 534, -175, -475, -472, -120, 446, -69, -585, -724, -105, 717, 766, 21, -466, -572, -482, -299, 81, 338, 205, -209, -399, 312, 265, -288, -678, -435, 250, 817, 444, 671, 297, -31, -577, -235, 649, 579, -51, -240, 346, 882, 675]
2412F75o58k74K41m9J76M89K63m63p66J50M39L37o16o74K28P23J64P5l54j52p12
2433g58q1K92O86J49l88n19N38N35n43l82l33n1M27K04O15J83m62o53k72N58O24
2454C69k76o71J66N50L92P7k01m52k74j26M35N12K12l41p62N82N29j24n11n27
2474d41J1M95M26L32M1q00n80k38Q02L20m15m73J32Q22J00j92n83o37j11M41M73
2495g5M56l62m27j43N35N24k25j028M9L28N15M33j73l16k84j29J89M63J08n14
2515g6r1O21O65J31o71o87j74J13M34N43L1l59j60j31K94J7k84q77J27O15O28
2536G09k01l53n63m4P4J8r6j83J34k44N00M17l12p40k15o0L81K50M5j7M6L05n2
2559b01r6k46m98J34N78N47M44k88n04k94L95r8K38J37L5N52J31L8J30k49l83
$$ y = [675, 17, -257, -16, -65, 111, 600, 863, 400, -366, -216, 223, 560, -56, -730, -502, 221, 385, 460, 106, -46, -758, -839, -547, 139, 288, -100, -619, -81, 454, -89, -471, -804, -855, -428, -224, 391, 574, 112, -541, -813, -255, 369, 93, -578, -412, 138, 530, 607, 406, -46, -320, -446, -11, 501, 713, 372, -390, 192, 721, 597, 86, -441, -430, 65, 491, 823, 864, 64, -516, -754, 48, 368, -47, -520, -388, 434, 534, 342, -241, -878, -989, -548, -75, 381, 19, -408, -551, -16, 508, 283, -745, -696, -368, 147, 580, 407, 91, -193, -322, -133, 330, 438, -76, -167, 454, 1119, 1250, 579, -108, -282, -169, 265, 808, 839, 480, 320, 189, 483, 500, 216, -661, -534, 81, 709, 508, 155, -408, -452, -378, -360, -456, -639, -505, -749, -249, 168, -144, -884, -1099, -1159, -778, -528, -483, -500, -454, -149, -201, -297, -543, -1041, -907, -329, 218, 662, 374, -130, -424, -29, -127, 111, 248, 283, 835, 966, 1004, 1134, 885, 502]
2580E02j40N33J92m2R6J40Q5k46k21k98m3l08J97R7J96Q4k34j59k02m77m05P9
2602e74K61J44P5l2j26n22n37j2Q0M1K24R6j02J29K8k80j24k22L10L7R0L05J02
2625f09J38j54O4M0j23L9j71P04K99P7Q0J23o9j75j00L43K43J8L95M0K91k82l25
2648H86k59J16K57K84o4J54j33q5k62k09J00k21k69L19L42N8n06j94k08j37Q0
2669D9l26p2Q1J40k78J4K17n87l74j88N8N56o0j77J36J97j86k16k95L4l2N3K77
2692i79M73K90m58j56q3J39O9Q7k02M73O04r7q0l07J96m5r8N08K26j8j40J20K92
2715H14R9l77k28M9K61J23L13K29j51k92o7P9n3j12p0M9L60P7K4m98k39K5k85
2738A30J9K93P2Mp1n19J72j78l66k89R3M91p3j80L5Kl25l22q6K01N0l07n4M41
$$ y = [502, 362, 895, 1087, 1045, 1141, 1281, 1366, 1120, 899, 601, 558, 250, 447, 544, 740, 824, 590, 431, 229, -248, -653, -574, -313, -169, -94, -126, -252, -774, -1311, -1323, -1243, -1202, -978, -882, -984, -855, -827, -1107, -1231, -1453, -1143, -1106, -1016, -711, -609, -471, -625, -561, -521, -644, -605, -776, -72, 227, 304, 384, 507, 438, 263, 163, 506, 749, 767, 1162, 1202, 1493, 1211, 886, 627, 743, 1000, 1284, 1220, 1374, 1241, 1156, 894, 685, 785, 564, 295, 614, 956, 1014, 508, 314, 106, -31, 49, -277, -349, -268, -128, -406, -392, -175, -762, -1136, -1324, -1266, -710, -770, -947, -811, -614, -800, -1016, -1311, -1277, -1309, -1256, -979, -506, -216, -674, -830, -913, -774, -705, -618, -820, -347, 257, 160, 80, -227, -31, -76, -174, 334, 560, 542, 402, 522, 814, 913, 536, 308, 357, 618, 741, 1054, 1283, 1132, 840, 773, 852, 799, 687, 617, 666, 1026, 1103, 1127, 629, 390, 415, 130, 149, 442, 514, 518, 447, -72, 100, -78, -444, -733, -640, -149, -222, -402, -367, -365, -690, -1012, -1098, -897, -847, -1154, -1208, -767]
2762g67J64r0n30J16j38m9K7P4N94K86l89RM6K12l99K05K69K98K30J04o4J54l91
2785b9Q1r7O28K88j31L7J41K67j69nK8j11j06k4K10P02j78l84l09L07q8l55j11
2808E92M6M43q6j47j44On34n14K44N0L5K7l06jO0l31l71l86L01j37%J47L56l73
2832a023l36j72K85K27k50j78K88K30K54J3N0l15k01K8M29M24J12J19m07O59J19
2853C55J14l24j39J76K42L56L60J6l74k02K88R5K03m9k06NN07p0R1m44l30m29
2875B41L76M09K1j96p45J64L27j97J28n95l09O6L11L38j46m80l52j21J56J42k30
2896f92j69j16P2M78N7m44k95r0J69K98L64M2l66l2K44N1O0j93j68J7M37L84J74
2919B82k69j68j25J37J15J12l9j03Q4K91L71j67j13k74P7j71K88J65J10j88q6
$$ y = [-767, -603, -693, -1223, -1107, -1245, -1294, -1267, -1193, -599, -313, -702, -693, -647, -435, -834, -629, -360, -62, 168, 272, 208, 362, -29, 52, -45, 583, 871, 740, 777, 918, 1185, 1016, 1011, 1039, 928, 822, 798, 1008, 1710, 1532, 1148, 839, 1146, 1058, 703, 592, 638, 1081, 995, 848, 704, 710, 176, -338, -94, -44, -9, 18, -288, -289, -229, -560, -931, -1317, -1016, -1153, -1153, -1006, -650, -1023, -1359, -1531, -1246, -1019, -1269, -1447, -1159, -929, -675, -662, -612, -927, -1128, -1100, -671, -247, -135, -16, -423, 236, 355, 469, 145, 6, 182, 424, 780, 1140, 1156, 782, 580, 868, 963, 1166, 1117, 911, 916, 1423, 1353, 1444, 1000, 670, 241, 617, 1026, 1047, 851, 106, 270, 597, 400, 528, -67, -376, -310, 1, 339, 193, -287, -639, -760, -604, -462, -692, -861, -977, -905, -427, -370, -814, -1109, -1199, -1030, -732, -368, -326, -692, -724, -480, -429, -369, -562, -730, -713, -276, 108, 282, 13, -155, -280, -143, -28, 84, 45, -58, 26, 317, 688, 521, 408, 134, 211, 40, 328, 493, 603, 415, 329]
2940C29L07j54j98j27P0J27n1K21j82J24l27j80K91k8p3J8j39K61j9n8m3r3j36
2963f0l0K23J66q6j29J27m0j15K51n63L67l46J37K44q7J14k32k19l3K0%j27r1
2986e09J69l4J34k06J23k45j03O1L5K25l7k1j18J03k67J98j32rL10k47J24K21
3008b25j35J41j77K20J59k9J40O6P9J80q2K1q0J48Q1r9L10O1J42j9J3J96n20Q4
3032F75N3J1L6Q1J3O0j81k07R2q2n6jo9q5k76jr4JK4j43k54q6j9R2j80o3j01k78
3060a038j4j1K02k06l4J24K85r6Ll23K4O5K85K10n7NQ7k0L17l74Q9O3J02L12K84
3085B84l0o2K42R7m6P6k3K25M9n0L84j22J58j87j01J6k4K48k1j03j63K65j48m13
3109E51J13N9k73K7L9j09J30k45k03L1k82j1k56J70j19J40r0l48P6q1l9k00K57
$$ y = [329, 636, 482, 284, 157, 227, 354, 303, 524, 342, 466, 139, -41, 250, 222, 149, 167, 28, 289, 270, 212, 169, 76, -60, -90, 133, 299, 213, 84, 211, 171, 56, 307, -256, 111, -235, -98, 146, 59, 173, -59, -278, -311, -291, -291, -418, -509, -340, -374, -240, -446, -323, -568, -671, -610, -575, -350, -387, -408, -526, -423, -690, -492, -624, -633, -323, -570, -446, -225, -360, -219, -396, -176, -17, -46, 94, 160, 239, 419, 337, 358, 278, 426, 507, 408, 718, 779, 921, 902, 915, 1111, 591, 675, 728, 739, 775, 856, 869, 929, 748, 541, 633, 551, 495, 494, 425, 340, 64, 63, -31, -30, -6, -149, -403, -489, -508, -416, -596, -659, -760, -1038, -1052, -1063, -861, -1067, -1101, -977, -692, -788, -785, -1108, -1084, -1019, -734, -524, -581, -576, -489, -509, -192, -566, -477, -414, -312, 0, 284, 254, 192, 434, 531, 485, 561, 538, 763, 812, 762, 1146, 1024, 1182, 995, 894, 910, 886, 1134, 1113, 1010, 847, 1112, 964, 551, 664, 723, 450, 477, 516, 407, 537, 292, 89, 120, -162, -173, -429, -259, -378, -238, -328, -676, -600, -681, -720, -920, -663]
3132f63r9j72M6Q0m1p7j28j3L09L0l9J16j82J58L04j46O7K43j84o9O4L61J21J21
3156B07l71Q3M3K23j0K04l2J22P1K39j1o8j93k49O02L8Oj93M8J67O9J56k70o6
3180H15J09j18j96K50k3k21m8j07j73R4p7j73O7N7j68l0J0l60J48l01Q6Q9l69
3203f39P5L0mj40k12O8k38K29L2j24J63R3k04r2j20J80K15K3m03K27P8M77m01
3226f87P0K34j96J05L89j13J66Mk6K82L48k58J5J14K31O3J68J19K6o3lJ40LJ76
3250A307p7j73l5J10k8o3l9j49KQj12l14K29j49j68k39O9j65j89m2k16L8k10L
3274f02j55j01M8j21k70k3q0K68q8L1Q3j81n8Q6lj05J49R0J36J62J19K2j57J65
3298e85K19J76j49L92l1K11N3J7R6J78K11l7J58M3j09J90M4N3M7k27N9j27K54
$$ y = [-663, -762, -934, -888, -808, -849, -926, -1054, -1067, -758, -728, -767, -651, -833, -675, -371, -517, -450, -207, -391, -460, -396, -35, 86, 207, -164, -81, -38, 185, 175, 379, 347, 469, 540, 779, 768, 700, 507, 258, 860, 898, 904, 711, 759, 926, 995, 1151, 881, 815, 924, 806, 610, 860, 837, 616, 568, 461, 288, 382, 305, 132, 199, 256, 88, 58, 68, -292, -144, -445, -359, -270, -639, -564, -534, -538, -678, -890, -822, -1060, -831, -799, -923, -760, -667, -871, -963, -1083, -903, -688, -665, -1068, -841, -763, -286, -687, -617, -383, -579, -474, -85, -198, -32, -28, -54, 228, 576, 318, 333, 447, 678, 741, 909, 1028, 1054, 991, 988, 1128, 1131, 1307, 1230, 1057, 1022, 1132, 1104, 1041, 1002, 853, 855, 863, 751, 437, 666, 517, 349, 110, 179, 14, -175, -217, -433, -395, -605, -602, -757, -858, -810, -931, -1201, -1224, -1304, -1036, -1124, -1093, -1010, -1191, -1249, -1163, -1166, -1271, -1122, -1032, -896, -734, -615, -593, -750, -585, -366, -190, -339, 53, 22, 233, 286, 303, 399, 577, 788, 751, 909, 952, 843, 1033, 1077, 1130, 1177, 950, 1009, 882, 1136]
3321A136j9p6j2k40Q9k76K29Q8m43J00j95N4j72q9p9l10O4j33Q6j40r3k53K8J58
3345d98p1k01k22J00M9j79K23n7j58J3K50p7q4K15j85K51j10M02K18j47M6K8R4
3368a00J92jQ4L3K8L46m8L6l03O7J13L72j46j49K69k42J40J5m2P2k31q7R4J04
3392F16j57k3j24N9k29j33J18k0l2n4J62j39N3k42L1j73J5m7J4o6J71k08R6J55
3416a57j68K6k97J63K16M8R5k67J86j51K00j68J08J38P6k1k29K30O1k07n0J68
3438@o9K42r2m3M5J99j95P6M6O9k67j18K25r7J99j78j71J26l3j66N3K51Qj78N8
3463a0j67J61O1q5j7J35j35J37R1K4q7k36J34R3j40K56j97K15j26N1N0PJj08p5
3488C3J17J25N5J1k28oJ88k30M3KJ6J43j52n1%m9k47J36Q7j03j56R9K20r3j82
$$ y = [1136, 1117, 1041, 1029, 789, 878, 602, 831, 919, 476, 576, 381, 435, 263, 174, 95, -215, -151, -284, -198, -338, -431, -684, -656, -498, -569, -770, -992, -892, -843, -1022, -799, -856, -1014, -1001, -751, -828, -912, -697, -882, -631, -741, -339, -121, -268, -222, -194, -100, 92, 91, 175, 208, 236, 582, 534, 570, 267, 334, 447, 819, 673, 524, 793, 551, 691, 706, 664, 736, 505, 418, 512, 616, 459, 436, 312, 371, 142, 9, 127, 107, 75, 21, 183, 44, 97, -145, -114, -287, -272, -319, -305, -371, -200, -408, -312, -157, -325, -299, -596, -433, -217, -169, -74, -341, -155, -306, -106, -274, -166, -28, 48, 27, -202, 28, 89, -118, -168, 0, -69, 173, 81, 38, 83, 282, 87, 163, 209, 278, 11, -107, 118, 21, 220, 42, -129, -3, -36, -202, -149, 102, 110, -68, -10, -177, -16, 45, -40, -57, 78, -57, 80, 171, 195, 108, -128, 6, 99, -41, 215, 18, 233, 107, 158, 208, 215, 216, 108, 33, 150, 275, 330, 341, 113, 107, 295, 65, 108, 110, 126, 269, 117, 66, 66, 17, -230, -94, -7, -110, -266, -167, 53, -40, -222]
3513b22on7j17N7K02k59R9J59j29J15j16M3r2j3J44J09l4R3O8j12K06l38J86K8
3537A4k1J1P4j3Q1qn5p9J36M7L7n7J74k46J6J33k99L32j59J39rr8m3J30K1k21
3563C7K62j91l4K5J10P9r6L2kj22P7j61J7Q3J64j56J9j56O7K7O0k11j61K71J18
3588A58p0j8j46N5k42J48m9nk5k65K87J67j51j96r2K20k08j8j8K00Q0O9r0n4o7
3613c30J01j35L4R8K86j81J36J39o5lj64J75j3L3j20K63J20o8K4j37l8K85j3J40
3637E67j94R8j4o6J2K7n6q2O0R3j33L25k77Q9j36K7n38J88P7o6r2K9K08l25k16
3662c95j28N0o6J92J97k99j00J78j87k9mj2oJ46K6J10l21Q9j4j7J5K80j96K55
3686b36L8R6N7n3j09J47O0M2J3K24K19j44K75j73o6j0M0Q2K17k6j5O2Lk9k90J86
$$ y = [-222, -228, -285, -402, -345, -143, -402, -303, -144, -273, -158, -274, -231, -323, -336, -192, -83, -117, -24, 44, -68, 138, -200, -14, 14, -7, 4, 78, 65, 146, 138, 83, 4, 140, 187, 224, 167, 341, 95, 111, 244, -55, 277, 118, 257, 248, 150, 107, 237, 258, 37, 299, 108, 74, 99, 209, 288, 192, 224, 222, 100, 177, 16, 33, 116, 280, 124, 143, -13, 54, 81, 141, -70, -231, 40, 158, 88, 70, -76, -21, -263, -115, -164, -169, -194, -459, -172, -5, -156, -352, -444, -224, -432, -450, -468, -268, -188, -119, -209, -263, -330, -229, -364, -330, -232, 54, -127, 9, 148, 83, 80, -84, 91, 78, 111, -9, 254, 374, 306, 330, 193, 155, 440, 427, 567, 373, 471, 457, 391, 403, 430, 374, 292, 352, 445, 312, 637, 360, 449, 313, 340, -198, -10, 67, 1, -91, -62, 146, -179, -395, -523, -473, -539, -347, -150, -449, -549, -371, -558, -587, -591, -603, -609, -463, -437, -327, -648, -559, -573, -590, -575, -295, -491, -236, -198, -102, -45, -98, -207, -60, 0, 42, 55, 279, 498, 354, 629, 456, 390, 380, 420, 502, 719, 693, 678, 740, 743, 714, 424, 610]
3712F10j29L6K9J80k3l49j58q5J7J28k90n1R0l9J03j79m5r2q3j02k82J95m0p4
3736f33RJ7K19l8l66J69r9K50J86j04j43K45k24J55k06L03K46jj67M00N0j21n4
3759I3k12M64k25J36O0M2rm5J39N6n3L8j27K21l9N2j3j1j67Q2k67j01P4P4O4j03
3785B23p3J83k16j51K5k02M8J72j55K8N8j03j82j3N4J03J1RL5J87j62j60j3j05
3809c99J36P1k25J68R9K8l5K09M3k22Rk1O1J47K11j80K70l82Q7K2j81K39k3m2
3833I0K65j89J9m4j64J31o2qJ2K21r1l6j78K28j12p2l00J15O0J17j14o4J14J08
3857D6k6k04J65m4J19J8j4M8K14k70l22K03K50p2l1k17J26J77j70P0K2L0p3j11
3881f6J66nL19l99j21K17lj28MJ4K27l33n5L47j62q5n0j96K46J34j68k07LK76
$$ y = [610, 481, 517, 546, 726, 703, 354, 196, 111, 128, 256, -34, -85, 5, -34, 69, -110, -155, -247, -330, -432, -714, -519, -559, -633, -624, -607, -388, -426, -792, -623, -722, -472, -286, -390, -533, -288, -512, -357, -563, -260, -14, -15, -182, 218, 268, 147, 93, -119, 345, 120, 256, 316, 358, 349, 304, 443, 499, 446, 484, 357, 578, 539, 591, 578, 567, 400, 482, 215, 114, 188, 262, 326, 223, 150, 333, 117, -34, -9, -211, -163, 9, -146, -118, -60, -163, -345, -358, -304, -201, -190, -181, -146, 41, -121, -281, -294, -399, -263, -192, -417, -249, -150, -122, -157, 52, 95, -127, -118, -139, -78, 69, 280, 100, 370, -12, 75, 97, -84, 155, 132, 90, 355, 166, 185, 141, -23, 108, 46, 38, 50, 271, 180, 144, -34, 194, 82, 10, -290, -175, -115, 2, -112, -176, -62, 46, 20, -184, -19, -63, 56, 74, 60, 108, 322, 52, -270, -67, 183, 111, 80, -137, -11, 166, -4, 66, 88, 118, 45, -66, 100, 95, 414, 15, -106, 111, 108, -20, -16, -2, 225, -108, -163, 184, 22, -63, -113, -309, -63, 71, -97, -304, -301, -25]
3905b5j3j57j15K36l23J23J45K7lJ21j75l15M13j27J58K2K57j69J36q6j3j04J08
3928A21m2K26j44r5K55o5J36L1j87j08J09j09J50K8J18k90J13k02R8n1n0j26j6
3951a00J19J08jp6j29j52J25k17J53K04j75K2r8J6mj14j02L6K43J17j60Q9k12
3974c08J06qQ0J90j98j74J45k7L70J36m73J41NJ01J3Q1m7Q7k92J88o3J56k15J49
3998A43j21K60k44O8J52j35J63j27n3k9L7L6j16NJ47k11J12l28J69m7nr7K02K07
4022A88k64P3k0k7K6j68J65J70k55J07N9k48Q1o1P1P5M6J11l0l54J00J70r6QM98
4047D25l92J5j9n2J10j26j73K2K45j03P2K5M1J9j49j61Q0J80j87j49R2K71o0P3
4071I9l06K56o6k63K03O7N9K5j92K42l01L58k41m3m2L99l9k79J65J72j06k84J91
$$ y = [-25, -38, -195, -310, -74, -397, -274, -129, -102, -105, 16, -159, -474, -61, -188, -30, -8, 249, 80, 216, 130, 117, 13, 121, 79, 305, 161, 66, 321, 256, 392, 423, 236, 128, 237, 128, 278, 306, 424, 134, 247, 45, 143, 92, 42, -84, -100, 19, 127, 126, 50, -79, -231, -106, -323, -170, 34, -141, -119, -217, -201, -205, -319, -421, -385, -142, -25, -185, -96, -308, -202, -210, -130, 60, -138, -312, -167, -194, 176, 312, -161, -20, -15, 86, 99, 180, 133, 220, -72, 116, 53, 209, -6, 143, 22, 282, 38, 106, 258, 123, 286, 159, 106, 77, 114, 150, 34, 39, 186, -25, 87, -241, -72, -119, -124, -221, -19, 188, -76, -3, -23, -50, -24, -192, -27, 143, -112, -5, 54, -194, -113, -174, -103, -28, 18, 129, 99, -255, -155, 15, -81, -73, 425, 33, 48, 29, -23, 87, -39, -212, -190, 55, -48, 24, 49, 90, 109, -40, -201, -121, 59, -128, -277, -185, 86, 26, 99, -207, 49, -17, -280, -77, -10, 49, 74, -118, 124, -177, 181, -60, -103, -145, 254, 215, -64, 101, 273, 167, -117, 74]
4094G4J20p7j5k23M21o8O2k80km5Q9J5j86K16j43J39j61M7J05k67o9J51l4J78
4118D7j15M8n1m6l18L78j71OJ9M5J23k29J54j40q2M2J22R5p0J43k0j44R2J16M9
4143I3j16J84j74J48M1Q7j95J70on6M7L1J30j20l7N1k41K70k64N9M1J57j58Kn8
4168H6Q6k23j0j20K32p2j1p6J21M3k76J60j92j57p8K86j64J00L0j33J92n3j02
4191c31O7o6J37M6o6Q5J50j37k1R3o2J01M0pK05O9l0m0q6N2M8l0j8K19n3j65K26
4218D26j64ln4j21K4K48j62n0J97j08J00l56J89r3r6n8m8J02j29J17l57K17J74
4241ek32R7j78J12Q7n6M0j23j77K27r1N9p5R5k2K14J05p1m5q6r6K22l2J77L5L
4267A84k13K69k16Q6R6Jl4r2K25j81J47j54k2K7p2K28j53K38n3k02o6J79j8k10
$$ y = [74, 194, 117, 102, -121, 300, 232, 294, 14, 12, -33, 56, 71, -115, 101, -42, 97, -64, -17, 88, -179, -248, -97, -131, 47, -68, -20, -71, -117, -435, -57, -228, -222, -203, -158, -35, -264, -110, -250, -332, -290, -168, -73, -143, 0, -20, -164, -72, 44, 93, -23, 161, -13, 135, 176, 263, 68, 238, 232, 176, 223, 254, 384, 264, 227, 278, 37, 307, 43, 102, 143, 300, 142, 144, 86, 172, -51, -61, -181, 51, -21, -32, -108, 13, 56, -220, -60, -252, -409, -487, -201, -365, -265, -235, -368, -176, -229, -331, -264, -330, -193, -147, -213, -128, 22, -115, -136, -43, -105, -4, 36, 29, 234, 303, 273, 233, 147, 199, 247, 217, 199, 418, 365, 200, 426, 262, 259, 205, 84, 108, 356, 194, 144, 341, 233, 333, -23, 166, 73, -23, -81, -129, -27, -156, -39, -396, -179, -5, -237, -140, -318, -206, -119, -175, -135, -258, -435, -208, -299, -240, -315, -220, -242, -28, 77, 6, -39, -125, -221, 1, -31, 146, 181, 184, -29, 240, 24, 110, 206, 207, 173, 81, 306, 125, 272, 118, 96, 123, 51, 279, 126, 364, 311, 109, 43, 222, 204, -6]
4291fn2J01j21Q9K33j57l83K21K12j46m7q3L34m46J65J13L6j78n0q3J34J15q9
4314h8Kl7m8Q8L3j98J21K35j32o5J62J66l38k47L03K9J55j25qp7K13l1j13L1j61
4339a30M3j60L58LN8K9j64P0n2K1k34L63j75j47L1J81L4j22j86J86j7%n7j45M04
4364A92j23n8k4j43J23j02L07j78M0O0n7j17m6K14m0j31L31l47K61j31l9J9J60
4387A71j01o5J51Q0j58L6O5j62Kr2q3O5j3j0K33n2p6Jj54O6j24o3J13J31L0m0
4413d9j59L36k42J16k45J11K39M9l80L43j9n4Jj1k01J42l7M4M8K30N7j9l70J62
4437I2K5j85rP3K28j92Q4j71O6j34K55j83K15j87l8k2K82j18m0j78l9L40k63K59
4461A60l9r2J25j39j6R6j87J3j29L04j28ql1Mn6O3M5J3O1R0j30k50L76p8RJ3r5
$$ y = [-6, -58, 43, -78, 11, 244, 87, -296, -75, 137, -9, -56, -139, 195, -251, -86, 27, 63, -115, -165, -248, -114, 1, -88, -86, -123, -171, -83, -50, -248, -127, 108, -24, -89, 73, 239, -99, -346, -43, -14, 141, 16, 8, -69, 144, 113, 0, 31, -130, -87, -247, 111, 114, 172, 201, 37, 107, 55, 76, -158, 205, 30, -117, -86, 95, 129, 7, -179, 7, -10, -10, -67, -212, 192, 69, 11, -13, -156, -33, -135, 172, -6, 34, 94, 37, -80, -126, 88, 48, -83, 248, -99, 162, 31, -8, 11, 171, 70, 5, 156, 236, 78, 114, 179, 17, 19, -73, -156, -91, -104, -114, 119, 67, -9, -8, -162, -96, -220, -283, -170, -39, -9, -49, -208, 128, -114, 2, -243, -132, 107, 156, -224, 119, 100, 46, 47, 36, -165, -23, -60, -16, 32, 262, 319, 300, -70, 92, 117, -68, -77, -4, 224, 32, 116, -55, 11, -123, 132, -51, 164, -23, -61, -83, 199, 81, 41, -137, -176, 164, -99, 160, 121, 29, 154, 15, -1, 95, -92, -79, -208, 96, -32, -40, -71, -67, -123, -60, -15, -2, 59, 149, 19, -231, 145, 67, 76, 89, -6]
4488fJ29MK1j67l9J51j9n2QN7j53K48k71k9O0j43J64K2j04j73J70L6m7K11j70
4513i2n2R1k48L4rJ9K39Q6l12L7%J32L2j5J5j55K71Jj7p6P1MJ93j79l1K26j19
4540A46L53m22L58j87k02P1K57k80J21KJ21p3k52K44qr5j40M2J34p2j92J41j67
4563a00M5L1k0Ml32J79j42J94k26J31k30R2j21K17J6p6J10j36J74k76k1K15J4
4586b58j38L6N0J92J23r0q0K13j47J62Q9N7L3n3P8M2N6r7K11j44J59K0k31N8J22
4611D63NK8k07J39l2j57K16n8K4o6n2p2j42J05j41j21r8J66j02K08k57n7J7p2
4635b63J16K7k1k75J41P6q7oK2k0k83M24j61j5P4M3k53J19M2NJ86j19Q7J52J71
4660A82k39R1l2o7K50k94K62J6q3l3K03J74j49L7j49J56k29K50n4r5K51l06K09
$$ y = [-6, 123, 127, 148, -19, -58, 93, 74, 22, 30, 87, -66, 182, -89, -118, -58, -201, -37, -15, -119, -292, -122, -86, -133, 78, -92, -144, -53, -301, -267, -276, -257, -18, 68, -244, -207, -207, -75, -43, -58, -43, -198, 73, 74, 57, -19, 52, 56, 249, 70, 39, 265, 146, 499, 77, 435, 248, 46, 117, 374, 94, 215, 217, 338, 265, 13, 257, 249, 154, 14, 56, 190, 118, -74, 67, -100, -55, -24, -44, -40, -372, -193, -335, -141, -367, -236, -466, -374, -495, -278, -262, -338, -228, -364, -190, -466, -487, -272, -258, -396, -360, -310, -118, 5, -85, -165, 48, -99, 63, 152, 209, 242, 189, 267, 309, 365, 268, 479, 335, 494, 514, 283, 341, 463, 468, 496, 289, 428, 396, 239, 455, 397, 421, 355, 303, 231, 89, 194, 53, -68, -166, 0, -102, 106, -151, -208, -191, -263, -147, -120, -141, -416, -275, -199, -286, -292, -270, -290, -573, -149, -310, -325, -251, -208, -461, -342, -300, -295, -109, -228, -141, 11, 182, -57, 34, 2, -65, 185, -109, 153, 169, 86, 53, 256, 430, 281, 318, 169, 325, 96, 346, 292, 197, 448, 142, 351]
4683C51m3j35K4o4JJ59j74j22J1J38j21LJ2J3j34m9O5q9J64j36J9j64k5J80K3
4708i3m2p3K62k47Qk5J23m0p9O8j37K13O3j88q8J50r1R1q3J47k23M8J28L6J3j65
4734b24J15j33K35Q5k89K07k0Q9L5m2m0J29j32K76l63J71on7J90k74J73J4M1J85
4758C65l38K90j61j39J08k8lj0J00p4J54j68n3N4R4j49m5l0J84q7k7rK1j01j4
4783f6j01K05j55O4q8r7J73j51J84m27J33r9J14N9K81l05m5J60r2K0K02j77k4
4806b32m6l2K72j75J77k33J12R0L5M7n3J30j82J86K1n0J89j66o6K06p5O1K61j79
4830B98m3K57k53K50k34P4l13M01K8l28J53m6m1j05P7Qm8k36K01k40L4M2r5p7
4854b36K41j95J33l1j99K47k09o4l7J92j21j96K16j5P7j73j60L31L3MM6lO7L1
$$ y = [351, 308, 173, 197, 133, 134, 293, 119, -3, 8, 146, 25, 28, 40, 53, -81, -130, -65, -154, 10, -126, -107, -271, -296, -116, -93, -135, -208, 54, -193, -185, -210, -87, -127, -206, -138, -275, -62, 1, -187, -275, -125, -216, -125, -208, -61, -284, -236, -108, -72, -59, -224, -109, -242, -7, 78, -211, -4, -24, 65, 100, 58, 18, 147, 15, 291, -72, 99, 93, 36, 226, -48, 125, 139, 180, 365, 27, 317, 156, 17, 125, 97, 94, 84, 184, 110, 264, 96, 43, 97, 191, 42, -3, -33, 151, 64, 37, 28, 49, -52, -66, -167, 38, -117, -53, -141, -238, -65, -216, -32, -459, -326, -425, -311, -252, 29, -276, -321, -161, -253, -233, -31, -208, -232, -278, -310, -38, -213, -36, -269, -157, -67, -32, 15, -38, 92, -90, 96, 117, 67, 256, 90, 24, 230, 155, 216, 477, 298, 255, 512, 259, 509, 275, 349, 36, 437, 465, 137, 290, 244, 203, 98, 175, 183, 135, -101, 100, -140, -106, -64, -159, -236, 5, -190, -57, -88, -287, -40, -249, -313, -350, -158, -279, -475, -259, -274, -197, -370, -530, -199, -166, -162, -116, -119, -52, -21]
4878b1q4j07Q7J25k30K46n1J8K62q9K7q9j20K34k14J01N8J4J31K2m9j09j00J40
4902B02J71k58K14j7Nk16J64j06L8l8Jo5Q7j07L7j77O4J43k06Ol8k3L4J62j49
4927g2J67l07LJ28j38K72q8j28J79j08J06p6ok53K40r2J5J80j35J7j60J89J33
4950F6j06r8R5J76k04J13J7r3L22j52k52O7K7M7N3k7L1Q7l81K71M7p8P6%p8J4
4976D0J5j72K7K87j52J92j37J44J34r1j14j89K25j5p7J8j0N0M8j10j21K15o0j18
5000B9l1nJ25k79N3R7K1r7nj41J21k0l7J0j1M2o1j89J80j31j0j6J84j14m2n2l9
5027d18P7J6K38k51J25J01K8n9J42l52J63J30J2k22J46K59PJ21K6k10L6j17K73
5050B71L8J24j15M1j79J44j9J44J8j46k7p0Q0O9p8O8l32J93r9j20M19m75R5M1
$$ y = [-21, -105, -212, -125, 0, -230, 16, -35, -17, 245, 156, 183, 94, -26, 208, -6, 95, 153, 167, 298, 320, 271, 162, 62, 202, 373, 115, 329, 312, 317, 101, 265, 159, 197, 159, 160, 95, 182, 75, 112, -65, -1, 142, -64, -58, -96, -119, -85, 77, -72, 95, -212, -209, -81, -219, 53, -35, -163, 16, -92, 14, -62, -68, -321, -81, -173, -158, 22, -113, -96, -256, -67, 66, -40, -138, -43, 133, -71, 42, 59, -34, 288, 136, -116, -49, -22, 25, 78, 51, 82, 169, -212, 59, 106, 28, 104, 104, 26, 40, 55, -117, -90, 197, 45, 237, 100, 244, 378, 287, 173, -16, 209, 194, 117, 135, 125, 175, 223, 113, -8, 207, 147, 29, -2, -7, 118, -161, -108, -11, 10, -87, -92, -233, -112, -132, -169, -159, -170, -128, -189, -378, -198, -329, -339, -355, -171, -285, -327, -379, -418, -341, -325, -87, -338, -213, -112, -84, -143, -1, -353, -190, -60, -48, -270, -124, 135, 142, 263, 289, 79, 115, -2, 271, 309, 433, 318, 359, 180, 324, 305, 449, 467, 321, 294, 224, 304, 373, 295, 363, 31, 224, 125, 5, 424, -51, 44, 85]
5074H5k23m2J59j59p4J22m8j99J08Q1k08k3K37j24L5k2k24N1p5J11J91j08q2J88
5098b43n5r1Q2J04J1P1Mk2K2J08rJ91l4O5j82J16j74M23k8J1O7q7J20j98J22j57
5124B37K73k03j59J69p2q2Q4k0O2j14J06o7j74O2L3N0k04K52k53p1j41K44L9P
5148E8j96J45k15K1j06o3J99kr5j43Q9K6m5M7j83J52r1J34q3L8nO2J84k33L66
5173F1l49K02po3L86l82J93M4K7n1O8or6J16J15l07M58j88j92L3N8J56L6n7qL
5199B50K9j06J8J15j98K06k31J16n3K3p9J25j32J01J16r7j88K0%%m5m0k01J33
5223a18J47k09r1K7R7J12k09P4P0k20l5O1O6j42J23j22J89k41L83m41L90j54n0
5246b93J24k45J28J42J83j41n7J50o0O6lj2J84J15j83J82P1Oj25r2K5J13K00j87
$$ y = [85, -138, -180, -21, -180, -254, -132, -180, -379, -271, -190, -398, -421, -184, -308, -273, -295, -519, -468, -543, -432, -241, -349, -431, -243, -298, -389, -307, -203, -192, -121, -117, -139, -117, -9, -18, 173, 139, 204, 22, 138, -36, 387, 359, 370, 437, 350, 470, 272, 394, 237, 510, 307, 148, 317, 245, 163, 247, 227, 289, 175, 281, 214, 40, 102, 135, 185, -19, 233, -20, -91, -232, 12, 51, 58, -138, 7, -208, -187, -293, -356, -157, -159, -254, -397, -308, -282, -327, -280, -463, -311, -402, -268, -351, -313, -318, -256, -72, -305, 61, -288, -86, -93, -156, 230, -152, 41, 85, 112, 61, 129, 123, 27, 143, 258, -49, 409, 221, 29, 62, 120, 276, 312, 255, 247, 250, 279, 173, 191, 306, 108, 314, 83, 199, 146, 169, 90, 215, 83, 184, 300, 203, 15, 35, 35, 35, -10, -50, -251, -118, 29, -180, -271, -244, -147, -35, -244, -170, -100, -320, -355, -294, -228, -370, -247, -369, -180, -421, -38, -479, -89, -243, -293, -169, -414, -286, -144, 39, -102, -159, -9, -69, -3, -6, -18, 166, 281, 98, 280, 351, 357, 232, 140, 165, 278, 478, 291]
5270B91J3J12J4k36J52J3n5n2K47j63j47R6l03K41k06jM7P2J57l05j36j6L58l23
5294a30Q6k48O1J95j62n9Q6l18J50j92K17j56l9J95K8j45Jn9K7r0K17M8k2J97
5318a12n2N8j02JJ51n5K74j78pL19L3j03j89J72p7J57J32k16K47Nj42J19K3Rr3
5343C74p3J4n8J46k23N7n2j1O1j12k0o1p4j92J45j40J32j03R7K6K9j34j22j64
5367d58J56k05J43M8m8J29k29J95r7K2%J18j27P7N2O9N0J03K6k36J25J39J7p9
5391a0l8k5L09J04k68O4r1K82q5K8K27j30j78J60p1q8K3R3k74K07P2K9l64J64
5415A40r0J26k8j12k4Q2j40K6n4n3K31l32J56pJ89l50M4Mj6PJ45k73J8J8L9J26
5441a28L1o1k7M8o2J5nM8N8j98J11J82Lq1j9j33K08K37k79J46R5j24lJ56Q5l50
$$ y = [291, 304, 416, 430, 194, 346, 359, 304, 252, 499, 336, 189, 285, -18, 223, 17, 16, 63, 135, 292, -13, -149, -165, 193, -130, -44, -292, -231, -36, -198, -257, -171, -489, -339, -531, -314, -470, -509, -314, -286, -431, -430, -489, -462, -552, -335, -287, -309, -112, -164, -106, -208, -207, -56, -111, 163, -15, -22, 297, 330, 227, 38, 210, 133, 290, 422, 206, 453, 458, 316, 435, 458, 467, 374, 301, 315, 257, 403, 180, 237, 185, 174, 235, 123, 103, 42, -32, -224, -79, -219, -87, -190, -93, -67, -38, -172, -294, -458, -302, -507, -364, -316, -364, -235, -464, -269, -366, -344, -344, -226, -353, -276, -224, -155, -105, -2, 24, -212, -87, 52, 69, -10, -48, -73, 236, 340, 72, 136, 45, 327, 242, 270, 497, 367, 189, 349, 278, 190, 213, 306, 32, 239, 311, 340, -24, 140, 50, 176, 148, 36, 12, 94, -46, -20, -74, -127, 104, -228, -72, -79, 110, -240, -196, -192, -208, -201, -56, -329, -311, -293, -254, -128, -97, -158, -185, -137, -199, -184, -189, -141, -83, -281, -170, 12, 15, -66, -85, -218, -10, 227, -52, 94, 189, 65, 62, 218, 303, -47]
5467d7K60j82L10j87rL5k25L28r5N7k88J9J73j78J00R9n2l7k3j31J82q0k6j26
5491a23K15J13k73J54j49o2P0L9R4n1p6Qm0j9l1P9K8j89L10k13p6K35LL3l75J99
5517i7J21J50k92K02k40K35j71R6k6j14O7q4K89k73K39p4q7j48K79j41N3Q0o7
5540ck20K29R0j17K7j66K36R8O6j49k0J43j49K55j07Ol1o0j58L05j16M0j82J48
5564A65j1%n3j18R4J57k68J5K8K8L9j32m5K2p3j56P7J31j38K60j97q5J86j14M7
5589a41k4n1j3NN8k9j17J9L41j90M5J91j76J23K9k14K35q5K09j16n7k5M1J99j31
5614A26R2q9K5j2j4J72j55j88L95j75j6j06J09J7j08N2j6J70k63qqN4j2J2j78
5639a24L7J20j24P9n7J64k44J07j27Q3l4j02J53k28J16Q3j68P2J52j87J99L8J33
$$ y = [-47, 213, 31, 341, 154, 145, 180, -45, 283, 188, 245, -43, -24, 149, -29, 71, 170, 118, 81, 58, -73, 109, 29, 3, -123, 92, 205, -68, 86, -63, -125, -55, -16, 78, 27, -49, -41, -81, -100, -131, -52, -24, -213, 97, -116, -192, 43, 46, 79, -296, -97, 24, 174, -118, 84, -156, 79, -92, 4, -22, -136, -69, -153, 136, -137, 102, 28, -59, -207, 72, -69, -16, 64, -3, -223, 6, 96, -21, 6, -160, 76, 174, 240, 91, 71, 214, 65, 320, 213, 219, 188, 128, -30, 275, 159, 199, 17, 165, 154, 154, 101, -17, 77, 234, -34, -19, 9, 37, 76, -56, -101, -79, -152, -308, -231, -100, -238, 22, -175, -260, -74, -188, -141, -165, -216, -229, -224, -166, -195, -312, -293, 48, -142, -97, 94, -82, 41, 70, -144, 91, 6, 215, 99, 42, 17, 58, 257, 126, 218, 129, 154, 142, 128, 300, 145, -43, 352, 177, 161, 55, 164, 181, 73, 125, 109, 279, 16, 8, 0, 54, 42, 54, -124, -87, 33, -91, -12, -69, 95, -149, -42, -169, -86, -120, -222, -69, -297, -181, -98, -266, -194, -42, -229, -30, 8, 141]
5662A41k39O4k3j2O4K7j01L23l60J47L2l5j18L43k0j88J32Q2k21j0J31j59KJ59
5686A61j03k7K89j35k4j42P8q8rK3p5o1K0N6L3l7l5j3j86MK72l6P7j73J5K8J4
5713g4M8l4r3%OJ09N2Q6q0k36K01k5k63K55k14J77M9q4K34j45L5j9J5O2R6j38
5739B0n3J20J86p2o7j42oN4l4j12L04k09k25J99K56k16o3J17L3q5r6J45J15j66
5763CP9j82R8M0p7P6J38p5j34q0o1L08m8k96K41J7L6q6R6J7j26j6J37o3n8j58
5789a74K25k9j89l7J67M0k02R4pJ33j62K85k93m9J65j17l6LJ57p0R6l6O7RJ7r6
5815c9k02K00J02o8n0m1L45m9k05J01L4lo7n9J47n7J70j18J6oJ36k58J35J24j2
5840B76k89J77Rk50L60j11j3j61J09P2K2j20k15K16p9L7R6l40Q3j00R5J80j33
$$ y = [141, -98, -34, -57, -69, -5, 22, -79, 244, -116, 31, 63, 28, -90, 253, 233, 45, 177, 259, 38, 28, 159, 0, 2, 161, 58, 31, 320, 185, 161, 19, 97, 9, 0, 23, -52, -113, -93, -37, -4, -41, -76, -89, -275, -271, 1, -35, 42, -131, -116, -88, -74, -26, -60, -153, -153, -147, -38, 14, 100, 20, -216, -15, -40, -303, -48, -262, -85, -36, -120, 114, -31, 4, -15, 0, 62, 158, 20, -33, 87, 273, 201, 134, -8, -14, 40, 6, -106, 198, -11, -236, -37, 219, 3, -60, 57, 90, 5, -91, 54, 169, 3, 82, -100, -2, 38, -39, 37, 175, 100, -34, -114, -175, 133, 85, -211, 30, 47, 83, -3, 93, 110, -16, -32, 105, 42, -16, -174, 51, 22, -167, -204, -37, 3, -199, -105, -112, 21, -141, 144, -149, -198, -33, -150, -186, -183, -26, -96, 0, -36, 31, 40, 57, -39, -241, -41, 61, -7, -57, -98, 247, 198, -7, 94, 128, 125, 58, -1, 146, 89, 259, 141, 157, 151, 287, 29, 164, 288, 276, -13, 164, 173, -77, 283, 172, 159, -2, 107, 179, 201, 81, -134, 82, 3, 40, 136, -204, -121, -221, -126, 54, -79]
5863g9Q0k84J96j46J07o7M9j58R8j88J55L5N6j08J05Q1o4o4J20K03k18n9J30J26
5887A06J2j11J1K06m3j30J11N0q5k76K97J37RM2j04l0jl3J83l79K12Pp0k24M3
5912f0K22Nj0j75N1OR2k90P2j1K5j96J52R5m5j79J12k64K98M7j24j1J26j96Q7
5937a71j0m0K4l5m5Q9J63j51M5l6KN5J72k10j2J53J26L2p0J01m3j02Q9p2J36%
5963A90J13j30j18K45j04m7j35J02J6j45J4K05k00J98k32M1l0J27J8Ol64J43J08
5986B1k0M0j15J49j54Q3m1J04m1o6PMj57MJ93k50R2N6j41J84p0J00j65N6R8p5
6012a04J64R7j90J13j87J82m5o4M4J11r0k1Mj88O0Q2Q9jP6M2KR5j90Q9O2o5j79
6039a2R7%M6m5l3N9M5r3R1j71P6J33l23J09MQ0j19J07j65K27j87m7Q2J17j17J1
$$ y = [-79, 1, -283, -87, -233, -126, -193, -144, -302, -204, -392, -237, -202, -146, -254, -149, -68, -132, -196, -76, 127, -91, -150, -20, 106, 118, 7, 18, 224, 181, 51, 162, 212, 127, -149, 148, 285, 294, 336, 232, 202, 201, 168, 351, -28, 184, 191, 121, -103, -60, 162, 167, 157, -18, 33, 39, 131, -159, -87, -98, -73, -269, -117, -22, -67, -246, -134, -398, -100, -53, -177, -188, -62, -258, -171, -181, -221, -197, -232, -277, -188, -25, -176, -131, -167, -165, -110, 62, -148, -160, -7, 119, 151, 81, 182, 139, 37, 126, 54, 190, 190, 303, 173, 55, 300, 196, 149, 14, 116, 132, -13, 1, 206, 6, 204, -28, 13, -17, 110, 128, 134, -230, -87, 21, 1, 41, -74, 75, -79, 4, -37, 67, 26, -40, -33, -29, -186, -182, 11, -239, -147, -91, -232, -48, -118, -18, -183, -127, -29, -104, 60, 157, -33, 80, -107, 75, 30, -34, 10, 121, 31, 10, 14, -174, -114, -32, 57, 56, 132, 174, 176, 271, 81, 170, 232, 167, -12, 85, 85, 131, 86, 53, 112, 157, 64, 155, -16, 60, 193, -130, -21, -17, 63, -56, 51, -114, 113, -74, -121, -39, 78, -39, -28]
6065b8R1j35L7q8n9J97j28Rn3K63k4l07M5MJ29Q9j41K8n3l8J10k20O9P3J20j12
6091a22Q3K64j83J25j49k08J00j0n9K33j88J44j5L3K05l06J73l9J13k47L8J03
6113H8J8O0j37M1k5J49j32J00L5j51J25M8k46J96j9n5K0O5O8k18j47J0K41m08
6137b74L27j54M0O4r9n9OK8p6O5Nk5Q8J14j88O6j37J04q5J80J53O7k02p5j3O3
6163a7j26J40J34k62Q0R6J76o4j83M4k5O2O7j58R0K94j21j16K7q2K2J2j3J4K36
6188C27l35K11j19N8M0k39K09j4j06j05m7o4L2J36k1j03k5M7k70K30K08r4j21
6211a65j02K09j29p6J64O0n8lq0J52J41k19J37j00J0J50j40J74l19K38J4Q2j74
6234c4Q5L8k5LJ32M4p9j09J61M0Kj1j32J27j19J64j50p4J00J44l80J23ql8O5l2
$$ y = [-28, 63, -72, -35, -123, -182, 15, -113, -104, -157, 106, 82, -225, -180, -176, -47, 42, -99, -71, -124, -162, -52, -272, -203, -130, -10, -122, -39, 225, 42, 167, 18, -190, -90, -100, -159, 74, -114, 30, 15, 48, 253, -53, 120, 81, 194, -53, -15, 88, 106, 166, 29, 70, 45, 194, 62, 162, 197, 46, 171, 219, -27, 169, 150, 95, 115, 180, 248, 30, -117, -107, 134, -274, 53, -101, -61, 3, -96, -155, -149, -121, -197, -132, -127, -152, -64, 50, -138, -72, -209, -105, -190, -10, 143, 210, 8, -67, -80, -17, -143, -3, 131, -131, -51, 45, 221, 157, -26, 18, -7, 55, 122, -36, 54, 348, 227, 111, 138, 56, 78, 90, 77, 91, 327, -8, 203, 84, 142, 182, -57, 152, 138, 32, -73, -120, -184, -152, -16, -37, -140, -165, -118, -388, -158, 50, -44, -165, -267, -58, -187, -263, -99, -39, -97, -100, -180, -28, 113, -106, 31, -69, -59, 91, -49, 125, -194, 44, 58, 140, -34, 51, 89, 64, 67, 199, 243, 164, 55, 216, 256, 258, 247, 115, 242, 123, 287, 137, 63, 163, 307, -73, 50, 42, 4, 69, 37]
6260C7L2j44M30k86k06j5K77k13K13k49n1J49mn2j4j90K20Rm8l8O6J88j03j92
6284a84J11J23J91k78j26J20J85Qq2m1j80p5K38k3J2J12Jl4q6K13k88J43L0M3
6308A33j88J93l17J02M5JR7Q4j99Pq1P0J07j00L4L6J2j2pj2P1%L3K7j49K54k95
6335e4J36n9M3ol2mj40J11PO2j67J39r6o4qJ86Q4m6j82k27J48J37K69k66j78J70
6361c7%j36Q1K4m4J13Q0j86p0K48n5j01R2m4J14M1j21r7J65k96K85j81lL9J17
6386B8J19o2Q0j36Q7Lqp1J05m9J03k1K8Q4j97J98j70L6J35j34j80k9M5M5K60k93
6412FJ35J69l21L8L6j41j1J0m6J93j61l2k9j43K70j82j70J60Q4p6J03j36R9NN7
6437h3k9P5j18P0J8Q2J8q5M2k42J49L0J98n0N1j27L19k28P3j58O9N7l1J07L3J
$$ y = [37, 69, -75, 355, 69, -137, -152, 125, -88, 125, -124, -175, -26, -30, -82, -96, -286, -66, -57, -105, -143, -77, 111, 8, -184, -73, 50, 241, -37, -163, -43, 142, 150, 68, 27, -153, -228, 10, -13, -1, 111, 112, 78, -8, 205, -83, 60, 90, 133, -55, 138, -179, -77, -32, -31, 66, 150, -49, -42, -123, -53, 54, -46, -12, 24, 36, 24, 17, 5, 76, 76, 109, 136, -13, 241, -54, 82, 23, 66, 60, 28, 24, -116, -5, 2, 64, -103, 36, -60, -124, -132, 54, 138, 92, -90, -317, -169, -32, 237, -29, -207, -37, -37, -173, -92, -68, -112, 1, 81, -105, -175, 73, 18, -83, 9, -35, 79, 120, -1, -98, 67, -229, 56, -125, -128, -89, 28, 147, 85, 165, 29, 116, 119, 111, 40, 145, 96, 199, 178, 206, 290, 93, 291, 121, 157, 292, 158, -22, -51, -6, 39, 299, 6, 141, 310, -11, 27, 63, -78, -89, -79, -125, 68, -93, -125, -154, -297, -27, -209, -379, -219, -135, -211, -108, -244, -145, -140, -83, -112, -37, -155, -85, -67, 15, 33, -52, -10, -252, -103, -73, 125, 75, 126, -1, 318, 90, 163, 5, 74, 131, 100, 207, 240, 241]
6463B41J0J2k48j1O5L15k71P7k34K2L2M0P4k19R2J98k52R9JJ3k67K20o7L0k46
6488b74K70r6q4n5J35o4J42j89Q8j54J24J08J28k45l0j55M07j63o2j46K61m6J29
6511B9L0j17m5J46j58J27l15L80q7p8K26O6l5M1j50K1N6j03R9J92n1k31k5K10
6535B28k12K3K9J01k03J31K4j53J71o3M9k32J25M1m1N7O1m1j44J1j87L63k33q8
6559a83J87j60J1J42K3J1p3P0j60K6q3J01o7n9Q9o3J39r2P1M8q4N7L7N2j23j15
6585a98K7J14k9K03k32m3J20j3J09l2J78k03J12L6j61J53j37j52Q6J64j6k7J28
6608A87P7J4k66J5J5K81j35j66M8M8r1N9O8k28Q9J84l3j84J04j23J85k46K52K1
6632A75J8q9j95K0q0K40k01%j63K64k71J97Mk68N1L7J6j61K44r2K54j51o2j6J81
$$ y = [241, 251, 263, 15, 4, 69, 384, 113, 190, -44, -22, 10, 50, 124, -95, -3, 195, -57, 42, 43, 56, -211, 9, -58, -28, -274, -4, -100, -184, -239, -104, -168, -26, -215, -127, -281, -157, -49, 79, -166, -196, -351, 56, -107, -169, -315, -54, -100, 29, 59, -58, -103, 43, -115, 12, -303, 77, -10, -88, 138, 204, 169, 210, 60, 81, 137, 34, 133, 325, 274, 43, 18, 228, 16, 39, 68, 169, -34, 97, 121, -32, 139, 76, 125, -107, 18, 59, 18, 75, 136, 95, -49, -38, -225, 138, -95, -183, 4, -156, -145, -3, 20, 31, -42, 28, -132, -106, -189, -88, -155, -214, -125, -188, -49, -141, -70, -22, -106, -49, -12, 40, -83, -198, -171, -57, -86, 117, -115, -158, -38, -51, 58, 26, 204, 1, 113, 149, -12, 141, 4, -148, -62, 102, 86, 59, 187, 264, 278, 12, 27, 42, 323, 188, 22, 70, 118, 27, 86, 154, -74, 15, 199, 166, -18, 86, -37, 148, -98, 154, 175, 193, 104, -91, -71, -151, 89, -112, -112, -275, -11, -282, -85, -81, -349, -298, -261, -245, -406, -162, -254, 0, -151, -213, -229, -48]
6657d8r4L8jqJ4q7K01j5J13j15r7J33M3P7R8j20K1K8q9J00L7Kk24P6J75o1j06
6684I1J85r2L8P3K0l12Q5J44J22m26J41j07Q7k5q0J6M1n7l9R6j54Q7R2q7k25L22
6710C6j23j0k03j06M79k03j89J24q3J02K4J81k82L7K08j15L2k02J29J8m3K28L
6733D2r2O1J28n1K5p3O9K15j78j65J47j00R5R9nM2J08q2j86k9Q5J61m3j64k6j60
6759g7R8J76l13J91o9Q0p0n5L7J65k02Lj7J22j59j59K00r3r1o9K58j08j57K0K11
6784g8j68j84L04j78J26j9lq1J13j0M2O6o4J08qM2J28k30o7K77O4p2n5J09l6j12
6810A4K39j95o0L06j88P9k10J62k02K78j39j05K34j49j01J82P2l95J01J65J16
6831B04j59K1j49N1J26j09J45o2j8j10k2J59J32k49J4j0p8J93l30J77j11m6L2
$$ y = [-48, -142, -104, -105, -113, -99, -186, 15, 0, 113, -2, -99, 34, 77, 154, 252, 132, 153, 181, 92, 192, 229, 231, 7, 83, 258, 197, 91, 276, 184, 222, 295, 315, 3, 88, 232, 354, -72, 69, -38, 49, 24, -56, -40, 1, -56, -95, 1, -153, -66, 26, -61, -286, 36, -87, -97, -300, -406, 73, -130, -319, -195, -278, -176, -152, 29, -253, -216, -8, -123, -91, -293, -164, -146, -189, 39, 42, -50, 11, 139, 88, 113, 40, 109, 324, 146, -19, 128, 28, 123, 222, 217, 259, 367, 285, 99, 70, 155, 316, 273, 109, 83, -77, 21, 197, -116, 75, 6, 86, 16, -39, -2, 163, -39, -36, -53, 69, -90, -249, -49, -142, -233, -302, -44, -152, -309, -289, -78, -246, -430, -126, -304, -178, -197, -200, -281, -168, -178, -136, -70, -134, -26, -34, 8, 136, -94, -161, 116, 180, 108, 53, 162, 126, 14, 253, 58, -2, 304, 116, 195, -15, 147, -55, 223, 84, -21, 213, 64, -37, 145, 217, -178, -77, 88, 204, 45, 66, -83, -32, 94, -15, 130, 68, 50, -60, -82, 77, 209, -40, -26, -36, -114, 79, -251, -74, -185, -231, -199]
6854a99QQ7J40j82J16j33L9J01q2j2pJ06J03l02J64j55l6J24M4mJ00k31J92J96
6878A77L8j71N7qj12O6l0k0J57M1k15N0J08j84J1L19j63mj05L2K3M3P6k03J50
6903A33j08K22j14N6k27L83j26j52KR8j32q5lq6LP8Q9N7j57P3n5k3J17q9l7j68
6929b51J80j2r1L5q5K52k00J03j12K9J0J7j5j03J87p3J0J16o7MJ95j37R7j09K34
6954B14l5j56m8L27k89q7n9K44N0j0J52j23J1Kl9j49K83o4k46K9J8J47k51M3J47
6979A11j14q0L3O7Lq9M7j18J22j38J0Jo4L3Q9j87lK44j21j03R6L7r6O1n2Q3J4
7006a14M4KK34k49j92K51K12k75J85Jq8p2J84l3j9%o7L01j12k6j29Q1P4R2r1r0
7032A04Q2J54J22l86p4J74r8m0l3J42o0k2j87k2j0J57q6j9j00J46J13j97J88j49
$$ y = [-199, -191, -104, 36, -146, -30, -163, -124, -23, -105, -117, -124, -18, 85, -217, -53, -208, -244, -120, -76, -80, 20, -211, -19, 177, 215, 44, 101, 93, -19, 47, 17, -3, 154, 195, -20, 30, 138, -46, -35, 284, 121, 117, 12, 44, 67, 110, 186, -17, 133, 25, 247, 133, 189, -38, 345, 219, 67, 69, 167, 35, -50, -53, -139, -136, -58, 31, 88, -69, 4, -51, -74, 43, -46, -83, -251, -71, -83, -174, -139, -224, 28, -172, -69, -181, -152, -142, -125, -140, -243, -56, -129, -119, -3, -70, -66, 129, -8, 89, -20, 214, 179, 23, -25, 302, 13, -74, -133, 111, 161, 151, 303, 180, 191, 193, 154, 5, 288, 224, -22, 7, 25, 172, -79, -36, 111, -3, -83, -50, 17, 20, -69, -22, -140, -18, -156, -146, -145, -209, -176, -87, -274, -277, -33, -154, -257, -161, -124, -220, -159, -211, -128, -114, -70, -68, 166, -83, -275, -24, 188, -87, 98, 99, 11, -61, 123, 90, 71, 71, 4, 305, 193, 167, 38, 119, 193, 285, 194, 104, 186, 340, 462, 76, 2, 176, 78, 38, 5, 147, 87, 65, -122, -144, -154, 3, -83, -102, -202, -56, 57, -140, 48, -101]
7056a01j8j68J06K44n9k67K42k4lj62O4j41P6J43o6P8p2J36q3k4K6J85j16N0p0
7081b4p0%J16Lq5J49l5j2J2J33j98J05q4P8kJ06j71k2k6O1K92j17k73M8K10r4
7107A00k56J91O2j94Q4J00n3m8J13j73Q7l7J74j16M3j40P5j52J6Q9k8k9J32j82
7131a42J30j90R7K12j18Q2j81Q4l8K05r9l18K09Q6j12O2P9l9j10O9J06Kq4k5K03
7156A70k54MM8l2J21o3lN8j85J89Pp8r5J17r3Q7j07M31m48j2J82L6J6K0q0J5P3
7183A24k04K31l8r7Q4J6r4J00j90J33O3o4N2q3J88k88J27l3R1j82j5J47n1O5J77
7208B59k91r3J22j77L4J43J9k89L22k05J29L2q1j10p1J65j2P6n1K18j14p4Q2p7
7232d4l2J33m7O1j05K3J83q8n7j25J95J03k52J58j17K64l08K60R1j83J4n8N0j55
$$ y = [-101, -119, -287, -181, 63, 4, -263, -21, -45, -48, -210, -146, -287, -211, -68, -134, -56, -128, 8, -75, -99, -73, 112, -4, 46, -24, -94, -94, 22, 25, -60, 89, 54, 42, 54, 187, -11, 94, 10, 88, 86, 192, 21, -1, -27, 34, 326, 209, -64, -16, 194, 100, -156, 35, 97, -97, -13, 87, 34, -14, 99, -74, 13, -24, 150, 34, 77, -63, 12, -140, -124, -35, -63, -92, 40, -142, -12, -202, -105, 107, -11, 71, -110, -26, -64, 141, 42, -276, -67, 19, -93, -31, 48, 9, -101, -32, 74, 76, -8, -33, 170, -84, -80, -32, -64, 57, -6, -9, 49, -136, 53, 60, -18, -113, 4, -89, -2, -109, 322, -126, -138, 44, 80, 96, 116, 36, 51, 124, -80, 151, 113, 16, 100, 116, 22, 122, -68, 65, 128, 64, 116, 33, 221, -67, 60, 27, 118, -64, -79, 68, 17, 82, 259, -32, -125, -3, -180, -146, -3, 16, -273, 49, -156, -27, 5, -76, -186, -257, -92, -104, -28, -79, 139, 25, -49, 33, -44, -76, 57, 10, 71, -34, -11, 172, 84, 27, -98, 97, 200, -52, 106, -11, 253, -55, 205, 296, 113, 127, 69, 119, -36]
7256c6N2j50J35J6P3P9k00J89Oj40m7m3j4J59l9j00L5m5K76m65L03j08o5K33j16
7281a2j44J50r2l6J51r1p4j4K45j68N2o1L3K12j49Pk42L90p1j01J52n9k66J30
7305e8j6J78j14nJ82r8j89K43l7j99J44j75J22q9J48o4J3j33J11Q5j28K4K08k54
7329a01J12k4J86qk56J54l25R0j22K29J08l40K46j6p4Q0J91K2j55J06j58q2M1
7352i6M0LP4r7o3J56n7L8N5j43J86k87J68l6k2l9pK03l29L78j88J04j3j75J91
7377D4J36l06L84m00J33J12j12q0J02k5N0K0k41L48k18o9Q4j9L7K5q0K19j43o6
7401f5M4R3L5j87J74j16N8Nn8P9j56N6R1K0r9J1K1lJ99j40J34k84Q0j57K08k06
7427a63K1J46rj33J66j05o3J57j18J64K4j83pk0K19K4k00J6j28Q2J33q0p9J58
$$ y = [-36, 16, -134, 1, 17, 90, 169, -31, 158, 164, 24, -23, -66, -80, 79, 40, -60, -25, -70, 206, -259, 44, -64, -129, 104, -12, -156, -6, -98, -134, 17, -74, -148, -162, 83, -85, -33, -94, -61, 151, 2, 9, -233, 157, 86, -15, 137, 78, -188, -58, -74, 104, -10, -15, 167, 69, -120, 123, 86, -113, 31, -144, -22, -111, 37, -27, -14, -147, -36, 49, -79, -55, 153, -101, 11, -13, 173, 165, -91, 63, -262, -172, -294, -65, 43, -297, -51, -67, -141, -61, 130, 152, -3, 103, -55, -137, -96, -56, -53, 21, -76, -139, 17, -40, -2, 53, -90, 96, -191, -23, -59, -81, -120, -127, 76, -253, 125, -63, 41, 28, -147, 44, 180, -126, 258, -142, -9, 103, -9, -89, 13, -12, 38, 58, -183, 165, -53, -122, -38, -57, -20, 5, -75, 144, 1, -65, -21, 72, 107, -80, 94, -22, 36, 41, -17, 62, -94, -38, 53, 73, -26, -15, 6, 3, 202, 62, 196, -88, -8, -165, 43, -163, -142, 4, -5, -138, 28, -77, -140, 17, -101, 63, 87, -96, -103, -123, 96, 120, -80, -64, -192, -110, 23, -57, -136, 22]
7451B2M1r4J55o0j6J02M0l33J76J0J17j6j35n8J06j8l3P9Lo8J17n0P9j94J19J05
7477A96q2L6o2J19k33J47k40J13ojn8M0kK0Jj04K07j26K0m5j03J32j54J87M9j09
7503e8n4Q1j39J29j35K60j28p0Q7p3K12l8P8q9n9j5j52L21p0L7j49K61k25k2K61
7528B51j31j77K37J45j91Qj34K02j67k7n6o0J53j16l6O4J06j86O0j28J78L0j12
7551h7K84m02oQ8J4j3J03j91L3J41q5Lm4j5J31J6j07J66J4k47J17J91k75K09J
7576C9Q7k95K51N6J07j17p3n3K6j16RK27N9J9J2k05M3J17Nj27N7K3j12M6l4K3
7602G4k34J89J06q2o6Q9j87R8K4J01p2k02O3Q7j72J52L9Ok04R0j45N8J16k2Q0
7627a4J37l66L56m4k90J68rJ25Oq6l3m1L38n5k09J60oj0j40K0k26K67m3J80q4
$$ y = [22, 63, -31, 124, 64, 48, 150, 190, -143, 33, 43, 160, 144, 9, -49, 57, 39, 6, 85, 88, 20, 137, 87, 166, -28, 91, 196, 114, 150, 88, 207, -26, 121, -119, -6, -12, -13, -71, -31, -33, -13, -12, -116, 91, -35, -15, -60, -163, -31, -185, 2, 51, -58, -112, -31, -170, -41, -176, 84, -44, -114, -27, -100, 112, 74, 152, 63, 4, -11, -163, 158, 88, 125, -24, 237, 12, -10, 251, 120, -57, 180, 325, 134, 142, 8, 210, 43, 16, -40, -100, 53, -63, -99, -35, 71, -115, -55, -183, -5, 25, -87, 197, -205, -211, -123, -109, -122, -19, -210, -177, -36, -121, -118, -162, -177, -46, -30, -137, 29, 43, -204, -87, 104, -171, 38, 39, 126, -169, 82, 138, 245, 128, 55, 2, 28, -88, -79, 148, 207, 226, 238, 33, 76, 193, 198, 71, 128, 151, 39, 85, 51, 74, -160, 29, 135, 53, -13, 76, -111, -13, 11, 112, 40, -162, -99, -12, -184, -32, 7, 13, -191, -101, -246, -188, -72, -94, -14, 123, -243, 113, 69, -221, -53, -62, 63, 69, -17, -50, -91, 247, 192, -17, 143, 137, 127, -13, 7, -219, 48, 5, 185, 101]
7652A01o1o2K9K01p8oK01j95j5j23O3q6J37l8j75L31k27J75q2mj67N5J14j01O4
7677E1p1j73L28j85j2j43K80m6j11m2k11J64l0J21k9j76J92O7j50J58O3k1k05
7700a81m6K42K1J7j95J11o6NJ39n4j07K32j11J4J03j83l8j17J90J02J38j02k63
7723a49K13O1j54N5L2LN6l4R2p0O1J7j00O2j83o8L2J16M8q0j12J70m8o8Lr5P0
7750g0J3n8L6j27K47q8l7J40r5m0k48M69k88J43j05J48N0j94J7J1q1J27N1j37
7774a16J09J63j57q8n7N1J8J70j24J21r1L4Nj19R2P9j0j40L91k42Jj45K35o8O3
7799A75q3J25n5r8K10j94O2l1n6J74j31M8j17J34j8M5j53l78K45J36J5j05p9P6
7823e3r1J51O9l0N2j83o3K24k25n0N1L8p7p3J28J6Q1n6K1J42l15J41P6J52k18
$$ y = [101, 40, -22, 7, 208, 130, 124, 325, 130, 115, -8, 55, -31, 106, 68, -107, 224, -3, 172, 90, 86, -81, -26, 88, -13, 51, -20, -193, 135, -50, -62, -205, 75, 29, -82, -124, -335, -171, -201, -80, -109, -285, -93, -26, -176, -18, 45, 24, -181, -227, 15, 36, 53, -142, -31, -97, -92, 47, -7, -114, 118, 7, 21, 124, -59, -97, -214, -24, 78, 216, 114, -149, 64, 125, -29, 26, 58, 61, 117, 83, 175, 105, 166, 183, 83, 145, -38, -106, -74, 42, 90, 10, -102, 68, 20, -48, -45, -140, -70, -57, -115, -79, -206, 41, -47, -84, 56, -39, -79, -327, 142, -146, -3, -108, 40, 90, -104, -87, -76, -157, -30, 21, -116, -7, 156, -1, -89, -146, -95, -77, 93, -31, 90, -1, 33, 38, -81, 11, 90, 80, -60, 331, 89, 90, -55, 180, 112, 175, 92, 217, 162, 64, 274, 80, 142, 111, 55, 229, 98, 146, 29, 163, 145, 190, 37, -341, -96, 40, 55, -50, -129, -53, -144, 7, 76, 46, 98, -85, -148, 76, -149, -199, -148, -110, -187, -260, -132, -116, -35, -91, -70, 72, -243, -102, -26, 126, -92]
7848i2J34l47J1O1K84j6M4l1r7k9J64NQ3j61q0K44o6m8k20L45q7j75J01K94J0
7873C31j23m4k06O0Q5q8N6J85k41J12M0N3q3n6j31rJ49J6k17R9pJ24k28k08J62
7898a69l1P9k3J08j0L4j35j9j0J69j46J15p5L2pj95J55J33P6k32K97j40O7j04
7922c1q6K38m5j80n5K90q7n4J40j73p0M2L4j77L40M8j1j86kJ33p2j22MR0P7J1
7948I6j41M1J24k4j00P5J47l95K77J0j86K65j50O8k37L58k56j29O4O4j69K99k00
7971i9J40j21K4J6J26m2M4j12o3j31J22p7J53p2J02j27j71L77j53Q7k85M41k33
7994e4J38O7k7j85J11L6j96k5J43l4J08r1j20M99l80Q9N1R8j27j40K02j12O8j20
8018aK28o2j0q1o1P1n1kJ52J29j96j2j37K9J81L5k00K33k54K6k7mj73K80r2R1
$$ y = [-92, 42, -305, -294, -233, 51, 35, 79, 48, -49, -78, 86, 91, 174, 13, -67, 177, 111, 63, -157, 188, 101, -74, 27, 321, 331, 208, 164, -42, 18, 103, 15, 71, 256, 15, 127, 167, 220, 137, 81, -50, -59, 90, 106, -111, -12, -19, 105, -123, -331, -169, -200, -121, -144, -36, -46, -12, -147, -166, -176, -7, -153, -38, -113, -81, -88, -283, -128, 5, 81, -151, 146, 6, 73, -31, -117, 121, 76, -104, -159, 131, 44, -10, 130, -43, -113, -71, -37, -214, 126, 174, 163, -23, -25, 108, 36, -86, -82, 8, 85, 96, -45, -4, 120, 96, -4, 71, 218, -177, 100, 110, -76, 189, 39, 107, -130, 228, -28, -157, -93, -29, -198, 101, -99, 41, -80, -56, -40, 86, 44, 88, -24, -87, -218, -96, -173, -20, -92, 10, -117, -288, 89, -64, 23, -262, 179, -54, 84, 151, 124, -61, 50, 86, -110, -135, 8, -26, 82, -9, -129, 370, -10, 79, 130, 228, 101, -39, 163, 51, 119, -1, 227, 165, 155, 74, 13, 84, 33, 31, 183, 312, 116, 104, -33, -4, 177, 212, 12, 245, -9, 17, -10, -14, -187, 93, 1, 92]
8044I2j04o4K21j48n7Mj9m8K19k21J36k56j8J51n0J23j54k0J62rn5m9P3J65j86
8069a12n4K34R0p8n1j64R2N6K1P9m9l7J34m0O6m6o0J08j24M0J91j29J2j53M3L5
8095A04J95k94l4Q8j13P1r7J21j24lj0J40J7jo9q8nL0j26R2j2P5j22J54m0oj25
8122a82J79nk8q0J70J7l63j5K71p6k5J1L0p5N8J29k14K07k9J14J09k39J38J57
8146B59j72O9o5k30J76P4O4j39l1j46K02M5k1J76j30o3j27M9R2%P5o9k62L18k04
8171f0Q3J21k39K13o9QP9k47Q4J73k67k06J91K33j38j28J78m6P7m2
$$ y = [92, -12, -76, 145, -3, -60, -56, -75, -123, 96, -125, 11, -245, -263, -112, -162, -39, -193, -213, -51, -60, -115, -164, -91, 74, -112, -166, 68, 158, 80, 29, -135, -43, 13, 34, 113, 64, 27, 161, 121, 187, 141, 81, 189, 65, 105, 296, 167, 179, 26, 69, 104, 299, 5, -29, 59, -54, 17, -80, 41, -83, -86, -96, 44, 61, 60, -9, -97, -102, -72, -198, -106, -118, -43, -165, -11, -51, -57, -182, -3, -8, -36, -116, 54, 71, -292, -307, -36, -112, -137, -126, -96, -171, -113, 16, -198, 9, -20, 94, 203, -36, 102, 259, 87, 156, 91, -139, 37, 111, 175, 36, 5, -141, 61, 106, 85, 261, 131, 68, -59, -10, 82, 82, 157, 88, -174, 144, -60, 23, 144, -95, 118, 49, 57, 136, -111, -27, 146, -121, -327, -136, 97, -41, -169, 9, -37, 40, -2]
8191b
$$ Imaginary data points
##PAGE= N=2
##DATA TABLE= (X++(I..I)), XYDATA
0@%%%%%%qJ6j6J6k4L3m1N4o6P9r7J12j31J59j85K14k50K89l31L79m34M91n57O31
30C33p10Q01q96J000j117J245j387J541j709J894k096K323k571K845l153L497
46A840l888M331m838N427o119O951p972R257j0931J3216j6537K1832l1631N5776
60C6714k21705m13371L02749K96654l9533k10279N6665J43144m3134j60485J6567
71b36014N6100j42006j92926J52961L83616J24827k75216k26636J08971J93042
81e3281n0652j58570J5002J59309P6939J050O6451P6364r8124j92989r045K16555
93D9009J54934o9432j02153P8177J50449j598j37486p7621M1004N1393K0031O0407
105B17114R0699R59j10489q2163K8338L7663n4227p0151L8441J11481M4900n9345
$$ y = [0, 0, 0, 0, 0, 0, 0, -8, 8, -8, 8, -16, 17, -24, 30, -36, 43, -54, 58, -73, 86, -99, 115, -135, 154, -177, 202, -232, 259, -298, 333, -377, 424, -472, 528, -589, 656, -731, 810, -899, 995, -1101, 1222, -1349, 1496, -1657, 1840, -2048, 2283, -2555, 2872, -3247, 3704, -4268, 4989, -5942, 7274, -9263, 12569, -19062, 36714, -184991, -598362, -295613, 1041, -38492, -248771, -192106, -48962, -92096, -252581, -236014, -179914, -321920, -514846, -361885, 21731, 146558, -128658, -355294, -246323, -53281, -103933, -262503, -247501, -88192, -11253, -10203, 56248, 132612, 34488, -158501, -167546, 49009, 203943, 134511, 32358, 110535, 260984, 259386, 121900, 44279, 85283, 136676, 156707, 217114, 307813, 308772, 198283, 116120, 144458, 182121, 127894, 57743, 96184, 207665, 252565, 193220]
117A93220p5818m0315l9749n4161k0398L4040L4616l413j1311R344r997p0316
129e4258q9854l4992K5306L0026P547P311J8960M421k9442m6726l6434j3711Q750
142b03096K9108L9558L0315P498j1867j5271q845l884l914O195L3943N5583M0446
155d231J214j9025p994N092J681M620K5907M0190K8134J3250J5092J0242j8411
168I5761l6384r496L1866L5869J2186R060K2805R590k8553m1190j5091N832K91
181I2546j009J7982K6091K042k5394k8714k4497l1655l0068P29L3295K5410j1844
194D4914l1748j7741m331j6784l5162l0007l532J9779K5873J7108m194l0838m0456
207a07119j9462J0510J5299m510j2319J1018L6050K7605r260l8289l2955j285
$$ y = [193220, 117402, 77087, 37338, -16823, -37221, -3181, 31435, 28022, 16711, 26055, 16058, -54258, -144112, -179104, -153798, -123772, -116225, -108914, -89954, -85533, -114975, -161701, -198135, -211846, -203096, -173988, -134430, -104115, -96617, -108484, -123755, -132600, -136484, -140398, -134203, -100260, -44677, -4231, -3017, -22042, -30036, -24944, -23263, -18643, 7264, 47454, 75588, 88838, 103930, 114172, 95761, 59377, 49881, 81747, 117616, 129802, 138862, 161667, 171257, 142704, 101514, 86423, 92255, 92546, 91537, 109519, 135610, 137652, 112258, 83544, 59047, 27392, -2676, -1947, 31348, 56758, 44914, 13166, -4575, -8906, -25690, -60852, -90859, -94391, -74612, -48739, -31631, -35825, -66663, -107119, -126581, -116071, -100772, -105282, -117601, -106583, -70533, -42928, -52188, -90477, -123432, -124717]
219a24717K8659L6676K0604o48n927Q566K1479J0042j6920k7150j712L9307N4204
232D2463K7264j4539k9757j0093J6976K0301L353r564k233J9734L4275K2557j4047
245A06690m4020l5153O733L7233K5640o198j9257m166J2482P233j6945l8011l4647
258b386l224L3588M0158P529l2919l9535j3430Q126p63k3184k5067k67K7642L1996
272H264P692k7857m7531l2991L468K7062J5929r018j1894J1542K6293P810k5506
285d6737l7540j8824J0920L1658L3358J4689r047j5993N27J2656M28k0563j4642
298e9110J8767M2247L3214N342j4470j7673j0746J54J0257J0497M448O355K0170
311D9452K6294P069k4601l5496j5285J1990K0742J2305O501N876K371n854j1415
$$ y = [-124717, -96058, -59382, -38778, -39426, -45353, -36787, -15308, -5266, -22186, -49336, -51048, -11741, 42463, 69727, 55188, 25431, 15338, 32314, 52615, 55968, 46404, 44171, 63905, 98180, 120737, 106690, 62670, 27517, 34250, 71483, 97123, 90925, 71668, 67502, 79984, 87217, 70272, 32261, -2386, -5610, 27978, 68136, 75665, 42746, 3211, -10219, -2093, -2856, -26040, -51107, -51374, -23732, 8264, 15956, -11901, -59432, -92423, -88955, -61893, -45964, -54982, -66876, -55334, -29041, -21231, -46737, -84277, -103101, -92181, -60523, -27165, -12476, -21523, -37516, -36989, -24333, -23905, -44468, -59110, -40343, 1904, 35118, 40460, 25990, 8317, -2429, -2275, 7982, 18479, 22927, 29282, 49452, 75746, 82815, 58214, 22718, 7433, 19423, 40165, 52470, 58971, 64847, 67218, 61364, 49949]
324D9949j3344j7473j7244j45K3863K6789L724j8405j8464r210j0488j6381q856
337b5685O171J1738O877M726M148q375k5700k7004o562J2194J1686M120N461R401
351a6804J487j1886j5368q297m185l756O111K2852K5598N642j5229j5133k441
364c1409J303k363L10J1681J6663J1600P414O354l615j9248j7976M104K3174J7505
378B5497J044k292P128Q719l375j4338j2953l937M957J4400J9538R631j0195k0369
392B3455r398O788M220j1049j3592M875K1882J6373n223k0318k0761j2075K52
405a4571J1835J0866l081j1177Q7J4431Q115j8264l1854j6000J2590K4690J4012
418A679k509j0504q390J66N315j280j4716j6663K308K6390K8698M971k0687k2278
$$ y = [49949, 36605, 19132, 1888, 1743, 25606, 52395, 56119, 37714, 19250, 10040, -448, -16829, -25685, -19514, -7776, -899, 3827, 7975, -400, -26100, -53104, -59666, -47472, -35786, -31666, -26205, -16804, -15317, -27203, -42571, -50868, -55053, -58809, -52698, -29846, -4248, 1394, -13835, -28968, -31409, -30106, -32469, -32159, -20478, -3815, 7785, 15199, 21553, 17938, -1310, -19286, -15182, 7992, 25497, 26541, 24249, 31377, 40096, 36721, 22383, 9430, 5493, 10450, 24850, 44388, 54019, 43824, 23455, 14057, 20845, 25065, 14016, 424, 5299, 27181, 43554, 38331, 18013, -2748, -14823, -14571, -2736, 8130, 5049, -6128, -6041, 8390, 16505, -1759, -33613, -49613, -37023, -12333, 1679, -830, -11334, -19724, -19558, -14243, -15523, -30239, -46902, -44594, -18204, 10494, 15465, -5222, -27500]
432b7500l043J2146Q891m149q497J824J7085K0515P636j3501k5037j3967J0488
445a7109K3168J2896o123j0939K676J5330J0009r706k2054j3377Q469K2941J7594
458C3775l19j3999j2005j35P432K994q651j2949m02J8095K0658J366k0012k1540
472e692m486R201P835j170m603r78N550P877K177j0358j9435j3131O399J8731
486b083J1165n182j1084j904N716P53q858r765k580N358R239R649M479o200j3166
501a4463p192N436P164k275n639M710J2741N845n534p913l507j421j080M853J0279
516B004O372l560m050L106L470n716r052L21R955Q746J568k03J042k257p209m791
532b54L389N245N2j242N348Q218n85j0189r039k84K844L38J556N624L685m013
$$ y = [-27500, -30543, -18397, -9506, -13655, -22152, -20328, -3243, 17272, 24908, 11407, -13630, -27597, -17109, 6059, 18955, 12832, 1893, 4569, 19899, 29908, 20202, -1852, -15229, -6760, 16181, 33775, 33456, 19457, 7452, 7317, 14749, 17743, 9092, -3857, -4259, 13836, 34494, 35860, 15848, -5692, -10178, -977, 6858, 5688, 1085, 107, 5657, 13534, 15711, 5353, -14082, -27213, -20814, -2083, 9082, 3900, -7184, -9088, -3372, -2619, -11477, -21242, -23822, -18464, -9225, 424, 4903, -1297, -14463, -21655, -16219, -9055, -11330, -16969, -12259, 482, 6327, 793, -7120, -10627, -12048, -13128, -8275, 2004, 8376, 4816, 766, 3872, 7342, 1626, -7426, -7105, 2850, 11596, 13164, 12961, 14003, 11746, 4537, -254, 3135, 8380, 8432, 7190, 12538, 20756, 20171, 9982, 943, 659, 3503, 3841, 5397, 11021, 14706, 10693]
548A0693n671m51L56o397q733J023J1393P902k825p786l185j241l013k282J107
563i110J399j238O71O400O339m847j3822q370M908J0851L766l908k475K276L811
578c349J042j480n083p877k550R659J6143O323r724j2452p68R881N379m726p616
593g198J95Q196J0964O461m023j3127j1237K389J4377J1114m527j1791k611J1536
607A0718J1944k620j5927j3524Q05J4030J4331K482j0265j3270k894R598R796
620A5204m627j6510r465R744J9125Q589j0211j8569j0210M913J2006N947n768
633A68j0869k514R595J1963p07j4827j6146j277J4407J4992R77j1306r626K467
647a2703R702M410o391j1437m310Q327J4789Q562n555j3264p110N137R984L428
$$ y = [10693, 5022, 4571, 4927, -1470, -10203, -9180, 2213, 10115, 7290, -496, -3681, -4922, -7935, -10217, -9110, -7711, -8949, -8278, -1878, 4461, -386, -14208, -22578, -17670, -6819, -3053, -6961, -9436, -7160, -3349, -2307, -3787, -8870, -16747, -19297, -9638, 6505, 12828, 3104, -9348, -10116, -235, 5144, 418, -7198, -7003, 1193, 12157, 18618, 14595, 1468, -9769, -7380, 6997, 18111, 13584, 1793, -818, 10718, 22662, 20042, 4115, -9409, -8604, 5426, 19757, 22239, 11974, -1296, -4190, 5408, 15204, 10577, -5933, -15398, -5654, 13471, 22060, 11849, -6720, -16930, -12017, -11, 5936, 168, -10701, -13215, -3620, 8343, 7636, -7191, -23337, -24614, -10207, 4785, 5762, -5544, -15170, -12703, -3001, 1409, -4982, -16419, -20729, -12402, 2387, 10949, 5394, -7870, -14980, -9843, 141, 3569]
661C569n676n874L161J0128Q643j841j0537r804J29R439R603K082n128m112K118
676E900N675J200o276p272j409O501Q521L977l048o845m851J112L373j28m420
691B010k614L667O065J718m172n488m211k571Q83L985L171j417l441M75K793j742
707h89p187m673J948M895K064M41J334m14m709n070J62L468J049k104J326N624
723b735L392l630n587o71J384o29l47M826O732M71m508j001L470l5n704k563N876
740a259Q045K178j781L08M37l664m025J992M636Q19k335K302P711K488p078q845
756A929j012M309K693L78J215J564j308k825J1M17m629p078J19Q089O390k758
772G504p610k886J341J92k836k870q10P1K482M852J638n664r416l412N692N782
$$ y = [3569, -2107, -7981, -4820, 5308, 13951, 12110, 1573, -8231, -8102, 1337, 10940, 13022, 7894, 3782, 5900, 11575, 12775, 6499, -773, -2182, 4319, 12840, 16817, 13769, 6924, 2073, 3185, 6558, 6430, 2010, -604, 3063, 9128, 10846, 6674, 1186, -3025, -5596, -4713, -728, 2443, 1026, -2415, -1940, 853, -889, -8076, -12749, -10801, -5906, -3842, -3401, -2067, -2481, -7190, -12260, -12098, -8630, -7581, -9685, -8359, -2735, 657, -2973, -8560, -9231, -7847, -8476, -8823, -3997, 2735, 3206, -1302, -2303, 1167, 1132, -4572, -7135, -1259, 6786, 8964, 7183, 7491, 7928, 4264, 239, 2231, 6867, 7686, 5351, 7653, 15364, 17852, 10774, 1929, 917, 5226, 7919, 8297, 9512, 11076, 9768, 6943, 6954, 7371, 2742, -4336, -4217, 3872, 10262, 7504, -106, -2992, -1651, -1459, -4295, -7165, -7975, -7904, -5422, -570, 1068, -4596, -14012, -17424, -11732, -5950]
788e950j000m682r41M611M418m19n416n231j739L443O882O057j54n066l739L862
804e064O923n28p921l513P080J0707L895l741m116j525KK155M749J764m321l631
820B915O011J0844J216j1534r466K887Q835L053l090k569K73J18O1J594m89p549
836C110q091K517J1878N743q870j1540p02O904J590o482m581J014K152M41K507
851b410K599n479j1456l540R247Q511m283q812J373R072L068o329o032k35J343
866a3363J88N015P997J443p381m524N545P149l705q651K82J0598Q029o96k549
881E377K04j286m097m10O397M563k880k490N335P316j824r180m870L402L722K27
897I506N70L414Q28l822l852P99K79l924m195K011O149K887l450n299j907j197
$$ y = [-5950, -6950, -11632, -12573, -7962, -3544, -3963, -9379, -14610, -16349, -12906, -6024, 33, -121, -5187, -8926, -5064, 1859, 1331, -6590, -10103, -3023, 7684, 11579, 7838, 3722, 2197, 2199, 4354, 9103, 10867, 6546, 2915, 8926, 19770, 20986, 9452, -14, 2873, 11708, 14761, 11671, 9102, 9375, 9493, 9554, 11148, 10659, 3110, -4981, -2464, 9414, 15157, 6287, -5253, -5955, 949, 2539, -3943, -8524, -7510, -5358, -4917, -2410, 189, -5290, -16746, -20286, -11039, -2528, -6811, -15623, -14250, -5178, -2110, -8439, -14471, -14706, -13363, -13175, -8160, -163, 1280, -6101, -10625, -5080, 2069, -1636, -10287, -10005, 593, 8622, 7926, 5377, 5581, 4295, 198, -212, 6185, 10748, 7868, 5378, 10713, 18029, 16205, 7025, 2155, 5557, 9279, 9506, 10076, 13490, 14318, 10496, 6644, 7443, 7722, 3798, -397, 1614, 7763, 10650, 7200, 1901, -6, -1203]
913a203k446j965J442K465j86j694L17J465k355o608m295K060M957K152n16m27
929f837J77j814k852p98J269J1m83K445N326L675k923n515k102K515L458J108
945c340N47J780K425J737M62m81k211k759k02M934O215K176l473k664J436L069
961I651o23l656j962K458M429K840O98k327m741l786P46M385J338l415k750K313
977E598M114J26n732o336k070K628L581J990r25l315l264m16K291n36m533n110
993a1909J547O661M375k726o135l205N05J930J124j87j477q69K621N007J778m613
1009e573o874j404N453N989J626k287j367J227K572J461j047l155j633K915N975
1024C878M993q83m669k675K157L586P79j877j259J628L678K794m46l690m106r15
$$ y = [-1203, -3649, -5614, -4172, -1707, -1893, -3587, -3270, -1805, -4160, -10768, -15063, -13003, -8046, -5894, -6410, -6837, -6660, -8474, -11326, -12124, -10855, -10844, -11327, -8882, -3556, 119, -2804, -8319, -10421, -7906, -4448, -3340, -2793, -1013, 1412, 3149, 3611, 3130, 919, -1840, -2042, 2892, 9107, 11283, 7810, 5146, 6582, 9651, 9028, 5372, 3410, 5868, 10297, 13137, 13835, 11508, 6767, 2981, 3727, 8112, 9450, 6035, 3285, 5598, 9712, 9838, 4106, -2230, -4300, -1672, 1909, 3899, 2974, -341, -3605, -4021, -1730, -2266, -6799, -11909, -10362, -3701, 674, -2052, -8187, -11392, -10887, -8957, -7833, -8020, -9497, -10366, -7745, -2738, -960, -5573, -12447, -13851, -8398, -2409, -783, -3070, -4437, -3210, -638, 823, -224, -3379, -5012, -2097, 3878, 8871, 7988, 3319, 644, 2801, 6387, 7166, 5289, 4030, 5658, 9336, 12130, 11684, 7994, 3888, 2973]
1040B973L434L919K26l147k071J257K304o57l654l386j385J866K977J912j750
1055D818m046k834k09J004n74k613j390J434K450J020k014l544k950p05J192J865
1071g096J216m83r25K18J215n28k300k165P41K658K652J410N87n76j203n80Q49
1088d310R63PL38K077L538K009m69j598j188l36K75J759K379J507N06N87O93K79
1106I016j951k592q03J338K839J961L45j108j499j862r64l79l52j184o33J768
1122C940K229j05k713l679j827k87Q46J54q73l08k69M53J195j467l690l295j06
1139i802K979K791N26k315j623J76J234k0j674j659L70K700L801J946j346l522
1155e438j909J700L634J336j458r66K296L653K024j686l078j792J173L758K823
$$ y = [2973, 6407, 10326, 10552, 7405, 5334, 6591, 8895, 8238, 4584, 1198, -187, 1679, 4656, 6568, 4818, 772, -2062, -2271, -1267, -1841, -4454, -5844, -4410, -1960, -940, -2954, -6498, -9448, -10153, -8961, -7096, -5880, -6363, -7288, -7070, -5855, -6383, -8683, -10848, -10107, -7449, -4797, -3387, -2800, -3376, -4579, -5159, -4310, -3347, -3340, -3002, -925, 2613, 4622, 4153, 2555, 1367, 1031, 1306, 3065, 5444, 6951, 7457, 8044, 8737, 9016, 7065, 4473, 3670, 5008, 7847, 9808, 10153, 9045, 7546, 5684, 4720, 4341, 3989, 2805, 2172, 3940, 6169, 6064, 3351, -328, -2155, -2442, -1596, -1442, -2315, -2623, -2892, -2439, -1244, -2711, -6401, -9696, -9802, -6823, -4032, -3506, -5821, -7444, -7268, -6034, -6054, -7728, -9387, -9017, -6317, -2516, -570, -1916, -5438, -7347, -5647, -2013, -677, -2135, -3101, -805, 2848, 4872, 3186, 108, -1684, -511, 3247, 6070]
1170F070N08j921j579J690L217N01l156m053J15M238M150J44l148l009m55R95
1186D307J352l11k353k272O63L917J880k911n549k427K068L278L18k120k367m67
1202b994J188J109m93k895k924j94L249L117l94l579k542R78K315N91j715k035
1218g218M75K442K727L22j550k334j052J266K626J264q96p28J092K871J134j789
1234F52k721m50K261K898J346l54r64r6N76N32L80o37j381M40K039K620l89k824
1252C928j572J102J869o48j650m23R36N92k93K08l53k228k081M95K671N78k568
1269E63j996R43J706j078k568p87P97O2l36Q25P24j411k887n83K132J659j797
1286d032j913R18K335M05k302r63J224L56p50Q78K346L00k282p17K648K303j184
$$ y = [6070, 6578, 4657, 3078, 4768, 7985, 8486, 5330, 1277, 1392, 5630, 9780, 9924, 6776, 3767, 3312, 4307, 5659, 5348, 2995, 723, 1386, 5303, 7183, 4272, -1277, -3704, -1636, 1642, 1960, -160, -2527, -2994, -1806, -697, -1190, -4085, -7009, -7203, -3954, -837, -1231, -4810, -7352, -6374, -4059, -3468, -5183, -7218, -6743, -4301, -1574, -1252, -2802, -5136, -6188, -4922, -2296, -1032, -1928, -2656, -1564, 1307, 2441, 652, -2069, -2519, -258, 2640, 3986, 3632, 2668, 2572, 3148, 3680, 4060, 3423, 2042, 2482, 4521, 7141, 6752, 3928, 2356, 3458, 5327, 4679, 3029, 2606, 3542, 4134, 3841, 4049, 3696, 1468, -613, -118, 2553, 3131, 563, -1433, -490, 1216, 138, -2430, -3217, -2420, -2358, -2694, -1869, -1145, -2556, -5443, -6026, -3894, -2235, -4032, -5945, -5027, -2692, -2287, -4589, -5552, -4328, -3972, -4722, -3844, -1498, -1198, -3480, -4197, -1549, 754, -430]
1303d30k545N44K712J301l23L11Q32l98j482O13K860J064k127j814J875L323P0
1320F386k665j620R86J222M03K67N90p24k542o00K451J853k648l460r5L342J568
1337D714j971l035r06J68J40O26N00r62k730j277K552L064j561m667k561K679
1353e227L290Kk029j418J11L80J098R66m16k513j614K622M849J261l989l290J281
1370d636L774J735j318j359M72J114J127J916Q97k068l030R87M621K548k279l287
1386A214K59L306J953j322k155l63L23M87J550J268j277l117j236K401K181j660
1402C812l645q68K713J841j164k541q91m23m92n9J391K38k160j788J198K149j098
1419a787l189j510K105J918m85j363K30K00J1n06N96M67r42q02J435K557N26j812
$$ y = [-430, -2975, -2431, 281, 1582, 1259, 1570, 2402, 2004, 522, 1135, 3995, 5059, 2932, 1118, 2993, 6316, 6386, 3721, 2101, 3087, 4309, 4712, 4979, 5569, 4845, 2303, 1703, 4154, 6007, 3359, -101, -196, 3146, 4714, 2743, -292, -1198, -1030, -890, -264, 236, -726, -3456, -4733, -2181, 883, -678, -5345, -7906, -5227, -1937, -1935, -3964, -5382, -5271, -4891, -3793, -2827, -3243, -5756, -7370, -4748, 101, 1362, -2627, -5917, -4636, -862, 873, -445, -1804, -1332, -218, 909, 2825, 3722, 1654, -1376, -389, 4232, 6780, 4501, 1214, 1473, 4779, 6732, 5410, 3255, 2892, 3215, 3702, 5252, 6520, 5243, 2126, 890, 3291, 5472, 3812, 167, -701, 2012, 3853, 2689, 148, -743, -1166, -1658, -1717, -326, -88, -2248, -4036, -2838, -689, -1787, -4976, -6486, -4381, -2463, -2948, -4311, -4081, -3881, -3870, -4376, -3780, -3313, -4255, -5057, -3622, -1065, -539, -2351]
1437b351j083J258J506P3q57L4J562Q50M08L19M31o77j060O21K151J054q91j183
1455B165R94J328l85j059k61L81R1K73M99M43p21j384n48J057M29j135j393M08
1473A182P37J83o80o24n33r07p29K22O92J07j165p19O38N77r87r99l78L88j19
1492c114j25Q47N53r01j304k2J297O93q97m87L77J000M08k65M44k76n93O6J272
1511a027J275m0j080k21J184J303j79j170J86O08O64N22O69M9q79o53Q83J410
1529C504J40j402r90J388J616j36j414q32L15K46J55K68J86p89j081J47J261P3
1547B655j785j127L08J111K81j226r29O4N0j81l78K0n26p90j38Q48M59j062j460
1566c806O8J313L80j081r20P37O45K97m14L2j87o84M58J188P63o01r30L37J770
$$ y = [-2351, -3434, -2176, -670, -597, -1454, -1420, 142, 992, 1400, 1719, 2150, 1473, 413, 1034, 3185, 4239, 3348, 2165, 3159, 4487, 4102, 3043, 2782, 3163, 3254, 3527, 4026, 4469, 3748, 2364, 1816, 2873, 3302, 2167, 774, 1182, 1919, 2102, 1422, 798, 265, -642, -1371, -1149, -457, -350, -1515, -2234, -1596, -1019, -2006, -3005, -3383, -2995, -3114, -3239, -2392, -1839, -2740, -4044, -4066, -2769, -2076, -2973, -3460, -3083, -2083, -1675, -1940, -1496, -1772, -2365, -2299, -1027, 248, 208, -872, -1093, 91, 1394, 1215, 45, 231, 839, 1503, 2025, 2694, 2743, 1864, 1211, 2094, 3504, 3644, 2242, 1252, 2640, 4256, 4120, 2706, 1874, 2189, 2435, 2590, 2858, 3044, 2255, 1174, 1321, 2582, 2655, 870, -257, 51, 1162, 1443, 217, -712, -648, -598, -779, -1157, -1137, -1663, -2453, -2591, -1743, -1284, -2346, -3806, -3738, -2425, -2045, -3126, -4046, -3309, -2664, -2367, -2781, -2749, -2936, -3620, -3162, -1974, -1211, -1812, -2742, -2405, -635]
1585f35O02q92r13P46J433J046j7p11K64K91J98J055M43m41o82L1J691J151m88
1604D172j799m08J532J016l19q90k47l31L69M10J83r49j304o09P94J195r9k010
1622G06j192L47Q81k30j002j250k98L57K68K15m62j494j182M25J334K70j138j144
1640d589K58R90N27m88n70j95qO92Q77O52n70r71K35J863J070n44r13k35J204
1659g15J260J028l14m48m0K47Q95R55K6q25k00P74J332O06j116j022J66R40J38
1678C687M90m03q08n37N8J215J41j209j670q7J165O87p29j493o66K7L07L23m40
1697E8j072j188k84J113Q94n86j867j249O66J394O06j262j061J65M28M50N18l21
1715b598j016o73J167J923N63j645j299L17J944J331m52j041k22Q51J051J220
$$ y = [-635, -33, -925, -1838, -1092, 341, 1387, 1370, 659, 923, 1214, 1412, 2467, 2910, 2469, 1787, 1818, 3509, 4660, 4172, 2373, 1965, 3497, 4513, 4194, 3304, 3057, 2726, 3095, 3505, 3688, 2739, 1435, 826, 1620, 2815, 2716, 706, -486, -139, 742, 512, -490, -1740, -2038, -1681, -1413, -1198, -1660, -3154, -4336, -3911, -2577, -2307, -3445, -4589, -4331, -3341, -2814, -3302, -3872, -4067, -4075, -3383, -2506, -1854, -2424, -3395, -3160, -1297, -227, -771, -1684, -1919, -715, 545, 1573, 1259, 811, 771, 1018, 1913, 2868, 2894, 2069, 1869, 2643, 3975, 4581, 3465, 2443, 2609, 3549, 3687, 4177, 3774, 2966, 2429, 2487, 3702, 3843, 2634, 964, 877, 2042, 2729, 2000, 507, -159, -132, 175, 498, 58, -1014, -2202, -2486, -1373, -479, -1065, -2932, -4181, -3515, -2121, -1515, -2777, -3838, -3673, -3245, -2795, -2277, -2598, -3614, -4287, -3120, -1197, -634, -2279, -3578, -3261, -1317, 14, -438, -1479, -1701, -850, 201, 1421]
1731A421q0r79p66L21K103R52m47j760n94J705J852K66j727j202M06J054Q89L99
1749C813p65j283q48R96J635pj843j449M67J788N40j485j401m08K94P48M61m49
1767H04j038j122j07J267Q02r93k126j89J112J174n45j087n33L08J79K30J2J12
1785a740q58o29Q42J518P5j349r39M95J104M35p02L90L26M8j56K60O64j35o99
1804a050N1J265Q61l17n94j81Q74L03n66K70P86M15p54k37R30O21l52q65l9P77
1824B198kk25O3L93j60q51k65Q67J80q69r51M38J154J7r19r12l6l82j9K67K26
1845B12k41r47o23P65O32n10j744l63Q28O74J74m71j72l19n50p8J070K13q80j058
1865c388R48J571M87m96r64k47M86M88L67O13j38j67j45Q71R32k69j366J6Q84
$$ y = [1421, 1341, 362, -404, -83, 2020, 2972, 2525, 765, 171, 1876, 3728, 3994, 2267, 1065, 1471, 2525, 3414, 3813, 3048, 1765, 917, 1913, 3548, 3541, 1698, 249, 716, 2504, 3044, 1559, 158, -250, 44, 792, 1253, 804, -234, -1356, -1463, -196, 606, -387, -2513, -2702, -1590, -416, -961, -2048, -2581, -2273, -2094, -1864, -1852, -1740, -2598, -3227, -2385, -867, -792, -2141, -3080, -2585, -1481, -1046, -1748, -1358, -1032, -984, -1140, -880, -216, -351, -1050, -999, 266, 1127, 810, 216, 35, 909, 1212, 646, 916, 1702, 2117, 1363, 1126, 2056, 2677, 2325, 1460, 1421, 2198, 2196, 1971, 2034, 2427, 2267, 1416, 1151, 2018, 2198, 1329, 378, 816, 1970, 1987, 1068, 156, 120, -262, -281, -14, 212, -29, -976, -1599, -834, -202, -712, -2456, -2819, -1991, -1317, -1143, -1614, -1786, -2105, -2655, -2733, -1663, -1450, -2330, -3388, -2440, -869, -382, -878, -1842, -2089, -1603, -1115, -748, -135, -273, -440, -585, 286, 1218, 949, -417, -401, 483]
1884D83J434L61m97m87j3p9N88N73L35q04q69M82J141P63j144j197l03N40N92
1903A899J90l02o98p50L3R94L15j027j579p01J227J289J41j129j387l59L74P19
1921g51J25q51r89J7J088J193p3j492j514J67J421J253k90p60n08J84J144P38
1939A02l0j348q74P45J518J133n81j132n12R63R08L22n35p32l00J052J333L58
1957B390r55j520p0J092R19pq56m42k09Q67P62n21j128q50L42J036P11k04j143
1976B14o44K85L59K04k05p89l66L31R23L63m99j176m38N68O38k11j73j47J70L32
1996b61J53j6n52o81J36O06N50J78l06l75L09L36l90j29j73J97J93M23J64O8l79
2017E1k74n0M91N1l65k00K61M87J05m51j08j04j48K65O1J81k01M9p0K00J55l65
$$ y = [483, 1917, 2278, 1781, 1294, 1281, 1202, 1790, 2363, 2698, 1894, 1025, 1507, 2648, 3411, 2267, 1070, 767, 1307, 1899, 2089, 1787, 1089, 339, 372, 1366, 1681, 654, -925, -1626, -399, 890, 1031, -98, -1485, -1844, -1470, -751, -626, -1477, -2466, -2449, -1361, -168, -241, -1733, -3247, -3080, -1659, -406, -696, -1456, -1964, -1780, -636, 102, 72, -1276, -2150, -1405, 113, 1246, 665, -467, -979, -16, 892, 1214, 679, -53, -353, 699, 2032, 2390, 1435, -85, -155, 937, 1856, 1849, 993, 551, 342, 1209, 1971, 1450, 322, -528, -186, 850, 1561, 1357, 214, -430, -145, 214, 418, 213, -576, -942, -611, 312, 675, 176, -1000, -1438, -870, -232, -443, -616, -763, -593, -261, -108, -124, -676, -1357, -1221, -615, -65, 113, -193, -568, -259, 77, -313, -442, -615, -418, -225, 198, 362, 430, 51, -223, -273, 218, 269, -96, -296, -35, 452, 557, 106, -2, -106, -254, 11, 72, 253, 52, 101, 31, 231, 386, 21]
2039B1m30R8K92K92J60j89k35l1Kp6K13j5j75J58R7L81J7m69k80N2M72K52q7n97
2063g7K4M73J89r0l46m20j22K51L53M73l76l89k98M27K89k95n94j38M18M33q2
2084A03k36j65k30j64P3R50j58p54l63L74R80j69o15m21K38M03M4K64p4o1n22
2105e03J10N68K84m41n86L59J044n6n67m18K9L33l1l1N42j48l92j07M92M27p25
2126A83q70J9J030L23l59m68P1L93l79j90K97l03k25j55O82K74j77n69k36L14
2146c45N47o11l72J51O50P5l53J53pj07j73m3P40q5k19j87N51M57n44n87J24N75
2168C90J82m7k82M21l3l68J64p8Q3k87l83L27R02l35l99n70L35R2l61r2P6M81
2190B18j20j67j81K76m74n50J90N89J11m64mK91K04k62n34l33L88L12k94N90K07
$$ y = [21, -409, -311, -19, 273, 433, 244, 9, -22, -20, -96, 117, 102, -73, 85, 182, 563, 580, 111, -169, -117, 355, 607, 520, -77, -53, 420, 609, 519, 173, -247, -369, -118, 235, 708, 332, -57, -355, 72, 361, 66, -528, -666, -248, 185, 103, -133, -298, -528, -692, -619, 331, 173, -581, -944, -570, 410, 241, -374, -795, -557, -154, -110, 154, 80, 19, -503, -393, 175, 459, 18, -568, -209, 835, 779, 212, -206, -177, 156, 125, 94, 636, 488, 96, -11, 481, 908, 183, -687, -668, 362, 685, 326, -142, -71, 322, -57, -247, 50, -253, -478, -633, 49, 323, 146, -423, -659, -345, 202, -409, -781, -630, 20, 95, -258, -105, -112, -219, -392, -435, 305, 220, 1, -186, 365, 822, 278, -309, -185, 390, 572, 525, 243, 664, 631, 263, 427, 349, 432, 145, -238, 89, 991, 656, 257, -313, 22, 114, -247, -339, -263, 218, 98, -69, -250, 26, -448, -998, -808, -219, -108, -572, -576, -285, -81, -343, -877, -1210, -822, -510, -804, -214, -7]
2211gk81m33K44N82J02o16k31M79O64K37m87j70J02k2J3K55K52m2j47K42M72P9
2233A287m77o69j91O35L02J05j69k58j0j49L00m8m50n17j01O43M60Rq18m29j7
2254e62Q5L72m08nk15q7M56M70l24q03o75K67O33O21j39k54l89K66L38m1l29l57
2276a080j31N79R89M45l25q45n90M74R49L46m36l66jM32Q59J72p76r74j18N20
2296A23J020L93n83o00q2K24P06p6r96o11J00J088O15R9j011q26k28N73P60k84
2316D04q24k99M04O79M15n93q59q29M22J031O46k47q94l49J02R42K46q13p86j77
2336a379Q74J096K87o48p57l88K98N44N29m84n14p4R41O78k83r81n58j74O88Q58
2356E53L47l46m73n51M39O04r8p57n15L33Q01M59P8p79o00j12L10O59K0k84m91
$$ y = [-7, -288, -721, -477, 105, 207, -409, -640, -161, 503, 740, 253, 83, 185, 163, 176, 431, 683, 641, 494, 736, 1208, 1287, 810, 141, -50, 585, 887, 992, 823, 565, 555, 406, 706, 658, 208, -309, -410, 233, 693, 702, -116, -545, -562, -477, -105, -513, -518, -733, -820, -364, 106, -218, -1021, -1696, -1429, -796, -175, -314, -568, -957, -691, -353, -394, -723, -1080, -1211, -632, 357, 802, 477, -368, -958, -484, 465, 811, 375, 9, 8, 440, 1299, 1471, 695, -279, -397, 123, 1143, 1536, 953, 353, 271, 495, 1201, 1125, 129, -482, -382, 706, 1321, 1420, 409, -417, -645, -72, 688, 404, -420, -719, -315, 364, 779, 186, -673, -1502, -1080, -49, 597, 350, -544, -893, -791, 151, 397, -416, -1202, -1379, -505, 591, 878, 230, -527, -915, -617, -73, 456, -28, -542, -616, 325, 1003, 720, -261, -819, -993, -305, 553, 900, 554, 81, -470, -31, 573, 475, -282, -797, -464, 337, 796, 874, 95, -505, -617, -307, 352, 372, 88, -403]
2377d03J42O71M55l88p46m97M00M42N26J71p6m98n35M20K16R1n94k58L45R02K94
2398A080o13l87o22j4L02L22M45j32l33k92O07P5k81n38m78N35M98R5K8q1l95
2419a79m67J42N72j99l86k26J47Q49L25m38m21k52k84J03P96L57q6m40l67J73
2439b81O61k95n68k30P19M48K84j07j9n61n78K82P84L90p20l57K93L81K04k13
2459E17p17Q4l07K50O10L14o9q95j79K74P52l72q63j15N38M31K95j38k26p63m28
2480a007L22N87M18n35k90J25O75O7n82l14j93K38P09J11L66l67r07J72N93M30
2500F18l69o22m9P50P13j74k29n22k82p2N47L41l18j60j99P72K29n16q96n34K73
2521f99O48M55Ll83k14k53j33J90K07n02k62M27O24L65p73p21P4J12K15j12L57
$$ y = [-403, -261, 410, 865, 477, -269, -766, -366, 76, 602, 773, 697, 199, -336, 84, 300, 391, -203, -461, -116, 786, 1080, 467, 80, -542, -556, -254, 68, 513, 381, 48, -244, 363, 438, 157, -381, -859, -324, 174, 269, 297, 216, -179, -646, -504, 68, -131, -517, -743, -596, 253, 578, 140, -281, -533, -817, -714, 82, 439, 353, -87, -454, -281, 380, 85, -483, -713, 6, 454, 738, 631, 612, 51, -527, -245, 539, 929, 209, -148, 145, 526, 730, 517, -200, -116, -423, -173, 437, 751, 682, -213, -392, -118, 634, 262, -601, -716, -178, 253, 548, 410, 184, -579, -1007, -685, -98, 320, -215, -505, -380, 295, 362, -220, -534, -727, -489, 220, 331, 697, 330, -577, -405, 188, 618, 249, -373, -422, 328, 1041, 867, 638, 116, -166, -238, 309, 650, 332, 172, -27, 745, 974, 458, -438, -972, -699, -51, 404, 407, 24, -190, -443, -576, -386, -179, -681, -943, -516, 108, 473, -300, -1021, -947, -835, -620, -732, -375]
2542c75O6j61K85K97J18m93n85J66L58N27K98k04P4M4j59qj16Q8m7M76K52M55
2564A356n3n99k99N4J49O3n9L13j4K78k39j97k39l48j63J5K55K46k43l48J56j06
2586b2m80j80Q4n0l9J07K04n9r3k77m63MJ31l55K18L18M43j73rk46l51j07L00
2609a095L09M42J69l2J4nO2m12K21K12M18J54L71K5lj66j4J6M4J15J07m6N43m
2633A445n2k49r4k54R3l04N97q3j47p7K9j50l35k84l38J04M21M12l71m25j38k63
2655d63k59l3o3N1K0o0L84j60m14l99R8K42R5k77L44J71M8j2o7j33j53l64M6P18
2679f40L97r5j15O3K87j41j52o3K94K29K40K50K50j14m66j53L96L34J29Ml09N51
2701A176K0n3m24q9N8j03K36L81r2k39P1n8J77l10l24m45Q1P34k05R7k53m21l1
$$ y = [-375, -309, -470, -185, 112, 230, -263, -848, -682, -324, 203, 501, 297, 371, 415, 256, 248, 132, 220, 173, 649, 901, 1356, 1303, 704, 405, 459, 608, 671, 612, 925, 911, 1189, 950, 753, 514, 166, 3, 18, 273, 519, 276, -72, 84, -22, -502, -682, -598, -648, -687, -580, -376, -435, -528, -805, -1268, -1264, -1133, -1488, -1270, -952, -509, -682, -691, -937, -1288, -1395, -1095, -786, -344, -175, -207, -193, -198, -136, -548, -327, -115, 303, 457, 828, 853, 850, 684, 670, 686, 730, 845, 952, 906, 1449, 1445, 1393, 1144, 1050, 796, 889, 585, 1182, 1099, 952, 875, 904, 754, 419, 135, -203, -99, 322, 734, 363, -62, -200, -463, -722, -755, -818, -767, -747, -807, -423, -583, -997, -1396, -1298, -1056, -961, -1238, -894, -723, -675, -687, -754, -887, -1040, -1404, -1358, -640, -243, -338, -453, -390, -103, -244, -396, -459, -165, 64, 304, 554, 804, 690, 224, 71, 467, 801, 930, 934, 625, 1176, 1196, 1143, 719, 630, 688, 585, 821, 1202, 1110, 871, 942, 884, 1061, 751, 427, -18, 63, 797, 592, 689, 436, 15, -16]
2724a6l80Q8J80K4k58R6L71j3m92m48j43R6m9O0K40K51j61k49j72O6r7l72O3L91
2748i24M62l4k41L0p0L1j59J00L13R0M9R9K42K19k50j04N8J01J75M4L41M52J2
2771A036m08j49L34K01k13l2L27K40J5k94l0k2k22q3K62K20N6k08j52N7o7j15
2793G53l73j25J26j38m6K10o6k75n61q5k6K61m34j12J92J67j06n38j07n1j47N
2815a476J45N07M4l31k70N1L76k81K0J9J83L27R8L08j4j92nR0L63KQ3oK60K00
2839E01K87n2j61K5r7L22K69L14j20j68j32L41J5n76R0J96k8r5L13P3k75m90k64
2862B88K12K95j9m47l22O8L22j82k57m44k69J39J6J64J10n91k53N5L29L7k05l16
2884a270o5M29K96J04k97k01k80J79N20k3K2k68K91J37M75N3o13M8M4L16N74j2
$$ y = [-16, -396, -308, -128, -104, -362, -266, 105, 92, -400, -848, -991, -895, -944, -884, -644, -393, -554, -803, -975, -909, -1006, -1378, -1315, -924, -462, -496, -737, -707, -777, -746, -905, -805, -492, -402, -353, -254, -12, 207, -43, -147, -89, 12, 187, 231, 572, 1024, 1036, 628, 479, 813, 1014, 801, 769, 1096, 1336, 1351, 1057, 1027, 1005, 783, 700, 962, 1182, 1238, 1030, 878, 935, 868, 753, 380, 255, 381, 243, 197, 407, 341, 66, -495, -580, -606, -345, -779, -891, -699, -532, -638, -1176, -1283, -1334, -1481, -1476, -1331, -824, -780, -1111, -1381, -1330, -954, -1235, -1215, -1196, -1013, -686, -588, -280, -294, -486, -491, -401, -38, -36, 47, 41, 301, 501, 788, 736, 575, 600, 503, 825, 1094, 1408, 1288, 1120, 988, 1329, 1344, 768, 858, 1054, 1026, 931, 1244, 1317, 1042, 552, 288, 500, 795, 776, 329, 7, 75, 397, 215, -42, -486, -755, -616, -600, -436, -326, -917, -1170, -1115, -786, -749, -954, -1270, -1335, -906, -610, -506, -803, -1004, -1284, -1105, -585, -608, -586, -854, -563, -426, 49, 102, -511, -463, -419, -103, 471, 459]
2906D59j55j00q8K30L60k90j70k6K26L90k0n2k33k58R8K30n6Q7r3j25L5L84k23
2929F10j86k10l30K19O7L26R6m55j48K02j58J2r6k54o0L46K32Q0n74K0k2j11L24
2952g0n4J51l02J44P9kl5l00kO9L0L31j01k1j71JN0k59K16l20O9Q2L04l2j2j38
2978b93k98Q2N1K6J13K06j97L1J05k8k75M5k9K41K2L02mK15j68l6o1LM1L60o8
3003C86N1J57K8O9q3j2j15R5j8K92j89J14K94j33l01k1p1j8L3J8K5K4j61k33J3
3028B44k50J47k27J54j09J81k00k49K8k67j50o8j60J13J72n9l77L09j64k67O0
3049a139L07p0j32M4K54K20l46J25j53J18K66J19P0l3P1K55J62j00J71n8oM70
3071F15J7J75oj6J3L9J45j78J16J49rK2J18N8k99o6l50N85j29k99j59J62k08P4
$$ y = [459, 304, 204, 116, 346, 706, 416, 246, 220, 446, 836, 816, 764, 531, 273, 371, 601, 545, 632, 539, 414, 449, 833, 610, 424, 214, -116, 103, 170, 496, 592, 137, -11, 191, 33, 45, -51, -305, -365, -19, 213, 293, -281, -261, -283, -394, -70, -124, 27, -275, -131, -52, -54, -89, -389, -391, -322, -292, 39, -62, -83, -254, -253, -203, -462, -246, -566, -497, -415, -111, -143, -155, -293, -591, -509, -458, -432, -319, -113, -310, -279, -174, -202, -477, -432, -461, -220, -198, 104, 100, 315, 147, 111, 50, 53, 94, 454, 386, 437, 594, 622, 691, 608, 596, 481, 576, 558, 850, 661, 775, 1069, 936, 635, 614, 543, 525, 558, 576, 601, 625, 464, 231, 244, -6, 141, -86, 68, -41, 140, -60, -309, -281, -548, -698, -766, -926, -813, -641, -700, -1077, -768, -932, -1199, -1139, -832, -902, -1034, -990, -736, -516, -862, -737, -890, -772, -506, -387, -317, -350, -279, -24, 138, 38, 209, 151, 145, 615, 632, 807, 801, 785, 798, 837, 982, 804, 920, 1069, 1060, 1082, 1200, 1258, 959, 893, 543, 1128, 999, 700, 541, 703, 495, 569]
3095E69p3k13Q5l57j09J99L5k33p3j29M2k78j64j44L3K7r1Nj4Q3l42n1K76o0J31
3120h46m4j20M52l36K16MJ7l4J71L88m55K21M3N2n0L14M6n5p3J91L35m5q7L9K39
3145E83J63j41K52n9mM0j64K55J54n01M5l0K88l8j07n6%J18lp6l1k02J16k96J17
3170D23K61l86j19j66N7r0j17j11J02r8J3Oj60L6k34n2j62J22J4J34l39Q1J6J42
3194f27k46q2OJ09J2n8Q9j54J59M3J17lP6j61K40J98J66j01K18j15k8J63K4l8
3218GL39J07l04M28J94J6j30M5L2J56J84Q8o9m2o8k7K1r8O2j06L4L8M6j63j94
3243E96J3m1j45L2k28k4o9k37O7j9p9l89j98Q5M9j09k23j2k87K7J19q6o0m1N7
3268a202Q0m2r9J60ro9J53n1K90M5K79l24N21j10L0J74JK86N0J19qK68J58QJ09
$$ y = [569, 496, 283, 368, 11, -98, 101, 136, -97, -170, -299, -257, -535, -699, -843, -810, -783, -874, -869, -883, -800, -1142, -1193, -917, -977, -846, -890, -1010, -558, -894, -678, -674, -657, -691, -520, -132, -587, -366, -323, -271, -321, -7, 39, -16, -89, 102, 437, 392, 305, 344, 583, 746, 605, 857, 798, 794, 834, 670, 925, 1079, 578, 623, 593, 881, 843, 736, 680, 680, 798, 795, 719, 688, 486, 602, 306, 423, 684, 298, 179, 13, 70, -20, -137, -248, -146, -244, -231, -225, -385, -349, -583, -635, -797, -675, -661, -527, -866, -785, -769, -627, -873, -955, -949, -840, -828, -886, -797, -951, -792, -749, -632, -635, -559, -720, -480, -282, -116, -217, 1, -114, -142, 21, 45, 7, 346, 453, 149, 577, 771, 787, 657, 702, 734, 890, 1074, 1162, 1093, 1051, 983, 956, 977, 879, 941, 835, 869, 907, 953, 790, 596, 609, 568, 423, 455, 227, 203, 134, -103, -36, -55, -134, -523, -721, -636, -587, -696, -919, -931, -1218, -1191, -1072, -1158, -1218, -1259, -1202, -1122, -1164, -1263, -1103, -1112, -1181, -1028, -1079, -789, -744, -465, -789, -268, -378, -348, -174, -173, 113, 163, 282, 274, 542, 700, 708, 817]
3293H17J03j50nL58P8j39l8J03K8Q5M9j03j22r7j6K11nm00j57J8R6k98J15l68
3317A63k08j3rN6R7l59l15r2K14l00Q7m28oK2L44j76m27Q1j77N27n7J03J56k32
3341i49M0J07O8J66J6j51L51J08O2R3k09L41L1MK96K17k32n6M16l9J20K27k53
3364G74q7N9L8J17J53k75o1j2O7Pj38l4k11J52j10J77k65j55j8q5p3N0j46j29
3388b05j07J19J2k06n3k6j7l0k4L0%M7k66N07j24j10mk69L54q2J58j29L70KR6
3413D3k41J05O9kj40J31N9N6j00J84o8L8n0J27j72J68J41j12j5JJ16l52J57l1
3437A12M8j14p2J69j1L2J2j94q6J31j81mK90l4l09J43P6k33L98l21K29k7J20l4
3461A40j65q8m5K25M5k09L06j26Q8j10j17J64j83j83L67Nk2J36r1L0R4k18M0j4
$$ y = [817, 920, 770, 765, 1123, 1201, 1062, 1024, 1127, 1155, 1240, 1289, 1186, 1064, 967, 951, 1162, 1157, 757, 600, 618, 714, 416, 531, 163, -45, -58, -67, -11, 86, -273, -588, -680, -466, -766, -679, -1107, -1113, -1091, -747, -923, -1350, -1269, -1446, -919, -976, -873, -717, -949, -909, -802, -734, -568, -552, -703, -352, -244, -182, -89, -298, 43, 74, 78, 374, 591, 359, 303, 719, 680, 800, 1027, 774, 687, 746, 784, 901, 1054, 779, 718, 706, 773, 780, 642, 608, 397, 549, 439, 616, 351, 196, 178, 93, 20, 70, -76, -205, -312, -193, -181, -387, -440, -466, -483, -513, -537, -507, -507, -460, -726, -219, -343, -453, -457, -726, -372, -454, -296, -425, -55, -53, 43, -198, -93, -24, -26, -166, -35, 24, 80, -20, 164, 96, 134, 84, 211, 39, 207, 348, 236, 221, 222, 338, -14, 143, 112, 160, 46, -26, 143, 132, 164, 176, -18, -104, 27, -154, -158, 132, 98, -211, -68, 8, -225, 173, -148, 81, 54, 174, 140, -25, -113, -158, 67, 112, -97, 209, 83, 171, 61, -56, 108, -75, -258, 109, 114, 92, 228, 137, 167, 261, 43, 83, 69]
3485F9j68pJ48J04k57Q6k21J23J02k72J29J03k2M3q0j45P0j30m7J56R9k62J08
3508b71O5M9j43L30k47M9J11kK3j82O5J90M8j57l9K5J8J05N5M5K18j68q9%n8j23
3534h3K33J49q1O9q6J06p2J4Qj24J84r2pj40J36p1J35j81K2p1J9q4j07L41J52
3559C69k65k88Q5P2J00j90J91p7N9n1j36J11k55J82lQ3j72%K50l50j1J41r6J36
3583a15j38R6JJ14k67j73J97J20Nj70J69J0n0J2K62k14%M9rj36K44l6L0l3l6K65
3609A97k99J91M7m9j0K63j0K57p4k06O9o4J3o6L25j56K0J63j52%j19n8k24K17
3633B75K36n2k62j41K2L6j23O7l38J96j56LJ62k28m5K2r0p9pm0j47K20k35J70
3657e34j46J71k68J83r2J93qj19L60k02J82l5L6r5K12J22K11j5Q8p0j18K37Q6
$$ y = [69, -99, -106, 42, 146, -111, -25, -246, -123, -21, -293, -164, -61, -83, -40, -120, -265, -195, -325, -372, -216, -117, -379, -271, -206, -157, -300, 30, -217, -168, -57, -59, -36, -218, -153, 37, 85, -72, -111, -86, -68, 37, 92, 137, 355, 187, 98, 98, 40, -83, 150, 299, 218, 287, 201, 307, 235, 249, 257, 133, 317, 225, 218, 78, 214, 143, 278, 97, 119, 48, 67, -17, -124, 217, 369, 104, -184, -99, -27, 73, -117, 74, -3, 56, 5, -131, -20, -275, -93, -96, -13, -185, -185, 65, -285, -296, -155, -251, -115, -253, -157, -156, -42, -309, -482, -285, -165, -160, -330, -161, -151, -201, -189, 73, -141, -141, -92, -101, -237, 7, -29, 1, -32, -68, 197, -102, 89, 136, 87, 77, 340, 330, 587, 513, 307, 376, 312, 325, 259, 584, 428, 448, 611, 459, 459, 340, 282, 58, 275, 511, 459, 197, 56, 78, 114, -9, 58, -280, -84, -240, -237, -75, -303, -348, -326, -416, -495, -502, -542, -689, -469, -704, -534, -680, -509, -777, -594, -686, -493, -501, -620, -260, -462, -280, -315, -279, -374, -162, -40, 171, 156, 244, 174, 56, 293, 379]
3680C79j77K07K13j71QL36k72N1J1J63j65K4j38J67j3k4J85j86k60r6o6K71r4
3703C53j49J41l99J08k13K00j02l22J37k8q6Q2k9k23R0j77P1q3p5M4J3J05j04
3726f46m9K5p0K24K26k1q9j53K36N2J51K9M4Rj47K23K33n3Q2p6R2n6L4K33l00
3751B33K72N1J05j07J0Qj41J46m9J16j50J24j77k10K32k34J6o6j73j1PJ09N1k68
3775a06j43k8N5j03Q5J47m32K64k49L06k9n9k71M2j23K62K34k55oJ8J89k3n7M
3799b78O4m9J59K48J11l55J24J76p6m4LO4O7O0p8K56k45M3j58M0k1K53k4o8k45
3824B7K00N0l24P1J18j95J20K4lj04J20k88k8q8M40q8k43K6K21Kj75qj4R4j43
3849a88MK99k3m3l27K06r5J98m2j19K76M7k4N2O5j06k56j42R1K07R3o1p2LM9p5
$$ y = [379, 202, 409, 622, 451, 459, 795, 523, 574, 585, 748, 583, 607, 469, 636, 623, 599, 784, 598, 338, 242, 176, 447, 353, 204, 345, -54, 54, -159, 41, -61, -383, -246, -274, -360, -278, -307, -530, -440, -617, -546, -629, -704, -660, -647, -542, -646, -695, -670, -740, -516, -290, -311, -400, -553, -317, -265, -114, -85, -41, -32, -179, 44, 277, 224, 306, 230, 322, 266, 300, 533, 233, 505, 556, 661, 554, 564, 572, 431, 577, 528, 644, 494, 618, 441, 231, 463, 229, 245, 179, 6, -5, 2, 111, 162, -106, -249, -277, -222, -325, -240, -93, -525, -261, -510, -204, -233, -292, -563, -521, -644, -382, -148, -403, -409, -391, -202, -225, -282, -278, -214, -263, -104, 144, 255, -100, 24, 200, 124, 80, 83, 147, 214, 274, 196, 452, 207, 250, 92, 132, 111, 364, 340, 272, 27, 227, 277, -47, 24, 142, -53, 67, 91, 88, -16, 104, -184, -212, -300, 140, 52, -191, -165, 56, 58, -117, -125, -139, -45, -188, -184, 115, 92, 49, -278, -72, -167, 31, -11, -130, 146, 193, 169, 221, 286, 180, -76, -218, -127, 80, 173, 112, 40, 43, 92, 17]
3875A7k07n6P6J77m5K07k6k20k23J39j03L7J9JJ73j44J9k7q0K06l79N2R5J53Q5
3900e4mr7J89L2j19j43Q9N0M6J9J43m1j00l5K6J84Q2j17N8k9Q6q9j91N7J20j77
3926a5J6K74R1j04K4j98j24p5Q7l7k26K95j2kR9j55k20J47L5m1j6k2N2l4O2k03
3952c02J78m2p0l9QJ33K53J7l65M5p9K66j22K9j7J03O2K9k3J60k82L34l69J87
3976I4J85k65J83pn9K09k09qj27R1PJ08Q3k31J6J2P9l63K28MK00j61J35l0j14
4001F0k56R8J36k41J19j14K93m1k6j70j09J27k92K17J35k07K30o4J2KJ38n0p8
4024h1J66k13K00j47K44N2j96j52M7Q8j71L55n4O6L9j51n4k96J94j99K25J44R2
4047A98j15j37n8l3O1P1N8p6o3J42l3J01k86M2j66J04L13L5k36J2J84p7J89j50
$$ y = [17, -190, -246, -170, 7, -38, 169, 143, -77, -300, -161, -264, -227, -208, -207, -34, -178, -159, -186, -266, -60, -439, -387, -292, -139, -54, -58, -155, 34, 66, -53, -196, -107, -57, -11, 8, 151, 110, 10, -25, 1, 185, 267, 150, 208, 179, 265, 176, -15, 42, 162, -15, 1, 275, 366, 262, 286, 88, -36, -111, -24, -61, -287, 8, -4, -6, 93, -62, -282, -135, -100, -141, -157, -179, -127, -161, -99, -302, -124, -166, -236, -275, -267, -134, 119, 136, -229, -184, -263, 3, -119, -90, -107, -4, 58, 87, 64, 224, -58, 276, -93, 94, 279, 14, 197, 190, 131, 340, 131, 123, -4, 87, 94, 202, 285, 54, 70, 82, 161, -202, 26, 30, 230, 69, 204, 174, 60, -196, -98, 38, -203, -84, -198, 95, 54, 28, -142, -251, -124, -416, -199, -64, -271, -41, -105, -93, -91, 47, -3, -81, 85, -128, 72, -75, 169, 221, 25, -127, -80, 8, -163, 192, 138, 204, 243, 92, 38, -258, -64, -263, -38, 106, 198, 83, -54, -112, -145, -84, -13, 45, -31, -94, 48, 15, 116, -170, -128, -294, -190, 123, 158, -78, -66, 118, 41, 230, 80]
4071H0n0Q2j40L6J31L8Ok59J60J92k07O6j86R5Q4K8J38k11M4l51K15PK8K69k95
4096@R0n7M4l9q1j26O1o7Pk6K40o3j53j6K8n1j29J2J80K55k4l33J78L8q4j44L01
4123D1J41q4k50m9M28Q4k17j02M3J37J1J22k43K54L8l22O9J37n6j23L2J74J15
4146C80k77K9k2p1Q4j03J38N0l66J61M0k39K43j37j43J56q0Q1p6P6j91nn4k8J57
4171a97J69l57P5P6M7o2N9k50L03j71J61k40M68nn3k06J72J36k29P9J28J28j57
4194G4L21j60p8oK9L0K26j81n4p2J50K43k55k40Q2N7m8K30k02M8K88l88m6jm1
4219Fn2j64J47L5j7p5p3j52J41L3j98L1O7q7k4J79J02o0j89P4J63qj19o0L00j22
4245a22l4L84k04j2j11K5K01J13j24k3K54j67N9No0K29r0K23k23LJ05k31p6j23
$$ y = [80, 30, 112, -28, 8, 139, 177, 183, -76, 84, 276, 69, 135, -51, 44, 128, 156, 294, 83, 127, -224, -9, -2, 26, 295, 0, 90, 33, 77, 38, -43, -169, -108, -175, -168, -194, 46, -17, -170, -186, -158, -209, -338, -326, -146, 109, 85, -248, -70, -32, -116, -260, 41, 182, 98, -152, -201, 227, 311, 94, -8, 35, 172, 183, 305, 62, 316, 354, 32, 101, 238, 182, 59, 91, 265, 380, 103, 132, 110, 39, 123, 20, 158, 208, -158, 3, 43, -196, 47, -90, -233, -77, -157, -76, -152, -76, -267, -272, -326, -354, -197, -28, -385, -310, -234, -187, -249, -190, -440, -137, -308, -147, -387, 81, 76, 23, -183, -11, 125, -104, -25, 103, 231, 74, 395, 235, 157, 151, 180, 210, 436, 255, 201, 129, 279, 522, 267, 27, 109, 166, 118, 348, 146, 194, 482, 94, 48, 47, 6, -46, -210, -63, -28, -45, -120, -193, -345, -204, -171, -369, -338, -271, -358, -382, -203, -101, -161, -350, -276, -113, -121, -240, -300, 0, -122, -156, 228, 24, 12, -99, -74, 127, 240, 116, 93, 347, 180, 239, 244, 184, 413, 323, 546, 323, 326, 431, 200, 124, 1]
4269AL16j62m4PJ52j34j13M2j08N8j02O7J48k07%k9K17k73jk5J6R4R7O1j17P9
4295D0l50k6K41JK3j5O9mJ17m0p8j34J47j59J50mP7k9M8O8qk12K04j65R3J17k0
4322A51j12K2L8r8J08j26J05J01j88J1N1j63ml7K57p3k09P9J97n0q3k10K30r8
4346a01j2m2J43J4J14k31K20k22J39r5j08K41R4l4j65J46k42J47N9q7j1r4L5L38
4370B46j97K00k33k6p6J99p2n1N2n3Q5j09Jj7K18l21J22L6L7M4k81J08L0k3Q0
4395ak59J17R7j62K17J28j26q8O2rq8J75n3K6O9q4q4J48l3l0j87R3K69o9P5j44
4421E9n6l2J72j56j3Q5P0o5R0j97K74j75m4J66j25P4k58k14L52q0J44o1K12l02
4445h0rL1J58l60L09k86J92J37k48K03k99L86l17J22M9N2l9M6k30N4N3P7j4K06
$$ y = [1, 317, 155, 111, 118, 270, 136, 23, 65, -43, 15, -87, -20, 128, -79, -79, -108, 109, -164, -165, -190, -174, -80, 17, 78, -39, 40, -310, -336, -95, -94, -71, -86, -17, -21, 96, 56, -22, -156, -9, -168, -18, -22, 55, 26, 74, 142, 134, -78, 126, -39, 54, 171, 151, 39, 61, 99, 1, 109, -17, 88, 189, 1, 12, 63, -100, -104, -141, 116, 43, -166, -87, 110, 60, -23, -233, -3, -101, -113, -155, -12, 2, 116, -115, 105, -117, 22, -73, -181, 60, 154, 120, -45, 101, -141, 6, 65, -22, -33, -127, -92, 246, 49, 249, 16, -10, -86, 113, 41, -10, 42, -11, 74, -35, -34, -51, 167, -154, -32, 4, 41, 85, -196, -88, -58, -81, -1, -260, -143, -46, -208, 9, 137, 11, -77, -15, -24, -112, 63, 10, 36, 105, 21, -63, 85, 52, 22, -165, -72, 197, 128, 203, 59, 3, -29, 143, -13, -26, 59, 129, 64, 154, -43, 231, 56, 12, 178, 53, 127, -131, -345, 7, -73, 71, 10, 222, -80, -89, -58, 100, -260, 49, -237, -45, 92, -156, 47, -252, 134, -183, -61, -12, 40, 1, 47, -183, -129, -76, 1, -13, 193]
4469A93l12P5J33m6m8L3m1jQ2K8q9o1K5p0P7ro8j8L05r1l01J26J55j30m0p5J43
4496b5m5n2o4J29L08l28p3M6n8O7j31K12j7J3j83K02L8J30n3r2m5q0L55k09j2
4521C3K90j85n0K83k30J14j62K24r5r0jr6Q1J85q9M9P2j07K8k18N9L3j30j07K44
4546A35k05J19Oj80J14j94RK69l33m1P1M3n2j7l6Kj15j24K64qL5M8j37Q2K2O9
4572a54J20kj29J22j71K81k04K33K54l12L7M1J16j18J14po8L3J81j06K49k41O7
4595C36J47p5l4j30K43k73l5K7j7L6n3Jj26L9p9k01K14M8o6j62M1N0q4L5j95k
4621c15o5NP2O9l37L33M7j99O2k0nJ75j38M2o8J06j0L1K21q3j89K54j71l8J45
4646g6J86Q8n0J49P2j11QJ16k05rJ61L5l54L42p5K2J55j6k42k4K28N6l12m2J45
$$ y = [193, -119, -44, 89, 43, -5, 28, -13, -14, 68, 96, 7, -54, -29, -99, -22, -31, -99, -117, 188, 97, -204, -78, 77, -53, -93, -168, -25, -70, -122, -186, -57, 251, -77, -150, -104, -162, -95, -226, -14, -31, -18, -201, 1, 39, 169, 116, 24, -21, -101, 254, 45, 33, 323, 138, 88, 371, 141, 255, 93, 317, 222, 132, 131, 35, 116, 301, 212, 261, 333, 226, 254, 36, 95, 128, -2, -109, 135, -70, 49, 55, -125, -11, -205, -196, 73, -260, -301, -230, -187, -239, -256, -292, -290, -405, -529, -265, -273, -238, -190, -327, -245, -223, -154, -34, -36, -165, -43, -214, 67, -137, 96, 350, 38, 75, 116, 232, 114, 228, 221, 153, 186, 367, 261, 510, 269, 336, 483, 408, 374, 244, 487, 214, 179, 206, 189, 225, 172, 173, 47, 86, 7, -194, 20, 68, 2, -160, -119, -69, -153, -118, -313, -315, -380, -375, -303, -234, -571, -238, -191, -390, -328, -348, -353, -178, -316, -274, -342, -236, -246, -215, 6, -77, -266, -12, -183, -221, -76, 110, 198, 148, 297, 369, 258, 266, 382, 177, 168, 329, 364, 10, 352, 277, 299, 454, 438, 196, 172, 400, 456, 144, 102, 247]
4671B47j30q7P3M7k61L48r4J06l03pq3m3j45K73R8r6K6j75p2r1lO0j20K08J5R
4697b00q4K31k66J14J25l19J30J7Q9j80P8K34Q1k07j21K48J14k10rJ29J05N3l55
4720b03L64N3l22L07p1j54J06m1j06L3K63J8l84L29J6L9l7j1k58L43k95K88j46
4743A31j35N5k8O2L3J28Jo7j1j48M5J54j66J51r6n8Kj02kJ18j32J0N9r9J0j24
4769b09m4J47j61J79q2K19j76m2P2j17j05J85n2j19K65q1k31R5j13J49J28j11
4791b04Mm3r6L18j15lK27j93J95j51oK49o0O6RJ08M3j55j6R8n6L3L1l1J08j07
4817B53p0l7K49k1k43Q3N2N9q2j88J32j99M3Q8P3k91k01J22K4J87j85M9j08r6
4841c07j06J90J61k19j66J85j51J66J1k4K6P3j12o3J98k53m2L33j31J05N8q2O4
$$ y = [247, 117, 30, 103, 150, -111, 237, 143, 249, -54, -61, -144, -187, -332, -59, 39, -57, -31, -206, -278, -369, -372, -312, -432, -224, -209, -200, -284, -53, -319, -205, -80, -399, -269, -252, -163, -343, -265, -31, 50, -157, -278, -30, 84, -126, -135, -6, 99, 152, -203, 161, 214, -108, 199, 128, -26, 80, 39, -67, -34, 229, 247, -137, 192, 208, 247, 210, 199, -59, 284, -11, 277, 131, -4, 51, 23, 85, 118, 246, 247, 180, 169, 21, 66, 220, 54, 205, 109, 51, 53, -49, -51, 67, -65, -55, 4, -95, -85, -209, -253, -106, -267, -88, -170, 49, -127, -169, -97, -214, -319, -134, -186, -305, -40, -121, -352, -257, -370, -221, -93, -204, -200, -243, -339, -21, -136, -139, 88, -105, 90, -61, -67, 182, 122, 188, 197, 305, 348, 193, 177, 275, 219, 252, 283, 252, 360, 253, 183, 146, 395, 374, 131, 214, 266, 325, 243, 55, 187, -12, 31, 119, 192, -99, -300, -178, -154, 33, -152, -103, -211, -307, -413, -223, -62, -281, -447, -262, -413, -247, -236, -260, -234, -161, -273, -336, -138, -391, -433, -100, -231, -126, -68, -150, -86]
4864h6J13j55J99J16k84J85j1P3k2K25j41p6P1jJ55o6j81J90L2J02k37J25j0j04
4888B12J07k45J92o8m4k42J72r9R7m1m4j1M7M5j45o1J85k78P5LJ30j46j46Q6j
4913b20J65j41n5k6K24p2l1p3K41j24l2j45L02j27K5k3J54Nj70J25k33L25k8j17
4937e1R3Pj28Q6P5J86l50O2j24L41q4j12J10j28J05J30k11j1K06j66K18k40J42
4960A56J02O4k67j50K06J9p2L4L0j6J2Rr2J85p4R2k51n1J78j33J35J09j40Mk42
4985a53J19J04j22M3k83L37n6l3k20J49j58L50j46j77R2J2pk21J27o9Jk6p4K38
5009a73j61K0J57l7k19L49j37OO2P8j21J1P1j18K24rM4o5J18p0J84j81K82j15
5033B00J4j0r8O7nJ52j54J94j23q3J89q7N5j38K36k32J31P6k67Q6j02qM4n9k08
$$ y = [-86, 27, -128, 71, 187, -97, 88, 77, 150, 128, 353, 212, 136, 207, 206, 361, 295, 114, 304, 336, 438, 201, 326, 316, 212, 319, 74, 266, 198, 154, -88, 84, -15, 82, 41, -3, -14, 33, 78, -67, -128, 57, -221, -146, -143, -13, -159, -305, -219, -220, -55, -196, -251, -277, -53, -125, -156, -229, 12, -112, -144, -289, 13, -114, -89, -112, 42, 47, -123, 2, -231, 94, 66, -51, 42, 49, -79, 7, 82, 268, -82, -20, -144, 197, 113, 1, 111, -17, 88, 218, 7, -4, 202, 36, 254, 14, 156, 258, 322, 55, -95, 111, 130, 58, 92, 122, 106, 118, 127, 35, 220, 146, 238, -13, -64, 114, -19, 116, 225, 85, 89, -153, -34, 70, -52, -9, -292, 45, -11, -44, -264, -115, -273, 77, -69, -246, -154, -142, -149, -370, -243, -312, -311, -337, -411, -173, -334, -314, -157, -194, -413, -64, -201, -195, -133, -55, -176, -165, -94, -212, 12, 3, 47, -18, 100, 30, 214, 33, 315, 200, 214, 204, 106, 173, 168, 320, 166, 360, 237, 154, 343, 256, 311, 173, 409, 177, 308, 384, 117, 203, 101, 93, 137, 78, -130]
5058a30J80k88J80k77K47j60j6J9n9q3P0j33m3J72m7K69o40L67J66k8p6J02pk84
5082d99k8L25k17J31K30rj49J82J61j34N7K3J34N6k47P6K72k00K00k0j52K7J89
5105D08j3r7J7R0j14O7j37m1j07J67O8q6J51l30J37P8j12rk06M2J75l4j26m6N5
5130ck73pJ42J1j99J55j76J12j36K7J9j94K37N6N7k04J68o6M3O7J8J05q0Kk35
5155c54L92k19K17j51j7K09q0JL3N8j06R8mN5N9n0n1J10k11O1J84Lp7q6J57m6
5181A85Q0J81k17J80j57K1k4p0Q7j52q8J99j2j62N8J62k16q4o0j17J91K9q2J03
5205C5l56J65P3j25P9j92Q8j12L5J67j72n0K62p3%l2n6j6k05K84j29K46r2P0J73
5230F7j5k09J8j7M1J52o7N3L2K22j98j07J77m4l1O8K62j04p3J22q7q3O8R7K74
$$ y = [-130, 50, -238, -58, -335, -88, -248, -264, -245, -304, -387, -317, -450, -493, -321, -368, -99, -739, -372, -206, -234, -310, -208, -215, -499, -527, -202, -419, -288, -58, -67, -216, -34, 127, -7, 50, 73, 207, 263, 16, 92, 364, 164, 364, 344, 192, 219, 408, 395, 298, 315, 405, 291, 358, 221, 180, 73, 240, 308, 222, 373, 43, 180, 258, 146, 137, -69, -27, 148, 114, -12, -58, -3, -276, -283, -141, -130, -329, -174, -350, -238, -374, -347, -328, -522, -285, -229, -172, -376, -208, -274, -231, -164, -146, -41, -121, -119, -354, 38, -181, 36, -115, -132, 77, -3, -2, 31, 89, -17, 81, 77, 132, 191, 141, 90, 200, -11, 50, 234, 237, 160, 74, 231, 185, 265, 446, 229, 409, 252, 273, 249, 179, 266, 114, 26, 225, 213, 51, 109, 271, 55, -29, -89, -206, -15, 14, -68, 35, -321, -156, -83, -208, -129, -321, -233, -345, -310, -143, -315, -365, -103, -176, -176, -208, -264, -280, -485, -201, -330, -84, -176, -106, 67, 52, -157, -139, -156, -115, 37, -30, 23, 55, 277, 79, -28, 149, 105, 74, 142, 404, 300, 227, 349, 262, 179, 247, 344, 618]
5255F18l98J30k50L06J21j83o9j87J79l9j52qJ22j21j75Q8qj5N1j67J08J15k80
5278b14m9L1Q3J11l11J66k07Qj12M7K20l0k72K06k4Q6k39K05n9Q9k9M4M3K8k1
5303b00Q8j3K2K41o7mjj05P0K86j09l0R6J20j0j0o6K6J38j34j03K25J9M3k07l
5329C12k7o9KRO9j45R5j71R5j67J4K1j44N8k30j3L4j8J25l3k05N6J00k33L1QJ44
5356b82J72l82QJ54J0j22L08k61J91J5j50O9M9L33k96j5L29l68M25j02K7M8K62
5379D22k34KkO4K29j13N2j85n9J93j58K6J22j67M1O6r4k79Q5L03j06j5o0q4k7
5404B2j21M9J54l08J92r8p7J86j97J35j24r5N0j25L1K27k79R2l4Rj4J3n3J24r1
5429c32K76n6j08Q9K3KrN4j28j7J69o8J12J75p7l18K56K4J38L2j30K4R0k23J42
$$ y = [618, 220, 350, 100, 406, 527, 344, 275, 88, 267, 228, 76, 68, 190, 69, -106, -18, -26, -41, 10, -157, -49, 66, -214, -263, -232, -149, -38, -349, -183, -390, -382, -494, -447, -227, -257, -529, -323, -347, -261, -500, -295, -354, -265, -294, -250, -207, -179, -200, -112, -125, -103, 138, 71, 67, 66, -39, 31, 317, 208, 178, 274, 394, 384, 374, 308, 334, 472, 338, 235, 460, 479, 522, 315, 312, 285, 216, 218, 227, 296, 151, 246, 75, 170, 3, 17, 38, -106, -48, -278, -291, -257, -275, -150, -183, -388, -332, -232, -465, -434, -426, -282, -110, -492, -484, -330, -320, -442, -134, -395, -204, -189, -339, -270, -221, 112, -184, -199, 130, -238, 187, 85, 112, 160, 422, 188, 190, 188, 252, 481, 368, 420, 235, 176, 369, 211, 237, 359, 192, 233, 299, 205, -74, 11, 314, 208, 193, 133, 49, 22, -99, -50, 104, -204, -12, -110, -187, -1, -198, -63, -187, -282, -232, -357, -326, -99, -378, -286, -320, -311, -325, -312, -365, -241, -332, -56, -112, -220, -131, -108, -106, -115, -61, -189, -206, -37, -105, 7, 182, 105, -213, 43, 67, 205, 237, 107, 131, 221, -2, 140]
5454A40l3J21J00j88MKk8j15J62j4J29m08K33k4J46q5j58Q8J21n5j68q4R3R7p8
5479bO8K1kj84J16j29k0J12J9q0R9k22l0Q6j26N4K08M1L2j00m6KkK47r4jJ3m4
5507C6j80K32j99P8J13L0j26j60K05O6k09L3OK9K85J1l16K35p7k12J65j07K65
5530B03j22Q6o7j19K37j00o9J81j05m8kJ15nj73M3J50p8j01k7L0M2r9no2R5j9
$$ y = [140, 107, 228, 328, 140, 144, 146, 118, 3, 165, 151, 280, -128, 105, 81, 227, 142, -16, 72, 193, 138, -30, -114, -21, 76, -2, 66, 87, 85, -99, 17, -112, -132, -20, -1, -81, 18, -204, -234, -148, -274, -220, -12, 29, 61, -39, -85, -83, -85, 162, 68, 67, 80, 36, -144, 88, -111, -33, 80, 110, -16, -176, 29, 95, -114, -81, -75, -46, 239, 250, -66, 169, 92, -120, 45, -62, 203, 81, 167, 100, -19, 218, 118, 49, 230, 125, 77, 75, 190, 185, 12, 55, 205, 127, 26, -1, 29, 71, -28, -33, -95, 0, -19]
$$ [...]
8191b7
##END NTUPLES=NMR FID
##END=
