##TITLE=1H_LR-676-R2-C2
 CDCl3, 8 sc, 
 1.7.2019
##JCAMPDX= 6.0         $$ Bruker NMR JCAMP-DX V2.0
##DATA TYPE= NMR FID
##DATA CLASS= NTUPLES
##ORIGIN= UXNMR, Bruker Analytische Messtechnik GmbH
##OWNER= root
$$ XWIN-NMR		Version 3.5
$$ Mon Jul  1 14:36:13 2019 Russian Standard Time (UT+4h)  she@DPX200
##.OBSERVE FREQUENCY= 200.13155
##.OBSERVE NUCLEUS= ^1H
##.DELAY= (6, 6)
##.ACQUISITION MODE= SIMULTANEOUS
##.ACQUISITION SCHEME= undefined
##.AVERAGES= 8
##.DIGITISER RES= 18
##SPECTROMETER/DATA SYSTEM= spect
##.PULSE SEQUENCE= zg30
##.SOLVENT NAME= CDCl3
##.SHIFT REFERENCE= (INTERNAL, CDCl3, 0, 15.7039)
##AUDIT TRAIL= $$ (NUMBER, WHEN, WHO, WHERE, WHAT)
$$ ##TITLE= Audit trail, XWIN-NMR		Version 3.5
$$ ##JCAMPDX= 5.01
$$ ##ORIGIN= Bruker BioSpin GmbH
$$ ##OWNER= she
$$ F:/spectra/data/she/nmr/H-F/1/audita.txt
$$ ##AUDIT TRAIL=  $$ (NUMBER, WHEN, WHO, WHERE, WHAT)
(   1,<2019-07-01 14:35:01.53 +0400>,<she>,<DPX200>,
      <created by zg, POWCHK disabled, PULCHK disabled
       configuration hash MD5:
       00 E9 B6 7A A2 85 ED C7 34 08 36 98 17 FE 4E 26
       data hash MD5: 16K
       FF 29 70 9E F1 72 A9 CF 83 4E B0 F1 AB 67 EE 9E>)
$$ ##END=
$$ 
$$ hash MD5
$$ 72 86 40 6B A5 53 40 E5 42 BF 65 D0 94 AC 2F D6
##$RELAX= 
##$RELAX= 
##$RELAX= 
##$RELAX= 
##$RELAX= 
##$RELAX= 
$$ Bruker specific parameters
$$ --------------------------
##$DU= <F:/spectra>
##$EXPNO= 1
##$NAME= <H-F>
##$PROCNO= 1
##$TYPE= <nmr>
##$USER= <she>
##$AMP= (0..31)
100 100 100 100 100 100 100 100 100 100 100 100 100 100 100 100 100 100 
100 100 100 100 100 100 100 100 100 100 100 100 100 100 
##$AQSEQ= 0
##$AQ_mod= 1
##$AUNM= <au_zg>
##$AUTOPOS= <>
##$BF1= 200.13
##$BF2= 200.13
##$BF3= 200.13
##$BF4= 200.13
##$BF5= 200.13
##$BF6= 200.13
##$BF7= 200.13
##$BF8= 200.13
##$BYTORDA= 1
##$CFDGTYP= 0
##$CFRGTYP= 5
##$CHEMSTR= <none>
##$CNST= (0..31)
1 1 145 1 1 1 1 1 1 1 1 1 1 1 1 1 1 1 1 1 1 1 1 1 1 1 1 1 1 1 1 1 
##$CPDPRG= <>
##$CPDPRG1= <>
##$CPDPRG2= <>
##$CPDPRG3= <>
##$CPDPRG4= <mlev>
##$CPDPRG5= <mlev>
##$CPDPRG6= <mlev>
##$CPDPRG7= <mlev>
##$CPDPRG8= <mlev>
##$CPDPRGB= <>
##$CPDPRGT= <>
##$D= (0..31)
0 1.2 0 0 0 0 0 0 0 0 0 0.03 0 0 0 0 0 0 0 0 0 0 0 0 0 0 0 0 0 0 0 0 
##$DATE= 1561977300
##$DBL= (0..7)
120 120 120 120 120 120 120 120 
##$DBP= (0..7)
150 150 150 150 150 150 150 150 
##$DBP07= 0
##$DBPNAM0= <>
##$DBPNAM1= <>
##$DBPNAM2= <>
##$DBPNAM3= <>
##$DBPNAM4= <>
##$DBPNAM5= <>
##$DBPNAM6= <>
##$DBPNAM7= <>
##$DBPOAL= (0..7)
0.5 0.5 0.5 0.5 0.5 0.5 0.5 0.5 
##$DBPOFFS= (0..7)
0 0 0 0 0 0 0 0 
##$DE= 6
##$DECBNUC= <off>
##$DECIM= 24
##$DECNUC= <off>
##$DECSTAT= 4
##$DIGMOD= 1
##$DIGTYP= 9
##$DL= (0..7)
0 120 120 120 120 120 120 120 
##$DP= (0..7)
150 150 150 150 150 150 150 150 
##$DP07= 0
##$DPNAME0= <>
##$DPNAME1= <>
##$DPNAME2= <>
##$DPNAME3= <>
##$DPNAME4= <>
##$DPNAME5= <>
##$DPNAME6= <>
##$DPNAME7= <>
##$DPOAL= (0..7)
0.5 0.5 0.5 0.5 0.5 0.5 0.5 0.5 
##$DPOFFS= (0..7)
0 0 0 0 0 0 0 0 
##$DQDMODE= 0
##$DR= 18
##$DS= 0
##$DSLIST= <SSSSSSSSSSSSSSS>
##$DSPFIRM= 0
$$ [...]
##$SUBNAM2= <"">
##$SUBNAM3= <"">
##$SUBNAM4= <"">
##$SUBNAM5= <"">
##$SUBNAM6= <"">
##$SUBNAM7= <"">
##$SUBNAM8= <"">
##$SUBNAM9= <"">
##$SW= 24.9336996594482
##$SWIBOX= (0..15)
0 0 2 0 0 0 0 0 0 0 0 0 0 0 0 0 
##$SW_h= 4990.01996007984
##$TD= 16384
##$TD0= 1
##$TE= 0
##$TE2= 300
##$TE3= 300
##$TEG= 300
##$TL= (0..7)
0 120 120 120 120 120 120 120 
##$TP= (0..7)
150 150 150 150 150 150 150 150 
##$TP07= 0
##$TPNAME0= <>
##$TPNAME1= <>
##$TPNAME2= <>
##$TPNAME3= <>
##$TPNAME4= <>
##$TPNAME5= <>
##$TPNAME6= <>
##$TPNAME7= <>
##$TPOAL= (0..7)
0.5 0.5 0.5 0.5 0.5 0.5 0.5 0.5 
##$TPOFFS= (0..7)
0 0 0 0 0 0 0 0 
##$TUNHIN= 0
##$TUNHOUT= 0
##$TUNXOUT= 0
##$USERA1= <user>
##$USERA2= <user>
##$USERA3= <user>
##$USERA4= <user>
##$USERA5= <user>
##$V9= 5
##$VALIST= <valist>
##$VCLIST= <CCCCCCCCCCCCCCC>
##$VD= 0
##$VDLIST= <DDDDDDDDDDDDDDD>
##$VPLIST= <PPPPPPPPPPPPPPP>
##$VTLIST= <TTTTTTTTTTTTTTT>
##$WBST= 1024
##$WBSW= 4
##$XGAIN= (0..3)
0 0 0 0 
##$XL= 0
##$YL= 0
##$YMAX_a= 502487
##$YMIN_a= -436400
##$ZGOPTNS= <>
##$ZL1= 120
##$ZL2= 120
##$ZL3= 120
##$ZL4= 120
##$ABSF1= 10
##$ABSF2= 0
##$ABSG= 5
##$ABSL= 3
##$ALPHA= 0
##$AQORDER= 0
##$ASSFAC= 0
##$ASSFACI= 0
##$ASSFACX= 0
##$ASSWID= 0
##$AUNMP= <proc_1d>
##$AZFE= 0.1
##$AZFW= 0.1
##$BCFW= 1
##$BC_mod= 2
##$BYTORDP= 1
##$COROFFS= 0
##$CY= 11.3945322036743
##$DATMOD= 1
##$DC= 2
##$DFILT= <>
##$DTYPP= 0
##$F1P= 18.9103706918063
##$F2P= -1.10871071338519
##$FCOR= 0.5
##$FTSIZE= 0
##$FT_mod= 4
##$GAMMA= 1
##$GB= 0.15
##$INTBC= 1
##$INTSCL= 1
##$ISEN= 128
##$LB= 0.24
##$LEV0= 0
##$LPBIN= 0
##$MAXI= 10000
##$MC2= 0
##$MEAN= 0
##$ME_mod= 0
##$MI= 1.114404
##$NCOEF= 0
##$NC_proc= 0
##$NLEV= 6
##$NOISF1= 3.799351
##$NOISF2= 2.8
##$NSP= 1
##$NTH_PI= 0
##$NZP= 0
##$OFFSET= 15.70392
##$PC= 1
##$PHC0= -8660.356
##$PHC1= 19.20097
##$PH_mod= 1
##$PKNL= yes
##$PPARMOD= 0
##$PSCAL= 0
##$PSIGN= 0
##$REVERSE= no
##$SF= 200.130013532006
##$SI= 16384
##$SIGF1= 3
##$SIGF2= 2
##$SINO= 400
##$SIOLD= 16384
##$SREGLST= <1H.CDCl3>
##$SSB= 0
##$STSI= 0
##$STSR= 0
##$SW_p= 3612.71676300578
##$SYMM= 0
##$S_DEV= 0
##$TDeff= 0
##$TDoff= 0
##$TI= <>
##$TILT= no
##$TM1= 0
##$TM2= 0
##$TOPLEV= 0
##$USERP1= <user>
##$USERP2= <user>
##$USERP3= <user>
##$USERP4= <user>
##$USERP5= <user>
##$WDW= 1
##$XDIM= 8192
##$YMAX_p= 0
##$YMIN_p= 0
$$ End of Bruker specific parameters
$$ ---------------------------------
##NTUPLES= NMR FID
##VAR_NAME=  TIME,          FID/REAL,        FID/IMAG
##SYMBOL=    X,             R,               I
##VAR_TYPE=  INDEPENDENT,   DEPENDENT,       DEPENDENT
##VAR_FORM=  AFFN,          ASDF,            ASDF
##VAR_DIM=   8192,          8192,            8192
##UNITS=     SECONDS,       ARBITRARY UNITS, ARBITRARY UNITS
##FACTOR=    0.0002004,     1,               1
##FIRST=     0,             0,               0
##LAST=      1.6414764,     0,               0
##MIN=       0,             -436400,         0
##MAX=       1.6414764,     502487,          0
$$ Real data points
##PAGE= N=1
##DATA TABLE= (X++(R..R)), XYDATA
0 0 0 0 0 8 -8 8 -8 16 -16 24 -32 40 -48 56 -72 82 -104 121 -144 169 -201 231 -269 311 -356 407 -464
27 -464 528 -598 678 -761 857 -962 1071 -1199 1336 -1485 1650 -1831 2031 -2247 2489 -2756
43 -2756 3053 -3383 3752 -4165 4644 -5189 5821 -6569 7468 -8569 9957 -11772 14260 -17891
57 -17891 23721 -34629 62187 -278002 -405045 166769 141513 -96980 -256293 -150649 -118376
68 -118376 -82905 -44624 -75562 -271353 -256197 93673 391647 180345 -216773 -259528 54151
79 54151 221954 118807 -5052 6342 52044 158795 339650 374476 74510 -229304 -107853
90 -107853 290232 418019 190339 22920 122212 237604 194062 105017 43901 -50441 -74410
101 -74410 136366 389298 294633 -84751 -254764 -41833 166527 75898 -114398 -140109 -61396
112 -61396 -10009 45459 80003 -60809 -311217 -343709 -88633 85567 -57817 -252102 -192167
123 -192167 -13666 -305 -130014 -220791 -253786 -258337 -139642 86159 150711 -71816 -284998
134 -284998 -196881 24072 48156 -91937 -129210 -24211 58851 83671 113759 87767 -51374
145 -51374 -132436 13066 214259 190787 12411 -16178 146788 249668 173943 59263 11012
156 11012 -2348 35671 176832 302038 224672 18229 -46454 80142 161167 70706 -31516
167 -31516 531 90490 125817 114034 67644 -46958 -159086 -116285 52183 112235 -27109
178 -27109 -162256 -113120 15347 32229 -62994 -153372 -194550 -185312 -96161 27710 36311 -107267
190 -107267 -216789 -144967 -19546 -39533 -164432 -198080 -91593 26921 62979 22357 -73199
201 -73199 -173760 -165271 -10969 128803 85476 -59133 -84179 44977 145294 100883 -6046
212 -6046 -54984 -20398 70371 169986 189224 85756 -24404 12166 150176 187287 62521
223 62521 -52720 -7508 133890 214945 178117 67366 -45074 -75141 18391 141568 137878
234 137878 4790 -76206 2177 115479 92055 -46676 -142750 -115019 -16246 63796 61695
245 61695 -35032 -146745 -147168 -28870 48913 -35834 -183525 -202582 -69826 55403 48260 -59145
257 -59145 -159965 -177923 -101536 2813 23740 -64767 -138845 -74603 61409 89266 -33653
268 -33653 -154649 -134318 -5572 105118 117698 39962 -54515 -66542 33310 135240 105619
279 105619 -23851 -76733 28097 166118 181483 79494 -16522 -24539 42703 118503 129861
290 129861 55367 -24197 3910 124896 183770 85595 -65745 -102637 -3322 107862 125858
301 125858 54340 -35528 -68350 -17732 54460 43200 -62061 -135798 -74412 51333 85791
312 85791 -9594 -122438 -144740 -80037 -5344 10584 -48023 -124776 -124050 -25921 59801 16222
324 16222 -117098 -183175 -109251 11810 55179 4447 -65158 -83429 -36320 30636 41147 -30829
336 -30829 -103459 -67512 61419 142583 87734 -29306 -74342 -14842 71739 103345 63093 -1280
348 -1280 -15327 53605 140590 135857 27840 -62964 -30526 80150 139468 97214 19466 -10655
360 -10655 23254 77626 88801 26121 -59280 -68354 26454 122291 102601 -12885 -96525 -73872
372 -73872 2340 38873 5570 -56690 -84328 -43000 29323 45039 -35769 -135710 -140369 -45557
384 -45557 35865 17883 -61315 -105014 -73229 -8812 18821 -23944 -101482 -127991 -55460 53225
396 53225 81545 900 -89487 -87678 -8997 49078 32233 -23630 -46693 -3430 73501 108379
408 108379 53381 -43267 -73832 4152 105616 120475 47071 -16380 793 67451 104438 70652
420 70652 -3087 -44149 -1877 90290 134784 76478 -21912 -51181 9393 72430 59213 -9544
432 -9544 -53427 -26087 43185 82630 42099 -52990 -112164 -72466 19273 56153 18 -74336
444 -74336 -79954 -21702 23098 -133 -69746 -117697 -91698 -8689 50799 21778 -65970 -111930
456 -111930 -65839 10093 23639 -33457 -84653 -65364 8548 65420 49305 -26615 -87045 -65443
468 -65443 21001 80199 52218 -17839 -36946 19084 81256 76589 10508 -45502 -31472 44877
480 44877 112364 103612 27420 -33158 -11444 60753 91584 43274 -23547 -28334 34124 95152
492 95152 89687 19566 -51223 -56158 6948 66883 54039 -16153 -57983 -22693 41106 49402 -13713
505 -13713 -83457 -90468 -30375 37168 45759 -14445 -81486 -84602 -24892 20523 -6498 -71898 -93442
518 -93442 -41622 27723 42007 -11842 -79235 -94153 -40835 26872 37899 -14979 -62677 -41049
530 -41049 28389 63159 21846 -48050 -68328 -16296 57812 84757 43357 -18656 -32409 17464
542 17464 71308 62209 333 -37313 166 74772 106012 61741 -11646 -42713 -5618 57750
554 57750 78938 35671 -21158 -22832 33565 77047 48013 -27229 -68846 -35683 32767 65145
566 65145 30655 -33245 -62254 -29741 22657 26883 -29171 -81798 -66117 3424 48765 20406
578 20406 -50161 -91606 -67633 -8468 23660 -2701 -55404 -68965 -20873 35138 30142 -34418
590 -34418 -85514 -65086 4639 52835 37851 -16111 -48816 -24746 29774 51886 12890 -42245
602 -42245 -42209 22234 84074 77407 13001 -38518 -26941 29210 69294 53445 3208 -20984 14446
615 14446 71381 80157 22131 -42145 -42934 18599 74142 67216 10749 -34268 -23921 24138 51430
628 51430 19958 -40646 -61894 -15762 48255 56843 -724 -62389 -66863 -18728 23319 13688 -34691
641 -34691 -65487 -40532 15824 38722 -4596 -72094 -90282 -39376 24693 36204 -8818 -54437
653 -54437 -51162 -6160 28457 11970 -39462 -65820 -29196 38004 64880 24037 -36689 -50523
665 -50523 -6532 42881 46091 5418 -28360 -12164 41982 76216 48761 -14945 -46387 -10800
677 -10800 52295 75625 39603 -9584 -16887 21727 57959 46571 -4791 -41404 -20215 39444
689 39444 73594 43366 -19108 -48423 -19064 28253 36949 -2514 -44155 -39518 7156 44155
701 44155 27065 -31560 -73033 -56076 -1208 30989 8503 -38576 -54887 -23961 14662 12872
713 12872 -30656 -68862 -57139 -3714 38366 26880 -24037 -59106 -41609 6149 29453 5000
725 5000 -34225 -38280 2115 45272 45335 2054 -38981 -34171 11618 50425 43777 4625 -17802
738 -17802 4329 45490 55896 19937 -24189 -27634 16002 63011 66455 24414 -18492 -19637 16599
751 16599 45085 31476 -8483 -26603 217 42420 50322 11581 -36408 -46271 -11786 28247
763 28247 30575 -6293 -40819 -34066 4983 27871 3128 -46114 -66242 -35530 13377 30060
775 30060 291 -42853 -55100 -26793 8129 8213 -26614 -53332 -34829 12310 36912 11519 -36445
788 -36445 -55963 -27799 18469 36962 12470 -24244 -28555 8381 45167 37364 -8005 -38656
800 -38656 -18364 32444 61596 42749 588 -19633 1508 38836 48134 16625 -19730 -14266
812 -14266 32015 68062 50674 -3445 -37818 -20235 26395 51346 30057 -13060 -30742 -3740
824 -3740 35481 36785 -7798 -50725 -43587 4469 38580 22194 -24742 -51688 -33294 6484 20965
837 20965 -9461 -53736 -60221 -16071 32334 29812 -22033 -65797 -56966 -9707 23383 11788 -26261
850 -26261 -45169 -21335 20727 32452 -4290 -49073 -47654 3103 48821 42321 -3014 -34494
862 -34494 -19572 23253 48089 28401 -14418 -30671 3691 55143 66008 23367 -23755 -23975
874 -23975 17776 51561 42120 4853 -17155 1304 40833 55801 22688 -28603 -41886 -1065
886 -1065 48272 50906 6169 -34711 -31071 5425 30236 14725 -26235 -49004 -26297 19259 35722
899 35722 683 -48091 -57133 -20106 16147 10909 -25939 -50612 -35008 4601 26583 4047
911 4047 -43437 -65123 -34026 17895 35511 3900 -35231 -37273 -4364 23689 17520 -13448 -33577
924 -33577 -16440 25586 49771 27649 -16649 -32267 -1331 39207 44089 12789 -15162 -8409
936 -8409 26033 52929 42894 3067 -27307 -14261 28641 53409 33699 -3450 -14860 7730
948 7730 32282 27438 -2832 -27884 -20048 15711 43324 29818 -15188 -45295 -29785 9079 24865
961 24865 1572 -31028 -36926 -12071 15335 14720 -16540 -48437 -46459 -11170 18178 8929 -25354
974 -25354 -42110 -22513 8329 13974 -12027 -41644 -42297 -8855 28431 32484 -1277 -36193 -33591
987 -33591 1661 28143 18729 -9198 -19600 1012 30837 38445 14619 -17637 -23429 6546 41621
1000 41621 43654 12230 -13710 -4083 27747 43217 24095 -9302 -22376 -1045 35397 49450
1012 49450 24626 -13894 -25384 -524 26856 22864 -5937 -24244 -10755 18269 29947 8638
1024 8638 -28177 -44465 -22554 14826 25882 -1958 -36000 -37083 -6847 16978 6371 -26863
1036 -26863 -47377 -33689 1685 23333 8690 -26117 -41951 -20917 10225 13555 -13360 -35392
1048 -35392 -23973 11092 33538 20253 -16178 -39156 -23759 15828 39021 22799 -10717 -20097
1060 -20097 4946 33272 31675 2955 -19670 -11142 20617 44280 35151 2292 -18070 -3390
1072 -3390 28983 38867 13370 -17612 -17301 13914 41789 36356 2623 -27192 -24980 5058 29594
1085 29594 21167 -10126 -26437 -8722 18805 19819 -9591 -37523 -34526 -4360 21959 17799 -13422
1098 -13422 -39823 -33387 -1617 17360 84 -32913 -41474 -15112 16730 20143 -6699 -34890
1110 -34890 -36390 -10181 16508 15355 -10616 -28599 -13780 18120 28760 4675 -26371 -28897
1122 -28897 196 31689 35856 11230 -15806 -16410 10459 34526 27239 -2856 -18424 583 32765
1135 32765 42080 18990 -10024 -16293 4286 29072 31050 7550 -15157 -9709 19287 36535 18379
1148 18379 -17390 -32268 -11675 19819 29705 9993 -18457 -27662 -10300 12134 11972 -13489 -34496
1161 -34496 -24243 6554 21295 2469 -28954 -39766 -21080 5902 13135 -5900 -30487 -32355
1173 -32355 -6565 19024 13545 -17858 -39024 -25779 6524 23696 11287 -13184 -22385 -6723
1185 -6723 16512 21224 679 -21543 -16289 15259 39376 29125 -3094 -21657 -8201 20454
1197 20454 34593 21558 -2446 -10625 7125 31915 33865 7761 -17841 -13835 14678 34896
1209 34896 25185 -1583 -16372 -5530 16467 23621 6035 -20069 -25341 -2348 24664 23698 -5644
1222 -5644 -31830 -28392 -3075 13566 5029 -17710 -29179 -16702 6096 13149 -6800 -33969 -37507
1235 -37507 -11858 14320 12742 -12312 -30660 -22492 1152 14320 2896 -20859 -30124 -11180
1247 -11180 18729 28044 6592 -20720 -23076 830 22979 20526 170 -12483 -2192 21334
1259 21334 32930 18178 -9026 -18601 1651 30846 36932 14718 -8968 -8383 13351 29596 22164
1272 22164 -1400 -16315 -5919 19757 32697 17197 -11190 -22038 -5598 16399 16877 -4028
1284 -4028 -21652 -16567 5317 19530 8559 -19051 -36228 -24547 3337 16753 1612 -23284
1296 -23284 -29628 -11982 6533 4404 -16115 -31978 -24939 -96 17281 8877 -16861 -31069 -17499
1309 -17499 8260 16464 1 -19456 -18156 4065 23888 21120 -1977 -20829 -14888 11315 29972
1322 29972 21650 -1367 -10883 4366 25327 27250 7996 -11432 -9589 13019 33836 30606 6269
1335 6269 -13426 -7924 14824 26768 13693 -8378 -14123 2617 22531 23131 1806 -21152 -22910
1348 -22910 -2485 17079 13606 -8681 -23591 -14931 5259 11411 -4585 -26509 -30772 -12546 9792
1361 9792 13143 -6619 -28187 -28121 -7572 9011 2551 -18101 -27607 -13863 8890 16752 1549
1374 1549 -20356 -25691 -7959 14468 17907 331 -15675 -9785 12119 24614 13569 -8593 -17176
1387 -17176 -2144 21903 31559 17263 -4852 -10322 6330 25168 23127 3167 -10619 -1577 20177
1400 20177 30852 18333 -5231 -16418 -4419 17194 24191 8298 -12340 -14092 4340 19381
1412 19381 12425 -10050 -24674 -16920 4162 16485 6597 -15191 -25858 -14029 5370 8003 -10045
1425 -10045 -27784 -24109 -2840 12856 6588 -14763 -29359 -22182 -1128 11509 2349 -17058 -22151
1438 -22151 -5795 13455 13497 -5610 -21978 -17105 4334 21193 17138 -1999 -14694 -6102 14450
1451 14450 23294 9894 -9295 -10715 8666 27737 26042 6375 -10390 -7167 11595 25901 19772
1464 19772 110 -10221 1330 21270 25297 7301 -13218 -14592 3228 20372 18644 309
1476 309 -15764 -12793 4856 15581 5057 -16240 -23631 -8858 11166 13612 -3690 -22837 -24738
1489 -24738 -9011 6457 5328 -11508 -24430 -17530 2088 11115 -1545 -21975 -26995 -11144 8465
1502 8465 12223 -1677 -17570 -17800 -1411 13441 9805 -8098 -18256 -7439 13740 22311 10009
1515 10009 -8357 -12670 1038 17813 20574 6849 -7360 -4406 13736 26634 18661 -1696 -11972
1528 -11972 -1037 18296 25120 13540 -3310 -7658 4154 18148 17010 264 -13883 -8973 10058
1541 10058 21003 10916 -9284 -18633 -9656 5922 11145 -21 -15642 -18394 -4697 9514 6672
1554 6672 -12114 -26126 -19906 -1372 8809 1314 -14666 -21909 -12977 2017 6352 -5712 -20846
1567 -20846 -20481 -3016 12699 9853 -7181 -18683 -12660 3476 13021 7034 -6791 -11816 -427
1580 -427 16377 19586 4795 -11072 -9592 7713 22025 19284 4398 -5345 182 14505 21566
1593 21566 12231 -3896 -8488 5133 22428 23512 7065 -8991 -8401 5729 16845 12534 -2340
1606 -2340 -11697 -5081 10199 15918 3161 -15417 -20074 -6253 9648 9557 -5194 -18280 -16355 -2843
1620 -2843 6569 487 -16014 -25024 -15435 3128 10226 -1810 -19177 -22539 -9477 4272 4169 -8074
1634 -8074 -17985 -13100 2935 13742 6551 -11257 -19726 -8304 10860 17391 6325 -7631 -8341
1647 -8341 4797 17276 15522 1184 -9693 -3856 14287 25349 17365 -517 -7818 2585 17876
1660 17876 20109 7457 -5603 -4278 10141 22213 17578 -543 -13360 -7773 9350 18119 8466
1673 8466 -7909 -12955 -2340 10504 9718 -5217 -19045 -17200 -1467 11034 6164 -10978 -21988
1686 -21988 -15206 222 5624 -5339 -19507 -20483 -6653 7512 6717 -8394 -22021 -19681 -3304
1699 -3304 9474 5196 -9332 -16261 -6629 8521 11844 301 -12957 -12662 1936 16574 16834 2732
1713 2732 -9251 -5318 10153 19692 12237 -2503 -7220 4069 19170 22082 9930 -4642 -6557
1726 -6557 5730 18407 16754 2774 -6895 -1269 13051 18255 7152 -8899 -13276 -2229 12386
1739 12386 14660 1951 -12611 -13838 -1800 8726 4342 -10449 -18699 -11033 3539 8392 -1875
1752 -1875 -16559 -20437 -10244 2821 4698 -6962 -18511 -15991 -1548 8449 2426 -12893 -20022
1765 -20022 -11093 4182 10753 3046 -9441 -12721 -2586 10049 10663 -1281 -11078 -6209 9069
1778 9069 18408 12138 -1918 -8526 -991 12530 17875 9632 -2823 -4707 7023 19018 17103 2597
1792 2597 -8139 -4115 9890 18136 12382 -734 -7505 -1204 10325 12909 2267 -10538 -10686 2075
1806 2075 13030 9150 -5662 -16016 -11704 982 8239 1865 -11348 -16938 -8359 4436 6443
1819 6443 -5460 -18237 -17542 -4544 6106 3428 -8551 -16258 -11050 1220 7012 -463 -13083
1832 -13083 -16067 -4375 9968 11787 -409 -12270 -10937 1429 11647 9519 -1087 -7770 -1880
1845 -1880 10718 15907 7211 -5707 -7813 3712 16466 16535 5031 -5270 -3258 8428 16613 11934
1859 11934 -947 -8254 -1375 12378 17221 7308 -6126 -9159 470 10489 9544 -1262 -10153 -7063
1873 -7063 4538 11188 4106 -10402 -16951 -8208 5228 8757 -1302 -13448 -14623 -4545 4907
1886 4907 2944 -8486 -17127 -12400 894 8391 1719 -11543 -16457 -7749 4289 6422 -2539 -11944
1900 -11944 -10267 1223 10913 7793 -4843 -13111 -7312 6892 14453 7899 -4083 -7367 1093 11635
1914 11635 12728 3373 -5932 -4384 7324 16820 13474 773 -6859 -1280 10558 14853 6633 -4253
1928 -4253 -5964 3416 13724 13339 1675 -9805 -8888 2843 11970 8184 -3845 -10127 -4592 5022
1942 5022 6996 -1881 -12283 -12968 -2722 7656 6539 -5494 -15904 -13100 -1082 6069 676 -10735
1956 -10735 -14844 -7371 3789 6450 -2015 -12819 -14047 -3967 6703 6039 -4136 -11178 -6218 5131
1970 5131 9867 3120 -7701 -10640 -1547 10546 14106 5175 -5874 -6750 3260 12648 10684 524
1984 524 -5209 225 10781 15163 8178 -2811 -6673 735 11710 13667 4068 -5519 -4477 5833
1998 5833 12558 7680 -3900 -9994 -4848 6139 11208 4427 -6903 -11139 -4008 5416 5261 -4384
2012 -4384 -12495 -9588 830 6987 1913 -9133 -14810 -9610 1316 5647 -1119 -11606 -12778 -3222
2026 -3222 6020 4557 -5868 -13505 -10006 1089 8369 5107 -4569 -9774 -4158 6015 8853 1202
2040 1202 -7487 -6307 4304 13033 10616 142 -7211 -3778 6682 13262 9324 -584 -5215 1365
2054 1365 11428 12903 4204 -5191 -4919 4347 11856 9752 656 -6181 -3361 5754 10371 3901 -6778
2069 -6778 -9952 -1711 8273 8856 -753 -10166 -10468 -2213 5070 3513 -5373 -11607 -7577 2023 5786
2084 5786 -1577 -11843 -13407 -4659 4600 4849 -3439 -11203 -10114 -1053 6048 3266 -6533 -11573 -5389
2099 -5389 5623 9415 2199 -6974 -8144 -144 8038 8140 674 -5753 -3306 6220 12293 7868 -2725
2114 -2725 -6963 -215 10126 12711 5549 -2988 -4088 3227 10535 9668 808 -6373 -3527 6244 12060
2129 12060 6639 -3897 -7813 -2112 6028 7365 451 -7321 -7534 172 7250 4791 -5292 -12355
2143 -12355 -8371 1876 6583 1116 -8035 -11049 -5245 2373 3849 -3076 -10700 -9992 -1085 6420 3610
2158 3610 -5934 -11281 -6183 3149 6473 1179 -6572 -8112 -1006 7646 8442 216 -7965 -6385 3283
2173 3283 10371 7581 -1046 -4954 -380 7252 9808 4058 -3654 -4837 2943 11400 11048 1684 -6051
2188 -6051 -4043 4832 10239 6395 -1787 -5738 -1142 6407 8781 2218 -6656 -8243 -422 7227 5945
2203 5945 -2567 -8577 -6053 1586 5458 1058 -7076 -10603 -5276 3594 6142 -1147 -9883 -10298 -2210
2218 -2210 4239 2530 -4842 -9440 -5768 2118 6201 1612 -6876 -9919 -3425 5774 7510 268 -6684
2233 -6684 -5331 2454 7946 5295 -2364 -6613 -2428 6558 10927 5697 -3210 -5797 749 8527 8612
2248 8612 1746 -4113 -2225 5048 10029 6955 -1684 -6555 -2491 6400 9451 3657 -4630 -5833 682
2263 682 6854 5710 -1732 -7883 -6386 1501 7091 4085 -4733 -9322 -5131 2645 4392 -1617 -8335
2278 -8335 -8094 -1158 5034 3649 -4090 -10410 -8419 109 5813 2393 -5504 -8629 -3261 4007 4961
2293 4961 -1166 -7463 -6804 488 7298 6200 -1283 -6783 -3814 4506 8132 3589 -3732 -5038 1200
2308 1200 8283 9044 2596 -4368 -4279 2642 8986 7335 -143 -4458 -653 6679 8741 3117 -4174 -5702
2324 -5702 81 7177 7900 1179 -5676 -5338 1612 6150 3136 -4276 -7688 -3339 3719 5741 499
2339 499 -6923 -8825 -3326 3381 3622 -2899 -8502 -6576 527 4465 780 -6297 -9230 -4615 2455
2354 2455 4937 383 -6423 -7293 -1207 5075 4100 -2682 -7019 -3804 3577 7542 4226 -2560 -5527
2369 -5527 -1305 5609 7872 2640 -3402 -2916 3828 8976 6710 -272 -4688 -1690 5380 9190 5772
2384 5772 -1231 -4004 233 6348 7111 972 -4749 -3732 2515 7140 4557 -2192 -6661 -4269 2241
2399 2241 5316 1200 -5812 -7491 -2257 3743 3476 -2978 -8391 -7472 -1326 3406 1577 -4626 -8351
2414 -8351 -5344 1378 3720 -1022 -7409 -7856 -1603 4550 4464 -1595 -6524 -5353 909 5764 3845 -2260
2430 -2260 -5257 -930 5800 7548 2349 -3805 -3644 2319 7709 7413 1759 -2912 -1380 4903 8737
2445 8737 5366 -1407 -3753 890 7208 8171 2432 -3422 -3801 1548 6271 5156 -1073 -5687 -3440
2460 -3440 2984 5953 1498 -5509 -7535 -2953 2727 3502 -1788 -7034 -7017 -1842 2824 1011 -5332 -9280
2476 -9280 -5714 1141 3924 -419 -6624 -7959 -3369 2318 3117 -1436 -6216 -5175 1015 5602 3368
2491 3368 -3023 -5903 -1988 4790 7145 3061 -2411 -3299 1692 7022 7174 1816 -2984 -1467 5104
2506 5104 8978 6121 -363 -3084 685 6116 7320 2780 -2410 -2919 2116 7063 5840 -982 -5883
2521 -5883 -3702 2449 5439 2158 -3815 -6074 -2653 2225 2943 -2019 -7275 -7008 -1442 3426 1797
2536 1797 -4718 -8529 -5956 -287 2425 -811 -5730 -7181 -3022 2512 3172 -1726 -6886 -5976 140
2551 140 4823 3247 -2110 -4837 -1738 3661 5908 2483 -2691 -3648 1331 7014 7435 2218 -2646 -1499
2567 -1499 4006 7630 5431 176 -2255 902 6228 7830 3405 -2479 -3645 1229 6197 5667 270
2582 270 -3803 -2515 2310 4633 1742 -3653 -6065 -2724 2857 4080 -687 -6246 -6856 -2148 2147
2597 2147 1008 -4094 -7366 -5301 -47 2611 -275 -5573 -7652 -3973 1590 2772 -1424 -5753 -5045
2612 -5045 207 4053 2390 -2516 -5534 -2928 2806 6073 3631 -1838 -3560 263 5224 5777 1463
2627 1463 -2294 -1008 3861 7507 5673 369 -2948 -568 4966 7420 3936 -1427 -2339 1503 5802
2642 5802 5412 453 -3844 -2984 1835 5274 3284 -1978 -4949 -2482 2218 3513 -848 -5682 -5874 -1369
2658 -1369 3054 2105 -2937 -6875 -5924 -1013 2319 274 -4732 -6592 -3404 1624 2586 -1673 -6040 -5928
2674 -5928 -1187 3227 2950 -1540 -4875 -3335 1696 4479 1998 -2797 -4081 -3 5043 5880 1819
2689 1819 -2614 -2493 1938 6044 5222 683 -2372 -172 4763 6787 3511 -1564 -2853 897 5468
2704 5468 5699 1600 -2673 -2373 2067 5226 3385 -1806 -4727 -2243 2923 4597 996 -3966 -5178
2719 -5178 -1869 2248 2136 -1996 -5600 -4470 -46 2889 601 -4635 -6918 -3770 1254 2755 -689
2734 -689 -5161 -5698 -1877 2371 2258 -2086 -5408 -3832 965 4005 1917 -2740 -4277 -1131 3325 4366
2750 4366 1068 -2798 -2854 1596 5633 4990 449 -3029 -1416 3598 6183 3896 -492 -1889 792 4809
2766 4809 5528 1914 -2183 -2062 2171 5702 4254 -454 -3604 -1668 2699 4583 1757 -2794 -4007
2781 -4007 -933 2967 3245 -850 -5041 -4530 -422 2927 1219 -3170 -5593 -3412 595 2034 -914
2796 -914 -5067 -5615 -2049 1935 1938 -2149 -5624 -4467 89 2579 1170 -2799 -4490 -2039 2384 3866
2812 3866 757 -3171 -3676 369 4331 4101 262 -2527 -1011 3043 5184 3165 -882 -2275 690
2827 690 4969 5992 2568 -1710 -1972 1701 5056 4508 575 -2181 -768 2967 4711 2308 -1865 -3441
2843 -3441 -597 3278 3721 -14 -3804 -3650 -87 2834 1559 -2651 -5416 -3702 497 2469 -119
2858 -119 -4153 -5616 -2743 1079 1125 -2207 -5140 -4245 -429 2312 836 -3408 -5405 -3020 1225 3357
2874 3357 658 -3075 -3695 -269 3245 3180 -251 -2866 -1781 2325 4964 3672 -164 -2259 40 4174
2890 4174 5136 2464 -1030 -1166 2084 5427 4828 939 -2014 -1055 2710 5243 3349 -604 -2402 -266
2906 -266 3479 3792 448 -3028 -3294 -15 3111 2275 -1506 -4351 -3345 220 1987 -280 -3896 -5091
2922 -5091 -2346 1311 1649 -1765 -5376 -5153 -1672 1474 769 -2675 -4666 -3118 504 2167 -251 -3608
2938 -3608 -4035 -985 2752 3119 -56 -2972 -2302 1433 4075 2951 -626 -2291 -144 3701 5187 2763
2954 2763 -637 -1532 1278 4524 4468 1436 -1153 -254 3125 5164 3221 -802 -2497 -204 3389 4545
2970 4545 1615 -2002 -2644 118 2766 2164 -1194 -3806 -2653 605 2417 331 -3240 -4796 -2690
2985 -2690 607 1328 -1530 -4502 -4506 -1186 1439 649 -2861 -5163 -3697 -49 2021 269 -3014 -3929
3001 -3929 -1409 1838 2248 -518 -3194 -2491 939 3486 2763 -430 -2355 -703 2766 4325 2359 -915
3017 -915 -1277 1531 4585 4486 1427 -1432 -926 2440 4834 3626 328 -1480 103 3102 3897 1430
3033 1430 -1686 -2190 375 3219 2896 -499 -3208 -2668 681 2443 950 -2545 -4100 -2208 875 1774
3049 1774 -840 -4028 -4345 -1549 974 732 -2220 -4436 -3376 -28 1641 -14 -3133 -4252 -2050
3064 -2050 1498 2347 -148 -3073 -3047 -93 2588 2145 -613 -2379 -1041 2168 3798 2042 -1162 -1893
3080 -1893 633 3763 3988 1488 -1255 -977 2119 4259 3419 353 -1557 -65 3001 4252 2159 -1045
3096 -1045 -1883 495 2921 2979 154 -2432 -1811 968 2881 1546 -1778 -3509 -1946 1165 2170 -191
3112 -191 -3236 -3682 -1203 1350 905 -1774 -4129 -3221 -216 1730 283 -2717 -4058 -2309 785 1626
3128 1626 -564 -3169 -3146 -344 2084 1710 -962 -2981 -1896 1229 3084 1668 -1133 -2227 -136 2717
3144 2717 3298 1094 -1512 -1303 1479 3883 3214 215 -1481 -284 2659 3841 2114 -736 -1484 614
3160 614 3310 3347 786 -1885 -1716 1003 3067 2252 -781 -2408 -1205 1317 2185 254 -2393 -2944 -829
3177 -829 1647 1648 -1064 -3575 -3315 -496 1564 388 -2256 -3699 -2229 511 1425 -674 -3026 -3417 -1116
3194 -1116 1351 1326 -988 -3049 -2207 423 2210 994 -1725 -2705 -858 1976 2906 1103 -1514 -1796
3210 -1796 735 2987 2743 253 -1425 -325 2359 3875 2249 -362 -1436 329 2928 3607 1506
3225 1506 -930 -1029 1163 3142 2373 -134 -2041 -768 1846 2818 1254 -1419 -2652 -758 1693 1877
3241 1877 -591 -2820 -2645 -165 1620 587 -2036 -3485 -2505 4 1130 -377 -2758 -3475 -1373 884
3257 884 942 -1359 -3492 -3003 -313 1663 985 -1482 -2714 -1352 1016 2147 424 -1745 -2027 420
3273 420 2792 2550 229 -1627 -1051 1727 3313 2443 4 -1017 441 2801 3448 1492 -771 -818 1317
3290 1317 3320 2864 565 -1168 -579 1774 2960 1536 -1160 -2033 -470 1931 2434 213 -2237 -2446
3306 -2446 -294 1308 747 -1524 -3011 -2194 185 1273 -299 -2951 -3537 -1813 405 851 -1037 -3125
3322 -3125 -2881 -832 971 431 -1820 -3183 -1870 751 1844 309 -1848 -2129 -284 1857 2201 262
3338 262 -1615 -1079 1418 3006 2369 -42 -1239 92 2539 3226 1897 -387 -524 1315 3098 3053 776
3355 776 -1050 -572 1830 3135 2065 -338 -1496 -199 1640 2259 467 -1594 -1844 7 1634 1234
3371 1234 -1039 -2916 -2186 -1 1163 93 -2358 -3126 -1731 264 804 -1122 -2954 -2991 -926 832
3387 832 325 -1656 -3084 -1988 140 1360 156 -1896 -2358 -651 1516 1928 225 -1696 -1426 742
3403 742 2507 1962 59 -1079 -7 1992 2929 1583 -417 -936 955 2947 3005 1077 -869 -385 1561
3420 1561 2844 2236 -106 -1146 -84 1791 2484 817 -1181 -1710 39 1830 1499 -597 -2252 -1904
3436 -1904 161 1372 348 -1783 -2775 -1617 294 944 -756 -2757 -2777 -1023 656 418 -1601 -2983
3452 -2983 -2102 -80 1181 219 -1892 -2566 -988 1038 1580 6 -1666 -1633 395 1969 1533 -364 -1442
3469 -1442 -559 1632 2803 1586 -546 -1157 432 2510 2763 1079 -662 -439 1232 2740 2206 148
3485 148 -1073 -398 1841 2569 1137 -881 -1426 -35 1818 1699 -223 -1814 -1542 184 1610 816 -1212
3502 -1212 -2378 -1409 503 1056 -410 -2229 -2343 -644 939 737 -1177 -2658 -2090 -159 1215 384
3518 384 -1564 -2495 -1288 684 1194 -188 -1853 -1885 -34 1617 1467 -354 -1857 -1056 883 2200 1286
3535 1286 -703 -1282 204 2031 2370 783 -930 -865 826 2389 2034 257 -1017 -302 1631 2396 1139
3552 1139 -813 -1217 143 1975 2132 502 -1286 -1316 422 1687 1050 -881 -1946 -684 950 1517
3568 1517 87 -1765 -2116 -769 954 929 -652 -2219 -1874 -98 1083 315 -1717 -2438 -1279 529
3584 529 1089 -167 -1815 -2125 -525 1118 1011 -641 -2036 -1314 682 1772 908 -747 -1450 -488 1392
3601 1392 1784 676 -919 -942 699 2212 1899 -102 -1266 -552 1409 2430 1515 -172 -850 145 1786
3618 1786 2025 450 -1039 -863 866 2104 1586 -423 -1523 -655 954 1626 634 -1149 -1769 -545 1178
3635 1178 1174 -567 -1976 -1894 -20 951 342 -1320 -2079 -1345 273 994 -292 -2034 -2304 -715 891 795
3653 795 -582 -2139 -1618 -1 1127 659 -909 -1771 -667 1016 1611 433 -1363 -1418 143 1756 1605
3670 1605 32 -1064 -538 1162 2255 1471 -257 -940 149 1900 2331 956 -707 -669 772 2021
3686 2021 1717 -7 -956 -552 1091 1906 944 -786 -1515 -266 1267 1200 -133 -1555 -1354 -29 1069
3703 1069 621 -1039 -2238 -1385 255 958 -81 -1804 -2096 -1064 392 332 -796 -2057 -1803 -196 854
3720 854 420 -1002 -1973 -1080 743 1288 292 -1177 -1338 24 1314 1467 244 -990 -650 879 1987
3737 1987 1375 -42 -685 262 1690 2109 881 -494 -499 912 2129 1850 284 -845 -340 961 2069
3754 2069 1175 -373 -1003 -185 1208 1399 79 -1297 -1315 14 1045 712 -858 -2072 -1425 35 855
3771 855 -84 -1599 -2034 -1109 386 535 -645 -1971 -1883 -428 820 299 -1178 -1984 -1035 452 1050 72
3789 72 -1174 -1376 -139 1312 1362 213 -1044 -674 727 1704 1272 -220 -831 30 1620 1934 1037 -327
3807 -327 -643 507 1808 1881 426 -722 -331 1079 1777 1104 -484 -916 -288 1236 1614 258 -1270
3824 -1270 -1353 -90 1110 907 -585 -1615 -1269 208 839 131 -1386 -1795 -930 330 693 -617 -1610
3841 -1610 -1635 -296 693 245 -1032 -1810 -1146 333 1056 307 -947 -1480 -482 889 1039 -158 -1019 -761
3859 -761 601 1548 1058 -217 -947 -340 1104 1824 1002 -364 -612 454 1597 1589 291 -774 -462 884
3877 884 1698 1038 -319 -966 -130 969 1367 304 -892 -1091 88 1213 987 -383 -1490 -1093 99
3894 99 932 279 -889 -1574 -856 559 710 -391 -1499 -1523 -347 769 562 -695 -1544 -987 358 940
3912 940 243 -1007 -1294 -293 1062 1027 -124 -1234 -1105 292 1258 956 -198 -889 -446 868 1405 632
3930 632 -702 -788 258 1357 1440 300 -726 -601 687 1538 1002 -268 -1143 -333 1021 1344 560 -774
3948 -774 -1164 -94 1122 984 -289 -1150 -785 406 1010 506 -819 -1480 -762 669 1143 1 -1142
3965 -1142 -1400 -161 846 679 -562 -1379 -860 225 1080 322 -862 -1296 -450 705 849 -117 -1201
3982 -1201 -1105 75 1043 747 -422 -1181 -691 475 1163 546 -546 -945 80 1021 1152 218 -972 -759
4000 -759 465 1392 891 -295 -931 -444 801 1263 438 -570 -729 91 1105 1150 10 -985 -701 423
4018 423 1231 680 -536 -1069 -387 657 1058 145 -1019 -1142 -171 975 761 -251 -1264 -825 144 889
4036 889 385 -870 -1298 -685 530 879 31 -1071 -1232 -132 862 698 -516 -1169 -786 404 1109 384
4054 384 -706 -1131 -243 893 998 206 -909 -844 349 1201 1021 -270 -832 -439 693 1211 580 -459
4072 -459 -806 94 1066 1166 211 -814 -628 428 1161 829 -371 -877 -506 710 1118 396 -663 -930
4090 -930 -54 802 609 -180 -1051 -868 185 797 423 -697 -1431 -787 368 788 81 -905 -1111 -361 624
4109 624 408 -443 -1297 -829 430 1047 499 -652 -1049 -357 721 892 198 -741 -834 295 998 840 -62
4128 -62 -715 -422 616 1199 735 -281 -679 9 955 1232 307 -564 -629 291 1217 770 -24 -759 -323 609
4148 609 1008 261 -610 -880 -195 788 784 -143 -1090 -1028 63 730 465 -592 -1103 -702 281 690 36 -1025
4168 -1025 -1183 -403 580 629 -239 -1072 -1014 168 653 449 -561 -1100 -467 489 973 209 -814 -892 113
4187 113 820 979 -39 -738 -363 510 1248 686 -319 -680 -69 1054 1258 399 -338 -605 173 949 919
4206 919 46 -780 -429 630 1011 486 -505 -1065 -260 635 689 30 -860 -826 -50 599 346 -420 -1153 -647
4226 -647 131 602 130 -821 -1168 -350 376 450 -367 -1022 -915 -50 669 545 -398 -919 -461 428 755 306
4246 306 -580 -685 105 1015 780 -98 -637 -486 519 967 767 -177 -456 -86 686 963 467 -446 -532 296
4266 296 973 834 64 -654 -366 352 936 398 -369 -686 -310 565 785 38 -718 -873 -202 591 477 -282
4286 -282 -925 -547 236 707 52 -604 -1073 -399 591 787 -15 -983 -792 -63 645 331 -344 -741 -553 461
4306 461 846 185 -490 -634 -195 650 899 120 -544 -474 334 987 689 -94 -583 -314 637 872 373 -312
4326 -312 -568 39 735 700 -54 -675 -470 306 706 457 -292 -809 -276 425 698 106 -533 -769 -69 646
4346 646 527 -324 -804 -691 166 642 180 -476 -1029 -389 453 619 -27 -705 -798 28 530 497 -298 -785 -526
4367 -526 198 669 374 -633 -896 -298 640 870 23 -582 -742 194 720 580 -195 -592 -203 431 905 294
4387 294 -354 -623 -35 853 1023 28 -604 -626 289 776 586 -267 -769 -346 425 728 117 -470 -633 20
4407 20 713 559 -211 -782 -595 127 689 411 -453 -878 -377 397 545 -19 -780 -833 -158 426 340 -468 -838
4428 -838 -619 276 651 260 -567 -879 -330 433 662 66 -590 -733 -85 600 533 -163 -608 -421 491 723
4448 723 284 -398 -539 -86 686 722 166 -483 -318 155 833 569 -44 -565 -226 610 947 480 -408 -560
4468 -560 15 568 735 174 -586 -430 338 724 252 -263 -685 -255 341 545 -10 -631 -751 -177 442 426
4488 426 -245 -929 -838 65 458 253 -581 -887 -425 227 438 17 -628 -743 -100 608 549 -245 -726 -481 273
4509 273 749 466 -299 -535 -67 552 746 153 -468 -372 271 895 734 99 -352 -118 682 924 570 -91
4529 -91 -541 -26 761 743 363 -445 -405 274 651 511 -209 -537 -324 395 652 119 -515 -875 -392 365 458
4550 458 -130 -862 -779 -99 236 99 -542 -890 -483 136 470 -140 -657 -950 -145 389 391 -235 -742 -602 130
4571 130 570 356 -247 -637 -194 483 728 166 -272 -294 202 734 829 137 -279 -68 517 947 614 -15 -438
4592 -438 117 655 747 206 -375 -360 324 780 502 -77 -632 -359 256 627 324 -472 -784 -287 271 307 -204
4613 -204 -701 -715 -252 340 191 -521 -847 -577 72 346 -148 -661 -844 -331 220 345 -113 -583 -576 11 509
4634 509 367 -311 -604 -107 490 854 250 -281 -341 88 748 520 154 -334 -154 469 912 596 32 -393
4654 -393 152 655 819 321 -219 -341 385 771 528 -15 -555 -315 381 810 341 -392 -605 -322 203 403
4674 403 4 -671 -767 -143 285 163 -552 -846 -536 130 424 -80 -619 -841 -460 202 338 -239 -721 -636 68
4695 68 439 166 -281 -697 -343 380 632 174 -283 -383 92 654 700 126 -444 -100 347 794 477 -106 -134
4716 -134 98 667 803 286 -305 -214 344 675 752 78 -404 -145 227 749 441 -400 -480 -171 431 532 -28
4737 -28 -642 -572 -56 396 284 -293 -720 -438 13 401 27 -686 -733 -428 216 362 -216 -638 -547 -113 448
4758 448 245 -236 -808 -345 226 444 50 -310 -535 -37 381 572 144 -437 -345 229 676 399 -84 -435
4778 -435 -23 409 670 300 -261 -263 156 662 670 199 -278 -114 366 597 492 -106 -421 -92 512 445 178 -293
4800 -293 -514 0 351 438 -76 -500 -409 87 357 178 -402 -707 -246 241 361 -143 -653 -616 -239 347 147
4821 147 -364 -794 -529 38 382 16 -633 -736 -259 437 311 -87 -486 -371 12 573 342 -175 -486 -328
4841 -328 320 604 452 -166 -372 103 629 538 256 -189 -143 462 737 597 -37 -258 -54 556 721 343 -239
4862 -239 -372 143 559 558 80 -402 -217 125 538 327 -275 -534 -252 123 299 -185 -662 -571 -123 330 114
4883 114 -338 -796 -587 -102 214 -7 -497 -601 -255 52 131 -217 -703 -597 -154 336 332 -130 -374 -281 230
4904 230 573 256 -181 -428 156 598 636 225 -319 -75 385 562 601 42 -234 76 551 816 388 -103 -31
4925 -31 207 480 608 102 -213 -287 336 435 181 -269 -431 -210 130 337 -87 -432 -648 -270 103 54 -316
4946 -316 -754 -595 -77 152 -104 -668 -718 -406 -64 109 -262 -641 -751 -134 159 213 -202 -564 -418 119 466
4967 466 190 -202 -294 6 443 606 247 -158 -39 252 717 584 158 -175 -16 522 704 502 24 -34 292
4988 292 568 679 214 -190 -239 252 573 235 -101 -544 -224 177 260 -40 -552 -551 -271 254 169 -264 -637 -504
5010 -504 -96 113 -31 -477 -697 -360 -6 141 -149 -554 -550 -64 223 136 -163 -508 -228 174 457 152 -182
5031 -182 -355 -156 384 549 242 -127 -315 228 571 597 187 -142 56 403 573 476 63 -151 111 460 628
5052 628 118 -177 -233 154 511 356 -76 -307 -253 167 309 -5 -339 -319 -186 240 203 -122 -536 -421 -129
5073 -129 115 11 -405 -625 -384 115 92 -191 -465 -510 -134 256 124 -65 -612 -423 -8 354 176 -82 -337
5094 -337 107 375 402 84 -69 -214 133 499 489 198 -120 21 306 545 299 -89 -123 -16 480 500 141
5115 141 -164 -259 62 389 305 76 -430 -182 122 250 102 -98 -446 -219 136 256 -31 -459 -358 -26 248
5136 248 104 -163 -437 -325 131 225 38 -423 -424 -63 175 126 -91 -521 -424 31 268 226 -326 -275 -178 165 315
5159 315 76 -189 -330 53 305 397 50 -333 -242 82 370 248 -63 -325 -80 346 449 134 -176 -245 34
5180 34 361 290 -54 -199 -249 256 417 250 -273 -393 -37 314 317 54 -225 -253 -17 177 242 -95 -316 -265 108
5203 108 333 62 -262 -508 -76 210 235 -141 -479 -340 -153 255 43 -205 -341 -151 165 133 4 -360 -283
5224 -283 -108 221 191 -92 -350 -197 43 476 275 11 -406 -99 308 388 149 -267 -231 12 402 370 25
5245 25 -278 -109 206 418 266 -30 -199 -73 312 274 164 -133 -371 -70 306 223 -76 -244 -180 141 171 69
5267 69 -209 -361 -54 219 315 -30 -288 -315 -70 203 102 -252 -330 -343 56 187 36 -302 -487 -125 191 112
5289 112 -52 -372 -272 -3 209 174 -100 -316 -124 203 425 33 -153 -182 68 391 328 126 -163 -178 216
5310 216 378 289 163 -233 -115 219 428 132 -268 -244 162 355 292 -38 -156 -197 101 441 36 -207 -343
5331 -343 -136 199 205 70 -298 -533 -108 164 138 -203 -378 -394 -22 229 13 -130 -403 -248 2 199 -64
5352 -64 -387 -380 -50 189 60 5 -326 -32 182 340 133 -129 -264 114 313 390 198 -232 -93 262 428 345
5374 345 139 -127 -47 383 388 294 17 -141 54 334 308 16 -25 -243 -46 208 81 -90 -386 -230 149 182
5396 182 110 -434 -379 -68 133 77 -204 -495 -486 -53 34 63 -226 -401 -267 58 171 -103 -473 -190 -33 224
5418 224 25 35 -288 -147 146 292 150 -66 -210 29 353 342 247 -94 -183 178 530 325 -28 -169 64
5439 64 256 407 233 -170 -167 -18 314 325 107 -196 -271 59 227 256 -178 -400 -271 106 242 -28 -310 -391
5461 -391 -16 87 141 -96 -342 -305 -143 172 11 -250 -429 -186 61 232 58 -314 -343 -41 67 133 -51
5482 -51 -126 -287 85 258 127 -193 -230 44 343 160 113 -149 -154 135 300 223 -25 -160 -116 212 269 258 -132
5505 -132 -174 -34 207 263 2 -239 -253 82 283 87 -171 -291 -122 173 109 12 -214 -365 -172 149 175 -73
5527 -73 -268 -279 -39 231 19 -170 -298 -129 199 194 20 -279 -199 -157 88 149 -17 -278 -300 139 279 114 -128
5550 -128 -256 -109 269 275 118 -102 -14 49 236 133 -115 -283 -210 152 291 134 -4 -233 -17 105 227 -12
5572 -12 -218 -219 146 258 224 -81 -243 -220 103 276 94 -148 -285 -142 153 205 42 -141 -219 -81 205 2
5594 2 -138 -222 -169 89 244 125 -256 -130 -50 245 186 32 -188 -200 19 124 209 -126 -166 -130 136 307 91
5617 91 -284 -195 -2 225 154 -169 -170 -187 10 249 117 -100 -296 -63 247 223 -33 -195 -219 27 272 239 -177
5640 -177 -348 -88 46 231 117 -145 -173 -68 156 195 152 -131 -261 113 162 230 -18 -107 -122 215 314 82 -135
5663 -135 -273 -131 211 167 -125 -263 -226 60 205 205 22 -144 -172 61 161 29 -220 -285 -104 99 173 -38
5685 -38 -198 -211 58 48 49 -143 -195 -27 164 197 43 -170 -139 -27 169 161 35 -219 -126 251 311 219 -94 -157 -69
5710 -69 163 295 139 -171 -129 -111 244 216 -76 -171 -77 23 213 265 -14 -192 32 85 145 -6 -204 -155 178
5733 178 232 50 -69 -245 -182 -66 115 19 -130 -347 -176 19 142 -33 -278 -208 37 128 83 -187 -342 -209
5755 -209 181 257 -4 -100 -214 0 209 172 12 -150 -94 26 235 210 -7 -221 -84 252 306 103 -121 -186
5777 -186 57 288 281 28 -132 -149 68 254 58 -195 -180 -74 166 232 27 -213 -276 -7 134 -14 -202 -209 -267
5800 -267 45 67 50 -205 -228 -245 77 122 -133 -253 -102 -2 176 155 -1 -260 -82 194 278 159 -21 -204
5822 -204 -95 225 235 45 -231 -181 162 295 236 1 -60 4 84 225 73 -65 -159 23 171 89 95 -167 -134 149
5846 149 140 17 -218 -291 -30 87 166 46 -110 -211 -16 196 193 -48 -262 -244 77 174 -13 -55 -181 -61 100
5869 100 206 -11 -68 -94 46 184 154 -47 -175 -44 69 251 149 -43 -163 -25 93 166 48 -209 -79
5890 -79 187 277 71 32 -210 -177 162 52 123 -184 -172 34 132 109 -59 -21 -169 -78 214 97 -117 -356 -257 98
5914 98 198 58 -162 -127 -100 204 10 -7 -222 -146 171 89 141 -88 -84 -106 130 126 84 -73 -99 -8 183 158 -30
5939 -30 -222 -240 163 166 111 -110 -175 -123 88 136 -11 5 -52 24 187 277 -15 -117 -137 -94 184 64 -126 -216 -148
5964 -148 32 54 -25 -128 -230 43 208 125 -76 -372 -126 171 224 140 -163 -144 -61 217 -39 56 -76 14 161
5987 161 297 201 -139 -65 38 161 146 152 -170 -205 -41 166 207 72 -248 -74 124 63 81 -98 -148 -101 -9 199
6011 199 152 -97 -136 -132 -39 33 -59 -193 -83 -22 84 -16 -84 -253 -42 74 21 -26 -182 -238 10 217 231 -41
6035 -41 -173 -117 178 115 71 -123 -239 126 170 152 71 -52 -62 99 204 218 48 -164 -89 114 185 -19 -195 -318
6059 -318 -191 68 130 -91 -126 -205 -7 176 65 36 -172 -2 123 104 -46 -281 -252 -20 91 -39 -118 -174 -95
6082 -95 49 95 -38 -67 -210 -53 121 168 -1 -57 -141 28 75 251 83 10 -103 132 244 128 37 -130 -83
6105 -83 109 163 89 -78 -22 130 282 164 -20 -54 -27 94 208 125 -155 -35 55 144 104 -65 -117 -247 -107 107
6129 107 94 -211 -346 -119 119 177 -145 -146 -305 -68 118 171 -100 -160 -173 27 106 -58 -137 -247 -9 46 221
6152 221 75 -54 -115 108 19 114 118 59 106 -38 175 190 38 -168 108 154 241 19 -88 -28 99 265 121 67
6176 67 -139 -153 86 139 68 -160 -271 -90 145 164 87 -258 -223 -65 92 148 -123 -71 -106 59 137 92 -145 -206
6200 -206 -65 124 129 37 -119 -210 30 202 21 20 -120 -54 72 64 37 -62 -38 185 155 320 33 -30 26 -26 249
6225 249 115 -6 -40 32 4 191 250 -55 -101 91 138 39 -106 -86 -157 55 224 93 -75 -154 28 -15 38 -13
6249 -13 -103 -149 -95 94 136 -101 -238 -212 -43 119 45 -147 -131 -128 207 75 -20 -139 -141 5 109 61 -41 -262 -157
6274 -157 173 207 103 -33 -63 -17 122 215 106 -97 69 17 82 48 31 -63 43 193 127 153 -146 35 121 143
6298 143 116 35 -108 -214 129 63 87 -106 -212 -129 45 89 92 -268 -158 -151 32 50 -87 -239 -146 19 39 21 -102
6323 -102 -163 -60 105 82 9 -160 -82 74 176 86 -111 -164 -123 50 100 178 -55 -208 -115 125 257 51 -82
6346 -82 -150 -6 264 201 -31 -141 -54 63 278 72 -107 -268 -43 234 146 24 -35 -122 -5 85 0 -85 -63 -167
6370 -167 48 181 -5 -132 -131 75 133 51 2 -113 -176 -56 189 182 -73 -52 -143 -17 14 11 -95 -74 4 142 40
6395 40 11 -89 -216 93 205 147 21 -109 -36 79 109 -2 -55 -124 -44 164 242 -45 -84 -90 87 137 -8 13 -107
6420 -107 -113 -20 46 3 -113 -28 -47 68 33 -62 -124 -132 64 184 37 -53 -187 -150 150 266 107 -130 -6 38 87
6445 87 120 59 -57 -119 60 51 83 -125 -132 -99 142 102 32 -156 -138 -70 131 84 -84 -84 -127 81 62 22 -163 -80 -41
6472 -41 59 7 -52 -185 -187 28 153 -63 -188 -107 -18 66 22 72 -93 -158 -58 207 147 35 -80 72 215 178
6496 178 98 67 63 68 200 104 154 -57 -71 70 89 47 -147 -87 -39 31 51 -67 -152 -68 -51 55 136 -94 -129 -110 -10
6523 -10 121 84 -150 -180 -174 -48 -1 24 43 -177 -138 -51 -109 -94 -120 -46 -65 -7 134 -127 -41 -15 83 146 106 -127 -51
6550 -51 113 244 171 47 -101 49 105 180 81 -4 -56 17 239 190 101 32 -52 101 108 92 37 -61 26 14 69 -91 -153
6577 -153 -131 -76 115 125 -74 -311 -94 -70 34 11 -179 -216 -114 -24 -30 7 -215 -87 -89 15 37 -89 -75 -115 16
6602 16 109 54 32 -175 28 61 124 93 -15 -118 70 122 152 129 -29 60 71 99 184 -21 -45 47 241 80 149 -109
6628 -109 -13 35 36 15 -3 -124 -109 111 154 49 -68 -99 -90 95 89 -85 -201 -177 16 131 27 -183 -147 -149 74 58
6654 58 42 -143 -86 27 91 116 -73 -88 -20 107 -5 94 -82 6 14 35 334 158 -52 -46 97 108 139 101 -72 87
6680 87 9 177 207 -7 -94 9 70 41 -19 -184 -79 35 68 174 -38 4 -63 -69 137 -16 -215 -187 -48 41 150
6705 150 -26 -148 -196 -54 195 42 -101 -68 -148 -9 184 -70 104 -66 -19 42 153 27 -185 -48 -3 130
6727 130 199 -4 -57 -135 3 140 -2 -100 -51 -61 21 128 35 -15 -46 77 34 5 -54 -124 -84 112 133 14 -53 -181
6753 -181 -25 -78 -33 27 -90 -84 -46 123 107 -32 -24 101 -42 138 44 -116 -128 -66 142 70 31 -171 -56 2 169
6778 169 -17 -45 -178 -47 29 92 -4 -262 -51 -39 88 -41 61 -106 -56 -34 110 83 19 -133 -87 36 70 25
6802 25 -20 -169 -111 74 116 26 -115 -132 42 43 41 -53 -71 -103 136 -5 53 55 -94 29 165 124 -13 -81 59 130
6828 130 -17 -7 -86 -188 -100 15 101 122 -33 -35 -41 146 -12 -63 -117 -84 93 48 2 35 -50 18 37 114 -52 -86 -112
6855 -112 6 104 -90 -55 -167 -2 100 46 -30 13 -140 -7 29 20 -52 -151 -100 32 145 -85 -92 -12 -128 130 103
6880 103 -106 6 -76 67 80 96 -18 72 65 86 43 -13 16 -71 44 92 157 121 -128 -146 -26 110 9 -60 -53 -103
6906 -103 -7 79 -201 -10 -67 -72 68 21 -19 -95 -123 -26 54 28 -22 -110 -24 21 21 87 -224 -201 -44 -19 -29 31 -115 -9
6934 -9 66 161 2 104 -14 31 169 57 147 -14 35 48 182 110 15 -124 110 84 88 -10 -24 -17 -1 71 40 162 -87
6961 -87 -51 -11 148 85 -32 -93 -50 -56 46 -97 -28 -64 -114 -96 1 -83 -101 -107 -102 20 -10 32 13 -150 25 20 -11 11 -175
6990 -175 -103 99 153 57 -90 -94 71 143 97 0 10 99 129 181 30 103 120 53 112 126 105 44 -31 65 8 4 42 -19 -34
7019 -34 56 63 -8 -60 -58 -190 3 40 -33 -40 -128 47 -98 -4 34 -108 -185 97 -7 -45 -170 -35 -98 -86 -14 -61 -212
7046 -212 -111 -53 -5 -16 -57 -136 -14 150 174 47 -95 4 -3 133 -12 -55 125 147 128 81 56 3 -51 32 169 109
7072 109 -12 22 -67 28 52 -46 -82 -45 -40 76 205 46 175 -102 -130 31 -5 -65 -89 -136 -41 113 -13 -130 -154
7097 -154 3 10 -34 -191 14 -20 39 29 73 62 -164 -19 -57 102 -136 79 -97 -15 82 61 0 -34 -18 -32 100
7122 100 158 -80 -68 74 117 127 83 -180 -31 98 73 60 109 -87 -116 35 -25 80 6 30 -44 80 49 80 -153
7147 -153 -44 -36 -15 13 -11 -124 -168 -27 42 51 -51 -111 83 4 -16 0 -60 -131 7 23 2 53 -41 -71 14 -79 -22 -22
7175 -22 -59 -17 39 68 13 -60 33 89 33 116 -98 -21 -59 11 5 -8 -30 17 5 57 -42 14 -118 -115 34 -34 54 -42 -72 -94
7205 -94 88 151 27 -32 -144 0 25 -40 11 -71 -28 -24 98 -29 -84 -46 -40 94 -6 48 -31 -70 54 77 23 91 -11
7232 -11 -68 71 73 -106 2 -94 -114 17 115 128 -7 -36 -61 91 -55 -78 -128 -55 29 -64 -54 18 -145 -93 18 56
7258 56 -97 -105 36 -18 121 122 -10 -172 -16 26 65 -2 -55 -91 -9 55 91 -90 -43 -30 -36 94 -35 -27 -63 39 -16
7285 -16 -6 -90 -50 -132 -40 101 -79 -52 -71 -45 32 83 -10 90 26 -167 -6 30 -28 -55 -136 14 45 77 109 -16 59
7312 59 25 89 117 -9 -102 -75 -19 -25 65 -46 -45 23 63 -29 -113 -7 95 -69 90 -33 24 -33 10 179 166 91 -148
7339 -148 28 7 116 6 90 88 -72 -17 150 141 -51 -33 93 -45 37 -86 -18 -12 18 13 -30 -92 -95 23 80 -29 -30
7366 -30 -73 -38 -80 -45 67 18 7 27 -13 -61 23 146 -109 -15 7 -89 49 -30 31 -22 65 -23 10 18 -169 113 115 74
7394 74 -21 -115 34 49 67 80 125 70 -41 74 -40 63 69 1 123 11 39 -27 35 83 113 35 -149 -7 6 -83
7420 -83 14 -100 -90 -210 -105 104 -51 -116 26 34 -84 105 -4 74 -29 -63 41 -76 -45 63 -8 -70 20 64
7444 64 -65 -92 -53 51 172 108 34 -69 -20 -33 186 52 93 -58 52 2 7 120 82 4 59 -5 -15 -9 -58 -12 123
7471 123 2 -112 64 34 95 -61 -116 -122 73 36 -10 35 13 -99 -147 -30 -89 -76 -60 -61 -77 -124 -49 54 -121 -70
7497 -70 -75 68 39 -40 -111 42 -56 92 -14 93 -57 -91 -77 61 93 64 43 -57 148 -92 4 -71 9 20 33 -19
7523 -19 -20 -25 -67 36 -16 162 14 -16 -113 90 49 -31 -90 -9 -80 -5 41 86 -92 -3 16 120 -57 10 -91 -108 92
7550 92 -150 -25 38 46 -71 -8 39 33 37 -60 -54 -21 7 101 -47 120 23 38 8 -57 61 -7 27 -25 14 -21 45 67 33
7579 33 73 -29 -27 0 -152 14 -21 42 -62 -2 -10 -30 34 -229 -102 38 84 -44 -84 -5 13 6 3 -15 189 -54 -49 10
7607 10 -32 -15 -67 -9 13 69 18 -17 22 44 59 -20 92 -47 -19 -61 70 200 75 -135 38 16 -68 51 -19 15
7633 15 -172 -37 -40 72 23 -134 58 46 102 3 48 7 -29 72 -27 -26 -23 52 4 -76 -56 -70 -97 51 -19 -72 -1 -82
7661 -82 -6 43 29 28 116 -102 -58 -26 31 50 -64 -55 38 81 -14 7 -49 51 27 158 43 -22 -52 138 75 43 42 -36 -28
7690 -28 -81 147 -10 27 -74 67 37 53 -32 -10 -74 80 88 -95 11 -29 61 -49 38 38 -36 -70 52 -14 -55 10 69
7717 69 27 -74 -57 -1 12 46 -23 48 -52 17 64 36 -64 -5 88 17 135 -97 59 5 6 -99 94 91 12 90 113
7744 113 -102 -60 135 37 76 52 9 -4 -73 53 -54 -77 -113 -80 -31 23 -39 -23 -127 16 -19 59 8 -140 -29 -143
7770 -143 -7 92 -142 -74 -42 51 53 53 -7 27 -94 38 -56 26 -62 -7 45 -27 136 -65 66 -75 135 -82 -53 63
7796 63 -115 20 73 52 -89 7 -22 -55 -3 80 37 -61 14 126 40 1 48 -34 100 -12 -74 -69 -85 -36 -75 -7 -18 52
7824 52 63 -125 50 84 33 -136 -36 39 -153 -18 -62 99 -39 11 111 -36 -166 -169 72 39 91 31 53 -54
7848 -54 39 80 -53 25 5 -25 87 111 -50 90 -125 116 134 26 -28 -24 -51 12 49 -79 -40 -78 17 -42 10 -22 -8
7875 -8 -15 -40 -4 -126 -4 -63 13 64 -118 -75 -81 34 70 -7 -14 27 -12 -76 150 25 37 -1 -39 70 2 115 17 29
7903 29 50 53 78 57 20 -60 -46 70 134 -39 -50 -48 -30 50 131 18 9 -34 85 101 -48 44 30 -49 -30 -127 -7 58 10
7932 10 -115 -39 68 -28 26 -99 2 66 9 -78 -73 -37 72 140 -95 -71 -58 -67 26 -31 60 -7 -50 7 32 2 -35 -30 -26
7961 -26 153 -33 17 -11 98 8 70 -30 30 90 76 -62 47 -14 -6 -1 -41 7 -132 -94 0 -35 -74 -47 -15 -26 -62 -125
7989 -125 -12 14 24 -5 -142 -93 25 77 -29 51 -41 -108 53 10 -22 -13 -124 52 -2 31 -22 3 -7 59 -92 -69
8015 -69 -43 19 48 3 -125 -2 -97 -34 33 32 10 -3 91 -80 94 18 -24 -3 -10 69 67 56 -81 -17 -53 -6 111 21 0
8044 0 -61 -69 -33 -1 79 -42 -109 34 127 28 -67 -94 -17 130 55 -30 19 -15 -12 -63 20 72 11 28 -70 74 18 -49 82
8073 82 121 66 101 92 -120 -72 -63 -25 97 119 17 -68 -44 67 -8 -79 -43 3 -63 -94 -53 10 4 52 110 -39 -13 -93 -96 78
8103 78 41 -12 9 -122 -35 40 -68 55 -53 -88 13 112 58 -4 -124 60 -10 146 22 38 24 -4 -17 81 -4 -95
8129 -95 5 26 80 36 -32 -30 -8 159 44 37 -20 84 104 10 61 -82 -95 -11 35 -7 -39 -45 -92 -42 226 10 -89 -76
8157 -76 -52 -27 66 -24 -60 -42 -19 -67 131 -119 -27 43 -30 42 -66 -67 39 54 -50 26 15 19 23 127 36 82 22 38 -1
8186 -1 117 91 -61 32 36
8191C6
$$ Imaginary data points
##PAGE= N=2
##DATA TABLE= (X++(I..I)), XYDATA
0 0 0 0 0 0 0 0 0 0 0 0 8 -8 8 -8 8 -12 16 -13 20 -24 24 -28 36 -36 44 -48 54 -61 72 -76 89 -99 109 -120
34 -120 137 -151 166 -185 206 -228 251 -279 307 -344 380 -419 471 -527 590 -671 768 -885 1035
53 1035 -1238 1514 -1921 2568 -3733 6257 -14035 86198 486816 362368 -33800 -144517 29494
66 29494 135369 125345 133556 110172 11033 70727 366696 502487 183282 -198984 -123111
77 -123111 254032 381311 176319 16487 65640 154968 206536 253118 171528 -114235 -296310
88 -296310 -64036 316860 325060 -13365 -199732 -65100 59769 -26823 -149277 -172276 -169088
99 -169088 -127006 42712 168763 -24849 -382931 -436400 -126199 85264 -57014 -260092
109 -260092 -228757 -82586 -28805 -39745 -66576 -185604 -327573 -245013 46976 177776 -13711
120 -13711 -199419 -95004 99440 80743 -76520 -128156 -60168 22830 139840 272738 233152
131 233152 -16190 -168052 -1841 238779 225452 52087 24714 154696 223548 181319 137233
142 137233 88360 -8425 -28932 130124 280741 190297 -14649 -30005 133136 188155 47864
153 47864 -85594 -85171 -27768 33189 118793 147554 4853 -193982 -205026 -39330 37559 -70687
165 -70687 -164560 -102643 -3831 -6247 -73992 -138541 -204886 -232513 -133146 26447 40241 -120215
177 -120215 -223603 -125779 14780 1865 -115254 -172107 -133629 -56654 37345 108424 63599
188 63599 -81546 -143292 -25916 106757 73273 -41989 -34282 101024 191360 154432 58172
199 58172 -23729 -52671 20318 173322 250933 146333 -8284 -5222 133291 195250 98666
210 98666 -18315 -24691 55346 138087 171635 119441 -5775 -86472 -20438 103225 97234 -45758
222 -45758 -128268 -39155 96417 109162 -3309 -128641 -183112 -138077 -19041 67280 13423
233 13423 -127811 -175190 -70375 25865 -32605 -168971 -206197 -108590 9213 46186 -10695
244 -10695 -112868 -173408 -116430 12823 59604 -42187 -153074 -106435 55056 140998 67709
255 67709 -62831 -117321 -62276 48945 129085 107784 9956 -36089 47230 156818 133827
266 133827 -6112 -82887 2055 148389 206077 141346 28197 -39496 -6645 98336 158035
277 158035 85918 -39102 -51435 73116 172081 116621 -24966 -98864 -55314 33538 80403
288 80403 47101 -39436 -92191 -40726 58913 63346 -64950 -183868 -150667 -9911 76637 33456
300 33456 -73932 -143467 -128261 -52232 5645 -26301 -117294 -143635 -47752 62077 46999 -75368
312 -75368 -158202 -117023 -11787 52688 34211 -34175 -79539 -40933 57475 103220 25516 -90721
324 -90721 -96160 26164 139398 131712 40059 -25525 -11124 53297 101754 83011 10688 -27496
336 -27496 37673 148546 169235 62334 -53523 -54156 41147 117177 104497 32966 -23726 -12916
348 -12916 55244 102116 51928 -61415 -111394 -35101 75802 91092 4203 -79257 -82280 -27652
360 -27652 14580 -2278 -68748 -119706 -85746 14815 69140 778 -121367 -161595 -87013 5373
372 5373 20528 -34331 -86623 -81507 -22866 31287 15035 -69196 -127804 -78405 36457 91657
384 91657 35893 -50317 -65269 -3748 58427 59196 3285 -48716 -30584 59869 137400 112375
396 112375 5838 -62361 -18495 76399 112850 65682 5488 2356 55882 107710 96059 16506
408 16506 -58659 -43866 54383 128050 92450 -7723 -57895 -16230 49532 56526 -2436 -66254
420 -66254 -69933 -4610 67341 63107 -27006 -112272 -101863 -17451 33554 -4496 -75501 -92286
432 -92286 -39770 21268 24129 -41876 -118702 -126344 -46679 42255 45585 -32923 -93949 -67884 4265
445 4265 33593 -8310 -67546 -74909 -14115 64731 85968 23625 -58023 -66921 8474 79561 67758
458 67758 454 -30769 13895 84575 104541 51501 -24954 -49123 8396 93706 117212 55177
470 55177 -17697 -16874 47650 88220 52013 -20780 -49479 -3698 70736 97981 45280 -40964
482 -40964 -75482 -26131 44322 48318 -17707 -71869 -49404 19236 51956 8961 -69500 -109341
494 -109341 -72938 3599 41612 718 -71019 -88582 -33254 22213 6290 -62781 -103580 -68134
506 -68134 9478 55054 27281 -44830 -87896 -55601 16467 47022 4879 -50424 -42772 24881
518 24881 76639 55675 -13495 -58663 -34160 38043 88752 68942 4609 -27105 12873 75400
530 75400 81105 19451 -37741 -24143 46209 100813 86161 18423 -35558 -24314 34555 70209
542 70209 37215 -25962 -41350 12268 71159 63164 -8447 -72220 -68100 -6877 46211 37819 -22261
555 -22261 -67642 -48054 10212 31218 -18188 -84539 -90651 -28424 35229 35672 -22607 -78466 -77831
568 -77831 -24520 21319 7803 -48266 -75383 -32310 36961 54024 -729 -65856 -72480 -16639
580 -16639 44360 54020 10235 -34288 -25521 30125 67791 38395 -26862 -49190 1526 72401
592 72401 90904 44161 -14507 -26589 15195 62741 61758 11071 -29430 -6247 59404 91522
604 91522 48118 -26102 -54972 -14813 45393 62206 22323 -29146 -35875 7843 47845 28425
616 28425 -38072 -79373 -47319 23529 55136 16069 -49149 -74420 -40447 9674 18638 -24722
628 -24722 -71606 -63691 -3022 43969 22058 -46976 -87436 -57960 5260 34862 6558 -40786
640 -40786 -50441 -8832 39055 36983 -18074 -66223 -48307 21729 71849 52797 -6718 -39479
652 -39479 -13795 36359 55236 22866 -21958 -23888 27622 79848 73124 11143 -39720 -26171
664 -26171 31859 68500 47721 -1566 -22519 7505 53774 59815 10863 -45681 -48363 7332
676 7332 60554 53772 -3161 -46741 -35112 9829 31492 2380 -46309 -59233 -18140 34934
688 34934 40226 -12608 -69267 -71181 -21073 22447 13179 -33138 -59677 -34910 13390 30329 -6445
701 -6445 -59989 -72199 -27180 29898 41759 1230 -42104 -39218 3217 34125 17380 -25370
713 -25370 -41677 -7164 46420 64674 28226 -24611 -38364 366 47959 53975 16848 -16112
725 -16112 -4177 39477 64440 40018 -9962 -33520 -6235 43404 63564 34660 -9858 -21137
737 -21137 9502 41579 32562 -11413 -41627 -23089 26110 53446 28413 -25070 -54796 -35085
749 -35085 7863 24523 -2392 -39807 -42554 -6744 24450 11423 -35615 -67750 -51235 -3403
761 -3403 26460 9691 -32452 -53197 -29726 10442 19146 -15368 -53477 -47996 -315 40770 34492
774 34492 -9178 -43000 -33479 7346 35798 23173 -11844 -23902 7132 48341 51337 10198
786 10198 -30360 -25986 18517 57596 54040 15268 -15873 -5623 33579 54589 28650 -16616
798 -16616 -28809 7990 53603 58218 17362 -25628 -29514 3371 34179 26827 -11307 -36010 -15999
811 -15999 27741 41275 2420 -50157 -61442 -21632 24438 29225 -8783 -48043 -47754 -10439 19417
824 19417 4318 -41536 -64777 -34822 16991 33093 -2356 -47934 -54141 -17582 20310 19683 -16968
837 -16968 -46823 -30501 20310 51176 25028 -30459 -53151 -17846 35922 53063 22953 -15340
849 -15340 -19073 14801 48040 40840 -2009 -31356 -8162 46354 71458 39427 -12633 -28664
861 -28664 3614 44566 49996 14827 -22736 -20655 21605 57322 41680 -12887 -47619 -26188
873 -26188 22373 41573 13511 -26898 -35783 -7244 24230 19447 -22901 -59963 -48170 3941
885 3941 38773 16940 -36822 -63076 -37937 4690 17367 -10411 -45545 -47958 -11384 26836
897 26836 23101 -21680 -57707 -42410 6714 34399 13854 -24358 -33819 -3867 32392 35938 1323
910 1323 -35942 -32474 14068 57399 51638 5669 -26563 -11667 28036 45868 25678 -5795 -12302
923 -12302 15248 49273 51398 13965 -25249 -22668 18623 49743 35573 -4481 -24111 -4748
935 -4748 28354 37301 9710 -29399 -41536 -12094 28580 34773 -540 -37197 -35833 -5302 13062
948 13062 -2148 -32287 -42604 -20292 13591 23171 -6434 -48149 -57794 -23561 16296 18482 -14208
961 -14208 -40368 -30740 1560 20319 6340 -25812 -41705 -20830 18776 35962 12997 -21235
973 -21235 -25051 4566 31395 24680 -5454 -22975 -6277 30941 52771 35543 -5376 -27845
985 -27845 -7552 32019 46981 24016 -5799 -6929 18758 39497 30629 -954 -23804 -13343
997 -13343 21669 43996 27503 -10573 -27893 -7639 22358 23974 -5219 -32979 -29701 1292
1009 1292 28361 22483 -13970 -45343 -39419 -5117 16598 2081 -27982 -35674 -13090 12173 9828
1022 9828 -19280 -46264 -41960 -7267 24282 19174 -16387 -41109 -26401 9224 23817 2413
1034 2413 -27850 -31656 -3212 29807 35343 7727 -23815 -24311 6870 33903 25957 -3736 -16050
1047 -16050 5933 37625 42956 14793 -18959 -24109 6246 42660 48100 16449 -15913 -14055 16609
1060 16609 36462 21050 -10527 -22269 -1729 28242 35759 10813 -22300 -30226 -5104 22921
1072 22921 19515 -12593 -35052 -21055 12469 26422 4175 -31901 -46775 -26807 7485 21006
1084 21006 232 -30728 -35928 -10213 13038 3750 -26948 -41521 -21920 12089 25932 6855
1096 6855 -25538 -37861 -16415 16980 25264 -180 -27083 -20973 13042 36194 23695 -9165
1108 -9165 -26760 -11673 20257 37534 23678 -4566 -13424 8652 35147 32131 1261 -21246
1120 -21246 -8712 25577 45175 30786 -2197 -21509 -9113 20369 33620 14414 -15605 -20418
1132 -20418 5803 31007 24022 -8226 -31130 -23229 4027 21433 10725 -16342 -30804 -15714
1144 -15714 11443 16193 -10868 -40388 -38244 -6260 20530 15099 -14382 -36853 -31762 -6369 11880
1157 11880 3354 -21851 -31576 -11113 17619 20211 -7110 -32380 -27285 2135 24988 20093 -4450
1170 -4450 -21473 -11173 17704 32853 15599 -15059 -22903 2944 33980 37559 13112 -10545
1182 -10545 -9584 12182 30110 23989 320 -13703 1237 30690 39859 15123 -17549 -23368 1447
1195 1447 28131 28704 4862 -17438 -16129 5758 22398 12244 -16821 -32619 -16243 13728 22226
1208 22226 428 -26972 -31318 -11464 8395 6306 -15597 -33669 -25961 1577 19263 5135
1220 5135 -26644 -41114 -22404 7135 16352 -860 -22090 -23192 -3584 15729 12846 -10301 -27889
1233 -27889 -17024 13744 31587 17635 -10299 -19588 -1208 22794 26360 7575 -11811 -9224
1245 -9224 15523 37548 31732 2403 -18535 -8358 20237 34580 20734 -2979 -9299 6981
1257 6981 25856 24986 2233 -19824 -16698 9594 30613 21901 -7708 -25986 -15072 8960 16966
1270 16966 489 -22405 -26730 -7860 14292 14632 -9517 -33566 -31788 -6832 11445 3260 -19736
1283 -19736 -29422 -15146 6699 11276 -7293 -30518 -32855 -9446 17233 19375 -3708 -24950 -20093
1296 -20093 3702 18260 8571 -11818 -17790 -918 22727 28841 10493 -13620 -16450 5985 28894
1309 28894 27003 4812 -10025 -191 22814 32625 17984 -6721 -15874 744 26152 33244 13895
1322 13895 -10021 -12041 7548 23146 15111 -7734 -20088 -8331 14887 24472 8627 -18091
1334 -18091 -28962 -13277 9723 13171 -6325 -25373 -21788 -940 12578 2585 -21316 -34723
1346 -34723 -23299 1735 14384 1630 -21346 -27983 -11093 8172 7270 -12039 -26510 -18534 5101
1359 5101 21084 13193 -10119 -23828 -12325 11818 22217 8732 -10491 -11104 8388 26803 23366
1372 23366 2150 -14273 -8177 14739 30984 23546 1645 -9420 3067 23285 26207 7572
1384 7572 -11821 -10369 10376 28623 24964 2210 -16878 -13228 7301 20034 9517 -12032 -18865
1397 -18865 -3576 15188 14797 -5762 -25920 -25805 -6001 12538 9746 -11400 -27246 -19854 1040
1410 1040 9792 -4305 -25248 -29037 -11382 9340 12349 -4932 -23969 -24373 -5275 11781 7740
1423 7740 -11655 -21801 -8726 13486 20772 5680 -14845 -18934 -2156 19115 23300 7280 -9500
1436 -9500 -7000 12635 26059 17008 -4011 -12474 1417 23219 30155 15586 -5180 -10604 4304
1449 4304 22266 22107 3098 -12182 -5848 14944 25424 12661 -9968 -19556 -7580 12129 18069
1462 18069 3698 -15708 -18882 -2441 13060 7947 -13622 -27599 -18574 2959 13309 2222
1474 2222 -18137 -26840 -15227 3170 7697 -7549 -24512 -22135 -1996 13729 7067 -13748 -25746
1487 -25746 -16568 3685 14563 6256 -10763 -16526 -2901 15233 16728 -556 -16166 -10844 10228
1500 10228 24867 18884 315 -10710 -2980 15236 23714 12853 -4471 -7766 8346 25697 23856
1513 23856 4769 -10766 -6861 10762 22494 16284 -1067 -10967 -2395 14532 19077 3559 -15611
1526 -15611 -17417 -263 15962 13369 -4702 -18929 -15897 -878 8758 1259 -15835 -23024 -11009
1539 -11009 7145 10049 -6737 -24396 -24558 -8088 6632 5021 -9389 -20673 -15659 828 10310
1552 10310 1093 -16648 -21813 -7086 11926 15247 1386 -12845 -12387 1869 14714 12758 -1494
1565 -1494 -11063 -3112 15498 24353 13185 -4991 -10033 2857 18902 21693 9413 -3227 -2788
1578 -2788 10922 22395 17114 -942 -11753 -2911 15714 22755 11038 -5978 -10977 -736 11722
1591 11722 11877 -1699 -14847 -12325 3966 15077 7201 -12577 -23222 -14503 2330 8136 -2074
1604 -2074 -16559 -19540 -7933 5177 4024 -11801 -24989 -20144 -1663 10446 3323 -13354 -20751
1617 -20751 -11282 3869 8306 -1923 -15539 -15910 -167 15672 14829 -1860 -15124 -10138 7295
1630 7295 17919 11815 -1985 -6676 3261 17986 20898 7823 -7938 -8018 8680 24323 22024 5302
1644 5302 -6730 -1597 12943 19697 11042 -3963 -9181 2006 17782 19733 4406 -12879 -13421
1657 -13421 1352 13572 8681 -7033 -15974 -8937 5734 10767 -984 -18485 -23367 -10273 6385
1670 6385 8251 -6521 -20820 -18662 -4013 5485 -929 -15886 -22549 -12547 4496 10952 -327
1683 -327 -16677 -19961 -6251 8970 9032 -4362 -14201 -7964 8195 17034 9070 -6939 -13823 -3128
1697 -3128 14452 21076 10552 -4249 -5670 7650 19513 16315 1710 -7330 -313 15362 23523
1710 23523 15033 -1623 -8919 562 15341 18084 5001 -8549 -7325 6486 16806 11035 -4963
1723 -4963 -15620 -10519 3994 11733 3780 -11104 -16215 -6216 6236 5126 -9486 -21376 -17450
1736 -17450 -2073 8771 3497 -11883 -21510 -15528 -631 6100 -2389 -15694 -17514 -4382 8460
1749 8460 7214 -6165 -16820 -12865 1728 12289 8153 -4736 -11485 -3017 11430 15900 4947
1762 4947 -8628 -8566 5312 18651 18021 5177 -5655 -3172 9311 18149 12995 -254 -5853 3525
1776 3525 17135 19144 6558 -6956 -7800 3927 14974 13487 995 -9368 -6247 6227 13019
1789 13019 4803 -10515 -15870 -5870 7789 9918 -1482 -14233 -15459 -5090 4752 2487 -10077
1802 -10077 -18220 -12133 1940 7860 -1601 -16164 -19831 -8883 4369 6803 -3452 -14377 -13620
1815 -13620 -1265 9103 5920 -7410 -15045 -7331 7456 13785 5777 -6552 -9009 771 12151
1828 12151 12972 2392 -7430 -4178 9763 19670 14030 -884 -8677 -1484 12346 17829 9919 -1800
1842 -1800 -4739 4122 14374 13470 1259 -8976 -5569 7857 15804 9109 -5107 -11492 -4781 6970
1856 6970 10252 728 -11507 -13248 -2299 9014 7311 -6205 -17051 -13604 -868 6285 641
1869 641 -10828 -15277 -7629 3589 5330 -5243 -16900 -16095 -2648 8839 6552 -6513 -15157 -10019
1883 -10019 2561 8903 2775 -8229 -11138 -1598 10813 12778 1906 -9570 -8371 4389 14242
1896 14242 11261 -120 -6143 -5 11758 15988 7590 -4867 -7516 3048 15881 16822 5042
1909 5042 -6004 -4883 6130 13721 9231 -2017 -8106 -2022 9342 13294 4158 -8697 -11643 -1940
1923 -1940 8776 7791 -3590 -12222 -8967 1970 8161 2038 -10825 -17042 -9929 3105 7737 -716
1937 -716 -12554 -14353 -4913 3897 1997 -7914 -14346 -9302 2636 8946 2785 -10078 -14919 -6285
1951 -6285 6737 9883 773 -9099 -8148 2806 11674 8974 -1791 -9055 -4461 7772 14699 9241
1965 9241 -2068 -5545 2740 12737 12749 2568 -5924 -3563 7778 16354 12750 633 -7924 -3872
1979 -3872 7531 13153 6358 -4517 -6775 1403 10093 8864 -1483 -10664 -9145 970 8969 5688
1993 5688 -5859 -12686 -7378 3236 6003 -2680 -13053 -13791 -4219 5642 5462 -4524 -13924 -12763 -2446
2008 -2446 5168 1620 -8537 -12582 -5238 5231 7113 -1380 -10753 -10913 -1228 8648 8655 -830 -8422
2023 -8422 -5214 5826 11935 6024 -4596 -7663 588 11415 13918 5990 -3730 -4688 3704 12008
2037 12008 10479 1158 -5130 -337 10128 14061 6464 -4626 -7783 -353 9648 11490 3212 -6535
2051 -6535 -7280 1473 8940 5808 -4945 -11287 -6351 3704 7429 1254 -8610 -11668 -5277 3314 4018
2066 4018 -4618 -12998 -10854 -225 6946 2597 -8440 -14134 -8824 1275 6002 945 -7914 -10042
2080 -10042 -2788 6022 5852 -3331 -10333 -6681 4271 10777 6351 -3217 -7536 -2061 7408 10899 4601
2095 4601 -4369 -5294 3888 12870 11498 1287 -5971 -2910 6759 12144 7919 -876 -4754 746 9243
2110 9243 10840 2617 -6867 -6788 2695 10567 8093 -1843 -8577 -5635 2664 7125 2288 -6899 -10419
2125 -10419 -4093 5133 6391 -2350 -11599 -10960 -2235 4610 2337 -5983 -10896 -7233 1387 5245 -188
2140 -188 -9817 -12036 -3815 6014 6817 -1500 -9254 -7871 612 6903 4897 -2956 -7474 -2952 6481
2155 6481 10487 4016 -5242 -6422 1754 9993 9453 1586 -4516 -2263 6088 11470 7901 -1559 -6587
2170 -6587 -1049 8770 11942 4885 -4023 -5150 1770 8060 6749 -923 -6713 -4237 4211 9253 4123
2185 4123 -6031 -10474 -4265 4729 6460 -624 -8327 -8647 -1742 4497 3137 -4846 -11209 -8355 878
2200 878 6105 1359 -7643 -10589 -4263 3447 4219 -2253 -8652 -7825 127 7209 5725 -3257 -9385 -5397
2216 -5397 4026 8418 3562 -4128 -5486 784 7902 8322 1210 -5792 -4523 4107 11125 8505 -469
2231 -469 -5325 -967 7073 9441 3802 -3591 -4621 2061 9510 9156 905 -6712 -5530 2893 8519
2246 8519 4875 -3556 -6908 -2272 4729 6125 -15 -7768 -8942 -1733 5747 5052 -3145 -9714 -7204
2261 -7204 726 4829 653 -7075 -9760 -4714 3433 5623 -530 -8354 -9398 -2157 4916 3898 -3325
2276 -3325 -7842 -4122 3725 7062 2412 -5441 -8015 -2065 6569 8857 2564 -4936 -4719 2638 8482
2291 8482 6110 -1077 -5126 -1094 6672 10181 5414 -2634 -5330 475 8126 8550 1407 -4664 -2942
2306 -2942 4318 8948 5585 -2371 -7000 -3508 4127 7606 2689 -5092 -6953 -739 5257 4017 -3405
2321 -3405 -8624 -6497 922 5679 2644 -5188 -9642 -5858 1713 4263 -1348 -7912 -7840 -1185 4655
2336 4655 3173 -3634 -8951 -6687 833 5768 3177 -3924 -7029 -2304 4741 6000 210 -5620 -4930
2351 -4930 1923 7769 6852 259 -4841 -2670 4659 8688 4845 -2192 -3925 1576 8285 8694 2354
2366 2354 -3621 -3624 2541 7925 6680 -31 -4530 -1616 5157 7452 2013 -4858 -6248 -626 5523 5753
2382 5753 -348 -6540 -6505 -621 4290 2082 -4779 -8384 -4291 2169 4026 -1069 -7568 -8609 -3558
2397 -3558 2617 3175 -2644 -7882 -6662 271 4732 1669 -5187 -7838 -3530 3315 5703 1533 -4392
2412 -4392 -5363 -121 5812 5735 -307 -4763 -2368 4961 8810 5233 -1303 -4138 -44 6489 8433 4102
2428 4102 -1900 -2558 3112 8205 6747 -5 -4556 -1718 4825 7903 4183 -2301 -5138 -1289 4492
2443 4492 5524 42 -6035 -5758 486 5237 2724 -4070 -8195 -5411 727 3371 -183 -6375 -8208
2458 -8208 -3645 2471 2634 -3250 -8765 -7300 -567 3882 1860 -4057 -7237 -4252 1758 4500 873
2473 873 -4998 -5778 53 6126 6081 83 -4866 -3298 3124 7379 5475 -148 -3059 210 6365 8189
2489 8189 3592 -2351 -2708 3126 8539 7510 1347 -3238 -1604 3942 7259 4574 -1799 -4604 -910
2504 -910 5153 6171 583 -5421 -5612 -187 4061 2472 -2974 -6865 -4830 783 3614 -399 -6932
2519 -6932 -8913 -4106 2100 2812 -2477 -7638 -6937 -1687 2361 976 -4102 -7284 -4121 2131 4806
2534 4806 757 -5099 -6210 -891 4773 5148 471 -3616 -2513 2802 6838 5117 -604 -3716 -133
2549 -133 6073 8366 4213 -1274 -1898 2620 7030 6451 1603 -2545 -1176 4231 7782 5118 -1247 -4627
2565 -4627 -1302 4315 5530 1026 -3935 -4372 32 3996 2843 -2747 -7130 -5563 324 3635 616
2580 616 -5288 -7370 -3845 1077 1435 -2798 -7105 -6599 -1419 2873 1864 -3766 -7613 -5320 753 3758
2596 3758 803 -4184 -5237 -961 3966 4287 156 -4053 -3498 1744 6354 5118 -58 -3057 -242
2611 -242 5191 7043 3434 -1662 -2422 2116 6995 7370 2536 -2288 -2078 2944 6649 4668 -508 -2976
2627 -2976 -219 4448 5623 1420 -3766 -4833 -641 4138 3924 -1193 -5664 -4748 277 3123 394
2642 394 -4886 -6972 -3797 1258 2601 -1233 -6240 -6779 -2585 1935 1189 -3574 -6773 -4320 1107 3532
2658 3532 725 -4283 -6030 -2490 2802 4272 711 -3551 -3464 1244 5281 4011 -897 -3692 -1006
2673 -1006 4339 6880 4033 -815 -2575 847 5482 6198 2060 -2072 -1435 3509 6975 5031 -244
2688 -244 -3499 -1120 3705 5771 2796 -2114 -3694 -205 4057 3964 -890 -5078 -4062 635 3804 1661
2704 1661 -3106 -5992 -3597 1114 2495 -929 -5734 -6223 -1994 2551 2004 -2801 -6437 -5266 -601
2719 -601 2610 812 -3466 -5289 -2401 2169 3301 -376 -4727 -4452 413 4640 3981 -637 -3854 -2159
2735 -2159 2592 5333 3245 -1192 -2965 370 5151 6017 2216 -1998 -1811 2500 5922 4853 409
2750 409 -2449 -537 4025 5990 3033 -1946 -3557 -139 4464 4795 696 -3281 -3141 665 3545 2106
2766 2106 -2325 -4909 -2801 1617 3324 -25 -4828 -5781 -2220 1900 1896 -2176 -5659 -4776 -735 2302
2782 2302 680 -3809 -6042 -3567 1342 3038 -103 -4383 -4639 -777 2892 2587 -1212 -4029 -2601
2797 -2601 1919 4783 2836 -1688 -3457 -419 4136 5222 2049 -1843 -1702 2067 5551 4797 743
2812 743 -2372 -770 3539 5798 3779 -589 -2248 454 4150 4590 1035 -2556 -2318 1384 4544 3257
2828 3257 -1294 -4547 -2945 1438 3264 938 -3464 -4757 -1973 1587 1732 -1799 -5238 -4762 -859
2843 -859 2118 722 -3569 -5828 -3643 616 2021 -666 -4497 -5128 -1764 2200 2585 -1019 -4311 -3510
2859 -3510 420 3492 2115 -1631 -3106 -583 3369 4415 1464 -2065 -2347 1444 5101 5106 1209 -1891
2875 -1891 -899 3150 5441 3626 -190 -1813 843 4508 5237 2092 -1591 -2088 1204 4332 3552 -377
2891 -377 -3028 -1709 1957 3668 1110 -2986 -4479 -1955 1839 2602 -808 -4479 -4602 -1295 1617 597
2907 597 -3168 -5558 -3886 24 2000 -371 -4272 -5308 -2674 1002 1627 -1506 -4349 -3607 225 2918
2923 2918 1839 -2129 -4058 -2003 2175 4024 2048 -1366 -2267 801 4008 3937 879 -1804 -586 3247
2939 3247 5467 3918 116 -1766 439 3903 5115 2384 -1000 -1509 1568 4544 4032 368 -2483
2954 -2483 -1833 1595 3523 1860 -1692 -3268 -1191 1863 2253 -980 -4260 -4296 -912 1981 1314 -2413
2970 -2413 -5194 -4059 -695 1362 -381 -3768 -4860 -2449 1034 1339 -1502 -4513 -4101 -750 2159
2985 2159 1572 -1713 -3557 -1793 1621 3326 1082 -2117 -2749 263 3813 4038 1259 -1528 -1110 2157
3001 2157 4718 3487 235 -1439 568 3933 5046 2628 -916 -1595 1359 4204 4087 827 -1845
3016 -1845 -949 1985 3884 2076 -1602 -3178 -1435 2032 2801 335 -2990 -3543 -937 1531 1071 -2040
3032 -2040 -4413 -3378 -111 1624 -158 -3515 -4856 -2749 539 1356 -1182 -3976 -3979 -1094 1713 1326
3048 1326 -1818 -3882 -2648 772 2818 1137 -1846 -2695 -228 2783 3214 519 -2096 -1540 1714 4465
3064 4465 3617 245 -1849 -432 3025 4431 2638 -407 -1085 1216 3826 3825 916 -1666 -1179 1825
3080 1825 3903 2688 -692 -2403 -764 2152 3153 712 -2412 -3101 -526 2111 1870 -1230 -3690
3095 -3690 -3046 -188 1629 304 -2741 -4029 -2317 709 1492 -903 -3752 -4005 -1376 1394 1218 -1738
3111 -1738 -3831 -2736 244 2016 609 -2372 -3141 -991 2044 2883 474 -2167 -2212 677 3326 2917
3127 2917 -84 -1840 -541 2463 3876 2130 -859 -1577 689 3478 3930 1215 -1268 -1104 1708 3750
3143 3750 2835 -125 -1726 -504 2226 3270 1255 -1639 -2283 -162 2373 2204 -376 -2855 -2312 290
3159 290 2051 916 -2220 -3766 -2306 707 1589 -208 -3018 -3629 -1501 1014 808 -1672 -3684 -2724
3175 -2724 111 1796 587 -2376 -3494 -1833 1164 2236 299 -2324 -2462 35 2381 2096 -396
3190 -396 -2184 -1224 1611 3246 2158 -568 -1720 238 2908 3427 1321 -1128 -1112 1599 3798 3287
3206 3287 507 -1506 -736 1889 3448 1971 -710 -1733 195 2616 2694 230 -2229 -2024 340 2453
3222 2453 1738 -1140 -2921 -1938 522 1581 -263 -2734 -3343 -1341 1099 1080 -1238 -3542 -3132 -730
3238 -730 1097 306 -2229 -3450 -2010 640 1452 -131 -2667 -3162 -813 1660 1842 -360 -2315 -1689
3254 -1689 950 2668 1635 -960 -2077 -210 2578 3347 1600 -740 -1178 1012 3179 2926 755 -1005
3270 -1005 -164 2404 3680 2364 -467 -1535 291 2674 3252 1059 -1369 -1583 613 2458 1889 -808
3286 -808 -2521 -1423 1036 1959 461 -2074 -3013 -1325 799 1022 -1158 -3274 -3016 -717 1129 478
3302 478 -2100 -3617 -2511 -114 1060 -116 -2432 -3052 -1067 1061 1187 -912 -2815 -2072 358 2176
3318 2176 1415 -814 -2057 -755 1620 2723 1307 -901 -1157 1001 3172 2931 778 -1056 -342 1916
3334 1916 3396 2560 330 -1022 292 2598 3224 1374 -879 -1217 692 2568 2305 -19 -1684 -1168
3350 -1168 879 1920 665 -1591 -2641 -1308 1022 1467 -459 -2785 -2832 -1046 743 434 -1694 -3197
3366 -3197 -2327 -257 863 -496 -2669 -3274 -1571 882 1030 -740 -2461 -2402 -245 1537 1085 -1020
3382 -1020 -2100 -1007 1315 2423 1174 -886 -1407 387 2511 2721 726 -941 -418 1604 3239 2548
3398 2548 392 -1071 86 2272 3286 1690 -347 -742 741 2438 2289 268 -1421 -1012 1076 2222
3414 2222 1310 -1102 -2362 -1231 897 1633 -95 -2207 -2464 -815 824 625 -1483 -3027 -2369 -395
3430 -395 909 -232 -2336 -3045 -1628 471 826 -763 -2545 -2391 -467 1248 907 -889 -2321 -1512
3446 -1512 753 2026 876 -1102 -1571 136 2065 2349 769 -1060 -904 1162 2810 2318 384 -953
3462 -953 -3 1933 2862 1593 -496 -803 708 2544 2483 623 -1203 -1013 791 2236 1584 -593 -1867
3479 -1867 -820 1078 1706 124 -1819 -2197 -583 1109 900 -988 -2648 -2261 -256 977 27 -1835
3495 -1835 -2758 -1648 441 966 -416 -2313 -2491 -594 918 834 -1002 -2330 -1494 637 1666 638
3511 638 -1238 -1927 -540 1521 2098 520 -1222 -1250 665 2224 1812 66 -1126 -186 1758 2617 1455
3528 1455 -419 -1253 243 2122 2473 793 -917 -901 920 2356 1645 -288 -1453 -584 1187 1934 775
3545 775 -1151 -1754 -383 1352 1343 -689 -2128 -1765 42 1333 689 -1283 -2417 -1527 257 1044 -377
3562 -377 -2040 -2186 -716 984 794 -971 -2469 -1771 23 1222 618 -1190 -1953 -934 1015 1472 96
3579 96 -1520 -1439 387 2063 1553 -149 -1294 -571 1172 2124 1310 -521 -1105 80 2005 2294 717
3596 717 -837 -930 713 2167 1920 67 -1173 -392 1350 2193 1000 -982 -1517 -34 1705 1767 91
3613 91 -1482 -1425 127 1300 894 -860 -1997 -1000 697 1209 -186 -2042 -2245 -729 879 708 -822
3630 -822 -2122 -1897 -70 965 478 -1404 -2251 -1183 552 1231 -82 -1493 -1704 -176 1167 1040 -368
3647 -368 -1630 -1249 902 2009 1162 -558 -1224 -129 1553 2102 788 -748 -615 837 2131 2049 154
3664 154 -980 -400 1412 2264 1212 -449 -886 136 1677 1843 427 -1116 -1087 378 1643 1265 -626
3681 -626 -1756 -992 607 1280 233 -1616 -2030 -886 700 840 -599 -2120 -1991 -306 772 206 -1376
3698 -1376 -2242 -1313 246 804 -284 -1681 -2084 -572 1051 1042 -537 -1808 -1266 461 1437 883 -513
3715 -513 -1188 -173 1300 1836 781 -718 -888 703 2298 2048 363 -974 -301 1331 2231 1640 -38
3732 -38 -743 50 1776 1941 780 -888 -826 385 1629 1197 -401 -1406 -576 597 1350 521 -1319 -1961
3750 -1961 -916 666 943 -561 -1800 -1734 -406 646 154 -1272 -2190 -1453 -13 759 -128 -1664 -2055
3767 -2055 -791 809 867 -436 -1652 -1440 108 1239 751 -625 -1275 -570 997 1680 731 -606 -811
3784 -811 503 1824 1780 355 -659 -138 1151 2148 1551 52 -737 301 1621 1918 954 -510 -819
3801 -819 445 1589 1352 -142 -1309 -701 458 1274 662 -802 -1557 -715 668 724 -362 -1667 -1635 -348
3819 -348 776 475 -1077 -2143 -1499 -12 832 -88 -1483 -1886 -853 549 565 -456 -1543 -1444 -14
3836 -14 1065 789 -597 -1217 -408 877 1490 595 -796 -939 433 1490 1734 391 -767 -512 789
3853 789 1785 1376 -3 -616 139 1484 1810 650 -623 -792 326 1576 1483 1 -1023 -875 437
3870 437 1254 718 -846 -1360 -648 685 982 -67 -1484 -1450 -446 746 533 -761 -1803 -1213 192
3887 192 859 132 -1305 -1667 -805 463 733 -220 -1266 -1220 -84 912 740 -595 -1303 -734 658 1294
3905 1294 553 -760 -955 -42 1205 1390 165 -824 -653 754 1576 1112 -253 -994 -200 973 1685 848
3923 848 -602 -807 187 1283 1178 -57 -902 -675 577 1348 734 -641 -1120 -494 677 940 75 -1116
3941 -1116 -1306 -173 936 717 -361 -1441 -1200 105 775 272 -917 -1310 -519 651 870 -99 -1318
3958 -1318 -1340 -115 993 698 -454 -1346 -776 486 1093 485 -760 -1103 -248 963 1113 107 -867 -754
3976 -754 322 1262 958 -239 -1050 -498 824 1408 808 -613 -859 -80 1107 1347 148 -730 -598 649
3994 649 1237 802 -381 -1089 -437 839 1180 309 -838 -1092 -71 845 848 -265 -1141 -807 250 1045 463
4013 463 -693 -1255 -510 538 931 52 -1016 -1220 -262 851 665 -372 -1269 -904 221 948 316 -836
4031 -836 -1225 -461 585 844 29 -1112 -966 101 1090 852 -278 -1185 -615 590 1286 570 -390 -848
4049 -848 -104 979 1168 81 -824 -535 490 1309 1087 -216 -871 -370 756 1267 561 -592 -890 -80
4067 -80 874 1013 32 -794 -739 367 1032 617 -609 -1098 -712 576 873 27 -1062 -1274 -292 655 694 -327
4087 -327 -1210 -946 118 678 240 -842 -1215 -547 621 744 -28 -1071 -1144 -121 906 731 -253 -999
4105 -999 -606 428 1093 527 -504 -708 -22 946 1191 242 -760 -620 255 1250 946 -174 -684 -373 743
4124 743 1301 637 -537 -787 0 1009 928 171 -703 -686 175 944 733 -462 -943 -632 509 839 200
4143 200 -889 -1079 -375 645 538 -328 -1093 -944 -15 605 272 -724 -1324 -553 465 685 163 -786 -996
4162 -996 -190 590 656 -128 -960 -514 377 1016 535 -370 -950 -127 811 1173 283 -565 -553 335 1028 973 -57
4183 -57 -664 -428 657 1164 738 -289 -712 8 714 1001 82 -885 -850 162 872 657 -262 -859 -712 323
4203 323 641 148 -729 -1100 -417 413 447 -183 -1062 -908 -177 442 367 -630 -1101 -728 282 691 93 -737
4223 -737 -1006 -216 596 650 -5 -820 -654 251 932 490 -325 -651 -307 741 1069 477 -329 -670 220 1104
4243 1104 873 131 -558 -433 522 941 656 -316 -766 -131 784 1130 298 -575 -724 24 790 496 -274 -843
4263 -843 -690 189 763 151 -668 -959 -509 409 573 -170 -942 -992 -116 634 364 -455 -976 -713 137 725
4283 725 225 -630 -853 -235 579 637 -95 -853 -591 181 885 582 -298 -725 -343 605 907 539 -342 -577
4303 -577 8 711 974 81 -581 -440 411 1033 709 -307 -744 -200 623 999 365 -442 -740 -133 773 676
4323 676 -68 -829 -507 268 695 326 -571 -999 -360 357 631 -95 -857 -837 -219 528 383 -321 -812 -646
4343 -646 180 747 247 -551 -794 -194 528 723 -18 -690 -616 65 727 483 -266 -719 -514 396 839 318
4363 318 -455 -776 -14 737 811 59 -561 -355 384 855 602 -214 -614 -219 501 852 388 -425 -575 -38
4383 -38 682 580 -75 -720 -485 291 817 459 -492 -859 -418 407 660 101 -564 -723 -40 455 500 -247 -853
4404 -853 -693 122 657 250 -649 -836 -351 264 649 -22 -627 -702 -22 523 436 -193 -803 -525 267 751 298
4425 298 -482 -608 -141 606 808 121 -621 -566 155 882 465 -53 -547 -207 556 827 435 -233 -526 102
4445 102 745 872 71 -503 -392 297 922 609 -154 -643 -457 408 747 243 -539 -628 -4 717 562 -29
4465 -29 -823 -739 165 637 319 -428 -840 -500 211 539 -44 -843 -787 -224 411 278 -228 -840 -605 44 578
4486 578 197 -515 -784 -237 467 591 192 -557 -673 -9 666 624 -95 -635 -201 513 876 420 -291 -486
4506 -486 81 676 970 322 -368 -415 242 846 626 -55 -517 -252 598 837 298 -302 -632 -120 585 586 -39
4527 -39 -637 -725 37 629 280 -422 -943 -475 56 504 -60 -799 -767 -318 287 398 -352 -876 -737 17 538
4548 538 103 -428 -766 -458 344 506 217 -510 -558 63 590 611 53 -506 -369 403 734 535 -177 -404 -12
4569 -12 766 873 465 -249 -416 416 856 728 134 -402 -98 573 815 330 -266 -524 -90 665 555 66
4589 66 -564 -680 16 453 249 -412 -778 -484 66 358 -143 -713 -803 -319 258 311 -263 -907 -813 -135 246
4610 246 245 -520 -958 -503 170 429 92 -479 -694 -132 529 498 -126 -547 -459 288 821 594 -53 -470 -62
4631 -62 717 840 457 -149 -192 378 910 746 73 -282 -184 585 907 481 -72 -435 -45 379 658 199 -450
4652 -450 -496 93 537 233 -309 -650 -416 201 367 -37 -595 -815 -352 162 208 -102 -870 -785 -246 322 86
4673 86 -561 -811 -382 33 418 13 -533 -676 -89 447 476 -2 -538 -462 171 862 429 -226 -373 -81 568
4694 568 875 371 -190 -252 201 811 715 124 -252 -182 295 806 486 -117 -305 63 562 655 142 -493 -407 158
4716 158 574 418 -269 -576 -455 200 559 129 -548 -665 -352 210 247 -151 -660 -670 -63 369 57 -379 -873
4737 -873 -543 182 479 121 -528 -742 -259 268 429 -99 -562 -426 47 447 314 -53 -395 -250 380 658
4757 658 248 -255 -346 13 691 648 85 -163 -219 256 822 491 -134 -380 12 596 655 294 -316 -240 176 598
4779 598 509 -63 -578 -284 319 497 187 -388 -562 -167 223 272 -145 -514 -565 -58 339 252 -287 -740 -506
4800 -506 109 427 -14 -479 -687 -306 179 232 -157 -507 -612 -77 394 159 -348 -572 -336 258 661 235
4820 235 -161 -492 -24 588 601 59 -285 -271 238 559 486 60 -320 133 583 712 380 -128 -206 272 717
4841 717 648 146 -280 -179 331 602 392 -67 -374 -23 342 439 51 -423 -490 50 247 408 -213 -731 -433
4862 -433 48 191 -42 -620 -763 -354 202 283 -211 -678 -837 -128 184 123 -419 -735 -413 76 358 95 -494
4883 -494 -483 -161 284 426 -23 -374 -384 240 604 492 -61 -314 -75 440 625 446 -37 -161 249 647 698
4904 698 231 -109 -65 387 715 621 25 -346 -126 468 524 370 -399 -352 -34 365 418 -111 -493 -556 66 274
4926 274 -24 -554 -685 -373 220 152 -254 -707 -660 -161 193 237 -341 -678 -548 -25 326 52 -415 -510 -285
4947 -285 227 398 0 -411 -519 170 489 542 -45 -367 97 439 585 460 61 -159 51 599 683 405 -28
4968 -28 -82 483 714 494 77 -213 -54 366 586 205 -248 -276 -59 374 365 -82 -508 -377 92 211 38 -428
4990 -428 -591 -461 38 276 -209 -675 -757 -251 91 81 -260 -701 -536 -149 189 81 -420 -645 -240 105 338
5011 338 19 -399 -327 32 539 461 63 -271 -81 357 597 503 39 -228 76 534 656 120 -99 -168 398
5032 398 636 509 112 -230 -34 332 630 280 -57 -315 -45 366 331 -27 -408 -467 50 282 171 -356 -601
5053 -601 -314 41 171 -22 -472 -701 -283 48 25 -283 -586 -534 -59 221 103 -473 -632 -334 178 237 69
5074 69 -316 -428 -4 352 335 -107 -227 -199 369 415 335 -79 -68 44 509 549 289 -83 -136 151 603 524 66
5097 66 -224 -68 291 589 265 -129 -285 -74 398 324 28 -396 -324 57 316 108 -336 -492 -358 28 330
5118 330 -30 -364 -560 -278 102 5 -86 -421 -503 -157 277 -1 -244 -474 -252 44 238 84 -294 -408 -67
5139 -67 223 289 56 -240 -173 224 350 162 -137 -275 -106 331 383 124 -223 -279 42 391 456 27 -194 -143
5161 -143 276 358 447 -9 -337 -128 358 359 31 -160 -351 -15 438 149 -105 -336 -325 93 299 270 -263 -418
5183 -418 -127 78 227 -174 -339 -442 -58 265 85 -275 -423 -243 152 286 152 -391 -402 -51 274 337 4
5204 4 -433 -183 162 297 207 -163 -322 -120 181 353 37 -192 -321 19 312 189 -42 -246 -133 90 344
5225 344 264 -188 -250 -16 400 444 226 -234 -196 115 364 286 31 -262 -12 154 410 57 -178 -345 -124 239
5247 239 251 -99 -382 -406 16 132 124 -244 -392 -238 87 247 -34 -272 -313 -123 177 129 -38 -461 -431 -4
5269 -4 148 144 -60 -328 -343 30 323 36 -300 -279 -18 190 284 -13 -193 -272 178 500 275 -2 -135 -51 253
5292 253 477 60 -226 -200 145 426 266 89 -194 -32 163 472 211 -209 -313 -137 232 304 226 -285 -333
5313 -333 77 223 235 -184 -365 -221 21 214 57 -315 -330 -100 116 161 -146 -369 -447 -155 159 41 -131
5334 -131 -378 -190 -4 140 74 -351 -257 54 152 242 -2 -312 -297 120 366 235 -47 -227 -41 202 292 253
5356 253 24 -148 132 447 371 120 -100 -102 234 363 332 -25 -190 -31 187 358 81 -86 -254 37 282
5377 282 220 -127 -389 -314 58 87 105 -325 -456 -294 96 157 -138 -376 -441 39 69 31 -224 -379 -325 0 274
5400 274 122 -68 -318 -44 151 322 94 -281 -256 200 275 325 -13 -224 -1 271 405 194 -4 -226 107
5421 107 327 483 136 -49 -184 206 393 292 59 -234 40 198 456 92 -121 -261 2 263 176 -49
5441 -49 -287 -408 127 208 -59 -292 -446 -186 4 34 38 -365 -411 -87 107 72 -172 -426 -280 -64 216 104
5463 104 -226 -286 -122 254 94 6 -180 -390 18 384 235 -104 -123 24 231 407 225 -74 -184 98 343
5484 343 295 183 -27 -70 154 310 228 -23 -151 -51 261 365 210 -216 -474 -136 203 238 -11 -249 -282 -88
5506 -88 231 28 -142 -376 -323 111 47 12 -284 -255 -122 237 234 -25 -400 -257 93 173 150 -85 -336 -113 170
5529 170 224 126 -136 -211 -26 251 224 69 -146 -125 193 424 320 -73 -81 -7 233 269 -15 -148 -180 84 305
5552 305 211 -167 -244 -98 214 347 115 -248 -149 26 173 182 -10 -244 -352 -112 222 152 -238 -133 -81 100
5574 100 212 38 -213 -259 -41 206 196 50 -293 -212 12 220 158 -84 -115 -156 68 123 -16 -61 -110 -56 280
5597 280 197 -57 -278 -188 24 259 120 -120 -264 -163 187 158 15 -98 -242 -117 113 268 -43 -422 -276
5618 -276 -7 93 151 -76 -269 -47 111 204 131 -158 -233 108 107 204 -166 -132 -30 125 287 170 -202 -130 -51
5641 -51 180 185 -61 -156 -200 3 353 155 20 -245 -80 192 128 -126 -150 -216 -49 138 213 -150 -136 -164 -72 164
5665 164 64 -50 -254 -185 174 217 -9 -226 -294 40 190 74 -82 -363 -147 218 154 107 -255 -117 -163 258
5687 258 227 119 -88 -156 94 244 275 -38 -153 -182 150 266 234 67 -91 -88 281 402 66 -256 -95 156
5709 156 253 183 -66 -292 -193 -53 185 74 -153 -229 -56 142 42 -6 -349 -416 -111 137 4 -147 -212 -110
5731 -110 -125 134 -43 -196 -324 -15 72 233 13 -291 -165 117 188 208 -79 -154 -42 211 306 98 -82 -19
5753 -19 132 243 288 95 -127 -81 115 339 346 -69 -180 -121 287 117 10 -146 -57 123 315 125 -63 -264
5775 -264 -175 40 151 71 -99 -383 -89 158 173 -74 -307 -294 -33 161 1 -230 -348 -231 40 163 94 -226
5797 -226 -220 -105 140 134 -78 -176 -38 51 112 128 -18 -182 -101 91 319 189 -282 -146 98 195 291 34 -128 -125
5821 -125 128 389 174 50 -42 -43 122 181 129 -160 -280 116 167 225 -117 -244 -233 63 267 -22 -187 -277 -189
5844 -189 169 85 68 -196 -204 -42 111 85 -3 -178 -290 49 70 50 -91 -182 -24 47 264 7 -175 -38 157
5867 157 191 259 -102 -269 11 118 186 156 -121 -231 -62 36 260 -3 -157 -112 51 194 99 -84 -192 -130 -11
5890 -11 172 60 -142 -238 28 196 216 -53 -107 -186 -8 200 77 -142 -308 -122 64 179 -14 -165 -204 14
5912 14 186 155 -31 -211 -122 82 189 198 -57 -157 -81 147 169 24 -33 -71 -61 224 243 91 -178 -120 192 147
5936 147 114 -98 -154 -42 49 139 -45 -163 -45 -114 110 35 -49 -295 -197 77 171 145 -160 -123 -70 199 67 2
5960 2 -214 -135 106 87 76 -17 -138 -133 30 147 136 -65 -197 -1 174 118 -3 -68 -232 86 246 171 -27 -147
5984 -147 -101 58 217 -47 -12 -241 -153 135 80 65 -197 -175 -5 122 -26 -96 -84 -111 39 85 -20 -224 -183 -84
6008 -84 157 7 -94 -361 -184 5 47 11 -101 -157 -27 90 83 26 -203 -157 142 178 20 10 -182 37 281
6031 281 158 144 -11 -148 4 156 111 102 -123 -133 120 1 188 -147 -183 77 64 69 -13 -170 -119 -115 -40 29 -44
6056 -44 -301 -235 -156 62 37 -61 -215 -49 176 178 45 -106 -154 -30 158 92 -74 -148 -90 98 162 33 -45 -128 -39
6081 -39 134 106 49 -167 -85 8 132 204 87 -87 -27 156 173 112 -46 -77 87 120 160 45 -119 -227 69 216
6105 216 -39 -31 -62 -144 82 95 32 -159 -193 -114 114 15 -35 -285 -208 -25 20 -15 -188 -455 -98 74 87 -93 -195
6130 -195 -87 33 174 154 154 -114 15 22 215 211 -55 -71 21 85 294 107 2 -129 -27 174 209 -8 -126 22
6154 22 274 242 92 -93 -106 71 -15 102 -37 -107 -157 16 177 39 -16 -167 -86 -38 24 22 -284 -269 -214 53 37
6179 37 -130 -225 -210 115 120 -21 -34 -210 -162 123 -55 31 -101 -220 -72 176 241 -87 -174 -21 73 117 201 16
6203 16 -76 59 202 326 140 -133 -21 79 193 231 31 -206 143 60 246 28 -128 -122 35 93 196 -12
6225 -12 -38 -303 -79 139 7 -113 -241 -138 -75 -1 90 -79 -172 -99 -16 123 88 -169 -258 -15 79 73 -18 -225 -128
6250 -128 -15 64 -22 -33 -155 -51 64 187 119 41 -67 53 203 153 46 -53 -78 112 301 70 10 -14 45 80
6274 80 136 73 -100 -66 77 132 224 -40 -82 -53 -10 172 -42 -118 -123 49 182 105 -30 -237 -190 -30 104 -69 -127
6299 -127 -222 -50 -16 13 -72 -159 -64 -30 128 29 19 -132 -133 11 141 115 -230 -155 72 124 39 -49 -35 -195 28 192
6325 192 191 -4 -201 -61 83 144 104 -135 -68 -16 142 108 28 -196 -110 62 211 261 -34 -186 -3 70 122 32
6349 32 12 -223 10 41 113 -35 -178 -121 -75 108 57 -59 -135 -136 106 96 -13 -170 -53 -26 106 175 -115 -100 6
6374 6 103 276 141 -51 -115 -100 -33 219 48 -61 -120 59 4 254 10 -169 -9 -5 56 -13 -67 -147 -159 -8 7
6399 7 -44 -79 -139 -27 70 50 -117 -20 -82 61 103 138 -75 -85 17 93 118 0 -86 -48 145 205 93 -90 -172 -33
6425 -33 118 182 89 -196 -135 11 62 21 19 -241 -112 15 76 78 -19 -149 -81 57 199 15 -111 -193 -73 81 54
6450 54 -50 -13 -102 -11 56 -1 101 -167 -62 -6 128 38 -173 -229 -1 0 119 -68 -84 -25 55 49 125 -63 -96 -60
6476 -60 194 170 102 -64 -60 248 90 222 61 -12 -29 62 153 87 -39 -81 0 215 141 45 -165 -222 43 121 58 -125
6502 -125 -99 26 55 -36 -18 -56 -35 -83 78 66 15 -188 -112 -51 -37 54 -87 -159 -101 -16 46 -143 -84 -152 37 114 63
6529 63 130 -32 21 16 154 68 -72 -159 82 105 90 42 -136 -149 3 125 93 -16 62 95 123 162 45 -55 13 15
6555 15 63 25 -10 -40 -74 30 124 11 -109 -98 -111 -53 0 74 -194 -138 -196 41 -53 -125 -164 -110 -86 39 -40 -126 -177
6582 -177 -106 5 116 104 -192 -85 -138 171 156 1 -93 -104 50 97 205 103 -28 12 143 87 116 6 -81 56
6606 56 132 45 -55 -104 -41 -39 250 134 -128 -143 -31 109 86 46 -186 -144 -100 49 -96 -36 -110 -121 -19 -6 -75 -14
6632 -14 -224 -17 64 84 -60 -204 -238 11 55 108 -70 10 -138 39 60 25 -83 1 -122 116 156 -105 -66 -74 90
6657 90 157 76 24 88 118 63 142 216 -54 -82 14 125 115 -4 -154 49 85 19 62 -61 -88 -79 1 145 82 -64 -155
6684 -155 -37 112 74 -113 -99 -132 -15 46 42 -152 -221 18 -96 53 76 12 -144 -30 65 145 -135 -189 -128 65
6708 65 110 56 28 -90 30 70 112 -3 -25 -10 -76 63 97 -88 -73 -20 125 57 152 -111 -162 26 125 226 100
6733 100 -159 -26 93 192 80 -14 -135 -114 103 22 11 -217 -141 69 81 133 -39 -202 -90 -34 126 35 -39 -180
6757 -180 -84 144 165 -4 -7 -117 140 13 -18 0 -30 -168 79 145 82 8 -121 -20 60 7 -4 -43 -139 88 73
6782 73 43 66 -141 -73 64 28 51 -39 -102 -83 40 79 -8 -66 -98 -16 -33 8 -102 -132 -168 -1 -39 -66 -84 -25 5 91
6810 91 166 3 22 -56 -34 33 36 59 -73 12 47 120 -61 -123 -100 135 99 1 52 -154 -107 15 138 109 6 -96
6836 -96 -6 52 124 -23 3 -149 -62 -30 27 -9 -238 -86 44 35 154 8 -31 -87 24 -61 47 -77 -114 -124 153
6861 153 -27 -44 -127 31 94 142 19 -70 -158 7 28 79 27 -45 -78 53 52 31 64 -28 -42 64 45 33 -22 -74 30
6888 30 73 142 -27 -227 -151 42 139 -67 -43 -113 -63 -41 -29 -124 -160 -156 -114 29 -123 -9 33 -45 -15 -4 58 -58 -69
6915 -69 -144 116 2 62 -146 -21 -26 47 -88 82 -132 -100 143 17 159 84 -80 -32 -37 27 56 -169 77 -74
6939 -74 124 25 44 -104 8 3 103 -55 -93 -133 18 68 -5 -194 -64 -8 -70 20 -153 49 -73 -71 -48 -40 -67 -50
6965 -50 -150 -234 13 60 100 -182 -36 63 67 11 9 -131 13 -34 24 -32 -124 -33 -7 186 97 90 -35 26 97 42 52 -60
6993 -60 47 -9 89 181 118 44 -43 4 0 -2 52 -101 -81 -5 79 102 -38 -73 106 20 44 -58 -58 -236 14 71 -37 -235
7021 -235 -166 -128 -43 67 -47 -103 -141 -79 -37 20 -131 -196 -62 17 5 75 -20 -136 -36 45 113 145 -82 -37 -22 163
7047 163 65 41 -35 27 59 193 173 -19 -193 62 133 108 86 -69 -106 53 135 113 34 53 89 -173 28 7 -60 -53
7073 -53 -114 -68 -123 39 -94 -129 -139 42 -17 4 -133 -195 70 -43 -57 -156 5 -30 -1 108 -19 -273 -78 -110 5
7098 5 135 104 -31 -13 189 97 -7 48 -16 -1 170 153 158 92 69 34 100 37 14 52 -114 29 75 61 -82 -142 2
7125 2 69 107 63 -126 -82 60 -7 -50 -119 -95 -115 51 21 -97 -149 -77 12 26 43 -47 -124 -108 35 -88 45 -66 -151
7152 -151 -16 89 85 -11 1 -61 22 34 85 -25 -98 -37 37 56 13 -20 -55 19 125 113 -52 -97 -117 -30 -23 118 61 -71
7180 -71 -134 -65 101 -24 -3 -14 -171 119 72 108 5 -27 16 -43 64 -32 -11 -103 -37 47 -18 -26 -153 74 42 52 9
7207 9 -108 -51 -67 122 112 -68 -100 23 5 86 34 8 -133 29 94 47 89 -78 -69 -12 -100 69 -54 20 5 -46 96
7234 96 59 -102 17 86 72 129 -68 -108 -9 15 94 -126 21 -58 30 132 158 -90 -103 -13 118 33 -77 96 -72
7259 -72 72 -53 184 -8 16 -72 -37 23 -29 -48 -33 -126 95 138 32 -30 -44 -52 35 -16 63 -135 -110 -38 58 -124 -124
7286 -124 -60 -65 86 30 86 7 -95 -20 -3 104 -27 -102 -50 -116 -48 -51 -20 63 -114 -3 21 38 -103 -8 -37 -65 60
7313 60 -21 -141 -47 29 124 112 -22 -60 -52 40 169 -61 -56 97 39 67 111 9 -2 81 59 129 14 -15 -109 46 10
7340 10 77 21 -143 -42 55 -37 6 77 -70 -156 -199 -80 98 -43 -28 22 8 164 127 -87 -65 -31 -146 40 59
7365 59 -239 -75 -113 88 -23 -40 -90 -43 114 81 7 -27 -16 40 63 38 127 60 -87 136 69 108 -3 -97 -74 131
7391 131 31 2 -45 0 -114 37 -24 39 84 33 -27 -1 -13 -101 -79 -80 109 -137 43 -249 21 -41 -26 107 -125
7416 -125 -52 -19 -180 91 4 -15 -149 26 5 -29 32 40 -93 -39 74 126 -39 27 -57 -25 95 44 30 -6 10 99
7442 99 61 -17 23 43 131 88 9 -145 -71 -21 29 -21 9 89 -19 -86 -26 -32 36 -90 -21 13 -53 -79 -138 -93 -15 -51 -115
7471 -115 -32 -166 -91 -77 67 25 -70 -169 -41 -68 66 -1 -117 -56 9 -13 45 35 -125 -162 -10 54 -29 -57 76 -61
7497 -61 81 68 -106 28 17 126 106 125 15 53 40 57 134 12 -41 -3 14 -111 70 48 -17 -138 -3 109 -34
7522 -34 -69 -193 -91 -46 -85 -87 97 -52 -35 -29 60 -41 -149 -64 90 73 -22 -69 -125 -24 -21 100 -9 -60 18 163
7548 163 -51 4 -27 -155 21 89 131 -10 -15 -15 21 93 27 21 -8 -27 54 -81 196 114 79 -121 43 114 -25 36 -34
7575 -34 121 4 18 55 -92 -64 -37 -163 -84 23 -41 -46 34 -50 7 -63 -132 41 3 -60 81 -22 -17 -96 27 -45 -34
7602 -34 37 -39 41 -17 -18 -98 -58 40 63 68 73 -51 36 57 -18 55 -79 -107 13 -11 -65 -72 5 -21 8 68 91 45 -78 40
7632 40 -36 57 41 7 -96 33 -42 -110 -52 9 -57 -55 6 1 65 14 -58 3 -92 -55 -52 -15 -34 -41 92 -100 -57 -27 -49 -70
7662 -70 169 16 0 -6 -20 126 88 27 -74 56 17 65 48 -71 103 70 37 30 51 0 -53 68 -6 -59 -61 -78 -23 -33
7690 -33 124 -137 -31 -23 -6 69 59 -11 -7 -78 16 62 -45 -28 -119 -33 102 -48 -56 -20 -70 -20 84 -98 106 -52 -167
7717 -167 -91 20 69 -48 -19 -123 68 70 -69 133 -39 -15 14 -71 43 32 -64 -12 123 30 18 -146 -15 72 62
7742 62 -78 -154 -71 -19 78 -49 139 -75 11 -23 24 -77 -7 -152 -17 89 29 -16 -19 -48 -70 12 9 -5 -93 101 4
7769 4 109 67 51 8 20 22 33 48 37 -52 -106 136 53 88 50 116 -2 125 83 4 -17 23 20 -88 92 -140 8 24
7797 24 193 40 -119 -98 -127 -2 -66 72 -64 -172 -30 84 39 -11 -61 2 4 -17 -119 -53 -108 82 -31 -251
7821 -251 18 -30 8 17 7 10 -35 -48 25 101 83 14 164 109 -8 151 72 -69 30 64 -16 46 150 117 -13 -87 -12
7848 -12 -4 88 -15 168 122 -26 38 -4 -85 -199 49 -67 -60 -155 16 -46 -74 -74 -81 16 -37 65 -24 -54 -163 -4 69
7875 69 114 -129 24 82 -65 90 -37 68 38 -46 -17 27 66 123 34 -68 -40 75 -25 43 171 88 20 24 26 -69
7901 -69 20 2 0 -12 -96 102 39 -65 -72 -21 -45 -57 84 -88 -65 -21 -32 -119 -35 -96 -112 -110 -79 -8 20 -21 0 -44 -53 -205
7931 -205 71 -71 -1 -136 -95 -163 36 101 43 -13 -74 -38 12 44 55 95 -86 28 28 43 -4 26 21 0 97 -49 19
7958 19 -100 8 31 81 71 11 -7 105 21 -135 -9 49 4 11 -27 -93 23 7 -73 48 122 -16 -97 -57 -66 61 107
7985 107 -27 -23 -112 -53 -11 -47 -8 -1 -19 -20 39 69 -13 0 13 76 5 -10 -70 -67 46 8 -38 -92 105 66 102 117 -49 -12
8015 -12 -116 -23 -54 -71 -4 -114 48 -77 -8 55 -113 -27 4 58 38 -151 -129 -8 -16 -55 34 -115 -20 -80 -19 -11 34
8042 34 -40 -12 -34 30 -90 -94 -139 52 -1 15 4 56 19 124 62 3 26 95 44 -2 24 12 -25 46 -41 -11 92 44 68
8071 68 -19 12 -13 19 -25 -51 -23 9 66 43 -98 59 -20 39 -39 -16 -51 65 -25 -53 27 78 -28 9 77 66 -23 -20 -9
8100 -9 -12 59 95 -13 18 -10 142 -85 28 -72 6 -5 173 106 2 -67 56 15 -20 78 1 -104 -49 72 79 -20 19
8127 19 15 -69 -38 -7 6 -82 96 -87 8 -43 46 -21 -39 63 16 -35 -37 -61 12 -61 -52 2 -16 113 105 -82 -74 -43 19 30
8157 30 -4 -60 99 77 -55 -106 32 64 70 -101 58 -47 -89 66 46 96 -37 121 102 44 -30 121 4 1 78 -60
8183 -60 5 67 -46 51 -70 -55 -107 -30
8191c0
##END NTUPLES=NMR FID
##END=
