##TITLE=1H_LR-676-R2-C1A
 CDCl3, 8 sc, 
 28.6.2019
##JCAMPDX= 6.0         $$ Bruker NMR JCAMP-DX V2.0
##DATA TYPE= NMR FID
##DATA CLASS= NTUPLES
##ORIGIN= UXNMR, Bruker Analytische Messtechnik GmbH
##OWNER= root
$$ XWIN-NMR		Version 3.5
$$ Fri Jun 28 13:54:40 2019 Russian Standard Time (UT+4h)  she@DPX200
##.OBSERVE FREQUENCY= 200.13155
##.OBSERVE NUCLEUS= ^1H
##.DELAY= (6, 6)
##.ACQUISITION MODE= SIMULTANEOUS
##.ACQUISITION SCHEME= undefined
##.AVERAGES= 8
##.DIGITISER RES= 18
##SPECTROMETER/DATA SYSTEM= spect
##.PULSE SEQUENCE= zg30
##.SOLVENT NAME= CDCl3
##.SHIFT REFERENCE= (INTERNAL, CDCl3, 0, 15.7039)
##AUDIT TRAIL= $$ (NUMBER, WHEN, WHO, WHERE, WHAT)
$$ ##TITLE= Audit trail, XWIN-NMR		Version 3.5
$$ ##JCAMPDX= 5.01
$$ ##ORIGIN= Bruker BioSpin GmbH
$$ ##OWNER= she
$$ F:/spectra/data/she/nmr/H-F/1/audita.txt
$$ ##AUDIT TRAIL=  $$ (NUMBER, WHEN, WHO, WHERE, WHAT)
(   1,<2019-06-28 13:53:45.62 +0400>,<she>,<DPX200>,
      <created by zg, POWCHK disabled, PULCHK disabled
       configuration hash MD5:
       00 E9 B6 7A A2 85 ED C7 34 08 36 98 17 FE 4E 26
       data hash MD5: 16K
       E2 2E 2B CA FB 6B 5E 7E E4 5C A0 85 19 2F 60 1D>)
$$ ##END=
$$ 
$$ hash MD5
$$ F5 34 D5 62 D0 2B 6C BA 8A A1 C5 19 29 1B 00 F6
##$RELAX= 
##$RELAX= 
##$RELAX= 
##$RELAX= 
##$RELAX= 
##$RELAX= 
$$ Bruker specific parameters
$$ --------------------------
##$DU= <F:/spectra>
##$EXPNO= 1
##$NAME= <H-F>
##$PROCNO= 1
##$TYPE= <nmr>
##$USER= <she>
##$AMP= (0..31)
100 100 100 100 100 100 100 100 100 100 100 100 100 100 100 100 100 100 
100 100 100 100 100 100 100 100 100 100 100 100 100 100 
##$AQSEQ= 0
##$AQ_mod= 1
##$AUNM= <au_zg>
##$AUTOPOS= <>
##$BF1= 200.13
##$BF2= 200.13
##$BF3= 200.13
##$BF4= 200.13
##$BF5= 200.13
##$BF6= 200.13
##$BF7= 200.13
##$BF8= 200.13
##$BYTORDA= 1
##$CFDGTYP= 0
##$CFRGTYP= 5
##$CHEMSTR= <none>
##$CNST= (0..31)
1 1 145 1 1 1 1 1 1 1 1 1 1 1 1 1 1 1 1 1 1 1 1 1 1 1 1 1 1 1 1 1 
##$CPDPRG= <>
##$CPDPRG1= <>
##$CPDPRG2= <>
##$CPDPRG3= <>
##$CPDPRG4= <mlev>
##$CPDPRG5= <mlev>
##$CPDPRG6= <mlev>
##$CPDPRG7= <mlev>
##$CPDPRG8= <mlev>
##$CPDPRGB= <>
##$CPDPRGT= <>
##$D= (0..31)
0 1.2 0 0 0 0 0 0 0 0 0 0.03 0 0 0 0 0 0 0 0 0 0 0 0 0 0 0 0 0 0 0 0 
##$DATE= 1561715624
##$DBL= (0..7)
120 120 120 120 120 120 120 120 
##$DBP= (0..7)
150 150 150 150 150 150 150 150 
##$DBP07= 0
##$DBPNAM0= <>
##$DBPNAM1= <>
##$DBPNAM2= <>
##$DBPNAM3= <>
##$DBPNAM4= <>
##$DBPNAM5= <>
##$DBPNAM6= <>
##$DBPNAM7= <>
##$DBPOAL= (0..7)
0.5 0.5 0.5 0.5 0.5 0.5 0.5 0.5 
##$DBPOFFS= (0..7)
0 0 0 0 0 0 0 0 
##$DE= 6
##$DECBNUC= <off>
##$DECIM= 24
##$DECNUC= <off>
##$DECSTAT= 4
##$DIGMOD= 1
##$DIGTYP= 9
##$DL= (0..7)
0 120 120 120 120 120 120 120 
##$DP= (0..7)
150 150 150 150 150 150 150 150 
##$DP07= 0
##$DPNAME0= <>
##$DPNAME1= <>
##$DPNAME2= <>
##$DPNAME3= <>
##$DPNAME4= <>
##$DPNAME5= <>
##$DPNAME6= <>
##$DPNAME7= <>
##$DPOAL= (0..7)
0.5 0.5 0.5 0.5 0.5 0.5 0.5 0.5 
##$DPOFFS= (0..7)
0 0 0 0 0 0 0 0 
##$DQDMODE= 0
##$DR= 18
##$DS= 0
##$DSLIST= <SSSSSSSSSSSSSSS>
$$ [...]
##$SUBNAM2= <"">
##$SUBNAM3= <"">
##$SUBNAM4= <"">
##$SUBNAM5= <"">
##$SUBNAM6= <"">
##$SUBNAM7= <"">
##$SUBNAM8= <"">
##$SUBNAM9= <"">
##$SW= 24.9336996594482
##$SWIBOX= (0..15)
0 0 2 0 0 0 0 0 0 0 0 0 0 0 0 0 
##$SW_h= 4990.01996007984
##$TD= 16384
##$TD0= 1
##$TE= 0
##$TE2= 300
##$TE3= 300
##$TEG= 300
##$TL= (0..7)
0 120 120 120 120 120 120 120 
##$TP= (0..7)
150 150 150 150 150 150 150 150 
##$TP07= 0
##$TPNAME0= <>
##$TPNAME1= <>
##$TPNAME2= <>
##$TPNAME3= <>
##$TPNAME4= <>
##$TPNAME5= <>
##$TPNAME6= <>
##$TPNAME7= <>
##$TPOAL= (0..7)
0.5 0.5 0.5 0.5 0.5 0.5 0.5 0.5 
##$TPOFFS= (0..7)
0 0 0 0 0 0 0 0 
##$TUNHIN= 0
##$TUNHOUT= 0
##$TUNXOUT= 0
##$USERA1= <user>
##$USERA2= <user>
##$USERA3= <user>
##$USERA4= <user>
##$USERA5= <user>
##$V9= 5
##$VALIST= <valist>
##$VCLIST= <CCCCCCCCCCCCCCC>
##$VD= 0
##$VDLIST= <DDDDDDDDDDDDDDD>
##$VPLIST= <PPPPPPPPPPPPPPP>
##$VTLIST= <TTTTTTTTTTTTTTT>
##$WBST= 1024
##$WBSW= 4
##$XGAIN= (0..3)
0 0 0 0 
##$XL= 0
##$YL= 0
##$YMAX_a= 555753
##$YMIN_a= -726295
##$ZGOPTNS= <>
##$ZL1= 120
##$ZL2= 120
##$ZL3= 120
##$ZL4= 120
##$ABSF1= 10
##$ABSF2= 0
##$ABSG= 5
##$ABSL= 3
##$ALPHA= 0
##$AQORDER= 0
##$ASSFAC= 0
##$ASSFACI= 0
##$ASSFACX= 0
##$ASSWID= 0
##$AUNMP= <proc_1d>
##$AZFE= 0.1
##$AZFW= 0.1
##$BCFW= 1
##$BC_mod= 2
##$BYTORDP= 1
##$COROFFS= 0
##$CY= 11.3945322036743
##$DATMOD= 1
##$DC= 2
##$DFILT= <>
##$DTYPP= 0
##$F1P= 18.9103706918063
##$F2P= -1.10871071338519
##$FCOR= 0.5
##$FTSIZE= 0
##$FT_mod= 4
##$GAMMA= 1
##$GB= 0.15
##$INTBC= 1
##$INTSCL= 1
##$ISEN= 128
##$LB= 0.24
##$LEV0= 0
##$LPBIN= 0
##$MAXI= 10000
##$MC2= 0
##$MEAN= 0
##$ME_mod= 0
##$MI= 1.114404
##$NCOEF= 0
##$NC_proc= 0
##$NLEV= 6
##$NOISF1= 3.799351
##$NOISF2= 2.8
##$NSP= 1
##$NTH_PI= 0
##$NZP= 0
##$OFFSET= 15.70392
##$PC= 1
##$PHC0= -8502.703
##$PHC1= 19.60098
##$PH_mod= 1
##$PKNL= yes
##$PPARMOD= 0
##$PSCAL= 0
##$PSIGN= 0
##$REVERSE= no
##$SF= 200.130013532006
##$SI= 16384
##$SIGF1= 3
##$SIGF2= 2
##$SINO= 400
##$SIOLD= 16384
##$SREGLST= <1H.CDCl3>
##$SSB= 0
##$STSI= 0
##$STSR= 0
##$SW_p= 3612.71676300578
##$SYMM= 0
##$S_DEV= 0
##$TDeff= 0
##$TDoff= 0
##$TI= <>
##$TILT= no
##$TM1= 0
##$TM2= 0
##$TOPLEV= 0
##$USERP1= <user>
##$USERP2= <user>
##$USERP3= <user>
##$USERP4= <user>
##$USERP5= <user>
##$WDW= 1
##$XDIM= 8192
##$YMAX_p= 0
##$YMIN_p= 0
$$ End of Bruker specific parameters
$$ ---------------------------------
##NTUPLES= NMR FID
##VAR_NAME=  TIME,          FID/REAL,        FID/IMAG
##SYMBOL=    X,             R,               I
##VAR_TYPE=  INDEPENDENT,   DEPENDENT,       DEPENDENT
##VAR_FORM=  AFFN,          ASDF,            ASDF
##VAR_DIM=   8192,          8192,            8192
##UNITS=     SECONDS,       ARBITRARY UNITS, ARBITRARY UNITS
##FACTOR=    0.0002004,     1,               1
##FIRST=     0,             0,               0
##LAST=      1.6414764,     0,               0
##MIN=       0,             -726295,         0
##MAX=       1.6414764,     555753,          0
$$ Real data points
##PAGE= N=1
##DATA TABLE= (X++(R..R)), XYDATA
$$ [...]
252 168438 270633 145691 -44257 -95322 12764 167417 254255 206865 57689 -37851 41845
263 41845 191491 186649 10095 -103368 4770 199953 254449 128112 -43845 -127317 -74946
274 -74946 67196 160683 82134 -97785 -152449 -3929 145086 81870 -122572 -229570 -151201
285 -151201 -7905 60043 16662 -96326 -183576 -145938 -10981 42110 -91507 -259927 -233261
296 -233261 -26391 118798 53946 -117404 -214987 -176888 -60100 38296 30706 -76265 -147443
307 -147443 -60040 101180 128065 -25097 -166937 -124768 43193 155692 130029 25925 -49589
318 -49589 -22248 95160 181556 116768 -42895 -95735 47138 227131 242629 98622 -31646
329 -31646 -32645 60565 144606 142133 52899 -29556 7889 144745 208331 90104 -92228 -133860
341 -133860 -5768 128210 132183 27761 -73801 -89253 -12235 73505 52485 -87839 -196879
352 -196879 -132565 38656 109628 4157 -142820 -176559 -99042 -17449 -9816 -75961 -151916
363 -151916 -146760 -33551 76503 39007 -126699 -231751 -153074 10547 79595 13615 -81187
374 -81187 -101164 -37396 47065 66849 -12639 -113685 -103312 41009 168598 136794 -3330
385 -3330 -79375 -16443 93075 129141 70564 -11181 -26128 59138 176231 196640 74998 -67060
397 -67060 -70442 62201 170690 141786 34496 -21440 22171 101976 124679 49338 -66019
408 -66019 -102701 -5119 130165 146205 19609 -106973 -103274 -3212 60049 18117 -77402
419 -77402 -126857 -78089 29065 82675 4752 -139435 -195134 -102255 24278 37569 -58711
430 -58711 -134089 -104521 -14198 35778 -8542 -110651 -172375 -115040 24242 104424 38853 -89917
442 -89917 -127242 -39382 57798 55056 -26789 -82858 -46407 55733 133205 105942 -8886 -93516
454 -93516 -47542 81198 146193 81359 -16817 -22298 67110 144301 122180 22646 -59961 -42935
466 -42935 66005 163692 144634 27858 -55715 -16917 81864 109290 30729 -60624 -62275 27238
478 27238 114932 107252 1166 -107246 -110804 -10605 74699 44302 -60607 -111223 -51500 39893
490 39893 52634 -31732 -131848 -151175 -68486 37542 58634 -28050 -123764 -117701 -23734 37291
502 37291 -9966 -105277 -133805 -58320 46956 82246 14576 -90038 -125755 -52108 52422
513 52422 73605 -3684 -73156 -40186 59491 109749 55779 -41824 -81661 -23390 81194 134960
525 134960 86283 -9627 -42130 27949 113108 104555 9479 -57365 -14954 90478 149165 104260
537 104260 1761 -60520 -26965 61765 104173 48889 -39206 -50823 30318 105109 78152 -29032
549 -29032 -107585 -84146 10761 78809 53208 -38280 -98476 -62486 20605 43444 -32374 -121461
561 -121461 -120282 -26646 58297 47761 -42229 -121062 -113721 -34009 30365 8324 -71536 -107804
573 -107804 -46223 47687 64771 -16357 -106064 -110815 -27504 61203 74288 8055 -60209 -49944
585 -49944 30307 86843 47541 -43287 -74102 -1266 99668 125878 59114 -24749 -43594 15657
597 15657 87569 93823 26849 -34614 -8779 84430 136749 80424 -26925 -73098 -17255 73170
609 73170 105701 53423 -22843 -43406 12116 74385 59449 -30620 -98701 -64305 37581 93428
621 93428 44574 -54359 -103218 -64034 10511 35931 -17083 -90430 -97247 -20733 55582 39323
633 39323 -57765 -132584 -106526 -14564 43595 15407 -58151 -91534 -45990 29093 45675 -22268
645 -22268 -102523 -98750 -5472 81920 76209 -6075 -71380 -53935 21290 70904 43498 -25951
657 -25951 -52445 7244 97156 116716 39715 -49860 -55715 24490 100174 95250 27208 -23229
669 -23229 -307 69811 106291 57919 -32316 -66667 -1936 93976 116208 43196 -42422 -53833
681 -53833 7860 63425 47649 -24758 -73619 -41642 40976 82209 27453 -71853 -112070 -55431
693 -55431 28014 43703 -19766 -85649 -79663 -10858 41340 14679 -69979 -124961 -88753 4149
705 4149 57317 19026 -62847 -95155 -45614 22379 29946 -29024 -83198 -63828 17796 79600
717 79600 56660 -26955 -81578 -48654 34625 79749 43967 -21647 -36887 19136 84483 86092
729 86092 18438 -46048 -37302 38463 102577 90795 20475 -27528 -1823 61908 84650 35938
741 35938 -31079 -40379 22067 91309 92962 21720 -51669 -55954 5772 59638 44447 -19799 -57291
754 -57291 -25482 36566 53221 -636 -72707 -90747 -37585 29764 41056 -13946 -73700 -72910
766 -72910 -16406 25908 557 -67000 -99261 -55435 18943 48261 5797 -62405 -87534 -46976
778 -46976 13453 29546 -11456 -56328 -45569 14884 57376 32350 -33859 -67968 -32783 35814
790 35814 71367 43062 -12323 -32365 6233 61074 67810 14846 -37200 -25645 41542 93718
802 93718 78791 16921 -26995 -13546 36927 67028 43327 -6273 -21575 20810 74692 72431
814 72431 8331 -53711 -49848 10994 63576 55092 -2024 -47609 -36858 14415 42491 7879
826 7879 -55761 -75526 -27264 34677 41738 -11461 -68213 -72285 -26992 15861 8708 -42662 -79540
839 -79540 -53201 15056 47203 2349 -72163 -96003 -46170 21422 41272 2160 -47505 -52929
851 -52929 -7640 38230 30410 -27140 -65837 -32585 42717 78192 40153 -24659 -45553 -5177
863 -5177 50825 64711 23853 -26548 -24624 36551 92657 77562 2411 -49040 -22452 47576
875 47576 83318 53333 -1459 -21924 11373 59215 63227 8750 -49778 -43668 25857 81925
887 81925 59153 -16224 -63100 -38913 20183 47178 12742 -46987 -68257 -23320 40435 47745
899 47745 -16176 -84053 -80535 -15724 31767 13290 -43340 -71295 -41858 12706 32156 -11701
911 -11701 -78589 -94188 -32035 45036 53825 -10265 -70802 -63070 -4305 37861 23107 -26494
923 -26494 -53299 -22025 41391 69911 27050 -41505 -54816 3136 65385 64198 9298 -29966
935 -29966 -10906 45259 80136 55561 -8830 -46748 -13757 59945 93868 51914 -13859 -28520
947 -28520 15146 57983 48726 51 -34732 -17357 38790 73940 44635 -27083 -66714 -31884
959 -31884 33691 52166 6024 -48412 -51880 -6522 34601 26174 -27993 -76851 -68210 -8420 37188
972 37188 16724 -44165 -72455 -38616 9835 14781 -27828 -69991 -64471 -11962 38797 35519 -22307
985 -22307 -74519 -62586 -333 41869 21693 -28128 -44688 -10231 36681 48006 12252 -34645
997 -34645 -41035 5008 59283 62691 14117 -25677 -8087 43329 66288 35279 -13642 -27625
1009 -27625 9340 63615 82179 43776 -15750 -33906 6024 53878 53232 9347 -22533 -6496
1021 -6496 35309 52586 24001 -27076 -51543 -22322 31250 49675 9331 -45643 -53003 -9191
1033 -9191 29880 17019 -33558 -67984 -52576 -3342 31274 14569 -37872 -70830 -48607 72
1045 72 15553 -18815 -57092 -50334 -4184 30907 18159 -30862 -67920 -53143 2935 45975 30676
1058 30676 -21320 -47604 -16705 32825 42981 6940 -31401 -28664 13867 55675 56558 15710
1070 15710 -24500 -16868 30414 62035 39221 -8109 -20979 16612 62773 68004 25883 -22935
1082 -22935 -32033 7461 55290 59828 15606 -25914 -17391 26839 47641 17799 -28914 -42845
1094 -42845 -11102 31939 42083 6361 -41679 -52835 -14660 26487 19159 -30512 -63946 -41558
1106 -41558 10064 33471 4142 -47099 -70179 -44437 3728 24265 -3726 -46539 -50743 -9604
1118 -9604 25812 10709 -36751 -60621 -33445 17298 43416 21341 -24874 -48242 -21001 29524
1130 29524 46400 10652 -32915 -28992 19968 58041 46296 1979 -27511 -13960 27262 54378
1142 54378 39744 -978 -18809 11577 55979 57636 11111 -32085 -24914 22674 60196 52295
1154 52295 8953 -27315 -22293 16558 43490 23648 -22422 -38566 -3649 39037 38027 -6763
1166 -6763 -46431 -43671 -6798 25185 18903 -20772 -51753 -37307 8555 30704 -1309 -53095
1178 -53095 -66811 -27921 18206 25698 -8121 -44628 -48423 -15938 16846 11312 -27817 -53544
1190 -53544 -28467 22240 42004 8958 -37258 -46453 -12418 28577 37229 8628 -24702 -24258 14784
1203 14784 50659 40382 -7320 -36307 -12685 36927 58362 34845 -4120 -15861 7558 40547
1215 40547 45163 13229 -21712 -16505 28815 63021 45644 -5463 -34647 -15580 25034 42930
1227 42930 22174 -14283 -28496 -4731 30652 34590 -4126 -46059 -42503 1210 32934 18026
1239 18026 -23571 -45941 -28592 5509 17827 -7080 -46193 -56606 -21868 23246 27715 -14394
1251 -14394 -56091 -52126 -11958 17213 7838 -24322 -41507 -23095 13783 29543 3661 -38564
1263 -38564 -47969 -9469 35963 39640 3195 -29089 -20533 16203 40811 28125 -6464 -26728
1275 -26728 -6551 37714 59265 33320 -10580 -22683 8178 43266 44013 12116 -13121 -4315
1287 -4315 29371 52923 37487 -6049 -33300 -13982 30966 50303 22407 -18441 -27595 184
1299 184 28223 23838 -9468 -38852 -33639 3160 31899 19531 -24370 -51970 -33787 4699 16948
1312 16948 -10393 -43315 -44905 -13591 17349 14608 -21636 -56281 -50913 -9620 23619 13338
1324 13338 -26166 -44879 -22349 13073 22218 -3711 -34475 -36433 -3494 33571 37467 3846
1336 3846 -29512 -22827 16088 42412 27236 -8396 -20115 5190 41857 52252 25622 -12206
1348 -12206 -21631 7955 45503 49061 16115 -12913 -4121 29035 45521 25778 -10038 -25329
1360 -25329 -4199 32593 46308 19835 -20801 -32553 -4193 27464 23346 -11955 -37565 -26073
1372 -26073 7874 25980 8310 -29172 -50446 -32692 3798 18493 -6665 -41105 -43836 -12361
1384 -12361 14996 6927 -27882 -51613 -39451 -2343 22836 11972 -24606 -44688 -24490 12894
1396 12894 23200 -3187 -32684 -28557 6100 34902 29961 -2143 -28071 -20296 15676 41518
1408 41518 30283 -3340 -17911 6238 39987 44528 15647 -14932 -15161 15503 46366 45882 15296
1421 15296 -14165 -9644 23039 43114 24711 -10022 -21343 2780 33812 38043 10131 -22731
1433 -22731 -29482 -4675 24819 23546 -7615 -34812 -24978 7677 23755 2221 -33357 -45784
1445 -45784 -24986 7516 17714 -4791 -36723 -43423 -16669 11364 6491 -26359 -47643 -30942
1457 -30942 5367 22360 4587 -27958 -42249 -23317 10238 23478 2975 -26538 -27393 4448
1469 4448 32533 24642 -8914 -29581 -14150 20390 40460 28353 -2613 -18037 711 32997
1481 32997 41594 15065 -15123 -12392 20811 47516 39651 7630 -16101 -8711 20272 39810 27187
1494 27187 -4902 -19571 1679 33445 36175 4416 -27555 -26563 2803 28047 23182 -5838 -30704
1507 -30704 -24906 3900 21028 2816 -31878 -42853 -17086 15818 18522 -10145 -39582 -41227
1519 -41227 -15568 10010 7902 -20230 -42023 -29811 5046 21754 -162 -35326 -43694 -16481
1531 -16481 15799 22206 -819 -26214 -26193 445 26040 20967 -10503 -30177 -12330 25342 41574
1544 41574 20848 -10707 -19349 2240 30448 36749 14264 -11553 -9264 21840 47414 36096
1556 36096 -390 -21030 -5074 28329 41867 24609 -4026 -13675 3851 28855 31301 3958
1568 3958 -24636 -21215 11079 34294 21942 -12182 -31668 -19653 6725 18507 1962 -26407
1580 -26407 -35485 -14039 15187 15936 -14980 -43699 -38936 -8570 12310 3476 -22729 -37665 -25010
1593 -25010 1370 13059 -5268 -35343 -41009 -13616 19051 20897 -6792 -30745 -25387 1726
1605 1726 20647 13690 -10147 -23085 -7001 23925 37005 16255 -15197 -20558 5725 33989
1617 33989 34392 12109 -7099 -2438 21135 38631 29335 819 -16030 29 31600 43663 22516
1630 22516 -6782 -12710 6521 27694 25851 3362 -17070 -13675 10962 29686 18517 -13086
1642 -13086 -31772 -18097 9306 17395 -546 -24589 -29068 -10903 9223 8519 -16048 -39801 -36928
1655 -36928 -8315 13927 5257 -23396 -38128 -24363 -449 6864 -8994 -29617 -31518 -9796
1667 -9796 15481 17047 -7808 -31747 -26689 2668 23556 15215 -8671 -19173 -4546 20271 29004
1680 29004 13576 -10778 -16161 5880 33554 36126 11971 -9237 -3430 21240 36028 24448
1692 24448 321 -10240 3556 29440 39459 21592 -7427 -16730 2781 27764 27716 3863 -15481
1705 -15481 -10685 11350 24129 12450 -14177 -28822 -17002 9714 20692 2660 -25154 -31798
1717 -31798 -11563 9454 6301 -17607 -35429 -29093 -4754 12604 4030 -22388 -38484 -26662
1729 -26662 969 12014 -4824 -28384 -29161 -5951 15140 11940 -10562 -29129 -22410 4309 24138
1742 24138 16881 -8746 -21813 -6024 21070 28129 8805 -13571 -13150 9627 32633 32043 10151
1755 10151 -10679 -7662 16297 34454 24860 -581 -10702 6463 30709 33594 11736 -12231
1767 -12231 -14506 6049 28464 28233 4998 -17146 -14152 9517 24089 10961 -15192 -25411 -9631
1780 -9631 13265 17830 -859 -23731 -28650 -10209 10506 9021 -14931 -34153 -24751 1605 15158
1793 15158 486 -25820 -36061 -20654 3133 11940 -2459 -23986 -27271 -7650 12881 9488
1805 9488 -14315 -29473 -16915 9950 23337 11077 -12556 -22041 -7451 16791 25211 8586
1817 8586 -13066 -13486 10218 31133 25819 1721 -14166 -4922 18021 31185 21447 544 -9227
1830 -9227 4393 26202 29865 9214 -13109 -11679 11685 30858 25097 1236 -15934 -9791 10115
1843 10115 22040 11575 -11590 -21610 -6250 15987 18853 -2044 -24688 -24935 -5304 11716
1855 11716 7900 -12065 -26809 -20575 76 11037 -1924 -26366 -34611 -16130 8860 13023 -5871
1868 -5871 -26891 -27252 -8727 8607 6502 -11815 -24842 -15940 7322 19400 6241 -16833 -22842
1881 -22842 -4868 17446 21012 4899 -12418 -10977 8757 26767 22846 333 -15281 -5818 19675
1894 19675 32744 20475 -970 -8081 5785 23257 25035 8745 -7909 -6201 14193 30734
1906 30734 23871 -1262 -17619 -9005 13864 24314 11671 -9383 -16789 -4144 13324 15551 -2293
1919 -2293 -22253 -22889 -2985 14210 8431 -13343 -26970 -18564 430 7685 -4821 -24287 -29722
1932 -29722 -13659 7327 11163 -7708 -28554 -28514 -7870 10002 5911 -12552 -23100 -13426 6066
1945 6066 15140 3430 -16365 -22054 -4963 17959 21530 3748 -13310 -10314 9684 24123 17573
1958 17573 -1126 -11617 -1201 20531 31311 19641 -2886 -11202 4079 24132 26000 9131
1970 9131 -6564 -3440 13996 25978 18560 -2159 -14876 -6228 14974 24834 10545 -11668 -17929
1983 -17929 -3154 14574 13705 -4557 -21462 -19568 -1957 12698 8682 -12577 -26940 -19524 114
1996 114 8732 -4769 -23133 -24996 -8449 8094 6967 -11109 -28035 -25347 -4967 12351 8725
2009 8725 -11594 -23893 -13680 6405 13999 1826 -14891 -16887 -1081 16720 18735 2671 -13487
2022 -13487 -11213 9010 23944 17046 -2953 -11667 922 21002 27040 13557 -5248 -10635 3953
2035 3953 22338 25426 9044 -7741 -5639 12339 23415 14637 -5159 -13731 -2580 15237 21743
2048 21743 8310 -11433 -18056 -3860 13888 14335 -4268 -20433 -16179 2701 13837 5059 -14025
2061 -14025 -24467 -16240 1809 9818 -648 -18794 -22976 -8326 8242 6518 -11815 -25286 -19042
2074 -19042 466 12493 6392 -11627 -22366 -13610 6103 14625 2799 -15009 -16849 -9 16820
2087 16820 15724 -1213 -13935 -9672 7345 19727 14439 -2185 -11334 -486 18171 23844 8735
2100 8735 -9835 -10840 6731 23329 22049 5975 -8566 -6659 8800 20462 14473 -3452 -12060
2113 -12060 -1400 16361 19911 4597 -12698 -14590 -129 14439 13460 -2239 -16687 -13945 2916
2126 2916 14505 5821 -13948 -23056 -11599 6651 11520 -1415 -17312 -19715 -7486 6464 5874
2139 5874 -9109 -21956 -16916 2315 13198 4124 -15012 -22552 -10852 6503 12044 1118 -13338
2152 -13338 -15676 -1460 13741 13265 -3818 -16960 -10214 8806 19973 11749 -4695 -10970 -962
2165 -962 14603 18488 7108 -7901 -8783 7139 23371 20639 1781 -11375 -5853 11615 21041
2178 21041 13443 -1882 -8949 -452 14772 18944 5199 -11872 -13278 2577 16808 13318 -3768
2191 -3768 -15230 -10111 4216 11854 3890 -12608 -19775 -9594 7586 12817 -2077 -19381 -21187
2204 -21187 -6081 6834 4472 -9586 -19098 -14005 717 8979 1433 -15774 -22743 -10440 8166
2217 8166 12124 -1122 -15958 -15219 -474 11332 9156 -4056 -14174 -8377 8854 19161 11097
2230 11097 -6122 -12435 -94 16071 17967 5316 -6420 -4358 9293 20999 17635 1699 -10470
2243 -10470 -4771 13226 22624 13616 -3211 -8526 1918 15249 15620 2943 -9846 -9786 3524 16190
2257 16190 13237 -3763 -16687 -11297 4731 11276 1507 -13106 -16894 -6660 6077 7645 -4673
2270 -4673 -19472 -20577 -6404 7447 5228 -10311 -20577 -13939 1000 7034 -1694 -15040 -18665
2283 -18665 -8220 7065 11072 -675 -15303 -14859 558 13187 9253 -5204 -12236 -4326 10025
2296 10025 17389 9577 -4904 -10898 -251 15593 19597 7605 -5697 -4234 10171 19770 14756
2309 14756 242 -7628 -1208 13524 21137 12851 -3359 -10235 269 14799 15924 2033 -10366
2322 -10366 -8543 4241 13742 9162 -5111 -15590 -11063 3298 10697 2288 -13624 -18352 -6789
2335 -6789 6598 6143 -6840 -19113 -17915 -4467 6858 4463 -9242 -20005 -14295 1052 8263
2348 8263 -1410 -14828 -16839 -4965 8785 9748 -1944 -14131 -13510 333 13122 11235 -3156
2361 -3156 -11735 -3992 11324 16683 7038 -6102 -8514 2613 16488 18303 6879 -5781 -5526 8573
2375 8573 19188 14559 -413 -7901 -104 13990 18727 8894 -5001 -9452 169 13692 14794 1697
2389 1697 -11068 -9380 4594 13652 6767 -8338 -15718 -9041 4366 9786 1786 -12460 -17252 -7589
2403 -7589 5626 5797 -7503 -18819 -15211 -920 7960 2935 -11466 -19179 -12839 1443 8223 799
2417 799 -13356 -16045 -3943 8992 8418 -4159 -14256 -10262 3492 12925 9207 -3582 -10981 -4116
2431 -4116 10607 16362 6875 -6817 -7931 4937 17289 16164 4335 -6467 -4089 8169 17759
2444 17759 13457 -120 -7244 586 14370 17550 5880 -7475 -8840 2408 13664 13370 1632
2457 1632 -9804 -8694 3209 12055 5844 -8263 -14981 -6578 6660 9595 -1179 -13928 -15889
2470 -15889 -6078 4698 4503 -6579 -17147 -14152 -560 7604 888 -12671 -18537 -9902 2816
2483 2816 6959 -849 -12166 -14308 -4201 7562 7669 -4205 -14046 -9293 4973 13398 7863 -4660
2497 -4660 -9797 -2445 9389 14211 6804 -4825 -5974 5535 17150 15289 2621 -7249 -3006 9668
2511 9668 17345 12439 633 -5051 793 12128 15494 5974 -6443 -7344 3972 14629 12099 -927
2525 -927 -10442 -7343 3670 9804 4978 -7149 -13593 -6747 5321 8506 -1693 -14778 -15925 -5131
2539 -5131 4652 2798 -7821 -15932 -13093 -2107 4672 -97 -13069 -18596 -10008 3998 7560 -2234
2553 -2234 -13466 -13633 -3192 6510 6062 -3168 -10978 -7386 4991 13189 7750 -4903 -9689 -801
2567 -801 11881 15170 6177 -3620 -3455 6302 15546 14773 4021 -5450 -1767 10933 18662 12090 -643
2582 -643 -5501 2436 12140 13588 4925 -5014 -5920 3290 12616 11277 -1659 -11949 -8261 3766 9591
2597 9591 2634 -9001 -13189 -6042 3845 5458 -3896 -15273 -16334 -5499 4585 3519 -8442 -17359
2611 -17359 -13060 -1706 3625 -2062 -11895 -15380 -7684 3864 6712 -1879 -13040 -13253 -1946 8889
2625 8889 7162 -3374 -9971 -4711 6380 12439 7234 -3344 -6940 457 12507 15626 6932 -3398
2639 -3398 -2889 7823 16121 12857 2119 -4442 118 11184 17271 11378 -742 -6488 664 12010
2653 12010 13476 3935 -6181 -5603 4271 10638 6820 -3856 -11635 -7734 3064 8586 1715 -10544
2667 -10544 -14539 -6862 3613 4119 -6009 -15322 -14142 -4005 3406 1305 -8952 -16481 -12467 -753
2681 -753 4680 -1430 -12099 -14081 -5167 5069 5965 -2852 -11242 -10171 -83 9570 8370 -2109
2695 -2109 -8914 -3962 7601 12929 6511 -3460 -5341 3076 12964 14207 5898 -3111 -2754 6710 15072
2710 15072 12652 2041 -4127 880 11495 14889 7417 -2982 -5639 1450 11293 11990 2892 -7170
2724 -7170 -6926 2418 9317 5863 -5234 -10860 -6374 3615 6601 -233 -10174 -13403 -6143 2840 3542
2739 3542 -5481 -14482 -13037 -2607 4869 842 -9350 -15132 -10266 242 4604 -223 -9448 -12261
2753 -12261 -4395 4732 5444 -2895 -10833 -8037 2779 10067 6688 -3244 -8347 -3435 6920 11917
2767 11917 6590 -2893 -5185 2383 12326 12691 3655 -4123 -2145 7106 13578 10534 1550 -3906 30
2782 30 9869 13795 6530 -4188 -6125 2121 11455 10869 1408 -6771 -6088 2286 8092 4983 -4360 -10228
2798 -10228 -5284 4086 7036 -665 -10541 -12399 -4279 4101 3584 -5102 -12498 -10924 -2247 4315 363
2813 363 -9331 -14401 -8854 1825 5556 -1235 -10427 -11922 -3959 4099 4676 -2915 -9351 -7596 1943
2828 1943 8603 5405 -4182 -8484 -2629 7489 10985 4662 -3650 -4802 3037 11094 11308 2910 -4477
2843 -4477 -2926 6748 13710 10387 927 -3988 1201 9395 11703 5077 -3142 -4059 3675 11444 10384
2858 10384 937 -7356 -5643 3574 9618 5419 -4247 -8692 -4360 3921 5839 -720 -9488 -10825 -3609
2873 -3609 4637 3265 -5574 -13102 -10204 -1226 3645 -779 -9912 -13124 -7758 1277 4260 -1973 -10764
2888 -10764 -11957 -4288 4099 3862 -3901 -9719 -6384 2679 7251 3540 -5021 -8095 -2327 7358 10519
2903 10519 4453 -3924 -4747 3242 11055 9738 2073 -3632 -545 8197 13440 9614 737 -3454 1447
2918 1447 10058 12373 5392 -2859 -2840 4404 10830 8667 106 -6311 -3940 4224 8998 4610 -4755
2933 -4755 -8718 -3688 4382 5552 -1737 -9785 -10015 -3160 3606 2268 -6047 -12057 -10286 -2082 2622
2948 2622 -1724 -10151 -12492 -6414 1989 3076 -4072 -11087 -11129 -3118 4422 3762 -3383 -9257 -6331 2208
2964 2208 7145 3117 -4454 -6658 -87 7885 9695 3307 -3739 -3517 4393 11598 10182 2523 -3449
2979 -3449 -114 8630 12960 8565 256 -3054 2105 9704 11581 4847 -2499 -2685 4091 10161 7296
2994 7296 -1078 -6423 -3491 4719 8472 3194 -5348 -8923 -4141 3380 4847 -2314 -9624 -9211 -2452
3009 -2452 3305 1102 -6896 -12025 -8618 -938 2811 -1698 -9160 -11644 -6051 1765 2999 -3941 -10452
3024 -10452 -9334 -1664 5024 3459 -3957 -8842 -5106 3004 6951 3142 -3884 -5971 166 7782 9037
3039 9037 2819 -3631 -2728 4612 10741 8924 1371 -2708 558 8578 11893 6655 -1013 -3082 2560
3054 2560 10052 10825 3733 -3172 -3119 3319 8574 6576 -701 -5570 -2327 4450 7376 1849 -6181 -8271
3070 -8271 -2731 4151 4394 -2400 -9262 -8439 -1883 3451 1237 -6531 -11167 -7421 128 2916 -1486
3085 -1486 -8505 -10225 -4608 2082 2223 -3884 -9536 -8143 -277 5160 3064 -4636 -8831 -4759 2866
3100 2866 6484 2575 -3872 -5347 355 6928 7472 1557 -4165 -2824 4063 9939 7826 657 -3605
3115 -3605 37 7631 10350 5595 -1294 -2854 2674 9180 9485 3204 -3342 -2702 3614 8578 6163
3130 6163 -1044 -4974 -1496 4674 6536 2124 -5138 -6973 -1494 4595 4847 -2072 -8044 -6931 -789
3145 -789 3804 892 -5914 -9778 -5958 937 3695 -1200 -8310 -9343 -4442 1882 2136 -3672 -8413
3160 -8413 -7038 -350 4150 1746 -5111 -8739 -4482 2981 5788 1743 -4944 -6063 -406 5953 6375
3175 6375 385 -4070 -2854 4028 8793 6647 116 -3544 49 7546 9580 4784 -1556 -2354 3416
3190 3416 9264 8785 2567 -3053 -2253 4380 8507 6667 -334 -4265 -1133 5221 7028 1938 -4398
3205 -4398 -5682 -246 5184 4754 -1966 -7428 -6429 -233 3909 769 -5807 -9199 -5474 896 2407
3220 2407 -2142 -8353 -9694 -3959 1603 1565 -4008 -9163 -7498 -1004 3348 607 -5776 -8280 -3829
3235 -3829 2773 4766 706 -4951 -5664 23 5866 5685 286 -4121 -1956 4443 8497 6011 -364
3250 -364 -2982 567 7406 9464 4941 -637 -1584 3688 9094 8161 1923 -2907 -932 5274 9190 5803
3266 5803 -1042 -4069 -623 5037 6780 1870 -4504 -5343 -63 4956 3275 -2680 -7383 -5996 -76
3281 -76 3463 255 -5834 -9175 -5349 972 2417 -2729 -8772 -8897 -3558 1819 970 -4494 -8552 -7108
3297 -7108 -839 3047 310 -5325 -7673 -3098 3059 4899 -64 -5176 -4911 846 6098 5561 386
3312 386 -3679 -1525 4680 8385 5282 -416 -2580 1531 7637 8495 4270 -1263 -1272 3756 8461 7594
3328 7594 1961 -2476 -1018 5201 8278 4843 -1597 -3987 -603 4865 5561 928 -4392 -4785 45
3343 45 4290 2993 -3277 -7200 -5509 97 3024 -200 -6005 -8044 -4760 899 1792 -2885 -8196 -7684
3359 -7684 -2417 2339 922 -4245 -8081 -5926 255 3049 712 -4542 -6520 -2631 3058 4534 112
3374 112 -4700 -4075 1438 5891 5151 -108 -3920 -1235 4320 7450 4631 -712 -2411 1436 6734 8142
3390 8142 3456 -1422 -1616 3374 7576 6524 1448 -2398 -556 5008 7172 4113 -2027 -4055 -468
3405 -468 4994 5686 746 -4354 -4546 267 4064 2540 -3065 -6325 -4176 801 3319 52 -5572 -7372
3421 -7372 -3684 1286 2181 -2304 -7012 -7011 -1721 2356 1524 -4207 -7800 -5099 664 3225 446 -4610
3437 -4610 -6195 -2185 3120 3865 -375 -4901 -4005 1149 5447 4590 -957 -4129 -1475 3967 6091 3656
3453 3656 -1254 -2537 1499 6420 7049 2125 -2385 -1679 3618 7657 6033 659 -2499 -399 4514
3468 4514 6545 3405 -1921 -3604 262 5209 5412 697 -4169 -3567 1233 4481 3106 -2564 -5457
3483 -5457 -3633 1408 3610 45 -5010 -6719 -2719 1774 2154 -2497 -6577 -6070 -1280 2171 537
3498 537 -4441 -7713 -4929 631 3215 26 -4998 -6123 -2021 2658 2922 -1355 -4941 -4034 1247 4769
3514 4769 3337 -1625 -4359 -1635 3819 6338 3095 -1767 -2413 1246 6052 6363 1965 -2142 -1480 3696
3530 3696 7445 5580 649 -2216 75 5069 6617 3355 -1834 -2969 1261 5477 5473 814 -3979 -3344
3546 -3344 1416 4539 2784 -2339 -5374 -2785 1861 2735 -401 -5006 -6030 -2501 1574 1897 -2666
3561 -2666 -6796 -5998 -1115 2028 -27 -4686 -7039 -4004 536 2249 -926 -5120 -6270 -2020 2455
3576 2455 2788 -1554 -4900 -3645 1064 4747 3026 -1806 -3826 -778 3828 5526 2712 -1410 -2508
3591 -2508 2208 5996 5982 1709 -1840 -670 3972 7102 5481 347 -2224 41 4987 6515 3025
3606 3025 -1555 -2212 1274 5080 4220 -207 -3392 -2846 1895 4471 2274 -2751 -5276 -3051 1444 3076
3622 3076 -567 -4968 -5979 -2321 1295 1521 -2830 -6250 -5259 -969 2068 -250 -4830 -6617 -3748
3637 -3748 1242 2149 -1045 -5447 -5547 -1340 2691 2579 -930 -4274 -2862 1232 4494 2418 -1688 -3397
3653 -3397 -384 4171 5579 2295 -1627 -2055 2058 5781 5669 1476 -1910 -568 3814 6648 4490
3668 4490 -362 -1961 607 4684 5588 2344 -1839 -2779 1019 4565 4060 -671 -3756 -2647 1566 3867
3684 3867 1503 -2637 -4787 -2196 1680 2656 -403 -4723 -5123 -1340 2488 1563 -2936 -5932 -4426 -156
3700 -156 1916 -100 -3998 -5697 -3002 838 2175 -1067 -4702 -4358 -372 3413 2661 -1885 -4413 -2708
3716 -2708 1529 3853 2510 -1719 -3296 -404 3752 4965 1551 -2230 -2142 2023 5410 4404 357
3731 357 -2188 -514 3497 5590 3538 -875 -2523 137 4420 5185 1634 -2344 -2133 1052 4187 3638
3747 3638 -469 -2986 -1837 1895 4229 1609 -2560 -4249 -1555 2490 3190 -274 -4180 -3839 -1042
3762 -1042 2014 1772 -2282 -5010 -3876 375 2454 -3 -3563 -5326 -2252 1416 1694 -1060 -4464
3777 -4464 -4135 -704 2670 1785 -2036 -4909 -2884 1389 3562 926 -2507 -3563 -782 3069 3920 1026
3793 1026 -2557 -2771 1576 4637 4210 312 -2314 -640 3262 5200 2496 -763 -1846 1099 4624
3808 4624 5127 1627 -1927 -1992 1540 5023 3869 -57 -2668 -1046 2265 4224 1764 -1965 -3413 -1217
3824 -1217 2839 2991 -371 -4273 -3666 -138 2723 1094 -2848 -5102 -3325 189 2222 25 -4088
3839 -4088 -5444 -2489 1209 1401 -1762 -4813 -3801 -484 2000 1327 -2499 -4857 -2870 919 3243
3854 3243 1065 -2884 -3731 -780 3194 3573 150 -2509 -1880 1777 4651 3982 451 -1802 -211 3683
3870 3683 5510 2914 -862 -1752 1615 4635 4521 1659 -1414 -1312 2262 4772 3641 -296 -2420 -834
3886 -834 2605 4429 1624 -2448 -3147 -726 2512 2503 -555 -4107 -3981 -620 2029 678 -3301 -4923
3902 -4923 -3082 392 2044 -585 -4858 -5350 -2389 1200 1483 -1551 -4674 -4153 -505 2295 827 -2567
3918 -2567 -4262 -1867 1555 3322 757 -2358 -2837 222 3494 3631 565 -2432 -1505 2322 4954 3405
3934 3405 333 -1615 -112 3561 4779 2597 -579 -1151 1358 4588 4325 449 -1990 -1186 2261 4139
3950 4139 2688 -932 -2916 -1184 1883 3473 815 -2140 -3243 -760 2154 1803 -1676 -4112 -3366
3965 -3366 -154 1959 347 -2752 -4711 -3181 572 2264 -783 -4200 -4558 -1153 1556 1246 -1573
3980 -1573 -3985 -3050 250 2420 1073 -1889 -4019 -1305 1901 3479 643 -2266 -2217 341 3669 3113
3996 3113 329 -2181 -900 2004 3882 2636 -577 -2310 194 3500 4391 1779 -1359 -1953 817
4011 817 3602 3339 248 -2105 -1333 1932 3997 2058 -1616 -3175 -904 2064 3187 349 -2684 -3146
4027 -3146 -218 2139 1939 -1050 -3778 -2906 226 2320 485 -2423 -3835 -1953 1136 1883 -159 -3287
4043 -3287 -3632 -554 2260 1820 -1426 -3799 -2832 782 2544 1251 -1641 -2899 -950 2116 2460 484
4059 484 -2574 -2649 691 3225 2765 -365 -2579 -1483 1801 3505 2189 -910 -2473 135 2628 3224
4075 3224 1232 -1445 -1890 801 3105 2681 36 -2255 -1432 1699 3182 1840 -1481 -2517 -721 2393
4091 2393 2675 394 -2423 -2380 130 2255 1911 -1061 -3219 -2188 701 2555 1038 -2346 -3720 -1489
4107 -1489 1461 2044 -352 -3178 -2860 -210 2055 1421 -1614 -3410 -2605 642 2536 918 -2319 -3218
4123 -3218 -1212 1594 2355 -165 -2767 -2493 352 2561 2315 -523 -2250 -1425 1580 3174 1526 -1246
4139 -1246 -2193 -102 2819 3261 978 -1808 -1674 936 3631 2681 -118 -2002 -720 2041 3318 1640
4155 1640 -1024 -1965 -58 2767 3191 380 -2529 -2017 460 2704 2178 -1037 -2690 -1831 1125 2396
4171 2396 444 -2399 -3432 -1143 1067 1385 -971 -3185 -3041 -269 1960 843 -1775 -3250 -2224
4186 -2224 283 2069 451 -2455 -3210 -1159 1675 1759 -350 -2604 -2247 1020 2720 1997 -828 -2238
4202 -2238 -1102 1876 3138 1470 -1054 -1680 319 3051 3113 828 -1387 -732 1592 3289 2723 -248
4218 -248 -1501 -482 2237 3291 1574 -1326 -1919 -29 2318 2688 145 -2195 -1948 680 2198 1420
4234 1420 -1537 -2993 -1742 461 1821 -145 -2547 -3203 -1420 925 1150 -1058 -3552 -3009 -670 1227
4250 1227 617 -1985 -3593 -2103 913 1793 265 -2397 -2902 -760 1667 2033 42 -2260 -1915 1001
4266 1001 2683 2332 -471 -1654 -69 1997 3007 1482 -903 -1401 882 2993 3172 1328 -994 -975
4282 -975 1608 3254 2536 -150 -1797 -406 1993 2930 1039 -1065 -1974 2 2310 2079 -105 -2402
4298 -2402 -2274 66 1677 1030 -1702 -3021 -1831 533 1473 -385 -2641 -3244 -955 1340 920 -1256
4314 -1256 -3494 -2745 -176 1563 764 -1632 -2914 -1316 1086 1640 298 -1847 -2204 29 2419 1780
4330 1780 83 -1618 -1237 991 2906 2119 -362 -1785 -65 2007 3282 1242 -1151 -1262 710 2887
4346 2887 2800 487 -1375 -636 1642 2941 2064 -637 -2127 -404 2049 2528 708 -1637 -2325 -130
4362 -130 1849 1789 -584 -2616 -1785 296 1576 602 -1584 -2748 -1882 854 1714 -204 -2675 -2688 -703
4379 -703 1095 1341 -1094 -3103 -2418 191 1550 808 -1769 -2870 -1145 1186 1888 18 -1874 -1953 -45
4396 -45 2112 2016 -198 -2124 -1174 848 2814 1680 -663 -1456 -139 1978 2685 984 -1170 -1320 557
4413 557 2773 2330 177 -1289 -912 1376 2934 1649 -750 -1846 -510 1919 2241 351 -1427 -1543
4429 -1543 237 1917 1919 -425 -2113 -1349 749 1985 806 -1394 -2419 -1143 890 1628 -118 -2282
4445 -2282 -2295 -620 1379 1002 -1279 -2757 -2214 87 1949 595 -1605 -3017 -1466 947 1574 -467
4461 -467 -2016 -2100 -2 1801 1541 -676 -1960 -1307 778 2432 1104 -675 -1810 -226 2372 2176
4477 2176 582 -916 -1229 660 2598 2331 369 -1128 -370 1456 2501 1634 -399 -1081 324 2213
4493 2213 2517 590 -1098 -1461 678 2057 1758 -483 -1907 -1431 789 1753 715 -1265 -2447 -933
4509 -933 1120 1155 -463 -2341 -2477 -465 986 676 -1522 -2501 -2136 -129 1177 -86 -1999 -2766 -1381
4526 -1381 627 929 -465 -2590 -2316 147 1626 1009 -682 -1980 -1572 791 1979 1222 -719 -1418
4542 -1418 -160 2018 2773 809 -1050 -696 1328 2876 2508 216 -849 75 1698 2890 1574 -351
4558 -351 -1031 362 2066 2669 675 -1311 -991 789 2129 1598 -845 -1857 -1119 767 1720 723 -1261
4575 -1261 -2499 -769 967 1096 -746 -2639 -2203 -879 560 226 -1890 -2945 -1836 -138 880 -337
4591 -337 -2200 -2633 -1220 1053 966 -386 -1779 -1982 -181 1548 963 -388 -1824 -757 1150 2346
4607 2346 984 -553 -1324 336 2057 2511 681 -893 -290 983 2770 2205 422 -938 -28 1728
4623 1728 2629 1434 -690 -1081 593 2289 2286 599 -1238 -960 509 1993 1288 -663 -2004 -1101 725
4640 725 1696 261 -1766 -1949 -602 757 596 -600 -2332 -2106 -585 964 208 -1160 -2456 -1578 182
4657 182 896 -368 -2081 -2111 -939 1113 1183 -492 -2232 -1695 168 1656 651 -822 -1942 -786 1318
4674 1318 1958 851 -1034 -1124 166 1843 2066 521 -1171 -805 1412 2235 1726 417 -1024 58 1719
4691 1719 2388 1137 -469 -925 168 1886 1656 171 -1436 -640 686 1995 898 -187 -1568 -653
4707 -653 1119 1785 402 -1237 -1832 -25 1275 1199 -708 -2080 -1734 -188 1199 118 -1335 -2486
4723 -2486 -1504 390 1147 -473 -1961 -2385 -879 894 791 -1047 -2373 -1880 -113 1364 452 -825
4739 -825 -1928 -838 853 1501 424 -1149 -1622 -299 1668 1585 -270 -1386 -811 670 1968 1057 -495
4756 -495 -940 -4 1870 2335 929 -396 -674 793 2054 1879 758 -736 -493 975 2091 1297 -192
4773 -192 -764 -228 1213 1526 563 -1109 -1343 234 1385 1271 -600 -1848 -1285 -240 1248 152 -1457
4790 -1457 -2295 -1429 217 742 -527 -2082 -2141 -770 437 319 -1294 -2421 -1992 -519 1002 243 -1263
4807 -1263 -2021 -1387 452 1014 127 -1373 -1582 92 1654 1279 -61 -890 -525 842 2329 1363 -392
4824 -392 -827 314 2231 2407 1189 -316 -348 916 2165 2354 837 -43 -91 1396 2341 1829 -99 -676
4842 -676 88 1578 1617 213 -899 -1064 -113 1106 821 -709 -1677 -1305 38 744 -76 -1605 -2209 -1356
4860 -1356 70 369 -1050 -2604 -2394 -767 169 -55 -1567 -2620 -1661 -222 794 14 -1402 -2248 -656
4877 -656 594 1137 155 -1019 -1135 390 1713 1592 178 -634 -380 1513 2181 1564 -34 -659 546
4894 546 1999 2361 1029 -76 -308 808 2196 2021 1010 -732 -279 1561 2212 1230 63 -687 -25
4911 -25 1342 1251 -80 -1206 -1419 -62 637 501 -910 -1950 -1708 84 590 -106 -1633 -2356 -1651 -293
4929 -293 89 -682 -2136 -2144 -804 296 67 -1185 -2228 -1373 -222 926 61 -1626 -1579 -748 975 1053
4947 1053 169 -860 -978 465 1690 1349 157 -953 50 1454 1934 1291 -381 -576 412 1922 1971
4964 1971 662 -210 -415 1180 1836 1526 60 -707 21 1019 1790 816 -428 -1191 -365 1377 1057 -66
4982 -66 -1308 -1133 -175 775 671 -878 -1655 -935 156 534 -199 -1597 -1955 -821 401 457 -761 -1775
5000 -1775 -1587 -403 523 454 -995 -1730 -1076 262 966 164 -1485 -1424 -402 985 1218 -111 -1198 -906
5018 -906 396 1294 1207 55 -816 -35 960 1768 855 -504 -753 496 1577 1462 452 -671 -269 934
5036 934 1665 1338 -100 -602 -19 914 1681 1026 -495 -1104 129 1126 1306 215 -978 -859 378 1224
5054 1224 851 -620 -1484 -1021 376 629 -185 -1089 -1699 -876 606 444 -718 -1687 -1295 -550 326 233 -1142
5073 -1142 -1640 -914 440 1042 -389 -1226 -1646 -429 834 1063 -76 -1476 -1312 325 1149 665 -626
5090 -626 -1306 -283 912 974 854 -726 -895 342 1073 1594 348 -678 -71 863 1865 1411 12 -637
5108 -637 109 1357 1349 782 -509 -491 355 1359 1322 -45 -956 -837 468 1119 860 -514 -1278 -584 464
5127 464 860 -351 -1137 -1375 -473 414 689 -842 -1708 -1624 -229 578 -248 -1360 -1669 -1008 -99 265 -171
5146 -171 -1508 -1866 -650 656 685 -543 -1381 -921 402 1024 799 -471 -1304 4 1034 1542 889 -379
5164 -379 -504 474 1660 1273 713 -632 32 1242 1809 1522 -21 -406 237 1215 1611 572 -518 -525 222
5183 222 1373 1293 37 -884 -385 675 1025 250 -802 -1185 -917 223 174 -242 -1416 -1560 -549 470
5201 470 152 -1013 -1602 -1580 -570 374 147 -1171 -1796 -879 198 482 -155 -1392 -1035 -335 786 480
5219 480 -395 -1133 -704 479 1150 855 -316 -754 123 1387 1373 384 -196 -181 385 1591 1301 380 -283
5238 -283 28 955 1458 1167 222 -567 73 1516 1351 575 -515 -782 -22 816 602 -218 -961 -936 302
5257 302 643 258 -723 -1374 -394 381 463 -920 -1575 -1348 -825 17 -56 -810 -1350 -1537 -123 535 0 -1047
5277 -1047 -1480 -487 351 640 -186 -1003 -1113 34 1089 801 -140 -693 -714 814 1412 598 -767 -656 -62
5296 -62 1475 1381 295 -492 -122 561 1350 1237 169 -616 -740 1243 1157 776 -235 -482 8 945 1089
5315 1089 552 -617 -998 120 851 1006 -377 -1175 -598 304 528 496 -444 -1223 -564 426 707 -106 -1277
5334 -1277 -1428 -76 566 316 -550 -1162 -856 -206 505 79 -728 -896 -344 701 731 -123 -952 -937 48 577
5354 577 573 -224 -1119 -600 325 1016 727 -492 -714 24 862 1083 87 -599 -322 554 840 1131 159 -797
5374 -797 -134 550 1142 541 -293 -594 -97 904 889 56 -402 -748 -153 1001 777 -101 -1035 -389 607 756
5394 756 283 -432 -790 -182 550 882 -229 -1010 -978 -105 903 426 -564 -1271 -822 231 536 -35 -813
5413 -813 -1035 -649 308 447 -385 -839 -806 10 251 139 -692 -989 -395 164 938 49 -595 -597 -146 873 871
5434 871 82 -833 -466 398 1157 981 106 -459 34 861 1321 322 -245 -465 360 1063 1035 516 -272 -389
5454 -389 538 1211 769 -269 -559 -169 799 1028 379 -779 -749 142 832 663 -303 -850 -699 30 87 260
5474 260 -479 -1086 -388 -79 439 -263 -1212 -1092 -485 567 541 -476 -1386 -868 -118 498 284 -490 -1126 -239
5494 -239 469 634 145 -664 -671 161 960 870 107 -322 -231 716 925 735 130 -568 101 989 1004 857 -98 -315
5516 -315 261 816 1024 57 -223 -359 460 1034 725 -246 -498 -285 437 756 -36 -669 -932 -137 372 362
5536 362 -500 -966 -913 -211 102 -175 -803 -1080 -650 5 89 -303 -744 -923 -604 333 49 -412 -827 -827 57
5557 57 770 349 -447 -847 -207 488 749 510 -336 -442 106 763 1173 124 -532 -179 479 1118 513 169
5577 169 -321 299 821 1091 485 -253 -223 93 961 767 321 -781 -348 347 941 286 -517 -726 -531 365
5597 365 723 7 -868 -848 -192 490 204 -294 -1048 -753 179 401 242 -637 -1019 -314 160 696 -377 -933
5617 -933 -755 -446 747 372 -121 -738 -510 434 738 509 -387 -568 -418 469 806 11 -305 -312 500 701
5637 701 754 6 -686 -292 431 693 776 -278 -590 -290 584 530 521 -553 -522 -8 722 655 -122 -678 -416 261
5659 261 694 198 -274 -516 -205 540 965 213 -748 -966 -298 745 670 -343 -898 -352 175 733 70 -33
5679 -33 -555 -218 297 557 -182 -865 -596 -183 667 719 -358 -361 -396 371 603 145 -382 -789 -189 424 528
5700 528 -36 -804 -891 -172 643 781 -44 -588 -360 510 705 384 -423 -788 -73 638 838 5 -557 -473 237
5721 237 529 853 23 -520 -36 336 873 489 -316 -347 -7 948 681 -44 -158 -331 16 370 789 -137
5741 -137 -633 -286 359 607 498 -745 -690 -101 899 578 -69 -567 -792 -79 644 255 -649 -1285 -569 13
5761 13 241 -194 -546 -654 -265 294 209 -77 -724 -963 23 604 142 -207 -691 -322 207 868 291 -531 -603
5782 -603 227 914 1099 35 -373 -36 613 599 492 22 -222 293 509 1138 218 -221 -481 0 547 655
5802 655 105 -486 -113 146 657 153 -453 -745 -284 360 247 105 -698 -970 -38 192 265 -92 -995 -689
5822 -689 -92 432 160 -109 -905 -640 66 308 -119 -642 -601 -442 535 402 -219 -560 -424 460 716 315
5842 315 -60 -632 47 466 563 272 -200 -297 417 812 841 283 -226 -264 208 921 334 -234 -403 28 752
5863 752 679 726 -154 -54 31 164 469 66 -423 -813 65 381 312 -305 -707 -265 -154 495 142 -769 -636
5884 -636 -221 392 298 -65 -813 -357 178 651 19 -525 -677 -454 217 204 -61 -477 -382 -196 591 559 156
5905 156 -321 -374 424 337 533 -166 -622 -368 414 578 65 -108 -420 169 263 704 -65 -214 -178 69 608
5926 608 488 -208 -429 -338 188 684 -51 -108 -589 -87 456 481 79 -656 -337 -262 372 93 -731 -303 -309 103
5948 103 408 -26 -370 -328 -253 498 494 -10 -455 -286 243 623 412 -389 -661 8 686 274 -34 -338 -627
5969 -627 -263 474 246 38 -633 -260 -87 642 533 -143 -391 -571 388 412 0 -387 -340 18 343 393 -228
5990 -228 -573 -502 -53 274 190 -299 -798 -81 481 714 216 -401 -340 22 413 511 17 -185 -326 150 724
6011 724 107 -169 -187 130 525 502 -20 -186 -435 186 453 302 -97 -590 -89 501 266 59 -224 -738 -102
6032 -102 478 173 -324 -572 -642 -288 440 121 -405 -845 -304 -73 177 142 -689 -490 -184 161 800 38 -598
6053 -598 -524 93 747 432 -164 -566 -242 677 718 522 -178 -255 -161 474 490 234 -454 -110 194 746 554 -59
6075 -59 -271 74 553 832 281 -340 -253 204 620 302 148 -467 -475 112 480 249 -113 -349 -609 -53 151
6096 151 5 -489 -539 -211 365 461 -404 -750 -659 -432 152 -67 -225 -1050 -491 81 292 -48 -357 -664 13
6117 13 567 401 44 -251 -287 64 598 308 214 -228 -67 459 757 122 69 -398 73 718 843 355 -214
6138 -214 72 -20 820 924 -202 -354 -161 405 509 364 -148 -419 97 416 202 138 -462 -581 37 269
6158 269 394 -395 -406 -430 162 352 -38 -231 -457 -496 505 152 -132 -546 -317 -344 286 376 -156 -664 -678 342
6180 342 390 248 -38 -365 56 497 428 290 -417 -335 554 358 -81 -49 -58 52 401 719 489 -306 -273 220
6202 220 767 595 127 -157 -353 132 382 630 -278 -455 -94 607 108 -88 -264 -535 34 288 129 25
6222 25 -426 -296 -121 172 65 -568 -409 -470 146 296 190 -482 -527 -57 57 330 -45 -629 -243 347 -85
6243 -85 306 -337 -304 31 205 363 -27 -413 -484 135 45 500 -57 -274 -277 361 632 210 -438 -595 -54 327
6265 327 627 542 83 -364 320 270 389 -97 -326 -386 139 646 264 -321 -281 -146 97 422 17 -207 -154 -95
6287 -95 323 131 210 -105 -202 171 505 404 -252 -704 174 389 285 -150 -705 -526 -99 415 406 -241 -463 -307
6309 -307 -37 293 156 -92 -307 -341 145 141 -69 -539 -469 -164 326 1 38 -638 -224 441 220 -244 -220 -270
6331 -270 1 517 302 173 -117 -175 28 547 375 295 -224 -290 415 684 452 48 -183 29 465 484 244
6352 244 -4 -425 125 538 564 -21 -592 -158 34 613 365 -275 -244 -237 114 8 -147 -166 -351 189 257 -223
6374 -223 -168 -793 -591 -162 179 -18 -775 -704 -154 229 121 -175 -447 -362 -21 424 108 -59 -391 -294 175
6395 175 332 320 5 -254 170 309 294 -76 -143 -60 190 383 438 -98 -385 -94 488 585 356 -470 -144 305
6417 305 546 789 141 -350 -25 42 68 527 -205 -243 -343 94 591 258 -137 -487 -93 278 17 35 -591
6438 -591 -591 32 -5 173 -344 -387 -722 95 111 -66 -135 -239 -516 -102 326 172 -253 -203 71 454 354 -83
6460 -83 -95 -123 565 338 203 -112 -44 -82 436 374 345 8 211 322 740 207 -54 25 211 91 635 2 -270
6483 -270 7 -161 460 277 35 -227 -356 25 381 -35 92 -250 -279 47 446 -66 -480 -605 -282 141
6503 141 117 43 -281 -563 -143 116 319 -125 -319 -10 150 324 8 -348 -423 -279 384 509 95 -154 -94
6524 -94 38 266 118 -190 -89 324 389 350 592 -9 -350 125 14 480 331 -190 -44 322 400 170 -51
6545 -51 -338 -325 58 330 -221 -355 -441 -73 56 136 -142 -520 -551 -52 423 112 -233 186 -51 -5 122 -152
6567 -152 -213 -290 65 194 235 164 -326 -167 -70 262 204 -152 -267 -276 551 327 305 -236 -261 293 305 528 -20 -436
6591 -436 -131 380 361 358 -85 -433 32 354 96 172 -210 -314 248 -106 407 0 -231 -373 139 227 89 -294
6613 -294 -370 -494 121 431 350 -235 -447 277 216 132 -9 -258 -293 380 344 206 -452 -272 -141 383 113 194
6635 194 14 -273 -94 414 244 -155 -227 -236 61 504 159 -226 -337 -126 115 87 -62 -212 -334 -214 193
6656 193 66 -6 -201 -18 283 -45 -34 -270 -266 -10 13 389 -5 -179 -92 177 593 83 64 -161 -35 161
6678 161 330 419 -151 -243 -112 462 -7 174 -289 -387 -169 276 187 -83 -150 7 211 345 489 -35 -115 -1
6700 -1 -120 346 116 -230 -292 119 242 -66 -300 -780 -548 -78 253 -9 -271 -418 -156 -172 81 -151 -209 -433
6722 -433 157 -246 36 -119 -271 -282 79 185 -169 78 -307 -342 361 189 11 40 160 142 250 366 183
6743 183 7 -269 293 244 285 -20 -197 -48 429 331 234 -479 -286 -172 270 344 148 -309 -157 184 192 275 -503
6766 -503 -251 -17 85 86 7 -544 -429 22 -28 -11 -169 -369 -472 -1 -1 -38 -325 -124 -17 216 290 -65 -283
6789 -283 -315 82 295 83 -222 -237 16 111 316 301 -89 -117 84 589 307 37 -140 -135 125 325 475 117
6811 117 -116 71 -148 546 75 69 -110 225 269 637 178 -172 111 104 358 260 -381 -545 -147 -53 83 -432
6833 -432 -231 -448 -87 220 425 -121 -415 -276 -204 299 -96 -149 -263 -226 -11 254 87 -230 -95 21 392
6854 392 384 -202 -399 -10 415 401 298 49 -94 -33 231 186 213 -193 34 337 267 112 143 -169 -110 106 254
6877 254 342 -131 -381 -77 369 328 22 -67 -258 -142 -23 19 31 -339 -221 140 389 17 -184 -263 -135 -11
6899 -11 142 88 -252 -443 -232 -54 62 -221 -501 -252 84 239 51 -286 -180 -210 -106 532 38 -289 -142
6920 -142 -181 95 418 277 -174 -4 21 390 405 -206 -96 -73 131 379 390 -191 -47 -184 336 262 -196 48
6942 48 -383 105 325 10 -351 -377 -24 112 206 302 -128 -201 145 218 -4 59 -68 -137 281 246 -88 12 -282
6965 -282 -103 21 -66 97 -328 -353 132 273 223 -58 -216 164 -138 82 75 182 -304 -348 25 2 -58 -420 -292
6988 -292 114 88 275 -16 -149 -93 -105 127 -108 -117 -53 7 382 32 -142 -189 -274 -153 160 10 -107 -360 -154
7011 -154 -51 13 -26 -248 -71 -7 -161 124 196 -294 19 103 -110 360 -78 53 -117 432 541 108 -263 -12
7033 -12 -236 171 298 213 -158 -6 -81 -151 82 139 -110 -313 169 138 -6 -224 -151 -291 272 106 30 -233 -473
7056 -473 -74 -101 -163 -286 -530 -530 111 22 102 -63 -90 -49 231 353 -343 -339 -160 177 114 63 131 -274 -41 -44 292
7081 292 321 -78 -101 -66 525 467 187 199 -238 400 85 270 51 -138 -304 267 323 372 -29 -229 -25 98
7103 98 338 -357 -348 -187 59 -48 22 -71 -400 -234 97 55 -200 -362 -376 -510 -2 -132 -319 -23 -338 107
7125 107 162 -1 -206 -318 -305 330 0 425 -150 22 -67 170 332 -34 3 -18 119 335 242 55 228 143
7147 143 184 240 85 3 -102 -321 368 304 113 -114 78 340 335 221 370 -106 -97 -45 -86 114 -123 -129 -231 241
7171 241 170 -18 -444 -226 156 -286 -107 -163 -314 -133 -86 -40 -67 -790 -288 -27 47 242 -68 66 -245 -107
7193 -107 -144 46 -238 -59 -141 22 122 140 -368 -25 153 190 143 154 -65 -102 -99 272 148 2 -97 -85 163 151
7217 151 263 -113 -351 -47 43 118 103 -10 37 -195 -109 -187 117 -257 -217 154 186 119 -177 -192 114 -242 437
7240 437 3 -72 8 -133 -66 26 -196 -259 -93 -80 -66 60 -425 -140 89 244 18 -63 -284 -369 229 -124 94
7263 94 -64 -94 -319 185 189 407 -240 -4 -51 403 87 47 -96 -146 -289 -34 66 -98 -301 30 232 -4
7285 -4 47 -85 -431 -194 144 18 -151 -388 80 -151 163 -147 -72 -205 74 -296 205 329 -141 -513 191
7306 191 407 -37 52 -186 -176 -128 311 16 -207 16 160 341 259 22 311 -143 -317 475 273 -160 -423
7327 -423 -60 7 103 -53 111 -284 -440 325 256 -16 25 -77 -97 -145 13 -6 -45 13 62 405 -96 -156 2 99
7351 99 319 103 307 -111 17 49 86 39 -31 -211 -116 245 205 169 31 -184 35 89 193 96 -59 -111 -184 362
7375 362 -169 56 -381 153 105 -11 6 -79 36 -173 151 82 -124 -381 -332 -67 -55 -267 196 -250 -376 -224
7397 -224 -179 -244 -552 -294 -390 101 -67 -133 -251 -243 -368 6 -120 179 -411 -264 239 -17 229 -231 -93 264
7419 264 545 215 -66 -26 -36 146 112 277 107 104 -143 151 456 174 -37 -45 -122 435 385 207 203 -281 72 -265
7443 -265 -62 148 -254 -262 255 -111 -34 -155 -414 -49 59 -189 -476 -509 -102 -408 132 -197 -34 -222 -264 -231
7465 -231 -119 -100 -289 72 43 227 82 270 -159 -334 103 56 239 75 -156 3 179 263 51 19 125 -16
7487 -16 310 193 254 -166 -36 193 189 321 2 239 167 186 487 189 94 162 -249 23 105 241 -59 -334 320
7510 320 99 65 -353 -357 -112 126 153 -92 -104 -336 -404 295 416 -174 100 -270 175 25 -223 -80 -370 -164
7532 -164 38 82 18 -199 80 203 44 255 95 -180 -248 122 212 358 153 -117 -89 -114 240 -89 -16 -66 77
7555 77 189 216 -136 -315 342 -45 159 -147 18 -11 159 -2 -142 -142 -87 -207 -66 186 411 1 141 -58
7577 -58 138 129 -88 87 -264 -158 -49 171 150 -97 -230 -112 107 -98 -82 137 -68 95 191 361 -182 -228
7599 -228 -172 32 143 167 -332 -273 -258 127 43 -102 -12 -33 123 34 -134 -227 -66 69 180 244 178 -163 29 -299
7623 -299 -56 11 -258 -81 140 113 181 269 -280 -19 -190 -123 146 -47 71 -17 -37 185 208 279 117 -310 214
7646 214 170 252 91 141 216 238 157 121 -233 54 -75 -93 -67 -219 21 -111 -224 -120 168 75 -9 -204 -133 74
7670 74 70 227 -220 -26 276 167 -48 -130 147 15 228 -79 -38 147 158 341 -86 324 -250 -184 -171 28 264
7693 264 85 -35 -167 251 121 327 -1 -292 -139 335 28 184 198 112 207 359 -165 317 -102 -52 -122 408
7715 408 -345 254 -136 -392 177 -153 -179 -200 -170 -37 10 13 -48 -301 -209 92 155 1 -224 -516 -23 198 -11
7738 -11 227 -181 -382 -66 71 17 -115 50 -158 -81 178 94 80 39 -174 -76 242 147 -62 18 69 189 332
7761 332 267 -98 -176 194 318 154 297 -20 41 171 243 -37 -224 -133 -84 344 238 -133 -117 -202 -13 126 -114
7784 -114 -16 -240 -61 -229 99 -51 -301 -204 44 231 -7 -99 -310 -314 -79 101 -103 138 -354 -339 148 26
7806 26 167 -63 -155 -9 -74 205 52 108 82 -50 -55 178 126 -259 178 177 322 125 -171 -52 150 335 -118
7829 -118 77 -256 151 155 78 184 -143 -94 52 124 43 138 -4 -245 93 -23 287 84 -13 -430 -59 335 -296
7852 -296 -66 -242 -165 1 9 -51 -103 -316 -76 -195 -3 332 -140 -34 9 133 -123 -362 -50 162 -213 419
7874 419 -24 -320 -174 -24 151 23 -84 -283 -50 168 66 -42 -11 110 1 -103 -7 -152 8 -127 124
7895 124 -11 8 -44 -445 -182 121 18 -75 87 -201 -3 -134 -90 13 -160 -29 103 217 122 165 -362 -161
7917 -161 -74 -86 302 8 175 195 86 87 -178 -289 -55 38 -81 108 -57 261 -509 112 -220 279 -139 -15
7939 -15 84 -4 145 -115 -69 8 45 431 51 -110 113 -387 -26 -76 -82 -259 -90 -323 -40 30 -59 -170 99 21
7963 21 7 135 -100 -159 -30 -134 -110 -22 81 26 -261 -2 -16 -134 -249 334 -13 77 318 71 -4 91 143 236
7987 236 -130 16 -109 -98 54 66 -337 -98 -262 33 166 -44 83 180 19 77 -223 -120 -62 -233 11 -36
8009 -36 -166 -251 -268 -217 32 153 -99 -66 -87 -228 -115 133 25 -22 36 -117 33 -198 34 62 265 -50 -126
8032 -126 36 -311 199 43 55 7 62 116 68 78 258 158 83 389 -137 -26 -221 54 -11 -29 47 125 454 -34
8056 -34 -135 -33 79 20 49 -140 -70 -99 -149 -181 -70 155 -56 -401 -19 -421 -20 -186 -521 -338 413 7
8078 7 -54 -26 46 230 -78 -106 34 -201 -269 -7 170 130 -105 -6 225 4 169 442 -59 270 327 179 320
8101 320 -119 141 107 -222 297 -42 187 94 192 -30 120 -107 45 79 248 94 102 -35 144 -150 59 -60
8123 -60 -170 -384 -335 -94 -191 -164 -249 -116 131 92 174 -106 -174 -249 5 6 -179 -131 -293 -8 68 49 254 -133 -77
8148 -77 -72 46 -86 125 270 -182 128 -74 38 -53 -67 -111 146 224 196 -157 37 -45 -72 550 411 -258 -147
8171 -147 -8 -40 182 102 -167 -223 -186 -115 323 -5 -359 -102 -292 349 285 254 175 -90 89 91
8191I1
$$ Imaginary data points
##PAGE= N=2
##DATA TABLE= (X++(I..I)), XYDATA
0 0 0 0 0 8 -8 0 -8 8 -8 16 -16 24 -32 32 -40 48 -64 69 -85 101 -114 133 -157 178 -205 235 -267 303 -343
29 -343 385 -434 492 -548 609 -685 763 -845 939 -1040 1153 -1277 1414 -1564 1733 -1923
45 -1923 2131 -2373 2648 -2958 3331 -3769 4299 -4953 5794 -6903 8459 -10790 14668 -22315
59 -22315 43187 -217355 -726295 -332397 109250 135763 -132102 -215489 -200873 -199973 -152297 -37905
71 -37905 -177534 -512326 -530798 -37180 322931 59883 -423701 -456512 -132884 38402 -56655
82 -56655 -153987 -198659 -229548 -94052 243562 359551 -16468 -432693 -298899 179529 349741
93 349741 115209 -46820 64498 198698 211270 204101 143005 -54156 -142963 157476 555753
104 555753 498342 49271 -166579 74769 335256 282486 111021 51291 45705 66540 220776
115 220776 375027 214726 -160205 -245117 75235 296998 98950 -173759 -131837 72506
125 72506 116587 23541 -60319 -183416 -331404 -257071 66880 220688 -51414 -378304 -320587
136 -320587 -46289 6086 -172016 -267048 -208682 -157066 -114396 -9623 12162 -183187 -355860
147 -355860 -210357 70962 76209 -171064 -267246 -82244 102634 102537 26174 -39903 -132849 -168174
159 -168174 2495 244063 242934 12298 -88149 76663 227906 151163 7509 3830 93583
170 93583 166303 232933 270271 165190 -24493 -42125 168620 310792 178381 -26105 -22075
181 -22075 139080 228966 190778 105354 -6729 -109992 -76058 106166 203461 60619 -122132
192 -122132 -84549 80690 88840 -88520 -220153 -186681 -77630 20547 78372 19403 -176724
203 -176724 -318919 -215320 4963 33444 -154204 -270899 -162088 2738 27389 -64841
213 -64841 -166459 -230183 -209126 -67472 78956 43226 -134113 -186837 -16223 140135 62271
224 62271 -135255 -195748 -69192 103045 199847 181451 48075 -99444 -90129 90999 220621
235 220621 130818 -30158 -13089 167724 274599 191010 30622 -54469 -15906 114221 238665
246 238665 225661 62104 -62633 22764 205938 224031 33320 -136010 -101056 66305 186898
257 186898 171965 43582 -105636 -146202 -32781 90405 40392 -133260 -189011 -36288 124722
268 124722 84965 -106757 -248411 -232198 -102145 32540 58273 -65146 -215361 -203001 -28955
279 -28955 76978 -39359 -229214 -249814 -86439 66268 73648 -26953 -130378 -153806 -65531
290 -65531 59748 71807 -64447 -168220 -65245 149659 220172 71707 -106816 -129109 -6637
301 -6637 128755 177084 115622 7425 -23471 83001 204138 165938 -6019 -94001 17421
312 17421 194041 238614 131335 2045 -35751 31161 132870 158069 52158 -82374 -73481
323 -73481 91304 212745 133998 -57512 -154656 -87483 33909 83189 29536 -69704 -117137
334 -117137 -52878 55808 56210 -93551 -231995 -188898 -15293 87442 22114 -114423 -181451
345 -181451 -136946 -39110 16508 -37849 -157219 -194959 -72913 86085 92681 -58959 -181357
356 -181357 -144446 -15387 60596 34061 -38711 -76250 -27199 81434 136856 50588 -98782
367 -98782 -127865 17120 177205 183511 62267 -30650 -10642 76072 135250 110932 21929 -38488
379 -38488 19146 157508 218071 115471 -39126 -72001 33775 134888 122082 28809 -38383
390 -38383 -16521 71901 136061 86472 -57709 -152984 -89848 61930 124918 35986 -89201
401 -89201 -115095 -42449 25130 7708 -82599 -158230 -131485 -9540 84594 34809 -115711 -200632
413 -200632 -132969 -6735 32578 -38952 -122035 -121710 -37530 51491 51267 -54033 -162046 -143183
425 -143183 -3441 106990 73138 -42351 -89812 -21111 71352 84945 13384 -66553 -66645 33816
437 33816 152526 166855 52454 -65764 -53157 65778 143591 99909 6229 -21052 45488
448 45488 133073 150653 70690 -42907 -76096 13907 132885 144702 37668 -56077 -31576
459 -31576 63632 101876 33805 -70036 -105847 -38370 69916 111696 33352 -93647 -137590
470 -137590 -58555 37987 31627 -63821 -128581 -85288 14192 60315 199 -113505 -171817 -112911
482 -112911 7496 62113 -5234 -107484 -118556 -29418 48355 23051 -73003 -132259 -88592
493 -88592 22792 99451 68187 -38151 -102366 -51342 54634 89610 18659 -60959 -43419
504 -43419 56564 133908 110806 10619 -69190 -49695 53710 137002 113244 15308 -34572 23663
516 23663 112137 117596 29288 -53987 -45667 44445 127471 123067 32643 -57020 -54329 31481 91971
529 91971 46618 -52391 -84366 -9456 83162 87510 -3567 -102177 -117424 -42915 42063 48023
541 48023 -31912 -103831 -82451 6438 49237 -14852 -117799 -145784 -69312 32963 61476 -4999
553 -4999 -95727 -117067 -47572 31664 26807 -55818 -111380 -62377 43813 92429 35319 -63436
565 -63436 -102182 -45218 48499 86983 36906 -37511 -41266 37591 108245 82377 -14282 -72311
577 -72311 -25979 76518 134310 97008 9117 -38790 296 79640 103981 38081 -41670 -34543
589 -34543 57152 129223 99519 268 -68092 -45934 31566 81615 52288 -25366 -63251 -14977
601 -14977 64766 71712 -16941 -109913 -106705 -15103 63685 51325 -30068 -95115 -82480 -13560
613 -13560 28423 -11773 -94289 -119737 -46817 49013 60776 -24729 -114662 -116426 -38597 34522
625 34522 31875 -34263 -84441 -55548 29241 74266 22020 -73372 -102776 -29321 69481 94496
637 94496 32194 -39884 -42832 22955 82915 67217 -9741 -58285 -12822 87890 135874 79965
649 79965 -17715 -54714 -854 77955 97524 42892 -21430 -20586 49782 109641 81608 -15521
661 -15521 -80246 -42263 52857 99534 52179 -30480 -61049 -16087 45599 47553 -22092 -92882
673 -92882 -83328 3903 74804 48729 -49800 -115087 -85624 -5820 32554 -8673 -77920 -93538
685 -93538 -34854 37263 39298 -39418 -118193 -109089 -19024 54582 37164 -40658 -84639 -46263
697 -46263 29020 54951 2999 -70028 -80442 -6788 80455 93558 22009 -53442 -50732 21908
709 21908 79791 60922 -4650 -34904 11654 88348 110305 49362 -34185 -52678 13358 92501
721 92501 101950 36638 -26053 -17522 46654 86939 52814 -23707 -60845 -18662 60001 90091
733 90091 38530 -40923 -66373 -18228 39751 36280 -26533 -75912 -53989 17208 58034 20346
745 20346 -63227 -108868 -72752 3355 37896 -2710 -66918 -79908 -28324 24446 14596 -49769
757 -49769 -98320 -74593 -419 51095 30058 -37210 -76707 -45984 18984 43887 2062 -54789
769 -54789 -53025 12606 74631 68098 2310 -53398 -42960 20363 72246 63230 10103 -21618 7021
782 7021 64136 79379 31168 -29080 -33359 25446 85266 86262 31043 -22508 -21504 28002 67598
795 67598 47767 -12267 -44763 -8331 57131 77234 27698 -41127 -62160 -23305 29098 38476
807 38476 -2014 -46981 -43876 4349 37743 8156 -60237 -93722 -54458 15686 44444 5481
819 5481 -57646 -81153 -45123 8238 17848 -28309 -76037 -65271 -1117 45610 23471 -41030
831 -41030 -77158 -49096 10419 40249 14184 -34750 -47676 -1532 56681 58842 -3627 -61486
843 -61486 -47527 25676 81757 68857 10255 -29601 -11894 40010 69127 39836 -15012 -29078
855 -29078 22997 86190 86463 21267 -37442 -30225 27325 70664 55901 1526 -34269 -11412 48161
868 48161 74059 26938 -49072 -71184 -15177 52573 58333 2049 -51740 -50869 -5577 29168 10584
881 10584 -46813 -79844 -44786 26477 52008 -1365 -76478 -93121 -38473 22095 25317 -24827
893 -24827 -71847 -63009 -3700 43192 21940 -49792 -90593 -50548 25774 54402 12228 -43211
905 -43211 -48467 -490 45749 40932 -12822 -57508 -36192 39677 93060 64309 -14664 -54767
917 -54767 -15904 51956 74444 36642 -12506 -18436 26882 76444 71894 10638 -43357 -26948
929 -26948 43229 85415 53280 -12190 -35463 2135 53147 59242 10598 -46448 -54181 748
941 748 62641 61215 -5703 -64889 -55057 2668 33428 4623 -45832 -59806 -23247 25546 32560
954 32560 -18512 -80541 -86069 -25502 34000 27202 -33477 -74678 -51780 3476 28534 -1115
966 -1115 -53906 -74467 -35389 28334 51350 8381 -49562 -54109 -2210 41755 29247 -18154
978 -18154 -40901 -10336 45261 71126 38738 -22839 -49250 -8153 58210 77854 34117 -15746
990 -15746 -14243 31297 65788 51841 4637 -27683 -10446 42691 76493 51245 -7467 -33662
1002 -33662 -110 46969 48200 1793 -38689 -29849 17933 54994 41481 -15722 -63427 -53919
1014 -53919 243 37588 15773 -35403 -54515 -23909 13889 12910 -28357 -67454 -63438 -16729
1026 -16729 27673 21671 -31133 -72494 -54678 83 26859 -3276 -51231 -61109 -21851 28507
1038 28507 40100 3341 -45149 -53438 -10397 37089 36929 -4625 -31384 -7173 39902 55213
1050 55213 22648 -24216 -36092 2954 58598 75651 36314 -16805 -24583 20629 61765 50852
1062 50852 4225 -22312 -726 44089 65437 40624 -9045 -34150 -8560 38680 50760 11610
1074 11610 -32328 -28005 17163 47122 25714 -26880 -59380 -41657 8431 40326 19884 -32911
1086 -32911 -61062 -34193 10831 16567 -23538 -60557 -51287 -6993 25407 12953 -32334 -65642
1098 -65642 -51103 -2871 27748 4630 -43611 -56482 -15000 33578 34634 -10109 -51548 -46946
1110 -46946 -791 42061 42731 1986 -32107 -18639 27238 49184 19573 -23602 -26463 16978
1122 16978 60983 60739 19435 -22854 -24182 17827 59235 54285 7230 -26175 -4643 45119 62758
1135 62758 27582 -19978 -31888 -350 39043 46825 14205 -25172 -28205 9182 40155 21559
1147 21559 -30035 -55422 -25418 25185 41607 8792 -38994 -57845 -32604 8701 21375 -10995
1159 -10995 -50255 -47682 -3705 27366 6529 -42126 -63992 -37237 7485 25819 2592 -36062
1171 -36062 -48874 -17693 24580 28837 -13310 -52771 -40049 12950 48467 33150 -11011 -36358
1183 -36358 -19359 20344 42152 23099 -14503 -23162 13566 56076 52846 5620 -31608 -18322
1195 -18322 27934 57629 44694 5657 -18585 -3455 35777 54000 25211 -21613 -32073 7331
1207 7331 50566 49412 7243 -28739 -25176 7196 31060 19249 -17167 -38865 -18331 24756
1219 24756 38316 1399 -48610 -57127 -18382 20958 21561 -12907 -44437 -41483 -9068 17354 5304
1232 5304 -36211 -60268 -35685 12809 29792 -1661 -42876 -47631 -14056 17928 16372 -15464
1244 -15464 -41988 -30551 12994 44297 27628 -21028 -45890 -19578 27655 45220 20528 -12726
1256 -12726 -16431 12190 42374 40487 5292 -25442 -14491 32067 63369 44025 -2218 -23193
1268 -23193 95 37781 46556 19171 -14562 -18783 12272 47514 45598 4623 -34025 -28117 12231
1281 12231 37844 20824 -16764 -32266 -11634 19640 24803 -4992 -43565 -50451 -15247 25122
1293 25122 24869 -16605 -51290 -42916 -6219 14344 -3316 -36981 -50003 -26664 10754 23634
1305 23634 -4204 -44589 -51948 -17440 20462 19430 -14599 -38024 -22536 14364 33207 14285
1317 14285 -22726 -38331 -12425 32050 49457 22110 -16885 -21238 12561 43022 36457 3575
1329 3575 -17577 -2607 33957 56212 39054 -1605 -23032 -1437 38453 49386 19336 -14771
1341 -14771 -13753 18973 44514 34017 -3477 -32266 -23691 13314 39338 24010 -16655 -36373
1353 -36373 -15838 16161 18842 -11637 -41664 -39032 -6767 21435 16314 -20558 -52621 -45151 -7435
1366 -7435 16980 457 -36210 -47284 -20997 12034 15641 -13007 -44079 -44699 -12171 21873 21953
1379 21953 -10675 -36313 -23402 13116 31050 10367 -22788 -29551 -1063 34861 44039 17719
1391 17719 -16989 -21391 10099 42632 38960 5261 -15763 1484 37351 50668 27678 -7708
1403 -7708 -19830 2695 37207 47705 21492 -13118 -15720 14187 39001 27042 -8919 -29809
1415 -29809 -13884 19569 35707 17416 -19415 -37736 -19591 13294 20908 -7996 -38085 -34863
1427 -34863 -2896 19771 7630 -27059 -48899 -37688 -4003 16175 2597 -30777 -44992 -22369
1439 -22369 10414 14282 -15727 -42844 -37165 -3646 23547 18718 -11225 -34402 -24831 8589 29270
1452 29270 13093 -18429 -25727 3319 36533 37209 7353 -20289 -17860 12379 40274 38761 9445
1465 9445 -14128 -2636 30800 45845 23686 -10852 -17755 9856 41147 43656 16143 -13716
1477 -13716 -16395 9489 34843 28232 -5301 -26476 -11422 22897 34797 9868 -24719 -35143
1489 -35143 -14273 15026 21188 -2762 -32002 -34269 -5906 18354 6977 -29283 -48759 -30272
1501 -30272 4307 18472 -16 -31238 -42605 -23302 6174 12693 -12162 -39434 -33826 609
1513 609 25812 13630 -20158 -38602 -22088 10370 27717 13389 -15083 -24406 -774 30807
1525 30807 33685 2604 -25425 -16340 19643 43820 33673 2977 -15123 -2429 26647 41140
1537 41140 22945 -8033 -15364 12213 44010 42482 8522 -18876 -14053 14757 35262 26299 -2387
1550 -2387 -20579 -7869 21995 32945 7732 -28113 -34642 -5921 23701 22574 -6519 -31546
1562 -31546 -29472 -5208 13292 3873 -25399 -42420 -24798 8680 19288 -6205 -39120 -43896
1574 -43896 -18085 8664 9547 -13571 -35037 -30209 -1558 19435 7805 -24692 -39874 -18646
1586 -18646 15929 26905 6496 -18672 -21420 578 24730 24877 983 -20856 -12101 21591 43970
1599 43970 30410 -3010 -17772 458 29239 37649 19737 -3535 -6646 15433 39398 36077
1611 36077 6264 -18658 -10814 21168 39821 25068 -4008 -16766 -3313 19211 24699 4816
1623 4816 -21359 -26368 -1665 24195 20853 -10289 -34848 -28446 -2250 12834 474 -24234 -34995
1636 -34995 -20473 3951 11135 -8736 -37592 -41721 -15924 10261 8345 -16227 -33973 -25683 -2076
1649 -2076 12183 1796 -22320 -33342 -16109 15112 26959 7050 -20725 -23275 371 23279
1661 23279 21625 1101 -13002 -4163 20851 36152 25031 -3084 -16526 696 31060 40631
1673 40631 20550 -4302 -6140 14994 33681 30058 6701 -12153 -6293 19250 36927 24570
1685 24570 -4859 -19942 -4987 19692 23339 2480 -19782 -20079 366 19414 15627 -10334 -33777
1698 -33777 -30091 -3514 14882 4438 -22468 -34149 -19048 3163 7093 -12310 -34354 -35662
1710 -35662 -13151 10792 10615 -14164 -35271 -28688 -1806 14102 2784 -21048 -27861 -10299 14943
1723 14943 21816 4021 -19740 -23481 -641 24998 25843 2963 -15299 -5605 20386 32880 18883
1736 18883 -5212 -13300 4163 29865 37543 18716 -6507 -10430 11679 33711 28838 3000 -13743
1749 -13743 -2928 21911 33396 18955 -7097 -19663 -6560 17731 25225 5826 -18530 -20120
1761 -20120 2402 20072 11032 -16471 -32255 -21509 3620 16973 4607 -21518 -34886 -20601
1773 -20601 4402 10138 -9867 -32145 -30142 -6809 11972 5840 -16994 -32477 -24473 -487 14524
1786 14524 4317 -19808 -27939 -8665 16950 20113 -2457 -23910 -20631 3806 24486 22183 1517
1799 1517 -15089 -8188 14614 28186 16067 -7036 -12867 7967 31797 32489 10173 -11120 -9595
1812 -9595 12161 31146 27299 4643 -12220 -3269 21159 31658 14669 -11093 -17928 501 21944
1825 21944 23607 4485 -15464 -16762 1312 17493 11707 -13079 -28012 -16192 8969 18650 1339
1838 1339 -23791 -31247 -15320 5347 9602 -7993 -27666 -27181 -5876 11360 4667 -19615 -33224
1851 -33224 -21787 3045 13125 988 -18896 -24308 -9396 10354 13962 -4740 -23267 -18979
1863 -18979 6177 25257 18405 -5409 -19673 -8789 14011 24993 14504 -4027 -9838 5876
1875 5876 26573 27867 7274 -11646 -7475 15609 32010 24148 2161 -9768 -362 20113 28704
1888 28704 14253 -8738 -15285 2043 24533 25823 4240 -16044 -14889 3845 16307 9497 -9832
1901 -9832 -20650 -11041 9060 15872 -568 -24883 -30974 -12309 9531 10726 -9035 -26920 -24929
1914 -24929 -6684 7233 1807 -18401 -30165 -20240 2789 13191 -404 -21894 -26139 -8633
1926 -8633 9739 10386 -6309 -20198 -14934 5682 21230 14589 -7040 -20331 -8923 15543 26328
1939 26328 13698 -5387 -8363 6951 23985 23653 6459 -9023 -5023 15920 31913 24208 1492
1952 1492 -10905 154 20779 26129 11136 -7494 -9996 5870 23581 22437 2594 -17474 -16310
1965 -16310 4158 19119 11639 -9574 -20298 -9876 7313 10954 -3703 -22340 -25523 -9278
1977 -9278 9541 9731 -10196 -28840 -24624 -4242 8788 728 -18999 -27763 -15987 3598 11636
1990 11636 -982 -20627 -25577 -9692 10430 11763 -5456 -18651 -12226 7986 18544 9381 -9474
2003 -9474 -17281 -4644 17224 26501 13251 -7108 -11788 5127 23225 22325 4772 -7863 -1905
2016 -1905 16181 27585 19079 -85 -10904 -1030 19350 25982 10512 -9031 -10540 6907 22400
2029 22400 18146 -2011 -16658 -12698 5415 18341 11285 -8889 -20483 -11073 7172 11473 -3686
2042 -3686 -21403 -21437 -4455 10566 7381 -10499 -25788 -22195 -3154 10105 2847 -16841 -25616
2055 -25616 -12665 6619 11048 -4234 -20829 -21568 -5528 11157 11971 -3432 -17717 -13386 5097
2068 5097 16860 8413 -10446 -15914 -1455 17621 21626 7347 -9352 -11720 3922 20846 21367
2081 21367 4128 -10139 -4357 14850 24959 15035 -3875 -10516 900 17847 21856 9371 -7151
2094 -7151 -9742 5110 19972 15792 -3548 -17262 -9268 10515 19757 9438 -10514 -19160 -9299
2107 -9299 7169 12415 -82 -16434 -18179 -2977 11610 6618 -11925 -24284 -16318 1873 10887
2120 10887 2146 -15007 -22675 -12268 5338 10346 -3506 -20498 -20608 -2496 13209 9907 -6886
2133 -6886 -18235 -12493 3675 13480 7089 -8297 -14626 -2380 15469 18629 3239 -13001 -11677
2146 -11677 5673 20659 17384 2241 -9028 -4009 11842 21472 13087 -4771 -11265 2042 19962
2159 19962 22483 6930 -9182 -8639 6013 17837 14169 -899 -11761 -6193 10722 19306 8165
2172 8165 -11782 -18649 -5361 11669 13701 -633 -14985 -15610 -2225 9441 5928 -10187 -21925
2185 -21925 -15188 3142 11395 862 -16599 -21658 -9466 5085 6682 -5739 -18469 -17667 -2396
2198 -2396 11545 8815 -8834 -21434 -13503 5067 13958 5448 -9471 -12568 -1684 12036 14100
2211 14100 1627 -12225 -10201 6733 21236 17282 -332 -10772 -3000 13299 19868 10937 -3085
2224 -3085 -7353 3663 18928 21450 7060 -9099 -8664 7328 19848 14038 -2134 -10051 -2608
2237 -2608 11219 15677 5458 -10512 -16097 -4177 12056 13841 -1504 -16954 -15614 -1000 8501
2250 8501 2864 -11804 -19118 -12528 2050 9134 -735 -17316 -23474 -10468 5763 6825 -6820
2263 -6820 -18834 -14908 -861 8563 4125 -9793 -18705 -11330 5572 14695 5791 -10000 -13931 -1108
2277 -1108 13405 13422 909 -9376 -5909 8028 19143 15529 383 -9610 -2553 13975 21521 10772
2291 10772 -3512 -5909 6315 19027 18211 4849 -7831 -6768 6825 18635 15139 -1119 -11329
2304 -11329 -4114 10169 13946 2383 -11124 -13326 -1984 10650 10562 -2893 -17307 -16984 -2328
2317 -2328 9034 4088 -12268 -19460 -11398 2765 6650 -3326 -16848 -19738 -8930 4949 7248
2330 7248 -5455 -17956 -15515 -454 9761 4286 -9996 -16797 -7258 7147 13879 5617 -8683
2343 -8683 -12712 -1465 12980 15044 2278 -9103 -4752 9848 19150 12925 -923 -8354 -1334
2356 -1334 13760 20792 11714 -3164 -6898 4506 17767 16479 2068 -8592 -4604 8936 17593
2369 17593 11661 -2762 -11838 -5475 8828 13902 3052 -11858 -13483 -1240 10413 7806 -5959
2382 -5959 -17058 -14347 -1157 8181 3601 -11230 -19404 -11165 3336 7140 -3871 -17710 -18203 -5588
2396 -5588 6843 6502 -5620 -16854 -14381 -763 9829 4579 -9449 -14690 -5095 9409 12951
2409 12951 2248 -10185 -11347 683 13733 14691 2619 -8504 -5127 8881 17683 11517 -2659
2422 -2659 -7597 1589 14890 18576 8482 -4485 -6471 4102 16491 15566 2049 -8842 -4718
2435 -4718 9619 17013 8941 -5219 -11212 -3858 8422 12479 2833 -10486 -12422 -1258 9701
2448 9701 6785 -7603 -17191 -11905 1509 8602 1949 -11531 -17799 -10725 2172 5847 -3819 -16266
2462 -16266 -16540 -3489 7385 4867 -8078 -17200 -12204 986 8942 3981 -8227 -13508 -5219 8540
2476 8540 11672 1068 -10400 -9689 2942 14078 12381 855 -7313 -4104 8181 16093 10861 -1630
2490 -1630 -6915 2216 15651 17759 6849 -5164 -5227 5819 15248 13750 2410 -6179 -2891 8951
2504 8951 15419 7622 -6253 -11259 -2003 10580 11771 971 -10159 -11584 -2182 6941 4972 -6378
2518 -6378 -15521 -11232 1902 8230 -132 -13882 -17814 -9040 2352 4333 -4513 -15059 -15519 -4543
2532 -4543 5880 3961 -8659 -17102 -11382 1941 8879 2556 -8352 -11958 -3820 7365 9872 1014
2546 1014 -8696 -8358 4171 15175 12719 220 -7896 -2498 9451 15347 10527 -51 -3977 3649
2560 3649 14508 16751 6861 -4652 -4996 6920 17082 13539 1448 -6324 -2076 8143 12982 6654
2574 6654 -5121 -10298 -2677 9137 11064 -262 -12044 -11725 -1763 6639 2946 -8349 -14980 -10531
2588 -10531 527 5405 -1388 -13822 -18428 -9453 2465 4369 -5743 -15555 -14184 -3262 4355
2601 4355 2056 -8690 -15293 -10193 2827 9941 3671 -8430 -11889 -2237 8966 10349 1209 -6650
2615 -6650 -4675 5897 14000 11868 1063 -6513 -1383 11567 18015 11007 -1083 -3781 4979 14795
2629 14795 15148 5715 -3544 -3325 6927 15296 12760 405 -7955 -2965 8317 12251 3960 -7050
2643 -7050 -9630 -1542 7636 7883 -2084 -12714 -13267 -2583 5952 2767 -8830 -15846 -10433 54
2657 54 3674 -4410 -13988 -15678 -7381 2541 3979 -5948 -15413 -13994 -2424 6075 2547 -8122 -13025
2672 -13025 -6687 4336 8745 2849 -6928 -9423 -1014 9808 11731 2134 -6523 -3618 7458 14746
2686 14746 10391 -233 -4765 883 11668 16319 9741 -662 -3896 3995 14217 14265 4008 -4562
2700 -4562 -2334 7736 13923 9327 -1257 -7211 -3438 6626 10827 3647 -7633 -10251 -1407 7194
2714 7194 5714 -5068 -13134 -11183 -1146 5612 1498 -9080 -15242 -10333 214 4207 -3089 -12801
2728 -12801 -14499 -5255 3497 2915 -6038 -13383 -11077 -946 5944 3025 -6875 -11862 -5488 5888
2742 5888 9435 1891 -7677 -8080 940 10363 10718 2646 -5198 -3428 5912 12663 9229 -228 -4683
2757 -4683 1729 12069 14946 6850 -3155 -4289 3876 13083 13008 3964 -4294 -3083 6073 12436 7761
2772 7761 -2851 -7920 -2190 7127 9479 2322 -6968 -8760 -1688 6066 5417 -4136 -12385 -9810 389
2787 389 6324 1535 -9175 -14197 -8395 864 3153 -2751 -11213 -12367 -4770 3598 2828 -6144 -13400
2802 -13400 -9995 604 6447 2238 -6809 -10625 -4679 4562 7465 863 -7366 -7640 1338 10494 9588
2817 9588 405 -6464 -3462 6042 11882 8272 -286 -3922 1508 10396 12962 5706 -3246 -3994 4558
2832 4558 12787 11407 2175 -4620 -2089 6547 11735 7005 -2150 -6833 -1795 7536 10109 2705 -6956
2847 -6956 -8433 -696 6072 4193 -4234 -10131 -7209 1131 5925 387 -9579 -13574 -7606 2079 4783
2862 4783 -2836 -11879 -11836 -4266 2945 1530 -6516 -12333 -9212 368 5367 1170 -8192 -11134 -4204
2877 -4204 5084 6690 -537 -7950 -6851 1931 9242 8024 -327 -6528 -3324 6278 12038 7561 -895
2892 -895 -3672 2742 10810 11588 4956 -2666 -2281 5526 13149 11286 2550 -4368 -1432 7614 11688 6372
2908 6372 -2579 -5578 390 7977 8923 1356 -6966 -7821 -320 6772 4443 -4189 -10124 -7163 1267
2923 1267 4716 -1316 -9781 -12443 -6320 1882 3091 -4271 -12055 -12004 -3776 2815 947 -7270 -12385
2938 -12385 -8228 702 4602 328 -7779 -10083 -3675 4237 6115 -477 -7106 -5638 2810 9292 6651
2953 6651 -1291 -5915 -1619 7660 12406 7782 -347 -3224 2537 10734 11471 5102 -1849 -757 6564
2968 6564 12325 9528 1622 -3613 -302 7635 11234 5840 -2806 -5698 264 7744 7902 251 -7452
2983 -7452 -7180 122 5827 3546 -4574 -9852 -7174 551 3376 -1952 -9739 -11847 -5255 2196 2360
2998 2360 -5179 -12117 -11105 -3261 2870 859 -6534 -10992 -6963 742 4154 -199 -7925 -8976 -2421
3013 -2421 5405 5936 -364 -6535 -4945 2923 8848 6821 -1096 -4709 -193 8123 11356 6157 -1404
3028 -1404 -2618 3030 10123 10998 3975 -2199 -1285 6240 11372 8642 293 -3910 -236 7373 10040
3043 10040 4860 -2791 -5388 544 7104 6484 -631 -7229 -6410 1019 5992 3052 -5391 -9979 -6220
3058 -6220 890 3769 -1360 -8634 -10257 -4400 2016 1816 -5174 -11167 -9327 -1799 3678 577 -7068
3073 -7068 -10322 -6274 1479 4187 -246 -7152 -8120 -1527 5556 5810 -724 -6009 -4364 2949 7880
3088 7880 5400 -1742 -4491 131 7396 9804 4660 -2258 -3542 3043 10064 9890 3400 -2274 -1352
3103 -1352 5516 10009 7140 -402 -3686 472 7275 9519 3721 -3257 -4834 649 6701 6446 -713
3118 -713 -6324 -4830 1694 6001 2594 -4952 -8635 -4977 2078 4060 -1009 -8082 -9129 -3336 2024
3133 2024 1883 -4828 -10047 -8263 -1413 3449 809 -6661 -9997 -5662 1461 3377 -1211 -7366 -7390 -1635
3149 -1635 4877 4465 -1844 -6936 -4674 2266 7064 4612 -1894 -4663 -426 6470 7768 3358 -2455
3164 -2455 -3318 3269 9311 9173 2436 -3170 -807 5513 9711 6901 -233 -3240 877 7357 8873
3179 8873 3702 -2536 -3410 2025 7464 6205 -222 -5460 -3516 2684 5692 2359 -4641 -7989 -3885
3194 -3885 2586 4447 -560 -7439 -8391 -3039 2153 1367 -5080 -9504 -7071 -864 2877 -737 -6927
3209 -6927 -9831 -5624 1275 2874 -1657 -7415 -7610 -1416 4068 2957 -2913 -7060 -4706 2097 6548
3224 6548 3352 -2445 -4927 -577 5943 7589 2466 -2859 -2387 3533 9028 8140 2001 -2432 -139
3239 -139 5997 9658 6542 142 -2607 1720 7911 8667 3384 -2779 -3222 2272 7235 6436 -107 -4835
3255 -4835 -3288 2839 5652 2078 -4499 -7248 -2889 3032 3466 -1879 -7438 -8210 -3075 2098 852
3270 852 -4959 -9331 -7397 -874 2156 -1204 -7405 -9423 -4642 1204 2630 -2458 -7483 -7345 -1156
3285 -1156 4228 2989 -3031 -6870 -3629 2870 6507 3306 -2620 -4435 195 6213 7299 2677 -2180
3300 -2180 -1471 4236 9294 7568 1457 -2238 311 6415 9484 5832 -45 -2578 1641 7267 8059
3315 8059 2864 -2831 -2779 2553 7087 5359 -971 -5039 -3275 2348 5267 1482 -5097 -6985 -3058
3330 -3058 2772 3034 -2525 -7771 -7674 -2201 2148 750 -4837 -8975 -6438 -452 2196 -1045 -6954 -8434
3346 -8434 -4262 1545 2691 -2150 -6887 -6006 -484 3731 2777 -2587 -5526 -2855 3381 6384 2686
3361 2686 -2808 -3890 751 6544 7151 2158 -2064 -1616 4179 8157 6266 756 -2468 400 6410
3376 6410 8401 4587 -960 -2256 1649 6729 7165 1999 -3306 -2766 2614 6573 4374 -1349 -4975
3391 -4975 -2775 2590 4788 1321 -4604 -5852 -1846 2581 2804 -2472 -7562 -6665 -886 3064 1066
3406 1066 -4829 -8011 -5609 -255 2149 -964 -5827 -7026 -3133 2076 2508 -2533 -6751 -5405 -51
3421 -51 3917 2434 -2809 -5148 -2630 2838 5161 2224 -2903 -4078 464 5949 6056 1577 -2742 -1584
3437 -1584 3259 6950 5375 412 -2633 351 5766 7985 3867 -1159 -2709 1576 6109 6196 1912
3452 1912 -2772 -2332 2520 5685 3900 -1678 -4869 -1986 3257 5113 1184 -3989 -5375 -1601 2826
3467 2826 2379 -1843 -6083 -5307 -616 3053 1220 -4584 -7472 -4524 827 2374 -1139 -5975 -7083
3482 -7083 -2508 2163 2198 -2724 -6360 -5554 -469 3609 1772 -3159 -5257 -2662 2758 4397 962 -3698
3498 -3698 -3909 625 5358 5632 430 -3221 -2224 3165 6635 4860 -159 -2208 701 5351 6707 3226
3514 3226 -1519 -2127 2063 6523 6115 1532 -2651 -1542 3382 5966 4111 -1213 -3991 -1264 3659
3529 3659 4915 1416 -3662 -4804 -925 3306 2389 -1960 -6043 -4502 -58 2753 672 -4551 -7164
3544 -7164 -4652 458 2118 -1209 -6339 -6591 -2434 1620 1192 -2987 -6541 -5001 -52 3266 1403
3559 1403 -3928 -5432 -2206 2376 4499 995 -3426 -3441 821 5230 4583 363 -2903 -1433 3327 6342
3575 6342 4694 -276 -2229 1099 5650 6908 3368 -1384 -1332 2386 6296 5952 1224 -2349 -982 3565
3591 3565 5984 3294 -1779 -3663 -563 3730 4439 843 -3879 -4762 -964 2867 2435 -2323 -6067 -4729
3607 -4729 -45 2361 -264 -5166 -6635 -3744 922 1988 -1842 -5924 -6557 -1993 2227 1220 -2986
3622 -2986 -6341 -4311 219 3237 1031 -3600 -4772 -1853 2630 3890 671 -3285 -3077 1411 4978
3637 4978 4279 28 -2956 -609 3577 6361 4092 -192 -1947 1131 5181 6172 2715 -1681 -1518 2648
3653 2648 5802 4814 449 -2712 -1156 3129 5243 3056 -1420 -3594 -963 3289 3782 -13 -4300
3668 -4300 -3981 -599 2964 1700 -2434 -5508 -4149 -211 2324 -131 -4547 -6101 -3171 1485 2096
3683 2096 -2008 -5868 -5265 -1347 2036 1239 -2425 -5563 -3857 1044 3373 926 -3393 -4663 -1406
3698 -1406 3246 3726 323 -2780 -2793 1081 4416 3594 -440 -2691 -902 3802 5699 2962 -1396 -2446
3714 -2446 705 4924 5320 1763 -1455 -1952 2035 5418 4429 17 -2963 -864 3143 5289 2273 -1639
3730 -1639 -3120 -350 3597 3601 59 -3719 -3820 80 3572 2202 -2403 -5198 -3518 1030 2239 233
3746 233 -3520 -4720 -2144 1448 1923 -1688 -5235 -5164 -415 2517 1460 -2742 -5259 -3439 583 2375
3762 2375 380 -3260 -4309 -1314 2692 3100 -227 -4071 -3409 898 3856 2698 -1109 -3154 -866
3777 -866 3018 4738 2358 -1441 -2580 818 4556 4937 1626 -2109 -1360 2696 5284 4059 -215 -2597
3793 -2597 -328 3646 5115 2695 -1640 -2959 500 3964 3916 -100 -2764 -2291 1130 3665 2290 -2093
3809 -2093 -4684 -2715 1060 3135 442 -3813 -4780 -1671 1663 1470 -2090 -4582 -4477 -1072 1657 486
3825 486 -3338 -5380 -3398 608 2302 -503 -4021 -4631 -1324 2003 2533 -555 -3842 -3278 703 3704
3841 3704 2711 -785 -2969 -583 3269 4182 1770 -1795 -1895 965 4886 4979 1414 -1832 -986 2828
3857 2828 5436 3882 60 -1566 438 3934 4884 2138 -1243 -2365 708 4119 3823 140 -3137
3872 -3137 -2261 1328 3689 1716 -2381 -4185 -2351 1209 2458 -337 -4024 -4965 -1602 1575 1465 -2519
3888 -2519 -5232 -4154 -628 1770 214 -3352 -5363 -3016 642 2104 -593 -3829 -4183 -1130 2531
3903 2531 2230 -1183 -3603 -2258 1197 3782 2579 -1076 -2924 -220 3599 4546 1987 -1378 -1666 1677
3919 1677 4899 4472 1110 -1263 -545 3035 5164 3702 -401 -1988 213 4039 4740 1236 -1808 -2032
3935 -2032 701 3291 2742 138 -3096 -2538 922 3024 1027 -2888 -4304 -1866 1365 1933 -1090 -4036
3951 -4036 -4579 -1563 1415 1149 -2002 -4565 -3484 -286 1802 497 -3118 -4454 -2178 1380 2225 -504
3967 -504 -3068 -3494 -585 2931 2366 -634 -3148 -2128 1777 3947 2091 -1175 -2382 137 3463 4321
3983 4321 1917 -1185 -1384 1547 4313 3618 462 -1829 -847 2536 4473 2402 -740 -2140 -182 3135
3999 3135 3512 789 -2203 -2159 802 3271 2474 -832 -3547 -2108 937 2190 1162 -2456 -3606 -1498
4015 -1498 1406 2038 -811 -4207 -3534 -492 2011 1406 -1837 -3957 -2762 245 2101 318 -2562 -3861
4031 -3861 -1703 1938 2512 -120 -3152 -2785 592 2746 2215 -719 -2807 -1698 1767 3437 1755 -1378
4047 -1378 -2627 -193 2767 3547 1241 -1691 -1817 1187 3159 2931 -22 -2291 -628 2373 3918 1647
4063 1647 -1553 -2558 -92 2607 3047 349 -2165 -2358 422 2999 2349 -819 -3287 -1793 1207 2847
4079 2847 669 -2116 -3217 -885 1845 1908 -531 -3279 -3293 -145 2505 1463 -1437 -3704 -2444 658
4095 658 2177 444 -2560 -3072 -1318 1849 2035 -483 -3308 -2707 266 2372 1722 -1530 -2976 -1564
4111 -1564 1285 2633 861 -2076 -2766 -299 3111 2850 511 -2201 -1763 986 3429 2594 -558 -2271
4127 -2271 -923 2004 3666 1643 -952 -1889 169 2873 2644 386 -1743 -1478 1139 3248 2258 -1022
4143 -1022 -2616 -910 1718 3012 1171 -2220 -2694 -563 1989 2107 -527 -2868 -2383 111 2111 938
4159 938 -1854 -3731 -2107 1003 2181 -111 -2787 -3357 -1152 1204 1641 -1176 -3283 -3054 53 2223
4175 2223 1562 -1618 -3043 -1242 1421 2481 936 -1659 -2547 23 2860 2904 296 -1681 -1522 1442
4191 1442 3515 2436 -60 -1647 -180 2829 3504 1611 -1064 -1491 682 3140 3023 376 -1628 -1200
4207 -1200 1298 3149 2039 -754 -1991 -1124 1542 2384 642 -2213 -2816 -457 1912 1572 -1188 -3191
4223 -3191 -2524 -107 1452 549 -2390 -3411 -2267 404 1219 -627 -2908 -3427 -1028 1538 1431 -964
4239 -964 -3241 -2522 236 2179 1209 -1418 -2904 -1196 1512 2475 832 -1822 -1774 369 3042 3011 437
4256 437 -1398 -634 1692 3316 2522 -200 -1594 -52 2451 3292 1473 -963 -1331 659 3000 2477
4272 2477 163 -1765 -1004 1361 2753 1477 -1088 -2336 -991 1251 2113 22 -2591 -2818 -777 1102
4288 1102 1042 -1339 -3200 -2643 -2 1267 277 -2107 -3471 -1719 636 1498 -480 -2816 -2953 -906
4304 -906 1779 1510 -879 -2677 -1830 689 2367 1443 -1073 -2330 -604 2178 2650 1107 -1003 -1540
4320 -1540 719 2884 2742 382 -1455 -838 1615 3275 1955 -681 -1423 130 2442 3127 894 -1531
4336 -1531 -1343 846 2708 2195 -312 -1959 -1363 991 2166 1154 -1362 -2520 -1207 1063 1493 -377
4352 -377 -2452 -2644 -515 1496 1259 -1121 -3141 -2271 182 1578 410 -1822 -2933 -1583 1031 1692
4368 1692 -386 -2348 -2546 -396 1825 1370 -815 -2449 -1608 823 2536 1168 -943 -2000 -464 1865
4384 1865 2543 698 -1475 -1286 949 2530 2513 136 -1517 -519 1698 3254 1522 -630 -1726 -139
4400 -139 2079 2419 697 -1391 -1591 665 1962 1664 -380 -2014 -774 1194 2406 1208 -1479 -2083
4416 -2083 -534 1637 1813 114 -2099 -2024 -373 1351 1160 -1200 -2650 -1797 346 1663 335 -2022
4432 -2022 -2686 -1141 1182 1267 -357 -2566 -2305 -421 1328 1343 -1229 -2646 -1521 982 1705 549 -1473
4449 -1473 -2152 -651 1908 2234 529 -1582 -1473 403 2287 2050 -183 -1516 -780 1523 2699 1424
4465 1424 -874 -1684 78 2269 2583 1069 -1114 -1109 941 2654 1967 -235 -1916 -740 1239 2537
4481 2537 1393 -1383 -2020 -209 1380 1665 -323 -2071 -1855 14 1476 843 -1133 -2630 -2041 189
4497 189 1104 105 -1978 -2910 -1211 632 947 -912 -2922 -2419 -412 939 954 -1528 -2691 -1701 592
4514 592 1424 478 -1705 -2008 -195 1629 2066 423 -1556 -1057 536 2526 1812 -243 -1437 -740 1898
4531 1898 2734 1547 -551 -1243 368 2605 2862 788 -829 -460 1075 2672 1821 -152 -1468 -677
4547 -677 1691 2120 980 -1016 -1844 -371 1678 1482 -172 -1679 -2269 -204 1174 526 -1493 -2604
4563 -2604 -1625 264 736 -279 -2412 -2817 -1162 600 525 -970 -2684 -2351 -164 1310 694 -1318 -2347
4580 -2347 -1699 394 1467 210 -1567 -1911 39 1834 1892 437 -1198 -741 701 2674 1663 -143
4596 -143 -1206 -140 1795 2561 1429 -456 -681 829 2526 2320 378 -745 -586 1186 2812 1816
4612 1816 -61 -1469 -220 1498 2067 766 -1044 -1781 -358 1531 1287 -321 -1998 -1562 -95 1551
4628 1551 608 -1549 -2759 -1627 310 915 -703 -2318 -2530 -863 748 492 -979 -2375 -2259 -15
4644 -15 900 266 -1455 -2240 -1086 1005 1650 302 -1310 -1658 -260 1558 1462 -144 -1431 -985 855
4661 855 2425 1517 -91 -1202 -120 1928 2397 1332 -624 -934 729 2189 2100 470 -831 -256 1031
4678 1031 2352 1515 -250 -1344 -104 1475 1977 692 -1413 -1495 93 1788 1484 -146 -1729 -1272
4694 -1272 124 1350 820 -1230 -1889 -1130 419 706 -519 -2115 -2221 -485 861 638 -1029 -2258
4710 -2258 -1724 -5 651 -45 -1503 -2390 -1245 321 1113 45 -1754 -1854 -348 1376 1206 -504 -1699
4727 -1699 -834 957 1707 1076 -432 -1353 -373 1538 1924 933 -467 -847 750 2200 1815 142 -964
4744 -964 -185 1145 2457 1499 -85 -1181 9 1865 1997 717 -745 -912 504 1676 1245 -15
4760 -15 -1596 -1087 669 1844 731 -1259 -1960 -688 717 949 -342 -2005 -1853 -612 911 302 -1114
4777 -1114 -2219 -1634 -150 697 -202 -1789 -2454 -1151 651 733 -584 -1690 -2055 -765 1006 565 -793
4794 -793 -1971 -1359 557 1440 710 -783 -1441 336 1656 1960 710 -488 -794 800 2020 2092 277
4811 277 -816 87 1892 2277 1739 -132 -69 384 1916 2418 1004 -464 -757 745 1994 1385 -225
4828 -225 -1315 -451 669 1173 720 -899 -1630 -1090 678 885 -435 -1955 -2002 -611 285 -84 -1563 -2350
4846 -2350 -1931 -338 403 -460 -1968 -2402 -1287 130 528 -927 -1986 -2084 -451 1030 685 -929 -1792
4863 -1792 -866 709 1270 972 -725 -1028 220 1566 2203 866 -409 -203 1216 2073 1655 557 -291
4880 -291 -21 1816 2472 1745 -2 -158 618 2103 1875 841 -538 -613 611 1599 1178 -378 -1240 -632
4898 -632 877 1314 7 -1171 -1834 -770 594 453 -742 -1754 -2008 -963 553 -86 -1433 -2168 -1685
4915 -1685 -211 120 -283 -1863 -2378 -1027 615 304 -465 -1731 -1465 -105 795 960 -321 -1334 -768
4932 -768 812 1599 887 -402 -759 140 1846 1862 739 -172 -333 1184 2201 1870 442 -140 176 1765
4950 1765 2512 1237 226 -873 466 1555 1726 144 -859 -635 535 1525 861 -450 -1217 -569 410
4967 410 1236 -102 -1381 -1790 -341 399 247 -671 -1634 -1641 -393 211 95 -1611 -2001 -1393 84 560 -313
4986 -313 -1398 -1919 -653 873 481 -620 -1557 -1266 -127 978 784 -622 -1234 -681 1064 1340 310
5003 310 -820 -853 152 1421 1434 337 -538 -140 951 1711 1367 388 -570 97 1554 1852 1169 -339
5021 -339 -506 613 1806 1488 433 -905 -902 823 1548 760 -279 -1316 -527 615 1117 250 -1347 -1234
5039 -1234 -475 864 797 -234 -1654 -1290 8 696 151 -1110 -1856 -866 12 845 -290 -1394 -1550 -592
5057 -592 598 372 -499 -1482 -1483 107 1127 305 -994 -1248 -491 396 1159 115 -766 -1281 207 1338
5075 1338 1338 -120 -838 -602 661 1614 1213 -105 -774 -17 1116 1654 618 -839 -741 690 1535 1643
5093 1643 127 -415 -241 723 2012 1362 -271 -804 -183 1118 1108 200 -1129 -1020 10 502 957 -566
5111 -566 -1486 -1100 8 747 220 -998 -1669 -1032 417 454 -524 -1601 -1620 -642 44 260 -878 -1502 -1595
5130 -1595 77 707 286 -1126 -1272 -504 604 848 168 -839 -923 366 1267 1102 -5 -559 -506 1019
5148 1019 1650 1203 105 -598 219 1807 1662 1229 -425 -377 870 1624 1524 417 -233 -460 770 1569
5166 1569 689 -437 -410 -92 1006 1047 28 -1127 -861 -34 576 385 -620 -1513 -1122 -145 697 -47 -1345
5185 -1345 -1840 -965 181 156 -852 -1462 -1820 -512 622 148 -798 -1759 -1026 51 699 260 -519 -1043
5203 -1043 -82 965 801 37 -680 -415 527 1324 1044 153 -392 -296 1298 1817 1344 241 -499 246 1451
5222 1451 1458 399 -203 -727 624 1386 1459 -176 -944 -151 845 1131 876 -671 -1280 -308 876 762 -216
5241 -216 -965 -1205 -138 383 490 -918 -1709 -1072 -51 580 -141 -1408 -1887 -1017 273 49 -638 -1713
5259 -1713 -1043 -467 251 559 -724 -1072 -468 485 893 487 -579 -661 -289 915 1052 206 -495 -383 454
5278 454 1458 1179 187 -513 -257 1004 1593 753 -197 -432 296 1292 1254 377 -647 -607 605 1278 911
5297 911 245 -582 -408 343 1182 480 -653 -952 -367 902 612 -267 -1156 -655 62 742 -76 -747 -1310
5316 -1310 -862 138 501 168 -1203 -1144 -537 433 593 -561 -1153 -787 -93 546 699 -623 -1225 -488 397
5335 397 1130 334 -596 -951 -192 763 979 -257 -585 -183 837 1006 519 -97 -735 -162 830 1263 661
5354 661 -323 -447 128 1231 1121 -165 -455 -277 495 1429 1198 -225 -663 -262 676 1037 527 -434 -810
5373 -810 -441 857 902 197 -701 -951 266 677 454 -350 -958 -589 382 663 164 -847 -965 -241 733
5392 733 281 -169 -1053 -1042 -237 525 216 -548 -1376 -681 310 760 20 -856 -1298 -14 818 675 -9 -741
5412 -741 -603 129 558 515 -142 -677 -120 877 919 366 -499 -653 413 838 1023 416 -703 -324 653 1151
5432 1151 708 -117 -770 -221 790 1062 349 -448 -521 295 1161 855 -69 -353 -422 396 850 516 -471 -1025
5452 -1025 -542 337 306 -134 -851 -1215 -141 102 236 -662 -1303 -970 16 316 -222 -1014 -1204 -503 269 630
5472 630 -231 -603 -762 -180 415 290 -262 -711 -532 149 1010 517 6 -630 125 829 985 828 -644 -235
5492 -235 501 1035 1242 403 -531 -230 753 1059 925 -298 -321 230 811 1171 163 -322 -586 155 888 825
5512 825 -59 -955 -428 126 695 24 -510 -1145 -558 358 456 -210 -1514 -1349 -361 422 113 -350 -1140 -1068
5532 -1068 -144 304 -7 -856 -1254 -428 120 663 101 -508 -852 62 714 683 -207 -785 -359 615 867 703
5552 703 -109 -599 264 912 1197 563 -97 115 598 1177 766 197 -295 -82 710 970 525 -315 -706 0
5572 0 676 1028 102 -802 -538 95 756 400 -338 -628 -739 102 531 81 -855 -993 -467 312 261 -109 -859
5593 -859 -1066 -75 182 125 -436 -1100 -651 184 635 -203 -783 -784 -371 449 750 152 -664 -567 97 501 275
5614 275 -148 -546 -381 531 997 538 -291 -708 15 737 794 120 -355 -67 210 742 744 222 -366 -174 467
5635 467 684 463 -479 -496 -59 328 825 139 -524 -782 -146 974 864 -254 -959 -672 416 547 -104
5654 -104 -695 -706 53 616 829 -81 -802 -463 184 524 594 -461 -744 -671 312 639 -63 -490 -485 -333 748
5675 748 759 -348 -724 -475 193 566 100 -275 -753 -511 184 689 406 -387 -539 -299 428 189 -110 -510
5695 -510 -536 91 707 773 -72 -619 -261 374 584 368 -306 -742 -125 778 535 188 -453 -233 415 931 754
5716 754 -15 -443 11 629 573 436 -360 -499 -69 372 330 -52 -737 -320 173 679 227 -365 -911 -574 216
5737 216 607 11 -600 -887 -368 422 322 -197 -994 -622 -133 80 517 -420 -968 -706 323 623 -22 -573
5757 -573 -656 -75 259 702 -4 -154 -286 458 834 261 149 -453 131 564 1029 385 -103 94 312 596
5777 596 787 428 -149 -331 355 849 705 -221 -617 -32 614 691 86 -470 -391 55 610 730 -41 -356 -718
5798 -718 143 424 321 -497 -744 -442 300 92 -232 -570 -1186 -459 56 327 -327 -1050 -449 170 359 -44
5818 -44 -520 -517 -454 773 602 316 -530 -869 116 787 456 193 -270 -105 459 721 377 264 -212 -93 665
5839 665 579 382 -269 -478 -83 635 645 44 -539 -274 364 845 439 -185 -665 -54 687 565 -62 -386 -826
5860 -826 -160 346 48 -316 -782 -587 138 548 166 -604 -692 -354 257 377 -7 -765 -601 -39 405 379 -580
5881 -580 -1156 -357 206 582 524 -455 -453 -401 407 402 28 -207 0 112 738 785 72 -10 -103 269 739 296 -287
5904 -287 -420 175 743 612 65 -733 -331 24 1141 679 145 -383 -398 362 339 417 -354 -731 -201 276 417
5925 417 -154 -730 -955 -54 356 135 -304 -512 -486 232 441 160 -610 -765 -91 405 215 166 -567 -612 -207
5946 -207 592 58 -140 -529 -494 322 599 109 -267 -533 116 549 509 139 -579 -499 34 413 407 -321 -566 -313
5968 -313 400 571 285 -107 -329 122 496 561 32 -695 -468 -351 349 637 -119 -531 -485 85 725 628 -178
5989 -178 -175 -229 645 975 266 -167 -267 156 755 255 -22 -670 -92 600 644 548 -323 -528 -251 308 487 91
6011 91 -484 -755 54 264 160 -317 -675 -619 126 286 161 -206 -901 -150 295 298 -123 -644 -804 -190 494
6032 494 284 -323 -711 -4 62 119 219 -495 -350 11 523 713 -50 -245 -406 268 661 657 -65 -408 -175
6053 -175 268 550 222 -187 -136 210 438 491 303 -283 -393 1 572 457 -105 -254 -293 492 667 161 -337
6074 -337 -537 -291 368 316 -179 -519 -387 -156 38 -157 -738 -725 -270 126 526 -671 -405 -462 -361 307 237
6095 237 -133 -476 -192 21 559 476 32 -696 -203 249 386 26 -354 -215 49 507 797 -54 -71 281 524
6116 524 579 683 164 -266 -130 511 418 437 -305 -255 351 504 532 221 -423 -27 425 439 210 -246 -301 -315 167
6139 167 344 -188 -355 -892 73 180 367 -381 -758 -609 133 354 -155 -644 -757 -430 -9 513 89 -670
6159 -670 -722 -92 476 186 -301 -228 -411 -70 209 -35 -96 -28 249 436 324 439 -297 -245 202 367 819 167
6181 167 -220 68 321 648 588 36 -348 43 849 446 252 -118 -422 3 518 469 -161 -526 -117 213 605
6202 605 168 -267 -537 -368 367 226 25 -425 -238 113 277 320 -398 -618 -240 5 8 -13 -595 -407 -236
6223 -236 254 105 173 -469 -673 321 613 651 39 -585 -500 303 524 163 -448 -442 -162 2 248 370 -449 -96
6245 -96 -85 511 357 224 -107 -387 -91 499 -12 77 -262 -47 350 290 186 -252 -330 -103 570 198 -65 -477
6267 -477 -99 268 233 341 -217 -348 -166 603 398 -75 -266 -424 44 261 289 1 -590 -434 -156 183 134
6288 134 -228 -640 -178 172 551 -76 -388 -363 169 418 310 -147 -322 -223 11 330 -295 -351 -317 89 201
6309 201 703 -74 -451 -191 48 202 379 30 -552 29 225 337 190 -71 -94 -31 415 539 20 -41 -259
6330 -259 144 278 453 -72 76 80 576 523 161 187 -365 -7 506 719 -102 -354 -536 231 418 316 -487
6351 -487 -736 -234 -33 298 87 -431 -477 -31 116 501 -366 -148 -790 -95 153 -4 -180 -241 -122 21 133
6372 133 -175 -438 -441 -77 147 485 -148 -287 -319 9 582 607 32 -430 -21 704 565 150 -188 -213 326 493
6394 493 419 292 -77 -282 209 560 232 144 -191 37 233 330 -54 -124 159 -48 398 462 68 -87 -458 -131
6416 -131 500 90 -587 -546 -428 499 98 -357 -499 -634 -515 47 -118 -187 -658 -300 37 367 52 -303 -411
6437 -411 -333 251 458 102 -260 -458 118 331 394 164 -358 38 373 517 246 131 -47 -174 513 521 454 188
6459 188 -147 -10 349 605 -67 -296 -345 259 438 185 -164 -133 -24 246 368 380 -263 -230 -181 212 256 -239
6481 -239 -718 -634 -209 254 -95 -324 -371 -327 -22 147 105 -691 -511 -310 323 181 -92 -495 -535 45 39 63 42
6504 42 -297 -86 225 258 302 -388 70 362 394 179 168 38 -277 152 362 381 -134 -344 90 293 777 330
6526 330 -93 -438 206 102 532 61 -123 -251 -134 302 5 -264 -261 -340 182 220 76 -124 -73 76 91 176
6548 176 -73 -361 -291 -87 411 410 -142 -512 -186 223 145 58 -231 -210 6 -21 206 -65 -314 -79 466 262
6570 262 -86 -189 -164 103 394 667 26 -139 -278 9 473 381 -104 -79 -288 293 543 279 -325 -486 54
6591 54 140 335 227 -433 -306 328 225 493 -170 -257 -166 75 332 488 -550 -304 79 202 676 -103 -224
6612 -224 -274 97 208 367 -304 -341 -147 306 249 189 -168 -589 -66 323 87 15 -299 143 89 408 437 -184
6634 -184 -444 -188 -92 -16 -26 -135 -383 -342 204 381 -57 -595 -207 150 220 237 -16 -219 27 342 415 331 -390
6657 -390 -279 -70 106 521 379 -228 -267 420 346 145 -178 -276 86 327 245 84 -96 1 -126 7 546 365
6679 365 -371 -466 -85 362 332 -86 -375 -275 35 300 -70 -85 -406 -180 104 548 -45 -368 -261 125 210
6700 210 127 -569 -416 -261 -143 66 -170 -171 -241 -360 150 222 348 -143 -442 -11 167 151 -65 -207 250 242 637
6723 637 -290 -214 -144 414 444 247 359 -156 -127 453 417 351 174 28 -113 275 452 328 -61 -136 -181 235 269
6746 269 -132 -350 -245 258 254 -43 -221 -466 -371 57 87 -200 -306 -524 -231 22 24 90 -414 -269 59 -9 79
6769 79 -135 -245 -224 -59 211 187 -188 -404 -168 164 296 258 -84 -50 165 531 390 120 -236 16 177 692
6791 692 330 289 -244 -141 304 288 146 -221 39 105 479 133 54 -188 39 3 209 152 -353 -171 54 235
6813 235 -164 -176 -391 -234 -174 34 8 -291 -260 -131 -117 278 86 -461 -215 -270 -186 362 -142 -411 -399 -129 182
6836 182 283 -271 -157 -7 169 72 48 -49 -227 20 251 165 -23 23 -172 440 516 406 -16 -286 -18 37
6858 37 345 190 -94 -209 282 299 388 -72 -322 41 160 304 253 47 -396 9 -10 10 -109 -96 -132 -74 -34
6881 -34 -81 -185 -592 -291 143 322 76 -310 -575 -179 13 137 29 -173 -138 256 114 120 65 -204 -266 -208 330
6904 330 298 -179 -426 -60 492 181 40 -111 -183 -42 618 214 -50 -90 -123 77 381 -230 -121 -138 -97 -25
6926 -25 10 -90 -186 30 -11 235 338 -70 -315 -174 144 34 164 -127 -118 46 347 232 182 -318 -193 -39
6948 -39 -78 195 -157 -83 -230 85 156 306 -72 -301 -446 75 385 -25 -141 -269 105 65 527 -40 -207 -364
6970 -364 213 75 -17 -300 -223 163 91 227 -164 -298 -455 152 112 86 -313 -292 -398 255 195 211 -252 -365 -207
6993 -207 273 110 158 -235 -279 23 272 251 -90 -86 -233 -40 486 254 -79 -105 -56 -70 300 96 125 -239 -262
7016 -262 140 479 24 85 -74 403 307 59 -300 -120 15 97 169 16 -111 -167 -23 25 -159 -88 -363 -100
7038 -100 59 154 -44 -286 -392 -163 -53 -52 -205 -220 -380 -19 112 160 -215 -190 -427 -80 253 160 -37 -375
7060 -375 -20 181 173 223 170 -160 232 305 451 -54 6 150 329 237 152 192 -230 193 282 222 361 99 27 378
7084 378 176 311 -235 -18 -33 -20 78 132 -326 -388 -360 175 99 -386 -192 -522 -241 -26 -18 -115 -486 -364 -45
7107 -45 81 -308 -584 -315 -185 177 294 -22 -134 38 322 162 143 250 -211 -173 -19 240 -230 -4 -153
7128 -153 290 314 283 251 111 -249 639 290 65 91 15 -119 365 239 -104 51 1 311 15 84 -193 -323
7150 -323 -116 107 -130 78 -99 -427 -227 -118 -157 234 -179 -480 35 -61 314 95 -410 -244 -303 402 191
7171 191 -55 -86 -104 187 -170 96 -119 -380 -179 133 233 134 49 -16 -209 407 382 278 7 13 35 373 -21
7194 -21 192 -218 -77 366 117 357 -32 -19 208 258 103 29 -65 24 -114 47 26 -35 -147 -195 -57 386 -190
7217 -190 -34 -204 155 129 15 29 -270 -2 -185 -246 411 -28 -263 -47 -4 152 198 -327 -252 -69 9 81 -96
7240 -96 -147 -323 224 157 160 238 144 -3 -239 -78 177 139 63 12 357 185 -251 -41 -54 -149 241 580 -310 -119
7264 -119 -297 77 385 175 -195 52 164 286 367 -116 -252 149 187 306 56 -109 -408 139 -41 196 -12
7285 -12 293 -191 60 262 -163 -110 -138 158 320 197 183 -232 -223 -213 68 103 61 -230 -222 77 -22 4 -299 -543
7309 -543 38 -49 275 -189 78 -251 289 537 -48 -172 -157 -386 64 297 125 48 -204 -53 -216 198 -79
7330 -79 -248 -320 -261 210 308 -127 187 -4 -95 229 -4 -288 250 427 439 198 303 -149 40 210 215 29 140
7353 140 -304 -179 164 69 183 289 -67 -36 46 79 207 -194 -32 43 -23 71 -281 -445 -380 94 -30 119 -33
7376 -33 -219 -55 197 65 -120 -286 -137 -225 -20 -240 -248 -328 -229 85 -66 263 25 -310 -155 -64 201 110 -381
7399 -381 122 -151 -185 266 -25 176 261 -61 400 325 130 -186 513 264 121 16 -89 -105 -226 240 142 170
7421 170 2 169 -160 284 263 206 -138 -68 -69 -68 186 -23 -91 -175 231 -125 115 -223 -213 -216 46 -7 -297 -418
7445 -418 89 125 -173 -195 -111 59 -345 251 300 -113 -294 186 68 89 29 -217 54 115 -27 132 169 -44 257
7468 257 192 344 312 187 21 2 151 119 181 -67 44 -20 115 373 69 -421 -147 -129 333 110 -38 69
7490 69 -233 -58 -121 45 -132 -222 -373 65 -55 34 -93 -189 74 253 42 -76 -72 53 68 -189 -14 -241 -261
7513 -261 -507 -57 209 152 -295 -80 -75 117 138 -47 -263 94 73 297 210 71 -316 20 295 239 178 -239 175
7536 175 418 366 155 68 215 -163 245 148 135 -224 -50 251 64 300 172 -97 29 255 81 21 30 -331
7558 -331 -45 102 298 26 -285 -33 -74 331 -92 -119 -53 -253 2 16 -165 -125 -249 -114 183 284 17 -306
7580 -306 -266 -152 -29 -99 -328 -297 164 -2 42 99 -55 -235 -7 126 52 75 103 138 -37 146 -62 109 -429
7603 -429 104 126 84 9 -33 -26 -293 -240 -45 44 -222 -210 -139 -100 203 122 -377 9 174 49 134 385 -100 -2 120
7628 120 297 225 -128 48 101 68 136 13 -103 138 122 122 -174 -59 13 -279 152 201 -251 76 -428 -117 -182
7651 -182 70 -69 -302 43 80 17 -143 -394 -354 70 19 102 -161 -169 -156 -74 -29 -150 -10 -170 -144 92 327 -37
7675 -37 -36 -135 -11 33 -60 -49 -48 91 -12 332 422 -81 -106 151 -36 153 259 -318 -69 50 281 194 199 -162 -140
7700 -140 152 261 -65 21 125 -93 -225 39 -55 -287 -298 -209 -134 -102 44 -173 -472 -54 -125 187 -113 -388
7722 -388 -109 -202 167 25 -182 -223 271 -95 -1 -95 -273 186 -357 42 -29 -147 167 -133 526 82 -101 133
7744 133 204 210 39 18 73 295 -45 193 104 117 -193 -169 19 31 492 117 -319 -182 113 48 102 -19 -59 -179
7768 -179 79 369 -75 -343 -224 68 -5 -57 -159 -257 -285 -182 -328 -110 -182 -328 -212 -257 215 68 -150 -245
7790 -245 -64 128 261 -53 -266 -142 279 4 -2 -50 -267 88 54 195 320 448 -98 -241 29 61 25 8
7812 8 168 241 268 37 -67 8 11 27 447 -95 -360 -130 -227 -37 415 232 -225 11 -26 -45 -139 -96 -207 -420
7836 -420 67 150 -382 -192 -399 -396 -2 -15 -112 21 71 -94 88 72 22 -116 74 372 -183 -39 -162 -104 -64
7859 -64 118 33 31 -63 -92 95 369 -182 160 -1 152 -118 -132 9 -117 -51 99 100 212 168 -381 -264 -62 101
7883 101 -40 -91 -19 -23 9 -250 140 -98 -51 -189 -86 83 5 -279 193 -104 164 180 180 -137 -397 -39 -56 55
7907 55 -19 -357 -329 134 141 88 -49 77 79 153 82 -38 42 -62 -155 14 232 102 118 -65 61 -12 -116 -286 42
7932 42 204 178 -3 96 -164 83 196 -262 -240 49 -167 210 380 90 -141 162 -8 43 184 -143 -86 86
7954 86 -273 -10 -17 217 263 -83 281 70 267 68 292 196 125 307 -1 16 76 265 92 221 -141 117 -66
7977 -66 -133 181 315 -1 93 3 -293 165 390 -61 -20 -393 -216 123 42 -183 -506 -189 61 118 -49 -188
7999 -188 -239 -68 151 96 49 -123 -189 128 305 88 -54 -289 -239 -108 12 -10 114 -76 196 115 336 -270
8021 -270 151 132 -61 357 0 176 103 -19 -72 319 205 273 47 -245 175 220 -37 156 -135 123 271 163
8043 163 162 -97 -42 -81 -124 -96 -199 -200 -198 104 26 -535 -120 -272 134 73 -287 -359 -22 -241 30 -127 -140 -124 -193
8068 -193 7 85 -7 35 -26 -96 26 456 -58 -116 -99 -27 239 170 -33 228 214 101 -26 70 149 -56 31 334
8092 334 -49 -57 228 -159 65 185 285 157 58 -214 118 313 -95 93 -196 -234 -40 -259 245 -16 -169
8113 -169 -84 -40 -1 191 44 193 -36 -80 29 -143 -141 -751 -191 -79 -80 -11 -13 -271 219 -11 -159 170 36 47
8137 47 -115 -168 -83 147 397 6 -50 320 114 -48 -76 285 360 30 -19 158 58 -123 -195 112 -204 97 -13
8160 -13 188 259 -243 -12 -79 -86 36 134 -126 -288 -94 -142 18 -113 -213 -14 -229 -108 -70 -6 -315 123 168
$$ [...]
8191a13
##END NTUPLES=NMR FID
##END=
