##TITLE=1H_LR-676-R2-C1
 CDCl3, 8 sc, 
 27.6.2019
##JCAMPDX= 6.0         $$ Bruker NMR JCAMP-DX V2.0
##DATA TYPE= NMR FID
##DATA CLASS= NTUPLES
##ORIGIN= UXNMR, Bruker Analytische Messtechnik GmbH
##OWNER= root
$$ XWIN-NMR		Version 3.5
$$ Thu Jun 27 16:47:45 2019 Russian Standard Time (UT+4h)  she@DPX200
##.OBSERVE FREQUENCY= 200.13155
##.OBSERVE NUCLEUS= ^1H
##.DELAY= (6, 6)
##.ACQUISITION MODE= SIMULTANEOUS
##.ACQUISITION SCHEME= undefined
##.AVERAGES= 8
##.DIGITISER RES= 18
##SPECTROMETER/DATA SYSTEM= spect
##.PULSE SEQUENCE= zg30
##.SOLVENT NAME= CDCl3
##.SHIFT REFERENCE= (INTERNAL, CDCl3, 0, 15.7039)
##AUDIT TRAIL= $$ (NUMBER, WHEN, WHO, WHERE, WHAT)
$$ ##TITLE= Audit trail, XWIN-NMR		Version 3.5
$$ ##JCAMPDX= 5.01
$$ ##ORIGIN= Bruker BioSpin GmbH
$$ ##OWNER= she
$$ F:/spectra/data/she/nmr/H-F/1/audita.txt
$$ ##AUDIT TRAIL=  $$ (NUMBER, WHEN, WHO, WHERE, WHAT)
(   1,<2019-06-27 16:46:58.29 +0400>,<she>,<DPX200>,
      <created by zg, POWCHK disabled, PULCHK disabled
       configuration hash MD5:
       00 E9 B6 7A A2 85 ED C7 34 08 36 98 17 FE 4E 26
       data hash MD5: 16K
       19 70 E9 83 0A 1C 69 3E 8A 8F 72 8A 64 06 8F A6>)
$$ ##END=
$$ 
$$ hash MD5
$$ 7B 6F 74 C5 03 66 32 66 9B D3 BF 8D 90 08 6A 8B
##$RELAX= 
##$RELAX= 
##$RELAX= 
##$RELAX= 
##$RELAX= 
##$RELAX= 
$$ Bruker specific parameters
$$ --------------------------
##$DU= <F:/spectra>
##$EXPNO= 1
##$NAME= <H-F>
##$PROCNO= 1
##$TYPE= <nmr>
##$USER= <she>
##$AMP= (0..31)
100 100 100 100 100 100 100 100 100 100 100 100 100 100 100 100 100 100 
100 100 100 100 100 100 100 100 100 100 100 100 100 100 
##$AQSEQ= 0
##$AQ_mod= 1
##$AUNM= <au_zg>
##$AUTOPOS= <>
##$BF1= 200.13
##$BF2= 200.13
##$BF3= 200.13
##$BF4= 200.13
##$BF5= 200.13
##$BF6= 200.13
##$BF7= 200.13
##$BF8= 200.13
##$BYTORDA= 1
##$CFDGTYP= 0
##$CFRGTYP= 5
##$CHEMSTR= <none>
##$CNST= (0..31)
1 1 145 1 1 1 1 1 1 1 1 1 1 1 1 1 1 1 1 1 1 1 1 1 1 1 1 1 1 1 1 1 
##$CPDPRG= <>
##$CPDPRG1= <>
##$CPDPRG2= <>
##$CPDPRG3= <>
##$CPDPRG4= <mlev>
##$CPDPRG5= <mlev>
##$CPDPRG6= <mlev>
##$CPDPRG7= <mlev>
##$CPDPRG8= <mlev>
##$CPDPRGB= <>
##$CPDPRGT= <>
##$D= (0..31)
0 1.2 0 0 0 0 0 0 0 0 0 0.03 0 0 0 0 0 0 0 0 0 0 0 0 0 0 0 0 0 0 0 0 
##$DATE= 1561639617
##$DBL= (0..7)
120 120 120 120 120 120 120 120 
##$DBP= (0..7)
150 150 150 150 150 150 150 150 
##$DBP07= 0
##$DBPNAM0= <>
##$DBPNAM1= <>
##$DBPNAM2= <>
##$DBPNAM3= <>
##$DBPNAM4= <>
##$DBPNAM5= <>
##$DBPNAM6= <>
##$DBPNAM7= <>
##$DBPOAL= (0..7)
0.5 0.5 0.5 0.5 0.5 0.5 0.5 0.5 
##$DBPOFFS= (0..7)
0 0 0 0 0 0 0 0 
##$DE= 6
##$DECBNUC= <off>
##$DECIM= 24
##$DECNUC= <off>
##$DECSTAT= 4
##$DIGMOD= 1
##$DIGTYP= 9
##$DL= (0..7)
0 120 120 120 120 120 120 120 
##$DP= (0..7)
150 150 150 150 150 150 150 150 
##$DP07= 0
##$DPNAME0= <>
##$DPNAME1= <>
##$DPNAME2= <>
##$DPNAME3= <>
##$DPNAME4= <>
##$DPNAME5= <>
##$DPNAME6= <>
##$DPNAME7= <>
##$DPOAL= (0..7)
0.5 0.5 0.5 0.5 0.5 0.5 0.5 0.5 
##$DPOFFS= (0..7)
0 0 0 0 0 0 0 0 
##$DQDMODE= 0
##$DR= 18
##$DS= 0
##$DSLIST= <SSSSSSSSSSSSSSS>
##$DSPFIRM= 0
$$ [...]
##$SUBNAM2= <"">
##$SUBNAM3= <"">
##$SUBNAM4= <"">
##$SUBNAM5= <"">
##$SUBNAM6= <"">
##$SUBNAM7= <"">
##$SUBNAM8= <"">
##$SUBNAM9= <"">
##$SW= 24.9336996594482
##$SWIBOX= (0..15)
0 0 2 0 0 0 0 0 0 0 0 0 0 0 0 0 
##$SW_h= 4990.01996007984
##$TD= 16384
##$TD0= 1
##$TE= 0
##$TE2= 300
##$TE3= 300
##$TEG= 300
##$TL= (0..7)
0 120 120 120 120 120 120 120 
##$TP= (0..7)
150 150 150 150 150 150 150 150 
##$TP07= 0
##$TPNAME0= <>
##$TPNAME1= <>
##$TPNAME2= <>
##$TPNAME3= <>
##$TPNAME4= <>
##$TPNAME5= <>
##$TPNAME6= <>
##$TPNAME7= <>
##$TPOAL= (0..7)
0.5 0.5 0.5 0.5 0.5 0.5 0.5 0.5 
##$TPOFFS= (0..7)
0 0 0 0 0 0 0 0 
##$TUNHIN= 0
##$TUNHOUT= 0
##$TUNXOUT= 0
##$USERA1= <user>
##$USERA2= <user>
##$USERA3= <user>
##$USERA4= <user>
##$USERA5= <user>
##$V9= 5
##$VALIST= <valist>
##$VCLIST= <CCCCCCCCCCCCCCC>
##$VD= 0
##$VDLIST= <DDDDDDDDDDDDDDD>
##$VPLIST= <PPPPPPPPPPPPPPP>
##$VTLIST= <TTTTTTTTTTTTTTT>
##$WBST= 1024
##$WBSW= 4
##$XGAIN= (0..3)
0 0 0 0 
##$XL= 0
##$YL= 0
##$YMAX_a= 17260
##$YMIN_a= -21267
##$ZGOPTNS= <>
##$ZL1= 120
##$ZL2= 120
##$ZL3= 120
##$ZL4= 120
##$ABSF1= 10
##$ABSF2= 0
##$ABSG= 5
##$ABSL= 3
##$ALPHA= 0
##$AQORDER= 0
##$ASSFAC= 0
##$ASSFACI= 0
##$ASSFACX= 0
##$ASSWID= 0
##$AUNMP= <proc_1d>
##$AZFE= 0.1
##$AZFW= 0.1
##$BCFW= 1
##$BC_mod= 2
##$BYTORDP= 1
##$COROFFS= 0
##$CY= 11.3945322036743
##$DATMOD= 1
##$DC= 2
##$DFILT= <>
##$DTYPP= 0
##$F1P= 18.9103706918063
##$F2P= -1.10871071338519
##$FCOR= 0.5
##$FTSIZE= 0
##$FT_mod= 4
##$GAMMA= 1
##$GB= 0.15
##$INTBC= 1
##$INTSCL= 1
##$ISEN= 128
##$LB= 0.24
##$LEV0= 0
##$LPBIN= 0
##$MAXI= 10000
##$MC2= 0
##$MEAN= 0
##$ME_mod= 0
##$MI= 1.114404
##$NCOEF= 0
##$NC_proc= 0
##$NLEV= 6
##$NOISF1= 3.799351
##$NOISF2= 2.8
##$NSP= 1
##$NTH_PI= 0
##$NZP= 0
##$OFFSET= 15.70392
##$PC= 1
##$PHC0= -8578.994
##$PHC1= 13.80098
##$PH_mod= 1
##$PKNL= yes
##$PPARMOD= 0
##$PSCAL= 0
##$PSIGN= 0
##$REVERSE= no
##$SF= 200.130013532006
##$SI= 16384
##$SIGF1= 3
##$SIGF2= 2
##$SINO= 400
##$SIOLD= 16384
##$SREGLST= <1H.CDCl3>
##$SSB= 0
##$STSI= 0
##$STSR= 0
##$SW_p= 3612.71676300578
##$SYMM= 0
##$S_DEV= 0
##$TDeff= 0
##$TDoff= 0
##$TI= <>
##$TILT= no
##$TM1= 0
##$TM2= 0
##$TOPLEV= 0
##$USERP1= <user>
##$USERP2= <user>
##$USERP3= <user>
##$USERP4= <user>
##$USERP5= <user>
##$WDW= 1
##$XDIM= 8192
##$YMAX_p= 0
##$YMIN_p= 0
$$ End of Bruker specific parameters
$$ ---------------------------------
##NTUPLES= NMR FID
##VAR_NAME=  TIME,          FID/REAL,        FID/IMAG
##SYMBOL=    X,             R,               I
##VAR_TYPE=  INDEPENDENT,   DEPENDENT,       DEPENDENT
##VAR_FORM=  AFFN,          ASDF,            ASDF
##VAR_DIM=   8192,          8192,            8192
##UNITS=     SECONDS,       ARBITRARY UNITS, ARBITRARY UNITS
##FACTOR=    0.0002004,     1,               1
##FIRST=     0,             0,               0
##LAST=      1.6414764,     0,               0
##MIN=       0,             -21267,          0
##MAX=       1.6414764,     17260,           0
$$ Real data points
##PAGE= N=1
##DATA TABLE= (X++(R..R)), XYDATA
$$ [...]
$$ plain form
751 -1104 -2307 -1404 531 1129 -383 -2253 -2289 -238 1889 2052 273 -1534 -1442 388 1922 1485 -341
768 -341 -1261 96 2353 3037 1383 -849 -1352 261 2248 2617 1192 -327 -219 1354 2452 1605 -450
785 -450 -1473 -311 1828 2662 1352 -757 -1539 -379 1277 1368 -345 -1926 -1495 549 1872 918 -1391
802 -1391 -2740 -1986 -121 904 102 -1549 -2149 -935 657 512 -1469 -3094 -2417 -50 1542 865 -1223
819 -1223 -2506 -1777 122 1170 208 -1589 -1956 -185 1877 1888 -128 -1837 -1383 614 2042 1559 -104
836 -104 -984 60 2036 2722 1099 -1200 -1538 550 2858 2994 1071 -761 -690 961 2200 1563 -329
853 -329 -1261 40 2178 2641 728 -1575 -1898 -153 1622 1539 -205 -1764 -1458 395 1670 592 -1899
870 -1899 -3060 -1577 855 1507 -159 -2121 -2322 -863 548 300 -1410 -2700 -1907 422 1783 511
$$ packed form
751a104j203R03J935N98j512j870l6K051K127J63j779j807R2J830J534m37j826
768c41r20J357K257O84j654k232n03J613J987L69j425j519J08J573J098q47k055
785d50j023J162K139Q34j310k109p82J160J656R1j713j581M31K044J323r54k309
802a391j349P54J865J025q02j651o00J214J592j45j981j625O77K367J592o77k088
819a223j283P29J899J048r62j797l67J771K062J1k016j709M54J997J428m83j663
836a04q80J044J976O86j623k299l38K088K308J36j923j832P1J651J239o37j892
853c29r32J301K138M63j913k303l23J745J775q3j744j559L06J853J275j078k491
870a899j161J483K432O52j666j962k01J459J411k48j710j290P93K329J361j272
$$ plain form
886 511 -2018 -2919 -1317 906 1421 -82 -1652 -1547 237 1873 1543 -554 -2120 -1210 1263 2619 1505
903 1505 -512 -1032 393 2018 2000 354 -1160 -749 1442 3181 2509 32 -1568 -682 1451 2409 1310
920 1310 -419 -888 327 1859 1882 75 -1760 -1538 537 2014 1166 -930 -1893 -837 798 1115 -263
937 -263 -2011 -2370 -846 1129 1381 -463 -2412 -2330 -583 661 8 -1497 -1970 -846 692 1016 -392
954 -392 -2193 -2446 -673 1330 1456 -282 -1712 -1220 491 1465 749 -803 -1457 -392 1474 2257 1090
971 1090 -701 -1053 408 1850 1653 198 -722 8 1649 2491 1573 -333 -1350 -318 1648 2384 1127
988 1127 -550 -749 516 1561 1176 -259 -1310 -924 587 1680 1054 -773 -1822 -968 569 861 -475
1005 -475 -1800 -1607 -169 1034 679 -994 -2412 -2151 -470 859 409 -1138 -1871 -997 303 508 -632
$$ packed form
886E11k529r01J602K223N15j503j570J05J784J636l30k097j566R10K473J356j114
903A505k017n20J425J625j8j646j514M11K191J739o72k477j600Q86K133R58j099
920A310j729m69J215J532K3j807j835K22K075J477q48k096r63J056J635L17j378
937b63j748l59J524J975K52j844j949Q2J747J244o53j505m73J124J538L24j408
954c92j801k53J773K003J26j738j430M92J711R74p16j552o54J065J866P83j167
971A090j791l52J461J442j97j455r20P30J641Q42r18j906j017J032J966P36j257
988A127j677j99J265J045l85j435j051L86J511J093o26j827j049Q54J537K92j336
1005d75j325J93J438J203l55j673j418K61J681J329m50j547p33Q74J300K05j140
$$ plain form
1022 -632 -1811 -1695 -218 1235 1154 -414 -1722 -1201 525 1498 693 -824 -1213 -12 1585 2011 863
1039 863 -727 -1059 246 1751 1805 482 -485 146 1562 2002 904 -615 -1009 200 1876 2355 1043
1056 1043 -775 -1156 188 1532 1225 -294 -1234 -561 826 1386 467 -1074 -1764 -925 545 917 -282
1073 -282 -1670 -1573 -149 895 275 -1400 -2347 -1655 21 1032 352 -1256 -2003 -1076 356 573 -639
1090 -639 -1692 -1248 253 1266 795 -661 -1612 -1024 576 1542 823 -687 -1019 301 1751 1668 176
1107 176 -1038 -726 778 2002 1826 446 -625 -189 1218 1823 822 -602 -664 732 1966 1711 213
1124 213 -1039 -915 391 1500 1153 -343 -1320 -642 878 1336 93 -1458 -1693 -540 694 767 -380
1141 -380 -1494 -1391 -218 608 -36 -1536 -2096 -991 630 1026 -126 -1599 -1959 -931 418 751 -269
$$ packed form
1022f32j179J16J477J453q1j568j308N21J726R73q05j517l89J201J597M26j148
1039H63j590l32J305J505N4j323r67O31J416M40j098j519l94J209J676M79j312
1056A043j818l81J344J344l07j519r40O73J387N60r19j541o90Q39J470L72j199
1073b82j388R7J424J044o20j675r47O92J676J011o80j608p47R27J432K17j212
1090f39j053M44J501J013m71j456r51N88J600R66p19j510l32J320J450q3j492
1107A76j214L12J504J224j76j380j071M36J407O05j001j424o2J396J234k55j498
1124B13j252J24J306J109l47j496r77O78J520M58j243j551k35J153J234P3j147
1141c80j114J03J173Q26o44j500n60J105J621L96j152j473l60J028J349L33j020
$$ plain form
1158 -269 -1337 -1085 325 1174 435 -1017 -1463 -359 1068 1445 540 -630 -819 261 1490 1460 93
1175 93 -1005 -454 1200 2113 1368 -88 -722 -21 1134 1541 747 -368 -496 657 1767 1377 -230 -1317
1193 -1317 -735 782 1532 810 -519 -1116 -478 628 888 -150 -1417 -1474 -161 1027 720 -716 -1726
1210 -1726 -1350 -155 504 -37 -1161 -1557 -697 577 765 -498 -1814 -1685 -244 886 663 -487 -1242
1227 -1242 -852 287 944 393 -813 -1261 -236 1236 1511 337 -838 -694 496 1338 1009 -51 -640
1244 -640 -23 1279 1883 1034 -495 -1003 43 1430 1661 619 -416 -348 594 1268 845 -319 -1013 -399
1262 -399 948 1533 579 -899 -1311 -348 773 767 -298 -1264 -1088 19 864 453 -896 -1755 -1183 111
1280 111 654 -107 -1175 -1331 -442 470 380 -686 -1638 -1390 -40 1056 717 -649 -1434 -803 428 848
$$ packed form
1158b69j068K52J410Q49p39j452m46J104J427L77r05j170j89J080J229l0j367
1175I3j098N51J654R13p45j456o34P01J155M07p94j115j28J153J110l90j607j087
1193a317N82J517P50p22j329n97O38J106K60j038j267n7J313J188l07j436j010
1210a726L76J195O59n41j124l96Q60J274J88j263j316J29J441J130k23j150p55
1227a242L90J139O57n51j206m48J025J472K75j174j175J44J190Q42l29j060n89
1244f40O17J302O04q49j529n08J046J387K31j042j035O8R42O74m23j164o94O14
1262c99J347N85r54j478m12R63J121oj065r66J76J107Q45m11j349q59N72J294
1280A11N43p61j068j56Q89R12r0j066r52K48J350J096l39j366p85O31J231M20
$$ plain form
1298 848 103 -815 -809 188 1186 1190 95 -932 -745 525 1519 1129 -51 -571 162 1260 1469 564 -527
1317 -527 -626 413 1557 1595 439 -655 -472 651 1319 732 -411 -820 -81 995 1232 279 -942 -1212
1335 -1212 -270 774 692 -406 -1219 -862 202 702 24 -1179 -1679 -951 295 765 -80 -1260 -1455 -509
1353 -509 370 155 -830 -1390 -852 269 840 281 -866 -1407 -682 584 1027 218 -787 -740 335 1196 923
1372 923 -134 -807 -359 794 1500 1025 -60 -504 219 1235 1340 386 -520 -345 738 1586 1329 174
1390 174 -712 -445 643 1254 694 -399 -705 86 976 896 -170 -1132 -1058 -50 832 645 -483 -1296 -947
1409 -947 84 513 -207 -1237 -1396 -557 392 477 -405 -1369 -1400 -448 453 287 -733 -1328 -732 403 776
1428 776 15 -985 -1161 -324 706 945 195 -673 -593 379 1146 799 -238 -732 -51 1107 1547 879 -171
$$ packed form
1298H48p45r18OR97R98Mj095j027J87J270R94l90j180n20P33J098K09r05j091
1317e27r9J039J144L8j156j094J83J123O68n87j143m09P39J076K37r53j221k70
1335a212R42J044q2j098q13L57J064N00o78j203n00P28J246M70q45j180j95R46
1353e09Q79k15r85n60N38J121N71n59j147n41P25J266M43q09j005M7J075Q61k73
1372I23j057o73M48J153P06m75j085m44P23J016J05r54r06J75J083Q48k57j155
1390A74q86K67J088O11n60j093l06P91Q90q0j066r62P4J008Q82j87j128q13L49
1409i47J031M29p20j030j59Q39R49Q5q82r64l1R52R01j66j020n95N96J135L73
1428G76p61j000j76Q37J030K39p50q68Q0R72P67l47j037m94O81J158M40o68j050
$$ plain form
1447 -171 -532 183 1176 1317 431 -378 -129 904 1489 923 -208 -738 -192 824 1258 609 -458 -799 -72
1466 -72 836 740 -318 -1149 -843 201 804 319 -746 -1326 -882 66 461 -229 -1232 -1348 -398 534 340
1485 340 -733 -1504 -1197 -196 494 217 -663 -1139 -628 361 657 -104 -1042 -981 92 1049 935 -23 -777
1504 -777 -511 454 1120 762 -142 -497 198 1205 1354 490 -432 -398 504 1303 1214 328 -371 -128 786 1331
1524 1331 720 -384 -744 35 1011 1091 235 -644 -697 24 682 483 -421 -1075 -659 353 775 46 -1063
1543 -1063 -1370 -665 222 365 -327 -1076 -1064 -309 373 104 -877 -1437 -892 214 666 55 -853 -1084 -454 367
1563 367 508 -122 -787 -646 284 984 673 -279 -770 -273 666 1087 615 -156 -344 278 1094 1140 310 -492
1583 -492 -309 673 1337 1007 127 -341 22 724 971 452 -314 -490 206 1040 985 13 -840 -712 145 714
$$ packed form
1447a71l61P15R93J41q86q09K49J033N85n66j131n30N46J016M34o49j067l41P27
1466g2R08r6j058q31L06J044O03m85j065n80M44R48L95o90j003j16R50R32j94
1485C40j073p71L07J001O90k77q80m76N11R89K96p61r38O1J073R57j14r58p54
1504g77K66R65O66l58r04l55O95J007J49q64r22L4R02P99q9q86o99K43R14N45
1524A331o11j104l60P79R76Q0q56q79n3P21O58j99r04o54M16J012M22p29j109
1543a063l07P05Q87J43o92p49J2P55O82k69r81n60N45J106M52o11r08k31O30Q21
1563C67J41o30o65J41R30P00l11r52m91M97R39M21m72p71j88O22Q16M6q30q02
1583d92J83R82O64l30q80m68L63P02K47n19p66j76O96Q34n5r72q53J28Q57N69
$$ plain form
1603 714 408 -378 -809 -466 228 461 -147 -1022 -1173 -404 424 371 -469 -1135 -961 -205 264 -24 -771 -1153
1623 -1153 -682 223 559 -43 -912 -1059 -318 434 447 -175 -696 -453 312 823 504 -344 -764 -205 771 1109
1643 1109 546 -212 -303 316 921 878 218 -314 -101 742 1300 943 -30 -522 -40 807 1020 422 -288 -330 300
1664 300 852 686 -123 -778 -573 271 804 381 -520 -907 -439 281 417 -249 -961 -1003 -308 409 326 -484 -1168
1685 -1168 -962 -147 299 -103 -835 -1031 -421 330 429 -236 -1009 -1017 -205 617 590 -170 -732 -442 335 731 322
1706 322 -366 -537 77 882 1046 407 -368 -390 397 1102 931 127 -343 56 846 1164 660 -122 -416 81
1726 81 835 1008 368 -367 -348 359 867 522 -344 -786 -366 440 756 233 -631 -941 -411 290 337 -352 -993
1747 -993 -831 -59 412 60 -759 -1182 -789 -4 365 -70 -805 -993 -374 325 286 -411 -964 -690 126 645
$$ packed form
1603G14l06p86m31L43O94K33o08q75j51P69Q28n3q40o66J74P56M69k88p47l82
1623a153M71R05L36o02q69j47P41P52J3o22n21K43P65N11l19q48m20N59R76L38
1643A109n63p58r1O19O05m3o60n32K13Q43N58l57r73m92M82Q47K13n98p10m2O30
1664C00N52j66q09o55K05Q44N33m23r01l87M68P20J36o66p12m2O95P17q3q10o84
1685a168K06Q15M46m02p32j96O10P51R9o65p73qQ12Q22k7p60n62K90P77L96m09
1706C22o88j71O14Q05J64o39p75k2P87P05j71q04m70L99P90L18n04p82k94M97
1726H1P54J73o40p35J9P07N08l45q66m42M20Q06L16n23q64l10N30P01M7o89o41
1747i93J62P72M71l52q19m23L93P85L69m35p35j88O19O99l9o97n53K74Q16N19
$$ plain form
1767 645 399 -337 -758 -365 430 769 312 -370 -449 260 939 865 170 -355 -171 498 984 782 109 -286 122
1788 122 865 1060 415 -353 -388 303 971 894 199 -399 -337 255 671 389 -317 -608 -180 498 571 -92 -810
1809 -810 -859 -210 384 308 -373 -935 -769 -70 340 -26 -774 -1060 -545 162 298 -205 -796 -819 -253 284 214
1830 214 -404 -843 -517 296 708 300 -452 -716 -209 488 707 266 -273 -301 275 821 708 30 -428 -93
1850 -93 678 1032 638 -30 -273 143 717 827 320 -258 -259 356 908 718 -44 -554 -303 350 688 311 -338
1871 -338 -569 -155 420 446 -160 -783 -734 -78 425 217 -443 -863 -601 13 275 -109 -759 -940 -402 293 379
1892 379 -233 -869 -825 -182 326 182 -342 -639 -321 273 518 86 -539 -656 -48 678 743 129 -422 -324 280
1913 280 727 578 15 -323 -37 627 912 504 -142 -307 211 772 742 151 -304 -146 449 849 551 -150
$$ packed form
1767F45k46p36m21L93P95L39m57o82p9P09O79p4o95n25J84O69M86k02o73l95M08
1788A22P43J95o45p68l5O91O68p7o95n98O2N92M16k82p06k91M28O78P3o63p18
1809h10m9O49N94p6o81n62J66O99M10l66p48k86N15P07J36n03n91k3N66N37p0
1830B14o18m39L26Q13M12m08p52k64N07O97K19m41n39k8N76N46j13o78m58L35
1850i3P71L54l94o68k43M16N74J10n07n78jO15N52j90p62n10K51O53L38l77o49
1871c38k31M14N75K6o06o23M9O56N03k08o60m20K62O14K62l84o50j81N38O95Q6
1892C79o12o36M4O43N08j44n24k97L18N94K45m32o25j17O08P26O5o14n51R8O04
1913B80M47j49n63l38K86O64K85m08o46j65N18N61l0n91m55J58N95M00k98p01
$$ plain form
1933 -150 -556 -273 424 719 308 -343 -508 -80 376 306 -233 -686 -535 73 474 184 -540 -907 -535 129
1953 129 310 -144 -712 -745 -240 264 221 -349 -828 -706 -39 419 195 -414 -696 -276 305 431 -16 -520 -505
1974 -505 57 616 596 37 -470 -302 342 737 449 -127 -327 117 678 791 321 -219 -306 170 738 728 183
1995 183 -257 -92 450 704 333 -266 -441 -18 573 697 161 -460 -554 -48 460 336 -222 -606 -389 138
2015 138 355 40 -528 -752 -389 170 300 -187 -725 -688 -102 348 136 -474 -821 -535 82 409 145 -404
2035 -404 -630 -280 260 364 -89 -514 -377 222 593 398 -168 -501 -233 388 723 439 -124 -324 96 652
2055 652 678 165 -275 -178 361 732 583 55 -289 -80 440 657 300 -264 -387 81 576 554 11 -468 -433
2076 -433 39 425 295 -243 -576 -341 202 371 -70 -631 -704 -229 232 250 -209 -643 -591 -126 242 71 -450
$$ packed form
1933a50m06K83O97K95m11o51j65M28M56p0n39m53J51O08M01k90p24l67L72O64
1953A29J81m54n68l3N05N04m3n70m79J22O67M58k24o09k82M20N81J26m47n04J5
1974e05N62N59k0n59n07J68O44L95k88n76k00M44N61J13m70n40q7M76N68j0n45
1995A83m40J65N42K54l71n99j75M23N91J24n36o21r4N06N08j24n58l84K17N27
2015A38K17l15n68k24L63N59J30m87n38L7N86M50k12o10l47K86O17L27k64n49
2035d04k26L50N40J04m53m25J37N99L71j95n66l33K68O21L35k84n63k00M20N56
2055F52K6n13m40R7N39L71j49n28l44K09N20K17l57n64j23M68M95k2n43m79L5
2076d33M72L86j30n38l33K35N43J69m41n61p3M75M61J8m59m34N2M65L68j71n21
$$ plain form
2097 -450 -729 -361 229 402 -28 -569 -631 -162 320 385 -34 -426 -330 173 536 328 -206 -430 -52 496 654
2118 654 262 -200 -256 179 623 617 129 -287 -155 404 761 524 -55 -302 -44 412 561 224 -218 -272 116
2139 116 518 421 -144 -566 -375 191 499 206 -318 -568 -321 124 269 -68 -551 -599 -158 300 184 -349 -726
2160 -726 -502 14 260 17 -432 -602 -265 207 340 -55 -547 -549 -24 435 347 -117 -424 -223 247 478 246
2181 246 -209 -369 12 546 662 218 -267 -248 214 597 490 54 -196 -24 421 651 353 -180 -361 -1
2201 -1 510 582 136 -298 -286 98 404 268 -159 -455 -279 215 430 100 -450 -592 -217 231 240 -174 -551 -476
2223 -476 -70 257 138 -333 -664 -464 62 303 22 -429 -505 -134 258 232 -167 -508 -397 91 479 359 -138
2244 -138 -452 -222 288 486 197 -186 -225 115 495 493 91 -284 -205 268 640 454 -39 -273 -11 423 541
$$ packed form
2097d50k79L68N90J73m30n41o2M69M82O5m19l92R6N03L63k08n34k24L78N48J58
2118F54l92m62n6M35M44om88m16J32N59L57k37n79k47K58M56J49l37m42n4L88
2139A16M02r7n65m22J91N66L08k93n24k50K47M45J45l37m83m8M41M58j16n33l77
2160g26K24N16K46k43m49j70L37M72J33l95m92kN25M59q8m64l07K01M70K31k32
2181B46m55j60L81N34J16m44m85J9M62L83j07m36k50J72M45K30k98n33j81L60
2201aN11P2m46m34J2L84L06j36m27k96J76M94K15l30n50j42L75M48Rm14l77P5
2223d76M06L27j19m71l31K00N26K41k81m51p6L71L92k6l99l41J11M88L88j20m97
2244a38l14K30N10J98k89l83l9L40L80km02l75P9M73L72j86m93k34K62M34J18
$$ plain form
2265 541 234 -194 -302 40 475 494 74 -357 -296 144 408 195 -253 -433 -169 247 361 36 -444 -582 -219
2286 -219 238 250 -171 -550 -418 14 244 0 -429 -587 -298 156 304 0 -458 -527 -134 282 241 -162 -447
2307 -447 -270 179 419 218 -203 -400 -120 361 517 165 -248 -239 179 543 444 25 -267 -131 315 598 414
2328 414 -43 -246 15 447 498 124 -265 -212 201 523 401 -40 -386 -292 148 414 204 -254 -427 -134 238
2349 238 253 -129 -492 -460 -76 256 176 -261 -580 -428 15 238 -23 -437 -554 -213 188 232 -112 -464 -434 -49
2371 -49 284 208 -209 -428 -193 275 431 138 -262 -339 3 389 474 162 -193 -163 226 533 378 -26 -232 33
2393 33 446 580 298 -121 -222 63 448 485 137 -231 -185 204 452 261 -161 -373 -159 221 364 87 -321
2414 -321 -444 -143 214 194 -186 -523 -423 -27 218 48 -339 -544 -368 29 159 -85 -445 -495 -119 226 183
$$ packed form
2265E41l07m28j08L42M35J9m20m31O1M40K64k13m48j80K64M16J14l25m80j38L63
2286b19M57J2m21l79J32M32K30k44m29j58K89M54J48l04m58o9L93M16m1m03k85
2307d47J77M49K40k01m21j97K80M81J56l52m13RM18L64r9m19k92J36M46K83j84
2328D14m57k03K61M32N1l74l89N3M13L22j22m41l46R4M40K66k10m58j73K93L72
2349B38J5l82l63L2L84L32q0m37l19J52M43K23k61m14j17L41M01M4l44l52L0L85
2371d9L33p6m17k19K35M68J56k93m00p7L42L86Q5l12l55L0L89L07j55m04k06K65
2393C3M13J34k82m19j01K85L85L7l48l68M6L89K48j91m22k12K14L80J43k77m08
2414c21j23L01L57k0l80l37J00L96K45j70l87k05J76L97J30k44l60n0L76L45m3
$$ plain form
2435 183 -211 -485 -361 41 308 200 -152 -329 -136 250 388 113 -234 -217 162 505 440 66 -207 -98 287
2456 287 527 400 9 -167 50 424 521 216 -159 -171 140 425 365 17 -248 -160 174 381 176 -248 -430
2477 -430 -152 213 292 -18 -383 -446 -150 127 96 -232 -491 -384 -3 192 -37 -448 -568 -285 104 196 -75
2498 -75 -381 -413 -118 195 171 -172 -408 -231 195 379 169 -197 -275 -18 327 407 151 -160 -147 203 522 449
2520 449 61 -186 -39 348 523 302 -26 -133 105 417 441 117 -227 -206 163 443 340 -66 -314 -189 129
2541 129 263 69 -259 -380 -120 191 191 -152 -499 -457 -83 183 68 -276 -492 -340 -19 142 -49 -391 -486
2562 -486 -195 160 200 -114 -407 -317 36 262 148 -170 -317 -129 247 413 196 -173 -263 58 390 407 105
2583 105 -125 -27 284 476 309 -17 -173 28 400 525 257 -115 -174 96 393 349 23 -213 -132 165 357
$$ packed form
2435A83l94k74J24M02K67j08l52j77J93L86J38k75l47J7L79L43o5l74k73J09L85
2456B87K40j27l91j76K17L74R7l05l75j2L11K85o0l48k65Q8L34K07k05m24j82
2477d30K78L65P9l10l65o3K96K77l1l28k59J07L81J95k29m11j20K83L89R2k71
2498g5l06l2K95L13k4l43k36J77M26J84k10l66p8K57L45Q0k56l11J3L50L19p3
2520D49l88k47J47L87J75k21l28j07K38L12K4l24l44K1L69K80j03m06k48J25L18
2541A29J34j94l28j21K60L11%l43l47M2L74K66j15l44k16J52L21J61j91l42r5
2562d86K91L55M0l14k93R0L53K26j14l18j47J88L76J66k17l69r0L21L32J7l02
2583A05k30R8L11J92j67l26j56K01L72J25k68l72n9K70K97m4l26k36Q1K97J92
$$ plain form
2604 357 203 -185 -349 -159 172 246 -27 -338 -356 -81 161 120 -203 -460 -377 -48 191 49 -307 -466 -241
2625 -241 65 138 -125 -396 -372 -84 195 189 -127 -372 -282 77 280 140 -167 -253 -7 292 331 84 -197 -165 121
2648 121 424 407 64 -176 -70 277 445 261 -43 -151 81 370 403 135 -148 -152 137 370 290 -53 -257 -124
2670 -124 191 328 113 -217 -347 -136 154 218 -41 -325 -323 -41 165 51 -267 -440 -267 49 185 -9 -315
2691 -315 -464 -232 91 154 -86 -350 -317 -17 195 100 -175 -322 -162 154 285 131 -163 -240 2 318 341 55
2713 55 -181 -126 182 414 318 27 -139 6 281 402 220 -61 -128 131 394 371 77 -189 -129 160 358 256
2735 256 -50 -228 -99 176 270 40 -256 -305 -55 193 179 -116 -357 -308 -43 142 35 -256 -411 -252 48
2756 48 142 -99 -372 -384 -126 130 98 -153 -344 -286 4 208 101 -194 -318 -137 181 278 79 -172 -168 64 299
$$ packed form
2604C57j54l88j64J90L31P4k73l11j8K75K42m1l23k57Q3L29K39j42l56j59K25
2625b41L06P3k63k71K4K88K79ol16k45R0L59K03j40l07q6K46K99L9k47k81L2K86
2648A21L03j7l43k40J06L47J68j84l04j08K32K89L3k68k83mK89K33q0l43k04J33
2670a24L15J37k15l30j30K11K90O4k59k84KK82K06j14l18j73J73L16J36j94l06
2691c15j49K32L23O3k40k64L3L00K12r5k75j47J60L16J31j54k94p7K42L16K3k86
2713E5k36N5L08K32r6k91j66J45K75J21j82k81o7K59K63k3k94k66O0K89J98j02
2735B56l06j78J29K75R4k30k96m9K50K48j4k95k41M9K65J85j07k91j55J59L00
2756D8R4k41k73j2K58K56l2k51j91N8K90K04j07k95j24J81L18R7j99k51MK32K35
$$ plain form
2779 299 267 24 -155 -50 242 439 282 -33 -169 40 330 420 207 -59 -73 134 358 303 41 -161 -43
2800 -43 219 352 175 -144 -255 -63 196 237 3 -256 -271 -57 178 113 -174 -385 -283 -6 117 -31 -298
2821 -298 -373 -194 54 85 -143 -391 -359 -93 163 109 -165 -352 -230 52 194 48 -177 -244 -35 235 271 40
2843 40 -182 -161 118 356 284 35 -118 8 261 377 209 -34 -97 123 367 390 133 -107 -67 180 353 262
2865 262 -14 -165 -45 210 287 96 -156 -247 -46 182 148 -82 -292 -247 13 154 43 -240 -393 -269 17
2886 17 134 -37 -298 -367 -175 51 40 -177 -338 -263 -12 140 49 -212 -324 -162 113 224 55 -195 -208 16
2908 16 252 251 31 -148 -80 153 327 237 8 -96 49 303 348 160 -77 -80 145 365 335 96 -112 -77 161
2931 161 288 196 -55 -154 -7 206 233 13 -213 -225 -23 179 143 -115 -303 -234 -5 114 -8 -262 -341 -174
$$ packed form
2779B99l2k43j79J05K92J97j57l15j36K09K90R0k13k66j4K07K24n5k62k02J18
2800d3K62J33j77l19j11J92K59M1k34k59j5K14K35o5k87k11J02K77J23j48k67
2821b98p5J79K48L1k28k48L2K66K56n4k74j87J22K82J42j46k25o7K09K70L6k31
2843D0k22K1K79K38p2k49j53J26K53J16j68k43o3K20K44K3k57k40M0K47J73r1
2865B62k76j51J20K55P7j91k52r1K01K28l4k30k10M5K60J41j11k83j53J24K86
2886A7J17j71k61o9J92K26j1k17j61P5K51J52r1k61j12J62K75J11j69k50j3K24
2908A6K36jk20j79O8K33J74r0k29j04J45K54M5j88k37lK25K20l0k39k08L5K38
2931A61J27r2k51r9J47K13K7k20k26j2K02K02l6k58j88O9K29J19j22k54p9J67
$$ plain form
2953 -174 59 87 -111 -316 -317 -115 86 51 -171 -320 -231 32 157 31 -205 -279 -103 150 185 21 -169 -153 66
2976 66 257 199 -16 -167 -57 207 348 227 -9 -105 38 274 317 141 -44 -30 178 335 254 9 -130 -25
2998 -25 214 304 167 -90 -180 -7 199 221 1 -208 -184 17 162 86 -147 -281 -166 45 122 -43 -269 -326 -129
3021 -129 88 101 -131 -329 -293 -69 78 35 -174 -287 -164 42 125 -16 -217 -237 -33 170 185 -10 -199 -150
3043 -150 69 239 191 -34 -130 -5 212 271 144 -60 -92 93 294 288 89 -85 -41 174 311 224 -18 -125 9
3066 9 208 273 111 -108 -153 22 194 164 -44 -223 -166 51 174 60 -172 -282 -169 40 81 -66 -252 -275 -96
3089 -96 53 26 -177 -322 -241 -18 117 12 -218 -296 -157 65 118 -24 -207 -197 -22 165 139 -41 -166 -90 120
3112 120 247 153 -56 -116 31 241 284 126 -63 -75 117 299 264 80 -60 2 170 264 166 -37 -98 40 235
$$ packed form
2953a74K33K8j98k05jK02K01l5k22j49Q9K63J25j26k36p4J76K53L5j64j90J6K19
2976F6J91n8k15j51J10K64J41j21k36r6J43K36M3j76j85J4K08J57q1k45j39J05
2998b5K39R0j37k57r0J73K06K2k20k09K4K01J45p6k33j34J15K11P7j65k26n7J97
3021a29K17J3k32j98L6K24J47m3k09j13J23K06Q3j41k01k0K04K03J5j95j89M9
3043a50K19J70m8k25r6J25K17N9j27k04l2J85K01oj99j74M4K15J37q7k42j07J34
3066IJ99O5j62k19m5J75J72l0k08j79N7K17J23j14k32j10J13K09M1j47j86k3J79
3089i6J49k7k03j45Q1K23J35j05k30p8J39K22N3j42j83J0J75J87k6j80j25P6K10
3112A20J27r4k09o0J47K10M3j58j89j2J92J82l5j84j40O2J68R4r8k03o1J38J95
$$ plain form
3135 235 250 49 -146 -149 33 186 143 -59 -189 -141 45 125 7 -198 -266 -132 59 73 -100 -277 -263 -76 65
3158 65 3 -200 -313 -192 -1 90 -19 -196 -257 -109 85 95 -47 -190 -161 41 192 131 -68 -173 -64 147
3180 147 259 149 -40 -99 55 233 249 76 -66 -20 167 307 228 27 -91 -3 198 269 150 -45 -102 39
3202 39 204 188 11 -142 -109 61 173 99 -120 -210 -119 61 121 -25 -220 -260 -106 67 68 -108 -265 -231 -62 46
3226 46 -24 -195 -265 -128 51 93 -50 -224 -229 -57 117 121 -41 -164 -134 50 176 88 -69 -123 -5 174 232 88
3250 88 -62 -78 78 234 221 61 -77 -20 170 263 178 1 -90 27 178 220 90 -92 -84 59 192 153 -42 -163
3274 -163 -107 62 164 67 -119 -194 -89 55 87 -68 -212 -196 -45 85 43 -138 -261 -194 -2 82 -9 -177 -236
3297 -236 -113 48 83 -54 -191 -176 -24 130 97 -77 -159 -86 90 182 86 -88 -135 6 187 204 68 -71 -67 86
$$ packed form
3135B35J5k01j95lJ82J53m3k02j30M8J86Q0j18k05o8J34J91J4j73j77J4J87J41
3158F5o2k03j13J21J91R1j09j77o1J48J94J0j42j43K9K02J51o1j99j05J09K11
3180A47J12j10j89n9J54J78J6j73j42M6J87J40p9k01j18Q8K01P1j19j95n7J41
3202C9J65j6j77j53L3J70J12p4k19r0R1J80O0j46j95m0J54J73Jj76j57L4J69J08
3226D6p0j71p0J37J79M2j43j74nJ72J74Mj62j23L0J84J26q8j57n4J18J79N8j44
3250H8j50j6J56J56j3j60j38N7J90R3q5j77r1J17J51M2j30j82QJ43J33l9j95j21
3274a63N6J69J02r7j86p5J05J44L2j55j44J6J51J30m2j81j23O7J92Q4r1j68n9
3297b36J23J61L5j37j37J5J52J54l3j74q2P3J76R2r6j74m7J41J81J7j36j39MJ53
$$ plain form
3321 86 214 182 19 -59 6 161 239 132 -55 -101 43 204 212 70 -86 -102 58 170 119 -34 -136 -58 87 137
3345 137 17 -146 -171 -58 90 95 -59 -199 -183 -32 78 25 -128 -227 -155 14 82 -24 -182 -199 -67 75 72 -67
3369 -67 -195 -161 27 130 75 -82 -159 -81 83 151 79 -74 -94 45 179 185 20 -99 -51 122 234 160 -11 -82
3393 -82 16 169 212 110 -46 -62 61 197 177 33 -96 -64 83 189 109 -69 -132 -34 106 135 27 -137 -166 -31
3417 -31 96 70 -72 -180 -152 -8 69 1 -160 -228 -121 45 74 -50 -188 -224 -60 61 48 -72 -181 -125 27
3440 27 119 37 -114 -157 -42 129 149 27 -112 -103 50 173 150 18 -78 -24 126 213 128 -20 -74 39 186 191 68
3465 68 -64 -51 92 211 152 4 -99 -57 93 178 92 -63 -110 -25 91 108 -25 -152 -133 6 106 41 -110 -210
3489 -210 -137 8 63 -19 -154 -186 -82 25 38 -73 -195 -174 -36 84 22 -117 -185 -101 42 99 24 -113 -123 -30
$$ packed form
3321H6J28l2j63p8O5J55P8j07j87m6J44J61Qj42j56j6J60J12n1j53j02P8J45N0
3345A37j20j63k5J13J48Nj54j40J6J51J10n3j53r9P2J69O8j06j58j7J32J42lj39
3369f7j28L4J88J03n5j57p7P8J64O8p2j53k0J39J34Oj65j19M8J73J12p4j71p1
3393h2R8J53M3j02j56j6J23J36k0j44j29L2J47J06q0j78o3R8J40K9j08j64k9J35
3417c1J27k6j42j08K8J44P7o8j61o8J07J66K9j24j38l6J64J21j3j20j09N6J52
3440B7R2q2j51m3J15J71K0j22j39RJ53J23k3j32r6N4J50Q7q5j48n4J13J47Nj23
3465F8j32J3J43J19n9j48j03M2J50Q5q6j55m7Q5J16J7j33j27J9J39J00o5j51j00
3489b10P3J45N5q2j35l2J04J07J3j11j22K1J38J20o2j39o8Q4J43N7p5j37j0R3
$$ plain form
3513 -30 112 139 31 -89 -70 82 182 123 -13 -66 14 167 209 112 -16 -60 59 191 197 70 -48 -16 102 183
3537 183 126 -14 -95 -8 109 146 53 -92 -125 -28 108 92 -31 -155 -134 -9 65 16 -115 -184 -123 9 44 -43 -180
3562 -180 -188 -75 55 32 -104 -202 -166 -15 69 23 -87 -159 -76 51 98 6 -96 -100 33 137 110 -11 -101 -45 87
3587 87 178 131 0 -57 28 159 176 86 -27 -32 78 174 159 37 -68 -29 109 169 98 -42 -90 -6 116 133 22 -93
3613 -93 -101 -3 98 63 -62 -157 -110 23 75 8 -143 -182 -99 28 54 -48 -152 -168 -55 56 38 -101 -165 -113 26
3638 26 83 -3 -117 -144 -46 69 108 3 -99 -90 20 131 105 -2 -83 -13 124 155 87 -29 -63 33 157 156 52 -62
3664 -62 -45 83 174 143 5 -59 -9 102 139 72 -42 -68 11 118 122 -4 -120 -97 30 108 53 -70 -145 -92 30 67
3690 67 -15 -127 -152 -57 45 38 -77 -173 -134 -19 61 16 -108 -167 -114 31 73 4 -105 -124 -27 80 72 -40 -108 -63 43
$$ packed form
3513c0J42K7j08j20J9J52J00n9j36n3Q0J53M2r7j28m4J19J32Oj27j18L2J18Q1
3537A83n7j40q1Q7J17L7r3j45l3R7J36j6j23j24K1J25P4m9j31o9O1J32L5q7j37
3562a80qJ13J30k3j36r8L6J51Q4m6j10p2Q3J27M7r2j02mJ33J04k7j21r0N6J32
3587H7R1m7j31n7Q5J31J7r0j13nJ10R6j5j22j05L9J38O0p1j40m8Q4J22J7j11j15
3613i3qR8J01l5j25r5M7J33N2o7j51l9Q3J27K6j02j04j6J13J11j8j39o4N2J39
3638B6N7q6j14k7R8J15L9j05j02RJ10J11k6j07q1P0J37L1o8j16l4R6J24jj04j14
3664f2J7J28R1l1j38o4N0J11L7o7j14k6P9J07Mj26j16K3J27P8n5j23p5N3J22L7
3690F7q2j12k5R5J02pj15r6L9J15Q0m5j24n9N3J45M2o9j09j9R7J07qj12o8M5J06
$$ plain form
3717 43 121 62 -44 -87 -14 117 153 61 -46 -63 49 142 134 35 -47 -12 91 159 106 -16 -74 2 129 150 52 -46 -74
3744 -74 24 116 96 -5 -89 -79 34 98 39 -86 -137 -48 51 73 -37 -134 -137 -53 42 41 -69 -159 -135 -14 52 3 -98 -152
3772 -152 -59 46 39 -39 -135 -123 -6 88 71 -38 -118 -68 49 123 56 -26 -63 12 117 129 41 -38 -39 71 159 142 25
3799 25 -35 3 110 158 85 -10 -54 27 110 141 48 -71 -64 42 119 73 -46 -85 -57 57 85 15 -100 -136 -68 40 50
3826 50 -42 -137 -133 -29 40 -7 -103 -151 -97 8 56 -12 -130 -154 -57 34 41 -45 -119 -93 10 95 50 -34 -96 -26 75 124 55
3855 55 -55 -57 41 136 126 44 -37 -19 72 142 119 19 -36 9 125 144 68 -35 -60 51 128 111 11 -73 -57 29 94 52
3883 52 -55 -101 -58 46 72 -24 -113 -114 -34 42 36 -74 -140 -114 -16 56 -6 -95 -142 -87 17 48 -12 -102 -105 -26 64 49 -27 -94
3913 -94 -48 37 98 54 -45 -79 -12 86 122 43 -33 -46 50 118 107 13 -53 -6 93 137 88 -25 -63 3 100 107 35 -53 -50 24 103
$$ packed form
3717D3P8n9j06m3P3J31L6r2j07j7J12R3qr9q2L5J03O8n3j22n8P6J27K1r8r8k8
3744g4R8R2k0j01q4J0J13O4n9j25n1Q9R9K2j10r7lQ4R5jj10r0K4J21O6m9j01n4
3772a52R3J05pp8r6J2J17R4j7j09q0N0J17P4o7q2l7P5J05J2q8p9jJ10Q8j7j17
3799B5o0L8J07M8p3r5m4Q1Q3L1r3j19PJ06P7m6j19l9K8J14K8p0j15l6O8J08J0
3826E0r2r5MJ04O9m7r6m8N4J05M8o8j18k4R7R1Pq6p4K6J03Q5m5q4o2P0J01M9o9
3855E5j10kR8R5j0q2q1J8R1P0k3j00n5M5J16J9p6j03k5J11P7j7j00q4J6Q6O5m2
3883E2j07m6M3J04K6r6q9jQ0P6oj10o6K6R8P2o2q9m7N5J04L1o0r0lP9R0j5p6o7
3913i4M6Q5O1m4r9l4O7R8L6p9p6j3R6O8j1r4o6M7R9M4m9j13l8O6R7Pp2q8LP4P9
$$ plain form
3944 103 68 -27 -76 -49 44 85 19 -70 -110 -40 52 57 -24 -120 -111 -25 58 47 -49 -117 -72 16 54 -6 -86 -111 -24 56 67 -15 -100
3975 -100 -81 2 88 63 -30 -80 -45 36 94 36 -39 -56 15 97 87 9 -66 -48 42 105 89 -9 -57 -14 66 98 50 -38 -62 2
4005 2 80 74 -9 -66 -44 28 97 59 -39 -95 -38 59 77 20 -64 -85 -19 56 56 -16 -80 -75 14 86 27 -57 -104 -54 43 78 6 -86
4037 -86 -89 -14 70 52 -29 -88 -64 21 79 32 -38 -92 -29 51 72 12 -68 -68 0 68 64 -10 -73 -53 38 101 43 -48 -57 -8 69 95
4069 95 27 -58 -65 15 86 82 -5 -55 -54 44 91 40 -40 -69 -21 65 83 -8 -72 -74 1 72 67 -14 -90 -64 27 69 22 -57 -100 -38 36
4102 36 47 -18 -93 -79 -6 51 33 -42 -91 -72 31 80 27 -67 -93 -30 62 55 -10 -60 -62 14 72 51 -24 -68 -43 43 101 46 -28
4133 -28 -69 -6 71 85 9 -51 -40 26 89 65 -29 -70 -25 56 93 23 -40 -63 -1 67 70 -10 -65 -67 7 59 28 -36 -89 -39 32
4164 32 52 -3 -87 -90 -39 44 46 -30 -88 -89 -10 45 25 -52 -96 -47 24 42 -2 -77 -78 -5 68 69 -2 -81 -47 33 82 47 -19 -52 -7
$$ packed form
3944A03l5r5m9K7R3M1o6q9m0P0R2Nq1r6RQ6Q3j1r6o8M5Q8L8o0q0k5Q7Q0J1q2q5
3975a00J9Q3Q6k5r3n0L5Q1N8n8p5j7P1Q2j0p8p5J8R0O3j6r8m8M3Q0L2m8q8k4O4
4005BP8oq3n7K2P2O9l8r8n6N7R7J8n7q4k1O6P5%p2o4NQ9P2n9q4m7N0R7L5p2r2
4037h6lP5Q4j8q1n9K4Q5N8m7p0n4O3Q0K1o0q0%O8O8mp4o3K0R1O3n8r1rM9P7K6
4069I5o8q5pQ0P1mq7n0JR8M7n1q0k9M8Q6J8r1o4kP5P1nq1p6K6R1M2m7p9m3O2P4
4102C6J1o5p5J4P3N7j8p5m9J9J03M9n3r4k6O3R2po5n0kP6N8k1p5m4K5Q6N8n5p4
4133b8m1O3P7J4p6o0J1O6O3k4r4m1M5Q1L7p0o3k3O2O8Lq0n5kP4N2l1o4n3N0P1
4164C2K0n5q4lN1Q3Kp6n8jP9N5k0p7m4M9P1J8m4p5jP3P3Jp1p9L4Q0M9l5o6l3M5
$$ plain form
4197 -7 77 82 33 -40 -31 28 95 62 16 -48 -29 58 106 59 -24 -55 -27 69 79 19 -40 -56 10 64 40 -27 -89 -54 25 56 19 -56
4229 -56 -83 -44 22 45 -8 -75 -89 -26 37 23 -55 -88 -60 5 53 5 -60 -99 -28 46 60 12 -59 -59 16 69 54 -14 -47 -25 52
4260 52 91 46 -18 -47 11 88 94 34 -26 -39 37 84 81 7 -46 -13 45 59 29 -31 -56 -14 50 72 -9 -67 -50 4 49 30 -32
4291 -32 -84 -47 7 49 -5 -66 -79 -28 21 32 -23 -72 -71 -6 57 26 -41 -86 -49 20 68 12 -69 -53 -2 59 58 -5 -40 -37 39 80
4323 80 61 -17 -62 -12 48 91 40 -22 -23 11 81 82 18 -33 -22 41 82 58 -17 -51 -22 50 78 23 -53 -58 -9 46 44 -13 -73 -63
4355 -63 -3 45 6 -49 -80 -36 19 27 -3 -71 -78 -22 40 24 -20 -81 -50 -3 45 19 -36 -61 -25 48 53 -11 -57 -61 1 71 68 -1 -41
4388 -41 -36 30 85 50 -28 -39 14 68 82 34 -24 -37 30 86 72 10 -33 -29 42 69 50 -14 -33 -15 43 60 10 -45 -44 -2 53 28
4420 28 -27 -77 -45 17 46 11 -49 -71 -33 23 33 -10 -57 -62 -12 22 15 -45 -73 -53 12 42 22 -48 -69 -24 25 50 -5 -54 -48 8
$$ packed form
4197gQ4Nm9p3RN9O7l3m6o4J9Q7M8m7q3l1K8R6J0o0n9j6O6N4k4o7o2L5P9L1l7p5
4229e6k7L9O6K3n3o7j4O3O3j4p8l3K8O5M8m8o5l9P1P4J4m8p1%P5N3j5o8l3K2P7
4260E2L9m5o4k9N8P7Oo0o0j3P6M7lp4n3L3N8J4l0o0k5M2O4K2q1n8J7N4M5j9o2
4291c2n2L7N4M2n4o1j3N1M9J1n5m9JO5O3l1o7m5L7O9M8n6q1J6N1O1jo3l5LP6M1
4323H0j9p8m5N0O0M3n1o2jL4P0Jo4n1J1O3M1k4p5l4K9P2K8n5p6nM9N5kn7o0J0
4355f3O0M8l9n5l1M4N5Ql0o8pN6O2j6m4o1L1M7M8k6n5k5L6P3No4m6mO2P0lo9m0
4388d1NO6N5l5p8j1N3N4J4m8n8j3O7N6j4o2m3MP1K7j9o4j9J8N8J7n0n5JM2N5k5
4420B8n5n0L2O2K9l5o0k2L8N6J0m3m7nN0L4po0k8K0O5L0k0p0k1M5M9K5n5m9ON6
$$ plain form
4452 8 47 54 -20 -47 -15 32 69 28 -25 -35 -2 70 63 20 -31 -24 35 80 57 -11 -23 1 41 67 24 -39 -49 -7 65 67 -9 -51 -35
4485 -35 3 51 32 -29 -56 -29 17 37 1 -56 -80 -17 28 18 -31 -76 -53 -8 30 11 -40 -74 -42 19 41 -13 -61 -66 -2 41 45
4516 45 -1 -49 -31 25 71 52 -9 -33 -4 45 68 32 -11 -14 25 78 61 -1 -24 -4 38 79 53 -11 -39 -6 41 59 23 -34 -40
4547 -40 12 38 42 -4 -48 -41 8 50 -1 -45 -79 -33 27 29 -19 -78 -71 -25 22 15 -36 -62 -46 1 25 2 -44 -70 -34 22 34 -10 -51
4580 -51 -39 5 36 42 -9 -37 -9 38 63 28 -21 -35 8 62 63 18 -33 -22 35 76 61 15 -20 -16 39 75 32 -12 -33 0 48 49
4612 49 4 -47 -33 2 47 35 -19 -49 -50 14 37 2 -48 -54 -30 14 9 -18 -64 -48 -2 38 -4 -35 -68 -45 6 37 -7 -39 -51 -17
4644 -17 42 36 -9 -39 -26 10 39 28 -16 -40 -12 37 67 21 -22 -42 6 54 50 22 -34 -29 32 60 36 -8 -33 7 54 64 30 -28
4676 -28 -26 9 49 55 5 -31 -23 23 55 23 -8 -33 -12 40 30 4 -41 -48 -9 36 21 -3 -61 -41 5 31 18 -33 -53 -19 14 25
$$ packed form
4452HL9Pp4k7L2M7L7m1n3j0L3P2pm3n1PN9M5k3o8j2K4M0K6m3o3j0M2P2Kp6m2J6
4485c5L8M8j9o1k7K7M6K0l6n7k4O3M5j0m9m5K3M5L8j9n1l4L2O1K2n4m8nO4M3M
4516D5m6m8J8N6M6j9o1k4K9M9K3l6m3lL9N3j7o2k3K0M2M1k6o4k8L3M7J8l6n7o
4547d0N2K6Mm6m4PM9M2n1m4l4M6O0Km8n9PM6M7pn1k6J6M7K4k3m6k6L6N6J2m4m1
4580e1J2M4L1On1k8K8M7K5l5m9j4M3N4Jm5n1J1N7M1j5m6l5MN5L6m3m4k1L3M8J
4612D9m5n1J4L5M5j2n4l0jO4K3l5n0oK4M4nk7m6J6M6M0m2l1l3K3N1L1m4l2j2L4
4644a7N9om5l0J3L6K9j1m4k4K8M9L0m6m3k0M8M8mk8n6NO1K8k4m4k5M0M7J0l4n8
4676b8KL5M0On0l6QM6L2l2l1k5K1N2j0k6m5pL9M5j5k4n8K0M6K6j3n1k0L4L3J1
$$ plain form
4708 25 -3 -38 -40 1 40 25 -24 -46 -29 23 47 26 -25 -34 -5 28 41 3 -27 -25 14 49 44 0 -32 -24 33 64 35 -3 -30 2 53
4741 53 48 18 -15 -18 24 56 39 -9 -41 -12 35 51 23 -24 -31 -12 31 45 0 -31 -39 -2 32 7 -19 -49 -26 14 25 -9 -51 -59 -21
4774 -21 14 24 -5 -50 -52 -20 27 7 -38 -43 -22 18 31 2 -24 -45 -18 48 38 7 -34 -25 18 50 47 3 -23 -4 27 53 42 -11
4806 -11 -3 17 57 69 7 -27 -7 23 63 53 7 -18 -1 50 52 38 -28 -28 6 36 36 -7 -45 -29 11 29 6 -37 -55 -36 11 19 -11
4839 -11 -56 -57 -18 11 1 -31 -65 -40 -4 32 -3 -40 -57 -27 18 22 -5 -39 -43 -12 27 42 1 -21 -6 38 59 33 -2 -12 16 54
4871 54 77 33 1 -12 36 60 68 15 -5 9 43 60 29 3 -11 15 44 50 5 -27 -21 5 35 32 -15 -49 -23 14 14 -6 -51 -49 -35
4904 -35 6 -4 -36 -57 -52 -9 11 4 -36 -69 -47 -16 15 -5 -46 -45 -13 10 23 -11 -44 -31 9 46 28 -4 -15 -6 36 53 36 3
4936 3 -17 15 49 64 29 -4 8 38 63 58 3 -24 9 42 58 23 -6 -21 3 34 35 -3 -27 -23 6 31 12 -16 -50 -31 13 10 -17
$$ packed form
4708B5k8l5kM1L9j5m9k2J7N2K4k1n1rK9L3J3l8l0KL9L5nm4l2QN7L1k9l8k7L2N1
4741E3nl0l3lM2L2j7m8l2K9M7J6k8m7pJ9M3J4m5l1qL7L4k5k6l0K3M0J1l4m2qL8
4774b1L5J0k9m5kL2M7k0m5nK1M0J3k9k6k1K7O6j0l1m1RM3L2lm4k6J9L1K6j1n3
4806a1QK0M0J2o2l4K0L0M0j0m6k5J7N1Kj4o6%L4L0%m3l8J6M0J8k3m3j8J9M7Ql0
4839a1m5jL9K9j0l2l4K5L6L6l5l7j7L0M5Mk7l4mL1L9J5m1k2J5M4K1k6l5j0K8L8
4871E4K3m4l2j3M8K4Qn3k0J4L4J7l1k6j4K6K9Om5l2OK6L0lm7l4K6L7%k0m5KJ4
4904c5M1j0l2k1NM3K0pm0l3K2L1L1k0m1JL2K3J3l4l3J3M0L7j8l2j1RM2J7j7l3
4936Ck0L2L4J5l5l3J2L0K5nn5k7L3L3J6l5k9j5K4L1Jl8k4MK9K5j9k8l4J9M4lk7
$$ plain form
4969 -17 -51 -69 -35 5 6 -28 -47 -53 -12 7 -1 -48 -57 -40 3 25 -4 -33 -39 -10 31 27 8 -12 -18 18 44 34 11 8 9 40 61 29 -7
5004 -7 -3 31 53 61 23 -3 -9 33 54 44 11 -9 16 44 38 23 -14 -23 22 45 20 -7 -25 -41 3 11 13 -36 -48 -25 1 13 -13 -41
5038 -41 -47 -16 19 10 -35 -45 -29 0 19 11 -36 -53 -22 6 11 3 -25 -25 -5 35 26 -3 -24 -13 22 41 29 -14 -7 10 53 53 35 4 -15
5073 -15 23 56 49 6 0 6 46 58 28 -4 -11 6 41 46 16 -14 -25 15 40 21 -6 -23 -15 13 20 11 -20 -32 -9 22 23 -20 -41 -35 -3
5108 -3 10 12 -15 -50 -21 -4 2 -12 -25 -36 -6 12 26 -15 -33 -26 10 26 26 -16 -24 -9 24 48 33 1 -18 18 33 34 9 -3 -1 28
5142 28 52 43 5 -13 4 39 49 24 -8 -16 8 32 29 3 -31 -20 16 32 3 -11 -33 -22 11 21 -4 -41 -44 -23 12 7 -32 -48 -33
5175 -33 3 11 -6 -26 -35 -27 5 16 0 -30 -32 -4 15 8 -7 -15 -9 12 35 13 -6 -24 8 46 54 10 -3 -13 22 46 35 13 -1 1 20
5210 20 47 36 4 -1 13 39 34 15 -23 -23 21 42 14 -1 -18 -23 16 27 5 -15 -42 2 19 2 -14 -48 -24 -20 24 14 -29 -52 -29
$$ packed form
4969a7l4j8L4M0Jl4j9oM1J9qm7rJ7M3K2k9k9oK9M1mj9k0oL6K6j0k3lJL1K1l2l6
5004gML4K2Ql8k6oM2K1j0l3k0K5K8oj5l7rM5K3k5k7j8j6M4QKm9j2K3K6J2k6k8
5038d1oL1L5rm5j0J6K9J9qm7j7L1K8Nqk8%K0M0rk9k1J1L5J9j2m3PJ7M3%j8l1j9
5073a5L8L3pm3oOM0J2l0l2pJ7L5Nl0l0j1M0K5j9k7j7QK8Prl1j2K3L1Jm3k1OL2
5108cJ3Kk7l5K9J7Oj4j3j1L0J8J4m1j8PL6J6%m2qJ5L3K4j5l2j9L6J5Jk5j2KK9
5142B8K4rl8j8J7L5J0k5l2qK4K4lk6l4J1L6J6k9j4k2J1L3J0k5l7lK1L5nl9j6J5
5175c3L6Qj7k0rQL2J1j6l0kK8J9pj5qOK1K3k2j9j8L2L8Qm4j3j0L5K4j1k2j4KJ9
5210B0K7j1l2nJ4K6nj9l8%M4K1k8j5j7nL9J1k2k0k7M4J7j7j6l4K4MM4j0m3k3K3
$$ plain form
5243 -29 2 17 -7 -21 -31 -15 12 9 -9 -22 -12 0 24 15 -11 -13 4 28 38 15 -10 -11 8 29 37 13 -3 -4 20 34 38 12 -9 -1
5277 -1 29 45 20 4 -12 11 34 30 -6 -21 -2 10 16 16 -16 -32 -16 -2 7 -18 -32 -47 -12 4 8 -17 -42 -35 1 15 9 -22 -30 -20 6
5312 6 19 -8 -32 -45 4 22 15 -9 -21 -25 4 35 17 -9 -14 -12 14 25 13 -14 -11 16 31 31 1 -18 -10 24 36 27 -11 -20 -17 30 24 15 -12
5349 -12 -15 7 23 15 -7 -30 -24 11 29 9 -21 -40 -19 11 14 -9 -21 -24 -11 17 -2 -22 -29 -17 14 28 7 -18 -28 3 16 13 -4 -16
5383 -16 -5 -1 29 11 -7 -24 -17 11 24 5 -10 -22 -2 24 23 1 -25 -22 -2 21 15 -3 -14 -2 19 16 6 -23 -9 4 24 21 2 -26
5417 -26 -24 20 23 13 -9 -22 -2 15 22 4 -11 -12 5 32 23 7 -28 -9 7 26 13 -7 -14 -10 11 16 7 -10 -29 4 9 16 -4 -30 -13 21
5453 21 27 10 -14 -42 -6 5 23 9 -15 -22 -9 14 13 -1 -28 -10 13 23 14 -9 -12 -6 21 20 18 -9 -1 15 19 22 9 -8 -6 20 29 12 1
5490 1 -10 13 23 21 12 -9 -13 8 22 18 -5 -11 -15 15 19 -4 -3 -15 -14 12 18 3 -11 -27 -5 6 10 -18 -31 -28 -14 -1 1 -24 -35 -14 0
$$ packed form
5243b9L1J5k4j4j0J6K7lj8j3J0J2K4rk6kJ7K4J0k3k5jJ9K1Qk4j6jK4J4Mk6k1Q
5277aL0J6k5j6j6K3K3ml6j5J9J2O%l2j6J6J4Rk5j4j5L5J6Mk5k5PL6J4ol1qJ0K6
5312FJ3k7k4j3M9J8pk4j2mK9L1j8k6nKK6J1j2k7LK7J5%l0j9QL4J2rl8rLM7ork7
5349a2lK2J6qk2k3OL5J8k0l0j9K1L0Lk3j2lJ3K8j9k0pJ2L1J4k1k5j0L1J3lj7j2
5383a6J1ML0j8j8j7PK8J3j9j5j2K0K6jk2k6LK0K3oj8j1J2K1lj0k9J4J3K0lj9k8
5417b6KM4Lj0k2j3K0J7Pj8j5jJ7K7rj6l5J9J6J9j3k0pMK1Nrj7j9L3NPk0k6J7L4
5453B1Oj7k4k8L6J1J8j4k4pJ3K3jj4k7J8K3J0rk3lOK7jkk7QJ6MLj3j7KK6Rj7j1
5490Aj1K3J0krk1mK1J4mk3omL0Mk3Jj2JK6Oj5j4j6K2J1Mk8j3LJ4J3Kk5j1K1J4
$$ plain form
5527 0 3 -12 -37 -27 -21 5 12 -16 -30 -13 2 13 12 -4 -15 6 17 36 -6 -4 -8 0 24 27 -9 -4 -14 15 30 23 3 -15 6 17 26 3
5563 3 -8 -16 2 28 11 0 -30 -24 6 19 5 -22 -25 -10 3 -1 -17 -41 -27 -10 -5 -5 -34 -45 -34 -5 19 -13 -21 -23 -13 9 16 -6 -13 -20
5599 -20 -7 14 1 -4 -17 2 27 25 9 -10 -13 9 28 29 13 -13 3 27 37 16 -6 -7 -7 18 28 5 -15 -7 -7 16 21 9 -23 -21 0
5634 0 15 10 -15 -32 -22 6 1 -25 -21 -33 -18 -1 -9 -32 -34 -21 -5 11 -1 -26 -39 -20 -6 6 -3 -23 -17 -4 11 -2 -18 -26 -15 16 21
5669 21 9 -21 -6 -2 19 25 10 -4 -11 4 19 22 1 -19 1 16 15 13 -20 -1 3 16 24 11 -7 -11 -2 15 11 3 -21 -16 -3 2 -4 -25 -21 -17 0
5708 0 10 -4 -21 -35 0 2 -3 -9 -26 -16 10 4 -7 -29 -20 -9 -5 -5 -10 -31 -19 -2 18 6 -27 -24 -7 2 13 7 -9 -13 -4 4 12 0 -11 -18 9
5747 9 16 14 1 -10 -6 12 19 4 3 -15 1 14 17 9 -14 -28 15 11 -2 -6 -7 -24 2 21 4 -9 -17 -12 6 13 -16 -15 -11 -1 10 7 -15 -11 -15 8
5787 8 9 -5 -14 -20 -10 18 18 4 -15 -17 -11 13 17 -9 -19 -6 19 24 10 -16 -8 0 16 10 5 -5 3 17 24 11 -7 -10 3 20 27 3 -9 -4 5 23
$$ packed form
5527@Lj5k5J0OK6Pk8j4J7J5J1jj6j1K1J1J9m2KmQK4Ll6Nj0K9J5pk0j8K1J1Rk3
5563Cj1qJ8K6j7j1l0OL0J3j4k7lJ5J3mj6k4J4J7N%k9j1J1K9K4l2qkJ0K2Pk2pp
5599b0J3K1j3nj3J9K5kj6j9lK2J9Jj6k6J6K4J0k1k2j%K5J0k3k0Q%K3Nj2l2KK1
5634@J5nk5j7J0K8nk6Mj2J5J7qk3kJ3J6J6j2k5j3J9J4J2rk0OJ3J5j3j6qJ1L1N
5669B1j2l0J5MK1Oj5j4pJ5J5Lk1k0K0J5jkl3J9MJ3Qj3j8mRJ7mqk4NJ3Nok1MMJ7
5708@J0j4j7j4L5Knoj7J0K6oj1k2RJ1M%nk1J2J7K0j2l3LJ7RJ1oj6mRQQj2j1pK7
5747IPkj3j1MJ8Pj5jj8J6J3Lqk3j4M3mj3mjj7K6J9j7j3qNJ8Pk9JMJ0J1lk2MmK3
5787HJj4roJ0K8%j4j9kOK4Mk6j0J3K5Nj4k6QQJ6onj0QJ4Pj3j8lJ3J7Pk4j2NRJ8
$$ plain form
5827 23 15 -4 -12 -10 7 7 17 -7 -11 -8 5 10 8 -11 -12 -4 5 10 -14 -14 -13 -4 8 10 -16 -13 -17 2 11 -14 -25 -10 7 -4 0 -18 -15 -5 1 7 3 -11
5869 -11 -7 -9 17 25 3 1 -12 18 15 19 -9 -5 1 11 16 9 -3 -15 3 17 5 -1 -6 -10 -3 -2 9 2 -13 -4 12 24 7 -9 -28 -2 8 18 -1
5908 -1 -12 -20 -14 4 -1 -9 -10 -5 -2 16 -3 -15 -9 3 19 11 -4 -21 -6 19 19 19 1 -16 -11 10 -1 3 -8 -15 -10 11 5 3 -15 -4 -6 24 11 -2
5948 -2 -17 -14 15 12 -4 -15 -11 3 16 17 0 -22 -14 8 4 4 -6 -8 -15 -9 5 15 -10 -12 10 13 17 -1 -20 -4 19 10 9 -7 -19 6 18 16 0
5987 0 -15 -12 2 19 7 -3 -7 -11 7 18 -1 -11 -15 10 14 29 -5 -10 -11 0 11 6 -2 -2 -12 5 4 -10 -6 6 -1 4 3 -6 -18 -10 7 8 3 -4 -11
6028 -11 -13 -5 -1 7 -8 -17 -6 14 7 -1 -3 -16 -6 17 11 3 -11 -18 11 15 10 8 -9 17 22 18 12 -17 -2 2 17 5 -7 -5 -11 8 6 1 -14 -10 1 13
6070 13 5 -16 -11 -13 1 1 11 -12 -19 -16 1 3 1 -19 -17 -9 7 -5 -8 -9 5 -4 9 6 5 -16 15 20 18 1 2 -2 -7 21 15 12 -8 -5 16 29 21 4
6112 4 1 -3 15 37 2 -6 -8 10 15 16 0 -8 -4 3 8 2 2 -10 -7 0 7 7 -17 -17 -4 -8 -3 -21 -18 -13 -7 12 3 -13 -6 -9 4 -1 -5 -9 -7 -12 14 7 6 -12 1
$$ packed form
5827B3qj9qKJ7%J0k4mLJ3Nkj9jQRNk4%JRJ2Kk6LmJ9Rk5j1J5J7j1Mj8LJ0OOmj4
5869a1MkK6Qk2kj3L0lMk8MOJ0Npj2j2J8J4j2onmPJJ1pj5RJ6J2j7j6j9K6J0J0j9
5908aj1qOJ8nqjNLJ8j9j2OJ2J6qj5j7J5K5%%j8j7NK1j1Mj1pNK1okj8J1kL0j3j3
5948bj5LK9lj6j1MJ4J3Jj7k2QK2m%j0kpOJ4J0k5kK2LMj8j9J6K3rjj6j2K5J2kj6
5987@j5LJ4J7j2j0mmJ8J1j9j0mK5MJ5l4njJ1J1nq%j0J7jj4MJ2pNjrj2QJ7Jnpp
6028a1kQMQj5rJ1K0pqkj3J0K3oqj4pK9Mnkj7K6Nmok9J5MJ5j2j2KoJ9knj5MJ1J2
6070A3qk1NkJ4%J0k3pLJ7Kkk0KQJ6j2ljJ4rJ3ljk1L1Nkj7JmnK8olk0LK1J3qj7
6112DlmJ8K2l5qkJ8NJj6qMPNo%j2LPP%k4%J3mNj8LNOJ9rj6PlJ3nmmKnK6pjj8J3
$$ plain form
6159 1 8 19 8 -2 1 17 14 11 14 4 5 17 23 12 9 -4 1 13 26 14 -1 -8 -7 9 2 5 -11 -5 -1 16 14 1 -3 -10 -1 12 -4 -13 -16 -21 7 5
6201 5 -5 -18 -9 -8 9 -4 -14 -16 -13 -1 -5 2 -5 -4 5 11 21 -4 -7 -1 9 16 15 3 -3 -4 19 21 6 4 1 13 17 18 3 3 -6 -4 14 3 -3 -6 -6 7
6245 7 1 -1 -11 -14 0 2 1 -9 -27 -30 0 -1 0 -12 -15 -15 10 -10 -6 -21 -19 -13 3 -4 -18 -16 -20 8 5 6 -13 -14 -9 2 10 1 -11 -7 3 12 7 9 -13 -7
6289 -7 10 17 3 -7 -7 0 15 18 11 -17 -18 12 15 17 1 1 -7 11 15 0 -16 -9 -3 8 2 6 -4 -7 -11 -7 13 -17 -8 -9 1 -7 4 -10 -26 -7 5
6330 5 -2 3 -12 -9 -4 6 15 -5 -16 -5 0 3 0 -9 -9 -11 16 18 1 -9 -3 1 11 19 4 -12 -11 10 17 10 0 -4 10 8 7 -3 -12 -12 12 2 9 0 -26
6373 -26 -2 12 2 2 -8 -15 -14 3 8 -12 -11 -13 -11 5 10 -2 -5 -4 2 -2 -1 -14 -1 -2 5 5 -14 -8 -10 1 14 17 -3 -10 3 10 6 10 -5 8 -4 7
6415 7 7 9 2 13 6 4 6 4 -6 0 4 3 16 -3 -1 5 14 12 -9 -11 -9 1 5 8 -1 -14 1 7 15 -5 -15 -4 -8 9 -3 -5 -11 -15 -14 -6 -3 -10 -4 -11 -4 9 -13
6462 -13 -9 -19 4 8 3 -13 -14 -8 4 16 8 -3 -2 0 10 16 5 -13 7 3 5 19 5 -11 -5 10 25 8 2 -14 -3 8 4 2 2 -15 1 12
$$ packed form
6159APJ1j1j0LJ6llLj0JJ2Oj1lj3NJ2J3j2j5pJJ6pLj6OMJ7kj3mpRJ3j6rlnK8k
6201Ej0j3RJJ7j3j0kLJ2mPpJROJ0k5lOJ0Pjj2ojK3Kj5klJ2MJj5%rKJ8j1ol%J3
6245Gokj0lJ4Kjj0j8lL0jJj2l%K5k0Mj5KOJ6pj4KmK8lJj9jNJ1Qrj2MJ0RnKk2O
6289gJ7Pj4j0%PJ5Lpk8jL0LKj6%qJ8Mj5j6POJ1oMj0lmMK0l0RjJ0qJ1j4j6J9J2
6330EpNj5LNJ0Rk0j1J1NLlr%kK7Kj7j0OMJ0Qj5j6JK1Ppj0mJ4kjj0r%K4j0Prk6
6373b6K4J4j0%j0pJJ7Nk0JkKJ6Nj2lJOmJj3J3jP%j9OkJ1J3Lk0pJ3PmMj5J3j2J1
6415G%KpJ1pkKkj0OMjJ3j9KORkk1kKJ0MLrj3J5OQk0j0J1mJ7j2komJQLpOpPJ3k2
6462a3Mj0K3Mnj6jOJ2J2qj1JKJ0Oj1j8K0mKJ4j4j6OJ5J5j7oj6J1J1mk%j7J6J1
$$ plain form
6500 12 -7 -4 -14 -7 6 10 0 6 -17 -13 -4 3 5 -2 -5 -3 16 -3 -3 -12 -6 -2 3 -11 -7 -12 7 -3 -3 14 -4 -11 -2 1 8 -1 -9 0 9 5 0 -3 -5 8 7 6 -2
6547 -2 2 11 -3 12 6 6 2 2 12 7 1 -3 -1 -2 -4 4 -4 -15 4 5 7 3 -8 -13 -12 -1 7 15 -2 -7 7 -14 5 -5 -8 -16 -5 8 0 -12 -10 -13 -9 15 1
6592 1 3 -11 6 -6 10 4 -9 -7 2 16 8 11 5 7 8 27 4 -6 -5 15 20 1 4 1 11 5 6 3 3 -14 -3 4 0 -9 -18 -17 -8 -5 -3 -11 -14 -14 -23 -4 -6 -7
6638 -7 -13 -14 -2 4 -3 -18 -26 -6 -2 1 -7 -16 -16 6 -7 -3 -11 -6 -9 -2 12 -7 -7 -13 -6 10 4 -4 3 2 -6 9 6 -2 -9 -3 1 5 14 -10 -13 9 9 6 0 0 7 3 3 10
6688 10 -5 -12 -1 0 8 -6 -11 -9 2 -5 -4 -12 -20 -13 15 6 0 -13 -1 4 4 -1 -5 2 -11 -5 0 -11 -4 -11 -18 18 0 9 -6 -8 0 13 3 -3 -4 -10 2 8 4
6733 4 -5 -9 1 -2 -13 -15 -12 -4 3 0 4 -13 -19 -9 -5 -3 10 -6 -10 -14 -2 -6 -20 -22 -10 -2 -2 -13 -15 -18 -15 -3 -2 -5 -8 6 -1 8 -5 0 -14 -4 -2 -4 2 0
6779 0 -10 -14 5 8 14 -16 -3 9 2 4 -5 0 1 13 2 -2 4 -2 2 -11 3 0 -19 -16 -11 -8 -5 -8 -11 -13 -9 -7 8 -13 -9 -13 -7 -6 0 -2 -21 -18 -3 4 -3 -19
6825 -19 -11 -5 -2 -8 -2 -7 -5 5 4 10 -8 -2 0 3 0 -16 5 -1 12 4 7 8 -14 2 8 5 0 0 -22 -6 5 -10 -24 -14 -2 -1 2 -8 -5 -9 -7 -11 -4 -2 -13
$$ packed form
6500A2j9Lj0PJ3Mj0Ok3MRPKplKJ9j9%rOMNj4MnJ9j0%J7j8pRLPrqRRmnlkJ3jjq
6547bMRj4J5o%m%J0nomKjkQqj1J9JKmj1nJJ1QQj7nJ4k1J9j0lqJ1J3qj2KlMK4j4
6592AKj4J7j2J6oj3KRJ4qLoKJJ9k3j0JK0Nj9LlJ0oJl%j7J1PmrrJRLKql%rJ9kj
6638gojJ2Opj5qK0MLqr%K2j3MqNlPJ4j9%oPJ6oqPjqJ5lqpOMMRk4lK2%lo%Pm%P
6688A0j5pJ1JQj4nKJ1pJqqPK8roj3J2N%nmPj3ONj1PppL6j8Rj5kQJ3j0ojoJ2Om
6733DrmJ0lj1kLQPlMj7oJ0MKJ3j6mmJ2mj4kJ2Q%j1klLJ2JllJ4pRj3Nj4J0KkOk
6779@j0mJ9LOl0J3J2pKrNJJ2j1mOoMj3J4lj9LNLLllkMKJ5k1MmOJOkj9LJ5Ppj6
6825a9QOLoOnKJ0jOj8OKLlj6K1oJ3qLJk2J6Oln%k2J6J1j5j4J0J2JLj0LmKmPKj1
$$ plain form
6870 -13 -7 -17 -6 1 -5 -14 -19 -9 -12 -8 -11 -28 -5 -1 -10 -8 -18 1 13 3 11 -2 6 -8 -6 10 -1 -12 -8 0 4 9 -7 22 2 -1 3 -3 -5 -9 -5 7
6912 7 7 4 0 -5 -10 -1 5 -4 -13 -8 -8 -8 -4 -6 -24 -21 -5 2 -19 -21 -18 -14 -14 -10 -14 -13 -15 7 -11 -1 -4 -11 -1 -7 2 -5 -13 -4 -8 0 1 -2 -1 -5 -5 9 -1 2 0 9 5 -2
6964 -2 7 0 5 9 7 13 -10 -3 3 2 8 11 0 -3 -7 14 2 -7 3 -3 4 -7 0 -6 -8 -3 -5 -4 -6 -18 -16 -16 -1 -6 -13 -1 -18 -13 -7 -16 -2 -11 -12 -10 3 -5 -3 -5 2
7013 2 1 0 -1 5 3 1 9 -8 -5 -7 -3 14 13 10 -1 5 -1 -2 10 5 -3 5 9 9 3 14 -6 2 5 1 3 -19 -9 -7 6 3 -6 -2 -17 -15 2 -7 -10 -9 -16 -11 -4 -2 -11 -22
7063 -22 -5 -11 -13 -8 -7 -8 0 -7 -4 -11 -8 -12 -3 -10 2 -3 -18 -1 3 2 0 0 0 3 10 11 -1 -8 4 7 -2 0 3 -15 -8 2 4 -4 -7 -12 1 2 12 0 -6 -6 0 10
7111 10 -9 -3 -14 -14 -14 -2 -5 -7 -14 -9 1 -9 -10 -11 -11 -14 0 -6 -11 -11 -9 -11 -2 2 -11 -10 -7 3 3 -18 -10 -1 -2 -6 0 -4 -5 3 11 10 2 2 -9 -2 -9 8 4 15
7159 15 8 4 -5 15 -10 -3 -1 16 3 5 9 -15 11 -5 11 -12 -10 -10 1 -9 -8 -14 -29 -17 -1 -9 -3 -6 -17 0 5 0 -14 -12 -2 1 -7 -4 -11 -5 1 1
7201 1 13 2 1 5 0 0 9 8 10 9 0 8 16 -2 -3 1 0 2 8 1 -5 9 11 0 -5 -7 -5 9 7 6 -11 -7 3 3 -1 2 -2 -17 -1 12 2 -3 -21 -11 1 -6
$$ packed form
6870a3Oj0J1PornJ0lMlj7K3MrKj0J9J2j0Qj3Qj4KJ6j1j1MQMNj6K9k0lMokmMJ2
6912G%lmnnROrrN%%Mkj8LJ6Pk1kLM%MmJkK2j8J0lpJ0oRpqRmQJlJm%J4j0LkRmp
6964bRpNMkOk3POjOLj1lmK1j2rJ0oPj1PokNkJkj2K%J5npJ2j7NOrJ4rjKJ3qKkP
7013BjjjOkkQj7LkMJ7jlj1OojJ2nqQM%oJ1k0QLmKk2J0KJ3lrMj5KJ7rlJpNPKrj1
7063b2J7okNJjQpLpLmRpJ2nj5J7Mjk%%LPJj2pJ2LrKLj8PJ0KqlnJ3JJ0j2o%OJ0
7111A0j9Oj1%%J2lkpNJ0j0jj%lJ4on%KkRMj3JLJ0%k1QRjmOmjQQjq%j1PpJ7mJ1
7159A5pmrK0k5PKJ7j3KMk4K6j6J6k3K%J1j0Joj5J2J6qOlj1J7Nnj4KJ0LqLpOO%
7201AJ2j1jMn%RjKjrQQj8jMjKOpoJ4Kj1nkKJ4kjj7MJ0%mLmj5J6J3j0nj8J0J2p
$$ plain form
7247 -6 -1 -11 -7 -6 3 0 -3 -9 0 -6 -2 4 -14 -5 -6 0 1 -7 -1 -2 11 7 10 -15 8 6 6 14 7 -5 -13 1 14 -5 4 5 7 9 7 4 2 -4 0 6 15 -1 -3 0 -3 7
7297 7 0 9 4 -1 -3 4 -8 -9 -11 -4 -11 0 -8 -12 -6 -9 -7 -5 -2 -14 -10 4 -3 -3 -2 -12 -9 0 3 5 -4 -1 8 -6 0 -5 -8 -1 3 3 10 -2 -6 5 5 6 -16 -12 1 -5 7
7348 7 10 -2 -5 -2 -4 10 -9 -10 -4 -5 -9 -7 -13 -6 -8 -8 -9 7 -2 -21 -12 -12 -9 -7 -5 -10 0 -1 6 3 -9 -13 7 -10 -5 -4 4 -9 -6 4 9 0 -5 2 3 4 4 -7 1
7397 1 9 -1 6 -4 -5 -6 1 17 2 -3 -10 -3 1 -8 -8 -3 0 -2 -3 2 -4 -8 2 -3 -4 -1 -9 -4 -5 0 -2 2 -15 -4 -12 -14 -2 -15 -16 -6 -4 -6 -3 -12 -15 -9 1 1 4 -6
7447 -6 -5 -3 4 13 -6 -8 -10 -1 11 1 6 1 0 5 2 1 6 -1 14 12 -4 -4 -7 -10 1 -19 -4 -2 -6 -4 1 6 -6 -12 -3 -3 0 -6 -9 -8 -6 8 -7 8 -10 -8 -6 -8
7495 -8 2 -4 -7 -15 -1 -1 3 -4 0 2 -6 -6 -5 -2 7 2 18 6 11 -3 -2 1 16 5 6 -9 -1 11 0 -3 -13 -5 12 -6 -5 -4 -2 -21 -17 -5 -12 -3 -22 -7
7539 -7 -21 -3 -8 -10 -26 -19 -14 -8 -10 -13 -17 -14 -9 -15 -9 -6 -7 -2 -4 -5 5 -19 2 0 -3 -1 0 6 0 8 2 8 10 5 10 8 3 -5 -8 3 10 8 -2 2 9 6 7 7 5 -9 9
7590 9 3 -2 8 3 -6 -21 -1 -14 -14 -10 -8 1 -11 3 0 -6 -11 -15 -7 -8 -4 -1 1 -6 -11 -3 -10 -11 -1 -3 -1 -7 3 -7 -6 -4 -3 1 -9 -15 -2 6 2 -2 2 5 3 1 -5 3
$$ packed form
7247fNj0MJRlloRoMOj8RjOJqOjJ3mLk5K3k%Qpj2qJ4J3j9RJKKklkoMORj6kLlJ0
7297GpRnnkPj2jkPpJ1qmOlKKLj2MJ4p%Jj0LRLKrLRj4OnlPM%Pj2mJ1%Jk2MJ3oJ2
7348GLj2lLkJ4j9jOjmKoPk%jJ6rj9R%LKKnJ0jPlj2mK0j7NJQj3LJ0NrnPJJ%j1Q
7397AQj0Pj0jjPJ6j5npPMr%NLkjNomJ0njLqNjNkMj7J1qkJ2j3jJ0KkLrlOJ0%Lj0
7447fJKPRj9kkRJ2j0NnjNljNpJ5kj6%llJ1k0J5KmKNNj2oR%LolJKJ4j5J5j8KKk
7495hJ0olqJ4%MpMKq%JLRnJ6j2Nj4JLJ5j1Jj5QJ2j1lj0QJ7j8JJKj9MJ2pRj9J5
7539gj4J8nkj6PNOklmLNoOLjNkjJ0k4K1klKJOoQoOKnNknqlJ1Pkj0MPlJ%kj4J8
7590IonJ0nrj5K0j3%MKRj2J4lonmQjMLKpnQpjJ0kKoJ0j0JKJMj0oJ3QmmMLkkoQ
$$ plain form
7640 3 -3 -4 0 -11 -10 2 -10 -7 -5 -6 -5 9 -4 4 -19 3 0 -7 -2 1 -8 -19 -9 -7 -2 -6 -5 -10 -14 -4 -1 -7 -20 -9 -5 -9 -14 -10 -3 -9 -1 -2 2 1 -10 8 7
7687 7 -1 6 3 1 13 8 6 3 -2 -3 -6 5 12 12 0 2 8 14 9 4 -11 7 1 7 -2 -5 0 -11 2 7 -11 -13 -3 -7 -9 -10 -7 -2 5 -1 -3 -14 -11 -15 -4 -13 -18 -2 -9
7736 -9 -16 -4 -4 -9 -5 7 3 -10 -10 -5 -12 5 -3 1 -3 -10 -6 -4 -4 9 -9 3 9 -1 -4 3 13 4 3 9 2 4 -1 -5 6 11 5 -1 -4 -6 1 -3 -13 3 -2 -3 8 4
7784 4 -4 -2 -2 -9 -7 -7 -12 -1 -6 -14 -9 4 -3 -19 -3 -9 6 0 0 -1 3 11 -6 -2 4 -9 9 6 -1 -4 12 10 -8 0 2 -9 0 5 11 6 -8 11 -4 5 12 1
7830 1 -1 5 3 -2 1 5 7 -9 -18 -6 -12 -4 -8 1 -12 -12 -3 -8 -2 -8 4 -1 -7 -9 -5 -13 7 1 -13 -4 6 -10 -16 -12 -7 -5 -3 -8 -9 -4 -2 -8 -3 5 -2 -15 0 0 -9 8
7880 8 -4 8 -6 7 5 0 1 -2 10 2 5 -4 3 -3 6 1 -5 -8 5 -3 -7 2 4 -3 -7 1 -6 -3 7 -8 3 -3 -7 5 -6 -14 -15 10 0 -8 2 5 -12 2 -4
7925 -4 -5 -9 4 0 1 -2 -3 -2 -14 -4 -2 -9 3 -6 0 1 -2 4 -6 -18 -2 -2 6 3 -5 8 -3 -1 -3 -7 -4 4 8 -4 8 -11 -8 -4 5 2 2 8 4 2 6 -2 -5 -3 6
7974 6 -6 9 -5 1 -3 -14 -11 -8 -6 -20 -7 -5 0 4 -11 -23 2 3 -1 0 -5 -6 -7 1 -10 -3 1 12 -3 9 9 4 -2 -1 4 9 10 5 1 12 0 5 0 -1 -3 9
$$ packed form
7640CojMj1JJ2j2LKjJJ4j3Qk3K2lpNLrj1J0KNmJnmJ0Loj3J1MmnMPoQjMjj1J8j
7687GqPlkJ2nklnjlJ1P%j2KOOnnj5J8oOrlNj1J3Nj8kJ0mkjLNPokj1LmJ1rnJ6p
7736ipJ2%nMJ2mj3%NpJ7qMmpMK%J3j8J2Oj0lPJ0rjOpKnmJ1NoolkPmj0J6njJ1m
7784DqK%pK%nJ1nqNJ3pj6J6oJ5o%jMQj7MOj3J8lplJ6kj8QKj1RNOnj4J9j5RPj1
7830AkOknLMKj6rJ2oQmRj3%RnOoJ2nokMqK0oj4RJ0j6oMNKKnjNKoNQpj3J5%rJ7
7880Hj2J2j4J3knJlJ2qLrPoRnolJ3qmRKpmQpLJ0j5J1omJ2j1qjK5j0qJ0Lj7J4o
7925djmJ3mJljJj2J0KpJ2rOJlOj0j2J6%QlqJ3j1KkmLQMj2J2j9LMRl%OmkMqlKR
7974Fj2J5j4Omj1LLKj4J3KNMj5j2K5JmJnjjQj1PMJ1j5J2%noJNNJnmJ1j2NnjkJ2
$$ plain form
8020 9 7 10 0 -2 6 0 0 8 -3 2 -6 4 5 -1 8 3 4 -1 0 -6 -7 -14 1 -1 -6 -10 -11 -10 -6 -11 -1 -11 -9 -2 -4 -4 0 -5 -4 -7 1 2 -17 -12 4 5 -2 3 7 -1 -1 3 -1
8073 -1 4 4 -1 -6 0 3 -3 -4 1 2 -5 1 -6 6 4 6 -1 -13 3 -9 -4 6 -2 -12 -19 -4 -6 -9 -5 -7 2 -1 -1 -5 -8 -2 -1 -5 -6 12 -1 -7 13 2 -3 -13 -12 -1
8121 -1 -4 -5 -3 3 7 5 15 5 4 8 0 11 11 2 -6 3 -4 3 4 6 -1 -6 -8 -14 5 -1 0 7 0 6 -2 -5 -2 -7 10 -1 6 -7 -12 -15 -6 -8 5 -12 -4 -1 4 6 -2 2 13
8172 13 -10 9 9 -2 2 5 0 1 2 1 8 -1 7 5 12 9 4 8 16
$$ packed form
8020IkLj0kQo%Qj1NqJ0JoRnJnJojpJ5knmjJMnJ0j0KPk%MnJlQJj9NJ6JpNMq%Mm
8073aN%nnOLojNJpOpJ2kKpj2J6j2NJ0qj0pJ5klMkRl%mlOJmjJ8j3oK0j1nj0JJ1
8121aljKOMkJ0j0jMqJ1%rqRpPJKpnkoJ9oJPpOqlLnJ7j1Pj3nlRkJ3j7QLNKqMJ1
8172A3k3J9%j1MLnJJjPrQkPlnMQ
8191A6
$$ Imaginary data points
##PAGE= N=2
##DATA TABLE= (X++(I..I)), XYDATA
$$ plain form
0 0 0 0 0 0 0 0 0 0 0 0 0 0 0 0 0 0 -1 8 -8 8 -8 8 -8 9 -16 16 -16 18 -24 24 -28 32 -36 40 -44 49 -56 62 -68 76
40 76 -84 92 -103 114 -126 141 -157 173 -195 218 -245 278 -317 371 -439 531 -664 878 -1278 2275
60 2275 -10110 -12042 8782 5202 -4572 -9752 -5296 -4076 -2350 -772 -2571 -9763 -7301 6981 16205
75 16205 5234 -9908 -8979 4506 10201 5297 654 1312 2911 6960 13678 13829 1265 -9407 -2381
90 -2381 13791 17178 6588 -107 4195 8674 6810 3571 1534 -1942 -2342 6307 15432 9968 -5719
105 -5719 -11351 -1553 6949 3069 -4365 -5206 -2586 -1182 1031 2504 -3423 -13385 -13477 -1914 4898 -2265
121 -2265 -11045 -8462 -848 -413 -5652 -8725 -9269 -9236 -4870 3670 5763 -3790 -12783 -8726 1398 3152
137 3152 -2824 -5091 -1261 2082 2879 3724 2695 -2440 -5191 978 9205 8094 276 -1557 4874 9416
$$ packed form
0@%%%%%%%%%%%%%%%%jRj6J6j6J6j6J7k5L2l2L4m2M8n2O0o8P6q4R3j05J18j30J44
40G6j60J76j95K17k40K67k98L30l68M13m63N23n95O88q10R70j195J542k156L553
60B275j2385j932K0824l580r774n180M456J220J726J578j799p192K462J4282R224
75A6205j0971j5142R29J3485N695m904m643O58J599M049O718J51j2564j0672P026
90b381J6172L387j0590o695M302M479j864l239k037l476m00Q649R125n464j5687
105e719n632R798Q502l880p434q41K620J404K213J473n927r962r2J1563O812p163
121b265q780K583P614M35n239l073n44L3M366Q540K093r553q993M057J0124J754
137C152n976k267L830L343P97Q45j029n135k751O169Q227j111p818j833O431M542
$$ plain form
153 9416 6819 2573 848 324 1747 7355 12411 8945 60 -2593 3352 7508 4044 -393 774
168 774 4215 5049 4198 2797 -1165 -5635 -4054 3210 6208 86 -6685 -5345 345 1745 -1807 -5168
184 -5168 -6689 -6874 -4187 658 1563 -4253 -9486 -6867 -803 -655 -6088 -8645 -5013 -218 1513 227
200 227 -3215 -7366 -7827 -1940 4506 3620 -2787 -5240 -485 4573 4023 40 -2433 -1740 1475 5761
216 5761 7460 3788 -1428 -868 5317 8485 4198 -1516 -1097 4320 8445 8148 4449 -265 -2594 478
232 478 6252 7522 2148 -2721 -538 5043 5853 769 -4056 -4200 -893 2720 3820 743 -4587 -6262
248 -6262 -1780 3088 987 -6006 -9042 -4614 1469 2761 -993 -5622 -7756 -5873 -1420 976 -1899
263 -1899 -6336 -5648 151 3578 -118 -6315 -7768 -3395 2122 4264 1928 -2574 -4626 -1335 4062
$$ packed form
153I416k597m246j725n24J423N608N056l466q885k653N945M156l464m437J167
168G74L441Q34q51j401l962m470J581P264K998o122o771J340N690J400l552l361
184e168j521j85K687M845R05n816n233K619O064J48n433k557L632M795J731j286
200B27l442m151m61N887O446q86o407k453M755N058n50l983k473O93L215M286
216E761J699l672n216N60O185L168m287n714M19N417M125k97l699m714k329L072
232D78N774J270n374m869K183N581Q10n084m825j44L307L613J100l077n330j675
248f262M482M868k101o993l036M428O083J292l754m629k134J883M453K396k875
263a899m437O88N799L427l696o197j453M373N517K142k336m502k052L291N397
$$ plain form
278 4062 4855 -203 -4384 -1910 4374 7333 4678 293 -1615 106 3808 5963 3924 -424 -1188 3803
294 3803 8674 6851 65 -3915 -1384 3833 6392 4884 1193 -1572 -802 2727 4240 673 -4259
309 -4259 -4124 1233 5163 3011 -2360 -5316 -3991 -737 1246 -102 -3829 -5916 -3180 1819 2673 -2427
325 -2427 -7712 -7274 -2330 1383 776 -2392 -4555 -3769 -749 1325 -628 -4871 -5990 -1589 3833 4306
341 4306 -47 -3892 -3393 123 3046 2895 106 -2174 -585 4097 6648 3571 -1777 -3119 852 5130
357 5130 5468 2726 395 581 2869 4846 3898 5 -2848 -631 4704 7011 3586 -1512 -2918 -293
373 -293 2537 2590 159 -2334 -2281 715 3447 2077 -2810 -5933 -3910 544 2121 -509 -3766 -4152 -1825
390 -1825 649 416 -2834 -6154 -5658 -1148 2751 1733 -2729 -5276 -3541 -181 956 -910 -3253 -3218
$$ packed form
278D062P93n058m181K474O284K959k655m385j908J721L702K155k039m348p64M991
294C803M871j823o786l980K531N217K559j508l691k765P70L529J513l567m932
309d259J35N357L930k152n371k956J325L254J983j348l727k087K736M999Q54n100
325b427n285M38M944L713o07l168k163P86L020K074j953m243j119M401N422M73
341D306m353l845M99L516K923j51k789k280J589M682K551l077n348j342L971M278
357E130L38k742k331J86K288J977r48l893k853K217N335K307l425n098j406K625
373b93K830N3k431k493N3K996K732j370m887l123K023M454J577k630l257l86K327
390a825K474k33l250l320M96M510L899j018m462k547J735L360J137j866k343L5
$$ plain form
406 -3218 -175 3287 3378 -531 -4316 -3541 1071 4325 3149 -136 -1433 536 3385 4175 1971 -1336
422 -1336 -2119 1182 5441 5944 2127 -1453 -768 2685 4324 2463 -539 -1374 832 3968 4873 2072
438 2072 -2199 -3602 -664 3038 3090 -249 -2776 -1743 1107 2241 132 -3342 -4871 -2818 1045 2641
454 2641 68 -3801 -4592 -1849 742 -32 -3070 -4671 -3007 457 2370 651 -3202 -5236 -3217 737
470 737 2273 5 -2773 -2458 573 2790 1807 -1335 -3363 -2016 1821 4465 3251 -374 -2142 69
486 69 3355 3648 835 -1576 -740 2517 4885 4202 974 -1795 -1308 1894 4086 2725 -444 -1431 1022
503 1022 3735 3303 -43 -2982 -2706 359 3170 2869 -262 -2918 -2326 440 1703 -332 -3303 -3694
519 -3694 -1074 1772 1884 -1001 -4028 -4304 -1670 1026 678 -2169 -3883 -2243 901 1862 -504 -3604
$$ packed form
406c218L043L462R1l909l785P75M612L254j176l285j297J969K849P90k204l307
422a336p83L301M259N03l817l580O85L453J639j861l002q35K206L136R05k801
438B072m271j403K938L702N2l339k527J033K850J134k109l474j529K053L863J596
454B641k573l869p91K743K591p74l038j601J664L464J913j719l853k034K019L954
470G37J536k268k778L15L031K217r83l142k028J347L837K644j214l625j768K211
486F9L286K93k813k411Q36L257K368o83l228k769M87L202K192j361l169r87K453
503A022K713m32l346k939K76L065K811l01l131k656N92K766J263k035k971l91
519c694K620K846J12k885l027k76K634K696l48k847j714J640L144R61k366l100
$$ plain form
535 -3604 -4188 -1718 1509 2422 274 -2374 -2396 314 2482 1393 -1639 -2816 -534 2944 4118 2136
551 2136 -935 -2077 -206 2698 3495 1364 -1017 -459 2612 4446 2772 -709 -2284 -469 2639 3931
567 3931 2341 -391 -1428 266 2535 2391 -383 -2720 -1844 1317 3273 1918 -1350 -3289 -2256 355
583 355 1568 -72 -2667 -3106 -678 1776 1250 -1887 -4268 -3528 -699 1381 732 -1667 -3169 -2002
599 -2002 528 1352 -796 -3497 -3430 -351 2573 2406 -351 -2658 -2284 168 2074 1495 -778 -1848 8
616 8 3001 3618 979 -2022 -2078 746 3386 3330 1054 -873 -398 1923 3394 2112 -793 -2039 -15
633 -15 3138 3912 1578 -1279 -1754 289 2252 1825 -543 -2215 -1151 1624 2962 1083 -2257 -3618
649 -3618 -1817 968 1750 -53 -2299 -2556 -622 1186 515 -2252 -4057 -2732 481 2129 542 -2345
$$ packed form
535c604n84K470L227R13k148k648k2K710K168j089l032j177K282L478J174j982
551B136l071j142J871K904P97k131k381N58L071J834j674l481j575J815L108J292
567C931j590k732j037J694K269j44k774k337Q76L161J956j355l268j939J033K611
583C55J213j640k595m39K428K454n26l137k381P40K829K080o49k399j502J167
599b002K530Q24k148k701O7L079K924j67k757k307L74K452J906n79k273j070J856
616HK993O17k639l001n6K824K640n6k276j927M75K321J471j282k905j246K024
633a5L153P74k334k857m75K043J963m27k368j672J064K775J338j879l340j361
649c618J801K785P82j803k246k57J934J808o71k767j805J325L213J648j587k887
$$ plain form
665 -2345 -3379 -1747 520 955 -823 -2683 -2298 332 2511 1769 -1215 -3166 -1915 1067 2608 1360
681 1360 -834 -1365 424 2556 2602 357 -1845 -1428 1442 3751 3130 427 -1289 -218 2126 2908 1239
698 1239 -987 -1191 1007 3310 3213 638 -1889 -1870 398 2286 1732 -451 -1702 -612 1411 1797 -207
715 -207 -2695 -3009 -799 1625 1659 -650 -2766 -2531 -557 799 -112 -2207 -3084 -1632 719 1499 -158
732 -158 -2518 -3112 -1366 757 951 -765 -2145 -1358 821 1962 733 -1594 -2541 -1008 1566 2687
748 2687 1440 -620 -1185 347 2050 1910 98 -1157 -214 2062 3300 2225 -63 -1264 -276 1751
764 1751 2593 1380 -460 -718 984 2619 2116 -194 -1939 -1356 821 2242 1534 -443 -1626 -938 636
781 636 1081 -346 -2113 -2183 -362 1386 1129 -919 -2666 -2467 -673 711 130 -1650 -2520 -1296 710
$$ packed form
665b345j034J632K267M35j778j860L85K630K179p42k984j951J251K982J541j248
681A360k194n31J789K132M6k245k202M17K870K309o21k703j716J071K344P82j669
698A239k226k04K198K303r7k575k527J9K268J888n54k183j251J090K023L86k004
715b07k488l14K210K424L4k309k116K35J974J356r11k095q77J452K351P80j657
732a58k360n94J746K123J94j716j380P87K179J141j229k327r47J533K574J121
748B687j247k060n65J532J703j40j812j255R43K276J238j075k288j201R88K027
764A751Q42j213j840k58J702J635n03k310j745N83K177J421p08j977j183O88J574
781F36M45j427j767p0J821J748k57k048j747J99J794J384n81j780q70J224K006
$$ plain form
798 710 1151 -574 -2592 -2805 -1007 950 1254 -135 -1585 -1460 108 1294 565 -1291 -1951 -302 2056
815 2056 2640 929 -1158 -1516 84 1960 2217 735 -769 -374 1611 2889 1882 -417 -1413 -45
831 -45 2057 2664 1295 -466 -753 679 2151 1818 -269 -1948 -1209 1242 2695 1561 -960 -2234 -1279
848 -1279 607 1239 -31 -1755 -1895 -197 1404 821 -1542 -3133 -2260 32 1264 297 -1662 -2507 -1405
865 -1405 477 969 -666 -2670 -2618 -294 1807 1418 -817 -2287 -1513 425 1418 569 -1040 -1483 20
882 20 2097 2370 349 -1787 -1541 819 2686 2182 204 -965 -96 1754 2563 1353 -753 -1399 336
899 336 2589 2849 843 -1119 -907 892 2010 1181 -634 -1483 -309 1701 2334 585 -1910 -2497 -696
916 -696 1385 1470 -331 -1871 -1620 -93 941 192 -1694 -2690 -1529 641 1363 -249 -2257 -2370 -637
$$ packed form
798G10M41j725k018k13J798J957L04j389j450J25J568J186p29j856o60J649K358
815B056N84j711k087l58J600J876K57j482j504L95J985J278j007k299r96J368
831d5K102O07j369j761k87J432J472l33k087j679P39K451J453j134k521j274R55
848a279J886O32j270j724j40J698J601n83k363j591Q73K292J232r67j959q45J102
865a405J882M92j635k004N2K324K101l89k235j470P74J938R93q49j609m43J503
882B0K077K73k021k136K46K360J867n04j978j169Q69J850Q09j210k106o46J735
899C36K253K60k006j962K12J799J118q29j815q49J174K010O33j749k495n87J801
916f96K081Q5j801j540K51J527J034p49j886r96J161K170P22j612k008j13J733
$$ plain form
933 -637 811 444 -1216 -2299 -1610 309 1664 944 -1183 -2426 -1352 797 1582 405 -1003 -867 613
950 613 1726 1267 -378 -1495 -734 1386 2717 1849 -239 -1137 38 1774 2069 751 -644 -575 912
967 912 2309 2093 321 -1185 -799 956 1916 1023 -576 -1006 144 1471 1422 -146 -1771 -1858 -188 1487
985 1487 1303 -531 -1959 -1497 17 674 -233 -1618 -1983 -929 531 896 -358 -2025 -2271 -794 669
1002 669 427 -1057 -1876 -1006 584 1131 104 -1519 -2039 -853 1030 1720 626 -937 -1086 218 1350
1019 1350 1049 -227 -911 -103 1463 2224 1332 -391 -1062 105 1796 2095 730 -631 -414 1085 2165
1036 2165 1660 33 -1146 -722 880 1909 1227 -384 -1014 -37 1145 931 -520 -1622 -1218 321 1457
1053 1457 980 -835 -2204 -1758 -50 934 45 -1528 -1879 -708 569 467 -858 -2048 -1891 -487 759
$$ packed form
933f37J448l67j660j083O89J919J355p20k127j243J074K149P85j177j408J36J480
950F13J113m59j645j117P61K120J331q68k088q98J175J736K95j318j395O9J487
967I12J397k16j772j506L86J755R60q93j599m30J150J327m9j568j625q7J670J675
985A487j84j834j428M62J514O57r07j385l65J054J460L65j254j667k46J477J463
1002F69k42j484q19Q70J590N47j027j623n20J186J883O90j094j563j49J304J132
1019A350l01j276o84Q08J566P61q92j723o71J167J691K99j365j361K17J499J080
1036B165n05j627j179M24J602J029o82j611o30R77J182k14j451j102M04J539J136
1053A457m77j815j369M46J708R84q89j573l51J171J277j02j325j190J57J404J246
$$ plain form
1070 759 548 -879 -1802 -1064 499 1040 -107 -1556 -1662 -214 1381 1609 313 -1138 -1175 251 1524
1087 1524 1211 -143 -776 185 1627 1940 819 -594 -860 328 1798 2030 749 -605 -441 1065 1989
1104 1989 1163 -519 -1170 -169 1364 1898 881 -695 -1284 -367 954 998 -322 -1448 -952 548 1203
1121 1203 207 -1413 -2029 -1164 312 869 -45 -1504 -1884 -698 647 502 -1011 -2101 -1538 35 934
1138 934 360 -936 -1584 -918 388 826 -134 -1316 -1171 364 1612 1241 -314 -1367 -889 589 1643
1155 1643 1328 77 -672 20 1370 1674 487 -760 -541 897 1955 1571 237 -691 -314 915 1663
1172 1663 999 -452 -1040 5 1493 1661 264 -1170 -1195 -50 938 777 -335 -1186 -868 317 918
1189 918 -26 -1552 -1952 -716 747 863 -400 -1609 -1584 -520 425 217 -921 -1717 -1112 364 1055 174
$$ packed form
1070G59k11j427r23P38J563N41j147j449j06J448J595K28j296j451l7J426J273
1087A524l13j354o33R61J442L13j121j413k66J188J470K32j281j354J64J506R24
1104A989q26j682o51J001J533N34j017j576n89R17J321M4j320j126M96J500O55
1121A203r96j620o16Q65J476N57r14j459l80J186J345j45j513j090N63J573Q99
1138I34n74j296o48O66J306M38r60j182J45J535J248l71j555j053M78J478J054
1155A643l15j251p49O92J350L04j187j247K19J438J058l84j334r28L77J229P48
1172A663o64j451n88J045J488J68j397j434k5J145R88j61j112q51L18J185O01
1189I18r44j526m00J236J463J16j263j209K5J064R45k08j138p96O05J476O91q81
$$ plain form
1207 174 -1299 -1682 -647 648 875 -5 -935 -803 328 1255 862 -517 -1297 -462 1144 1786 919 -367
1225 -367 -686 182 1237 1398 486 -530 -416 843 1876 1426 -65 -919 -238 1055 1452 613 -475 -626
1243 -626 277 1260 1177 -123 -1358 -1170 257 1333 862 -547 -1331 -813 234 537 -249 -1260 -1386 -379
1261 -379 733 690 -654 -1808 -1553 -198 697 194 -985 -1475 -769 391 758 -97 -1290 -1500 -392 872
1279 872 939 -138 -1013 -688 422 1037 513 -553 -955 -113 1216 1707 756 -612 -877 230 1382 1320
1297 1320 277 -439 -6 1025 1549 933 -257 -850 -121 1175 1607 675 -554 -692 282 1125 788 -348
1315 -348 -1099 -663 527 1186 565 -807 -1476 -781 390 654 -297 -1276 -1202 -187 632 302 -871 -1689 -1328
1334 -1328 -85 681 168 -999 -1409 -605 434 505 -444 -1346 -1177 -18 1026 903 -240 -1128 -772 421
$$ packed form
1207A74j473l83J035J295K27q80r30J32J131R27l93j379p80Q35J606O42q67j286
1225c67l19Q68J055J61r12j016J14J259J033m50j491q54O81J293L97q39j088j51
1243f26R03R83q3j300j235J88J427J076m71j409p84N18J047L03p86j011j26J007
1261c79J112m3j344j154K55J355Q95n03j179m90P06J160L67q55j193k10J108J264
1279H72O7j077q75L25J110O15n24j066m02Q42J329M91r51j368k65J107J152o2
1297A320j043p16M33J031N24o16j190n93P29J296M32r32j229j38R74Q43l37j136
1315c48p51M36J190O59o21j372o69O95J171K64r51r79P4J015Q19l30j173q18L61
1334a328J243P66n13j167m10Q04J039P1r49r02J69J159J044j23j143q88L56J193
$$ plain form
1352 421 1077 500 -465 -595 298 1243 1274 325 -649 -617 482 1526 1404 282 -520 -74 1035 1463 702
1371 702 -377 -614 241 1253 1368 427 -625 -674 263 1039 658 -472 -1033 -434 641 973 161 -1034
1389 -1034 -1444 -672 410 630 -304 -1254 -1129 -148 478 -37 -1126 -1596 -946 207 694 26 -1097 -1445
1407 -1445 -628 417 506 -408 -1147 -800 301 957 544 -483 -1037 -514 619 1194 619 -406 -594 318
1425 318 1278 1163 136 -624 -259 802 1523 1180 167 -453 -23 977 1327 596 -416 -485 452 1336 1171
1444 1171 92 -820 -680 268 1005 651 -404 -963 -387 561 700 -236 -1227 -1240 -307 566 482 -479 -1365 -1216
1464 -1216 -260 426 -25 -1084 -1461 -687 363 544 -303 -1226 -1271 -404 502 520 -360 -1077 -685 414 998
1483 998 385 -696 -983 -150 917 1170 509 -344 -448 342 1149 1048 102 -526 -40 1104 1595 915 -185
$$ packed form
1352D21O56n77r65j30Q93R45L1r49r74L2J099J044j22j122q02M46J109M28p61
1371G02j079k37Q55J012J15r41j052m9R37P76l81j130n61N99J075L32q12j195
1389a034m10P72J082K20r34r50J25R81O26n15j089m70O50J153M87o68j123l48
1407a445Q17J045Q9r14p39L47J101O56m13j027n54N23J133N75n75j025j88R12
1425C18R60j15j027p60L65J061P21l43j013o20M30J000L50p31j012o9R37Q84j65
1444A171j079r12J40R48P37l54j055n59N76R48J39r36r91j3R33Q73q4r61q86J49
1464a216R56O86m51j059l77P74J050J81q47r23m5Q67R06J8q80p17L92J099N84
1483I98o13j081k87Q33J067K53o61q53j04P90Q07j01r46o28M86J144M91o80j100
$$ plain form
1502 -185 -570 86 1049 1273 554 -343 -372 473 1193 820 -277 -899 -425 560 991 397 -589 -993 -422 455
1522 455 561 -328 -1241 -1114 -82 662 249 -815 -1405 -973 -71 324 -162 -993 -1230 -485 429 447 -521 -1360
1542 -1360 -1090 -41 691 426 -420 -888 -480 386 773 228 -634 -730 169 1141 1113 180 -592 -386 507 1123
1562 1123 890 107 -319 122 1003 1294 578 -341 -467 339 1145 1093 300 -379 -263 454 982 604 -348 -828
1582 -828 -285 689 956 161 -751 -881 -236 378 295 -386 -968 -767 28 538 72 -951 -1399 -813 170 440
1602 440 -182 -932 -1024 -384 237 178 -558 -1114 -796 158 744 303 -607 -938 -363 460 683 133 -495 -495 222
1623 222 960 892 62 -597 -313 602 1143 789 43 -239 224 923 1060 437 -338 -367 429 1197 1075 192 -479
1644 -479 -260 472 831 445 -266 -548 -89 639 786 56 -840 -959 -185 569 411 -418 -957 -690 10 322
$$ packed form
1502a85l85O56R63K24p19q97k9Q45P20l73j097o22M74R85M31n94r86m04N71Q77
1522D55J06q89r13J27J032P44m13j064n90M32R02L95m86q31k37P45R14J8r68q39
1542a360K70J049P32k65q46m68M08Q66L87n45q62r6Q99R72k8r33p72K06Q93O16
1562A123k33p83m26M41Q81K91p16r19j26Q06Q06n2p93o79J16P17N28l78r52m80
1582h28N43R74K67p95r12j30O45O14q3o81n82K01P95N10m66j023m48N86R83K70
1602D40o22p50r2O40O21n9p36n56L18R54N86m41r10l31N75Q23K23n50o28%P17
1623B22P38o8q30o59K84R15N41l54p46k82M63O99J37o23p75k9P96P68j22q83o71
1644d79K19P32L59l86p11k82M59P28J47p30q96j19P74P54j58q29n39K67P00L12
$$ plain form
1664 322 -133 -907 -1178 -610 247 433 -275 -1073 -1084 -320 330 148 -581 -1028 -648 196 617 203 -637 -960
1684 -960 -349 529 706 81 -528 -380 402 940 664 -131 -581 -175 755 1248 806 -75 -387 164 913 970
1704 970 327 -249 -114 592 1116 841 -10 -568 -240 606 1001 448 -414 -610 1 674 588 -181 -824 -753 -36
1725 -36 523 333 -475 -1002 -673 73 337 -276 -1028 -1065 -341 353 297 -466 -1119 -1008 -238 367 154 -587 -953
1746 -953 -456 331 533 -66 -768 -758 -55 677 721 62 -540 -394 382 892 561 -184 -435 140 917 1086 497
1767 497 -232 -325 307 981 976 287 -311 -87 648 1042 590 -194 -491 -32 629 791 267 -419 -532 27 604
1788 604 435 -375 -914 -600 228 588 126 -665 -1003 -607 37 226 -238 -837 -868 -243 287 73 -675 -1118
1808 -1118 -729 66 438 77 -633 -882 -389 340 499 -66 -686 -606 149 726 554 -104 -486 -199 455 796
$$ packed form
1664C22m55p74k71N68Q57J86p08p98j1P64O50j82p29m47L80Q44M21m14q40l23
1684i60O11Q78J77o25o09J48P82N38k76p95m50M06R30M93m42q81l12N51P49N7
1704I70o43n76J35P06N24k75q51n58L28Q46L95n53q62j96O11O73q6p69o43P1P17
1725c6N59j90q08n27L29P46K64o13p52l7P24O94n6p63o53J11P70O05k13p41l66
1746i53M97P87K02n99p02J0P03P32M4o59o02J46P76N10l31p45k51N75P77J69n89
1767D97p29r3O32O74no89n98K24P35L94m52p84k97M59O61J62n24o86j13N59N77
1788F04j69q10n39L14Q28L60m62p91l38L96O44J89m64n99l1O25N30k14p48m43
1808a118L89P95L72l61p10k49M93P29J59n65o20Q0P55N77j72o58l82K87O54L41
$$ plain form
1828 796 459 -146 -313 236 944 981 295 -369 -301 424 969 827 194 -245 -64 536 833 419 -267 -463 102
1849 102 752 744 50 -561 -516 62 499 307 -326 -714 -452 183 457 -24 -787 -982 -424 234 293 -301 -855
1870 -855 -769 -189 235 29 -602 -966 -569 158 440 -20 -674 -782 -229 356 369 -144 -607 -440 248 748 504
1891 504 -230 -617 -213 523 803 420 -141 -220 263 733 696 122 -344 -149 556 1035 711 -55 -420 -51 585
1912 585 782 351 -227 -333 99 633 603 -18 -568 -464 157 560 230 -408 -666 -290 285 373 -153 -779 -855
1933 -855 -295 323 324 -303 -825 -717 -151 199 -38 -594 -775 -359 229 372 -129 -751 -776 -135 458 403 -201
1954 -201 -584 -335 270 583 281 -286 -516 -85 575 776 304 -280 -303 265 732 599 20 -287 -19 566
1974 566 873 536 -120 -393 0 625 745 230 -335 -293 252 655 448 -165 -571 -368 210 580 271 -363
$$ packed form
1828G96l37o05j67N49P08L7o86o64O8P25N45j42o33m39J81O00K97m14o86j96N65
1849A02O50qo94o11M5N78M37j92o33l88K62O35K74m81p63j95N58O58N9n94n54
1870h55Q6N80M24k06o31l64L97P27K82m60o54j08N53N85J3n13m63J67O88N00k44
1891E04p34l87M04P36K80l83n61p9M83M70l7n74m66J95P05M79l24p66l65L69O36
1912E85J97m31n78j06M32N34l0o21n50J04O21M03l30o38k58L76N75Q8n26o26p6
1933h55N60O18Jo27n22J08N66L50k37n56j81M16N88J43n01o22k5O41N93n5o04
1954b01l83K49O05L13l02n67k30M31O60K01m72n84k3N68M67j33n79l07K68N85
1974E66L07l37o56k73L93O25J20n15n65M2N45M03k07o13m06K03N78L70l09o34
$$ plain form
1994 -363 -615 -263 258 275 -248 -717 -608 -33 378 172 -442 -868 -667 -6 336 19 -576 -729 -282 223
2014 223 240 -233 -661 -585 -30 423 289 -260 -602 -286 332 566 151 -429 -468 62 625 679 186 -295 -286 218
2036 218 664 547 20 -270 55 609 744 284 -267 -333 142 673 710 188 -337 -291 217 608 381 -222 -497
2057 -497 -184 349 502 85 -446 -578 -184 282 281 -208 -662 -536 26 353 56 -509 -795 -460 72 292 -42
2078 -42 -563 -683 -235 245 212 -301 -703 -479 116 448 204 -292 -540 -238 277 457 132 -338 -350 160 636
2099 636 527 -23 -425 -200 368 714 501 -5 -251 24 511 655 262 -232 -234 248 676 547 -6 -366 -192
2120 -192 286 555 300 -230 -473 -149 373 499 30 -522 -551 -104 291 213 -243 -566 -433 21 263 -29 -564
2141 -564 -732 -318 244 314 -160 -635 -621 -184 224 184 -230 -541 -366 148 424 128 -405 -536 -96 426 465
$$ packed form
1994c63k52L52N21J7n23m69J09N75M11k06o14m26K01O61L42l17n95j53M47N05
2014B23J7m73m28P6N55M53j34n49l42L16O18K34m15n80l9N30N63N4m93m81RN04
2036B18M46j17n27k90L25N54J35m60n51o6M75N31L7n22n25M6N08L91k27o03k75
2057d97L13N33J53m17n31j32L94M66jm89m54J26N62L27k97n65k86L35N32K20l34
2078d2n21j20M48M80l3n13m02K24N95L32k44m96k48L02N15J80l25m70j2N10M76
2099F36j09n50m02K25N68L46k13n06k46K75M87J44l93m94kM82M28j29n53l60J74
2120a92M78K69k55n30k43L24N22J26m69n52k9M47L95p8m56l23J33M54K42k92n35
2141e64j68M14N62P0m74m75J4M37M08m0m14l11J75N14K76k96n33j31M40N22L9
$$ plain form
2162 465 51 -329 -261 184 560 448 -35 -366 -126 436 713 399 -131 -269 102 523 546 136 -248 -185 270
2183 270 651 467 -114 -452 -201 310 506 175 -287 -380 -68 313 310 -127 -550 -489 -1 377 214 -332 -622
2204 -622 -402 59 207 -70 -473 -568 -206 219 249 -203 -655 -528 -1 336 136 -319 -507 -230 203 371 93
2225 93 -344 -446 -50 432 478 50 -320 -194 248 520 298 -124 -283 12 491 651 280 -223 -317 88 550
2246 550 529 110 -237 -111 287 499 281 -164 -370 -113 359 495 117 -370 -432 -31 331 255 -183 -502 -377
2267 -377 36 327 142 -349 -603 -347 124 247 -115 -513 -485 -92 241 163 -257 -584 -470 20 345 181 -274
2288 -274 -488 -180 259 338 -24 -371 -307 110 471 412 -19 -356 -225 268 551 325 -120 -238 81 483 537
2309 537 163 -221 -213 209 573 501 28 -290 -121 343 513 208 -230 -341 -33 366 428 58 -359 -395 -15 314
$$ packed form
2162D65m14l80O8M45L76j12m83l31K40N62K77l14n30j38L71M21K3m10l84O3M55
2183B70L81j84n81l38K51N11J96l31m62r3L12L81lm37m23O1M88L78j63n46k90
2204f22K20M61J48k77m03r5L62M25L0m52m52J27N27L37k00m55j88K77M33J68k78
2225I3m37j02L96M82M6m28l70J26M42K72k22m22j59K95M79J60l71n03r4M05M62
2246E50k1m19l47J26L98K12k18m45k06K57M72J36l78m87o2M01L62p6m38l19J25
2267c77M13K91j85m91k54K56M71J23l62l98K8L93L33p8m20l27J14M90L25j64m55
2288b74k14L08M39P9l62l47O4M17L61n9m31l37J31M93K83k26m45j18L19M02N4
2309E37l74l84QM22L64p2m73l18J69M64J70l05m38j11L08L99O2l70m17l6L80L29
$$ plain form
2331 314 207 -253 -498 -277 153 303 0 -458 -591 -292 146 251 -97 -503 -496 -98 220 58 -355 -541 -273
2352 -273 148 318 56 -356 -489 -144 292 354 -30 -370 -269 160 464 313 -83 -304 -99 334 516 267
2372 267 -138 -209 155 517 477 66 -255 -131 278 556 407 -12 -270 -90 314 448 136 -252 -282 67 399
2393 399 294 -118 -447 -342 36 301 152 -276 -499 -299 102 196 -132 -499 -504 -162 165 123 -230 -534 -442 -42
2415 -42 210 63 -352 -508 -228 181 283 -5 -351 -375 -24 299 304 -25 -286 -144 248 480 267 -143 -251
2436 -251 40 440 542 251 -96 -155 153 484 443 74 -182 -16 372 519 258 -149 -268 -15 335 404 104
2457 104 -260 -312 8 304 201 -193 -456 -303 74 228 6 -359 -478 -262 73 135 -157 -538 -493 -120 185
2478 185 88 -299 -533 -368 -16 184 41 -284 -384 -141 221 288 -47 -360 -284 115 434 333 -14 -232 -99
$$ packed form
2331C14j07m60k45K21M30J50l03m58j33K99M38J05l48m06PL98L18j62m13j86K68
2352b73M21J70k62m12j33L45M36O2l84l40J01M29L04j51l96k21K05M33J82k49
2372B67m05p1L64L62m0m11l21J24M09K78j49m19k58J80M04J34l12l88l0L49L32
2393C99j05m12l29J05L78K65j49m28k23K00M01R4l28l67nL42L27m2l53l04R2M00
2415d2K52j47m15j56K80M09J02k88l46k4L51L23Nl29k61J42L92K32k13m10j08
2436b51K91M00J02k91l47n9L08L31m1l69k56J66L88J47k61m07j19K53L50O9l00
2457A04l64n2L20K96j03l94k63J53L77J54k22l65j19K16L35O2k92l81M5L73L05
2478A85r7l87k34J65L52K00j43l25j00K43L62O7l35l13P6L99L19j01l47k18J33
$$ plain form
2499 -99 254 473 287 -69 -163 132 498 504 152 -161 -95 247 497 382 54 -184 -40 304 447 206 -200 -312
2521 -312 -8 325 303 -23 -335 -289 17 218 85 -266 -488 -306 73 214 -44 -431 -529 -246 73 80 -202 -450
2543 -450 -380 -78 172 44 -322 -513 -276 148 290 39 -295 -334 -53 245 280 -2 -252 -172 193 449 319
2564 319 -53 -201 18 381 470 212 -83 -102 175 487 461 110 -195 -127 245 467 304 -49 -191 5 284
2585 284 315 41 -268 -263 17 320 254 -125 -419 -335 25 198 26 -313 -431 -212 68 125 -142 -451 -461 -154
2607 -154 151 90 -229 -455 -325 28 204 17 -298 -394 -157 189 276 31 -271 -267 54 323 251 -50 -219 -55
2629 -55 266 447 253 -69 -195 26 370 454 190 -109 -82 218 426 303 -10 -186 -40 284 435 243 -125
2650 -125 -267 -45 271 293 3 -281 -244 48 230 112 -192 -392 -263 51 182 -22 -369 -426 -168 132 123 -168
$$ packed form
2499i9L53K19j86l56r4K95L66Ol52l13O6L42K50j15l28k38J44L44J43k41m06j12
2521c12L04L33k2l26l12M6L06K01j33l51k22J82L79J41k58l87r8K83L19Pk82k48
2543d50P0L02K50j28l66j91K37M24J42k51l34l9K81K98L5k82k50Q0L65K56j30
2564C19l72j48K19L63Q9k58k95j9K77L12k6l51l05O8L72K22j63l53j42J96K79
2585B84L1k74l09NK80L03o6l79k94Q4L60J73j72l39j18K19K80N7k67l09j0L07
2607a54L05o1l19k26J30L53J76j87l15r6K37L46Q7k45l02ML21K69p2l01j69J64
2629e5L21J81j94l22j26K21L44Q4k64k99K7L00K08j23l13j76J46L24J51j92l68
2650a25j42K22L16K2k90k84L7K92J82j18l04k00J29L14J31k04l47n7K58L00rk91
$$ plain form
2672 -168 -423 -391 -92 154 77 -209 -406 -248 49 177 -33 -314 -313 -15 251 239 -35 -289 -231 79 338 265
2694 265 -33 -201 -35 291 390 168 -111 -133 131 398 375 110 -131 -79 217 438 311 -26 -190 -21 309
2715 309 367 139 -168 -206 9 249 240 -31 -281 -203 70 242 90 -253 -394 -202 102 170 -58 -344 -388 -155
2737 -155 90 62 -210 -416 -312 -5 165 19 -284 -398 -217 87 177 -22 -261 -285 -28 240 193 -78 -282
2758 -282 -144 174 344 192 -99 -175 22 305 376 153 -103 -108 148 404 356 74 -128 -33 250 369 215 -49
2780 -49 -142 50 306 341 65 -223 -227 53 284 217 -80 -279 -202 39 158 13 -254 -342 -139 108 96 -143 -406
2803 -406 -371 -89 119 31 -241 -415 -284 10 136 -15 -298 -370 -154 136 151 -78 -266 -211 55 238 148 -109
2825 -109 -238 -81 231 371 202 -88 -165 58 332 355 122 -79 -24 223 391 290 24 -131 -1 291 391
$$ packed form
2672a68k55L2K99K46p7k86j97J58K97J28k10k81JK98K66j2k74k54N8L10K59p3
2694B65k98j68J66L26R9k22k79k2K64K67k3k65k41N2K96K21j27l37j64J69L30
2715C09N8k28l07l8K15K40rk71k50P8K73J72j52l43j41J92L04O8k28k86m4K33
2737a55K45k8k72k06J04L07J70j46l03j14J81L04R0j99k39k4K57K68m7k71k04
2758b82J38L18J70j52k91p6J97K83P1k23k56nK56K56m8k82k02R5K83J19j54k64
2780d9r3J92K56L5k76k88mK80K31o7k97j99P7K41J19j45k67q8K03K47j2k39k63
2803d06L5K82K08q8k72j74J31K94J26j51k83p2K16K90J5k29j88N5K66J83r0k57
2825a09j29J57L12J40j69k90p7K23K74K3k33k01N5K47J68j01k66j55J30K92J00
$$ plain form
2846 391 195 -80 -143 63 285 250 6 -199 -150 76 240 127 -161 -323 -187 83 145 -40 -305 -344 -128 71
2868 71 70 -186 -387 -318 -70 101 -5 -262 -361 -194 52 102 -96 -319 -314 -67 181 184 -57 -256 -183 77 250 146
2892 146 -79 -153 25 264 313 111 -115 -105 129 360 331 99 -110 -28 226 364 254 7 -109 34 267 321
2914 321 119 -109 -125 74 263 185 -61 -233 -140 115 230 77 -191 -304 -154 65 131 -69 -292 -284 -75 75
2936 75 3 -235 -376 -262 -9 109 -26 -262 -355 -178 68 103 -70 -272 -243 -18 167 128 -109 -246 -127 124
2958 124 257 122 -100 -167 29 276 302 76 -109 -74 152 333 277 52 -93 1 241 334 170 -59 -131 66
2980 66 278 294 80 -146 -137 64 246 163 -48 -196 -89 109 176 6 -224 -284 -95 122 110 -122 -321 -288 -68
3003 -68 107 12 -215 -337 -216 21 94 -64 -255 -286 -102 101 86 -120 -271 -204 34 202 96 -140 -247 -95
$$ packed form
2846C91j96k75o3K06K22l5k44k05M9K26J64j13k88j62J36K70O2j85k65l9K16J99
2868G1jk56k01O9K48J71j06k57r9J67K46N0j98k23NK47K48Lk41j99P3K60J73j04
2892A46k25p4J78K39M9k02k26J0K34K31k9k32k09Q2K54J38j10k47j16J43K33N4
2914C21k02k28j6J99J89p8k46j72R3K55J15j53k68j13J50K19O6k00k23QK09J50
2936G5p2k38j41J14K53J18j35k36r3J77K46L5j73k02K9K25J85l9k37j37J19K51
2958A24J33j35k22o7J96K47K6k26j85L5K26J81n6k25j45R4K40R3j64k29p2J97
2980F6K12J6k14k26RK01J82q3k11j48J07J98O7j70k30o0J89K17j2k32j99L3K20
3003f8J75r5k27j22J21K37P3j58j91l1J84K03j5k06j51O7K38J68j06k36j07J52
$$ plain form
3025 -95 136 232 108 -109 -120 66 242 233 38 -112 -38 204 334 221 -10 -120 23 250 322 153 -54 -90 79
3048 79 261 239 29 -143 -84 112 246 127 -102 -199 -74 118 155 -16 -226 -244 -56 114 78 -130 -284 -229 -21
3071 -21 83 -26 -230 -319 -163 50 93 -96 -295 -292 -85 105 75 -120 -242 -162 42 146 49 -147 -200 -37 194
3094 194 220 47 -143 -125 78 249 229 40 -101 -20 191 301 191 -19 -76 72 268 280 112 -75 -64 130
3116 130 286 214 -6 -161 -68 132 222 109 -114 -192 -54 108 113 -43 -220 -207 -18 117 24 -189 -321 -212 -7
3139 -7 90 -35 -242 -291 -156 16 39 -113 -272 -237 -34 105 49 -148 -253 -129 75 163 32 -150 -174 3 182
3162 182 207 32 -109 -84 128 259 203 19 -75 41 222 293 145 -37 -79 102 284 267 81 -86 -50 116 230
3185 230 151 -31 -128 -18 151 183 32 -162 -210 -48 121 113 -76 -228 -215 -31 78 -4 -195 -283 -170 17 67
$$ packed form
3025i5K31R6j24k17j1J86J76rj95j50P4K42J30j13k31j10J43K27P2j69k07l6J69
3048G9J82k2k10j72N9J96J34j19k29r7J25J92L7j71k10j8J88J70l6k08j54N5K08
3071b1J04j09k04q9J56K13M3j89j99LK07J90l0j95j22Q0K04J04r7j96n3J63K31
3094A94K6j73j90J8K03J71k0j89j41Q1K11J10j10k10n7J48J96J2j68j87J1J94
3116A30J56p2k20j55R3K00R0j13k23p8J38J62Nj56j77J3J89J35r3k13j32J09K05
3139gR7j25k07m9J35J72K3j52j59L5K03J39n6j97j05J24K04Q8j31j82k4J77J79
3162A82K5j75j41K5K12J31n6j84r4J16J81P1j48j82m2J81J82j7j86j67L6J66J14
3185B30p9j82r7J10J69L2j51j94m8J62J69qj89j52J3J84J09q2j91q8J13J87N0
$$ plain form
3208 67 -85 -260 -271 -107 66 38 -136 -272 -196 9 112 41 -142 -207 -99 92 148 25 -121 -104 61 218 180
3231 180 -3 -124 -35 169 269 187 -2 -84 38 216 256 110 -47 -45 119 248 208 25 -96 -38 144 215 112
3254 112 -92 -148 -45 124 157 -10 -178 -191 -36 88 70 -112 -231 -163 13 68 -38 -214 -271 -130 57 78 -84
3277 -84 -238 -234 -74 64 35 -131 -220 -129 50 109 13 -154 -185 -34 149 166 24 -117 -101 62 189 150 -8 -86
3301 -86 0 168 228 127 -35 -71 62 223 228 67 -79 -47 118 233 167 -12 -111 -36 117 185 82 -87 -132 -15
3325 -15 128 122 -50 -193 -148 10 125 45 -131 -231 -143 23 67 -35 -192 -212 -91 59 41 -107 -239 -196 -20
3348 -20 89 26 -148 -193 -111 60 125 13 -130 -152 -20 136 121 -13 -118 -79 87 183 111 -29 -106 9 176 219
3372 219 92 -58 -78 67 200 197 49 -68 -27 117 205 118 -39 -95 -6 156 182 41 -111 -131 1 128 111 -50
$$ packed form
3208F7j52j75j1J64J73k8j74j36P6K05J03p1j83o5J08J91N6j23j46J7J65J57l8
3231A80j83j21Q9K04J00q2j89q2J22J78M0j46j57KJ64J29m0j83j21N8J82P1j03
3254A12k04n6J03J69L3j67j68j3J55J24j8j82j19O8J76N5j06j76n7J41J87K1j62
3277h4j54MJ60J38k9j66q9R1J79N9r6j67l1J51J83J7j42j41J6J63J27l9j58p8
3301h6Q6J68O0j01j62l6J33J61Nj61j46L2J65J15o6j79r9P5J53O8j03j69m5J17
3325a5J43oj72j43M5J58J15q0j76j00Q8J66M4j02j57k0J21J50j8j48j32M3J76
3348b0J09o3j74m5Q2J71O5j12j43k2J32J56j5j34j05L9J66R6p2j40p7J15J67M3
3372B19j27j50k0J45J33lj48j17M1J44Q8q7j57n6Q9J62K6j41j52k0J32J27j7j61
$$ plain form
3396 -50 -169 -117 27 109 20 -143 -210 -89 41 80 -62 -206 -200 -60 66 43 -112 -223 -160 2 80 1 -132 -190
3420 -190 -79 62 93 -29 -148 -138 13 150 119 -35 -130 -62 105 177 106 -27 -89 35 164 187 62 -66 -43
3443 -43 114 219 169 13 -77 -12 152 204 117 -42 -89 16 149 152 15 -116 -103 23 126 77 -93 -169 -97 43
3467 43 93 -5 -159 -207 -95 38 72 -70 -220 -195 -48 32 -22 -145 -216 -136 18 81 -21 -175 -195 -70 79 91
3491 91 -29 -147 -108 25 123 81 -50 -104 -27 125 185 76 -58 -69 64 169 169 43 -57 -10 116 208 159 2
3515 2 -57 5 151 180 68 -68 -71 50 145 144 -12 -127 -94 39 125 74 -87 -157 -86 48 61 -36 -170 -168 -56 48
3541 48 26 -99 -214 -186 -23 74 5 -146 -194 -111 40 48 -26 -151 -161 -31 73 64 -61 -136 -75 59 138 64 -76 -109
3567 -109 5 139 174 77 -52 -55 69 175 142 26 -50 0 125 194 102 -21 -79 21 147 161 69 -65 -88 39
$$ packed form
3396e0j19N2J44Q2q9j63o7J21J30L9j42j44OJ40J26k3j55j11O3J62P8p9j33n8
3420a90J11J41L1j22j19J0J51J37l1j54r5O8J67P2p1j33o2J24J29K3j25j28K3
3443d3J57J05n0j56r0O5J64N2q7j59m7J05J33Lj37j31J3J26J03m9j70p6P2J40
3467D3N0r8j54m8J12J33L4j42j50K5J47Q0n4j23p1Q0J54O3j02j54k0J25J49J2
3491I1j20j18L9J33R8m2j31n4P7J52O0j09j34j1J33J05%j26j00M7J26R2m9j57
3515Bn9O2J46K9j12j36lJ21R5jj56j15L3J33Q6n1j61p0P1J34J3r7j34KJ12J04
3541D8k2j25j15K8J63R7o9j51m8Q3J51Qp4j25j0J30J04rj25p5O1J34P9p4j40l3
3567a09J14J34L5r7j29lJ24J06l3j16p6N0J25O9r2j23n8J00J26J4r2j34k3J27
$$ plain form
3591 39 136 100 -40 -118 -73 44 111 20 -108 -153 -62 54 71 -49 -169 -156 -35 63 16 -102 -181 -123 -11 50 -16 -142
3617 -142 -173 -80 47 61 -53 -155 -138 6 94 65 -55 -127 -71 62 128 59 -68 -90 19 133 139 13 -83 -53 74
3642 74 170 127 3 -60 -17 113 169 85 -29 -67 40 140 127 23 -73 -48 56 141 87 -61 -129 -62 70 114 15 -124
3668 -124 -143 -46 50 48 -57 -141 -125 -19 66 -4 -122 -186 -99 41 59 -32 -149 -163 -64 34 46 -46 -144 -107 5 93 36
3695 36 -81 -120 -35 76 115 19 -74 -92 15 127 119 6 -84 -33 88 163 111 -8 -47 25 131 139 53 -50 -54 57 158
3722 158 134 5 -84 -47 85 123 73 -44 -79 -35 73 90 -12 -114 -116 3 81 55 -78 -169 -119 -4 45 -10 -120
3747 -120 -156 -78 21 40 -52 -155 -148 -33 54 21 -97 -158 -102 12 76 26 -97 -122 -45 69 105 9 -79 -69 36 117 88
3774 88 -8 -64 -3 114 160 95 -39 -70 18 127 165 64 -18 -25 71 126 100 0 -68 -8 92 136 45 -67 -88 -11 84
$$ packed form
3591C9R7l6j40p8M5J17O7r1j28m5R1J16J7j20j20J3J21R8m7j18p9N8J12O1o6j26
3617a42l1R3J27J4j14j02J7J44Q8k9j20p2N6J33O6o9j27k2J09J14Oj26r6L0J27
3642G4R6m3j24o3M3J30N6q4j14l8J07J00j3j04r6K5J04Q5n4j48o8O7J32M4r9j39
3668a24j9R7R6kj05q4J6J06Q5p0j18o4Q7J40J8r1j17j4R9R8J2r2r8L7J12Q8n7
3695C6j17l9Q5J11L9r6r3j8J07J12qj13r0N1J21P5n2j19l9P2J06Qq6j03mJ11J01
3722A58k4j29q9L7J32L8n0j17l5M4J08J7j02j02kJ19P8k6j33r1N0J15M9n5j10
3747a20l6P8R9J9r2j03PJ15Q7l3j18o1N6J14O4n0j23k5P7J14L6r6q8J0J05Q1k9
3774H8r6n6O1J17M6o5j34l1Q8J09L8j01q2pR6N5k6j00o8O0J00M4r1j12k1P7R5
$$ plain form
3801 84 84 -13 -100 -97 -10 69 37 -78 -141 -99 16 43 -33 -130 -152 -63 30 15 -66 -163 -147 -30 48 21 -75 -144 -79 34 64
3830 64 5 -94 -99 -2 94 76 5 -84 -58 53 136 97 -11 -56 9 113 143 62 -22 -30 50 139 131 29 -54 -18 87 141 74
3859 74 -32 -78 -14 61 100 34 -78 -87 -11 62 54 -61 -126 -95 9 65 -4 -109 -158 -90 2 46 -28 -121 -149 -53 31 10 -77
3888 -77 -137 -84 6 64 14 -80 -113 -37 58 81 7 -87 -79 7 110 89 3 -64 -23 80 137 78 -14 -42 26 131 137 43 -48 -41
3918 -41 55 127 103 5 -61 -24 62 109 40 -45 -67 -12 81 78 -18 -101 -87 -4 65 39 -62 -119 -78 5 48 -15 -102 -122 -49 29
3948 29 31 -40 -120 -104 -13 58 37 -61 -121 -80 19 87 25 -73 -88 -18 66 73 -6 -75 -45 44 116 74 -20 -73 -23 75 117 48 -39
3979 -39 -72 7 89 100 21 -51 -34 48 117 61 -39 -85 -27 69 76 17 -74 -92 -15 61 57 -24 -89 -79 15 72 23 -56 -94 -52 35
4010 35 60 -15 -109 -100 -22 58 49 -44 -102 -84 3 61 21 -61 -98 -48 49 69 4 -84 -92 1 81 68 -18 -78 -58 20 97 38 -29 -66
$$ packed form
3801H4%r7q7LQ7P9l2j15o3M2J15K7p6r7k2Q9R3j5q1r7J6J17P8k7r6o9O5J13L0
3830F4n9r9nR7R6j8p1q9K6J11Q3l9j08m5O5J04L0q1q4qQ0Q9qj02q3L6J05N4o7
3859G4j06m6O4P5L9o6j12rP6P3qj15o5L1J04N6o9j05m9O8R2M4p4r3k8R6Q4k1q7
3888g7o0N3R0N8n0r4l3P6R5K3p4r4QQ6J03k1q6o7M1J03N7n9r2k8O8J05Or4r1P
3918d1R6P2k4r8o6L7Q6M7o9q5k2N5R3lr6q3J4Q3O9k6j01n7M1Q3M3o3q7k0P3P8
3948B9Kp1q0J6R1P1k1r8o0M1R9O8o2r8j5P0Q4Pp9o9L0Q9P2m2r4n3N0R8M2o9q7
3979c9l3P9Q2J1p9p2J7Q2O9n6j00m6N8R6Pn9r1j8P7P6mq1o5J0R4N7m9p9l8M2Q7
4010C5K5p5r4RP8Q0rr3n8J8Q7N8m0q2l7N0R7K0o5q8qR3Q0j3q6o0K0P8P7n9o7l7
$$ plain form
4042 -66 -25 63 88 19 -48 -54 28 92 65 -29 -73 -45 36 85 63 -40 -76 -16 59 83 9 -74 -69 17 74 53 -34 -83 -52 42 88
4073 88 26 -61 -98 -43 44 66 -15 -89 -74 -9 63 25 -53 -105 -46 30 57 11 -67 -97 -36 48 59 -9 -88 -77 8 56 41 -37
4103 -37 -87 -44 56 73 26 -61 -68 -8 79 77 2 -71 -62 36 82 74 -11 -58 -29 61 79 32 -49 -60 -2 81 75 6 -65 -63 18 70 48
4136 48 -28 -81 -38 41 58 2 -61 -78 -14 42 46 -30 -97 -72 8 61 15 -59 -109 -63 19 60 -7 -77 -78 -26 35 34 -36 -84 -54 26
4168 26 74 24 -56 -81 -34 45 65 22 -53 -63 8 64 65 -7 -53 -25 43 95 58 -24 -60 -4 72 86 28 -42 -50 16 69 57 -11
4199 -11 -65 -35 26 48 19 -58 -91 -26 41 61 -11 -73 -86 -18 39 30 -42 -90 -72 11 37 -11 -73 -90 -49 45 43 -16 -78 -74 0 63
4231 63 46 -28 -67 -52 23 59 16 -39 -58 -6 68 69 10 -50 -39 33 78 72 -2 -45 -20 53 83 47 -25 -54 16 73 66 10 -58 -49
4263 -49 27 70 53 -32 -72 -28 34 60 14 -65 -66 -23 33 32 -37 -90 -69 -5 48 6 -69 -86 -61 29 48 -3 -67 -83 -27 21 38
$$ packed form
4042f6M1Q8K5o9o7oQ2O4k7r4m4K8Q1M9k2j03l6O0P5K4p4q3NQ6N7k1q7m9L1R4M6
4073H8o2q7l7N5Q7K2q1p4J5O5P2l8p8n2N9P6K7m6p8l0O1Q4J1o8p9J1Q5M8j5p8
4103c7n0M3J00J7m7q7pO0Q7kp5p3RR8M6qq5m7K9R0J8m7q1j1N8Q3oo9p1KQ1N2k2
4136D8p6n3M3P9J7n6o3j7O4N6Mp6o7K5Q0N3m6p4n0M6Q2M1o7p0jN2O1jp0m8L0Q0
4168B6M8n0q0k5M7P9K0m3p5j0P1N6Jp2m6K8O8N2l7q2l6N6P6J4n8p0qO6N3j2o8
4199a1n4L0O1K2k9p7l3O5O7K0p2o2j3O8N7rp2m8J8Q3K6m8o2j7M1R4kn9o2MP4O3
4231F3j7p4l9J5P5L6m3n5j9N2P4Jn9o0J1P2M5op4m3K5P3L0l6p2k9P0N7pn6o8R
4263d9P6M3j7q5m0M4O2K6m6p9jM3N6jo9n3K1O4N3m2p5j7K5R0J9n1o4j6N6M8J7
$$ plain form
4294 38 -15 -78 -59 22 59 23 -41 -60 -23 53 72 13 -36 -47 12 72 72 20 -34 -25 40 85 52 -19 -42 -2 58 88 18 -50 -46 11
4326 11 70 65 10 -61 -46 15 50 21 -39 -64 -26 28 44 -4 -59 -77 -3 43 37 -31 -86 -62 7 37 9 -43 -81 -43 16 38 -18
4357 -18 -64 -71 -13 51 32 -29 -64 -39 28 79 32 -22 -47 -6 61 65 14 -43 -33 21 71 53 -10 -38 -12 43 88 42 -21 -51 9
4388 9 53 69 12 -32 -38 17 56 36 -19 -61 -30 30 50 12 -56 -61 -27 44 44 -8 -70 -56 -8 38 20 -29 -79 -51 20 45 2 -72
4420 -72 -75 -30 30 39 -27 -75 -71 1 42 31 -22 -58 -22 29 48 4 -37 -49 3 54 59 18 -40 -24 24 74 50 -2 -47 -16 66 77
4452 77 34 -16 -44 16 57 55 6 -44 -35 36 61 44 -25 -53 -24 27 49 2 -41 -64 -14 32 34 -31 -83 -67 0 38 -2 -52 -77 -46
4484 -46 10 34 -18 -67 -64 -40 25 10 -31 -67 -44 7 38 6 -43 -59 -24 27 55 17 -46 -36 8 58 56 8 -26 -13 38 69 51
4515 51 -22 -34 9 51 77 28 -22 -37 17 76 64 7 -42 -11 46 59 21 -38 -54 -16 37 44 -9 -62 -67 -9 25 30 -26 -81 -51 -1
$$ packed form
4294C8n3o3J9Q1L7l6o4j9L7P6J9n9m9j1N9O0%n2n4RO5M5l3p1k3M0O0L0p0o8MN7
4326A1N9nn5p1J5O1L5k9o0k5L8N4J6m8n5j8P4M6oo8n5K4O9L0k8n2l8L8N9K2n6
4357a8m6pN8O4j9o1l5K5O7N1m7n4k5M1O7Mn1n7J0N4N0j8o3k8K6N5M5m6o3l0O0
4388IM4J6n7m4oN5L9k0n5m2L1O0K0l8o8nL4P1%n2o2J4M8M6j8m9n0K8P1K5m3p4
4420g2lM5O0Ro6m8MP2M1j1n3l6L6N1J9m4m1j2N2N1Nm1n8J6M8N0k4n2m5L1Q2J1
4452G7m3n0k8O0M1km9n0RP1K5j7o9k8K9N1K2m7m3k3N0M6Ko5n2J6O7L8m0n0k5L1
4484d6N6K4n2m9LK4O5j5m1l6K3N1L1l2m9j6L5N1K8l8o3J0M4N0km8l4J3N1L1j8
4515E1p3j2M3M2K6m9n0j5N4N9j2n7m9L1N7J3l8n9j6L8N3Pn3n3nN8L4Nn6n5L0N0
$$ plain form
4547 -1 18 -5 -59 -83 -38 17 20 -31 -69 -83 -22 34 8 -46 -78 -45 10 37 17 -17 -44 -10 37 58 -1 -29 -25 39 66 53 -5 -39
4579 -39 -4 46 71 37 -5 -25 3 60 57 12 -17 -22 30 59 41 -19 -41 -30 29 43 2 -38 -55 -27 28 28 -22 -58 -36 -10 25 9
4611 9 -39 -81 -47 0 25 -9 -68 -79 -38 24 16 -30 -69 -52 -4 25 20 -23 -50 -21 21 55 -4 -39 -49 -1 52 41 0 -36 -33 17
4643 17 48 43 -11 -22 7 53 58 16 -20 -24 15 63 48 4 -45 -30 28 51 25 -19 -41 -10 30 39 -1 -46 -39 -3 36 18 -32 -66 -42
4676 -42 4 22 -1 -54 -66 -35 4 30 0 -52 -46 -9 19 8 -27 -49 -34 11 32 13 -39 -48 -12 36 45 4 -36 -32 13 45 40 -1 -27
4709 -27 -2 48 65 28 -13 -31 6 42 51 31 -29 -19 8 57 40 -10 -37 -6 37 52 19 -24 -35 -6 37 39 -4 -48 -42 5 38 18
4741 18 -28 -63 -43 9 28 -1 -47 -58 -20 18 23 -17 -56 -45 10 29 1 -36 -65 -41 7 17 -2 -42 -48 -11 24 28 -20 -51 -38 13
4773 13 40 30 -27 -46 -20 23 37 15 -16 -18 8 51 50 5 -22 -11 32 42 40 -4 -29 0 35 63 27 -18 -26 12 41 27 4 -47
$$ packed form
4547aJ9k3n4k4M5N5Ln1l8j4O1N6k6n4l2L3N5K7k0l4k7L4M7K1n9k8MO4K7j3n8l4
4579c9L5N0K5l4m2k0K8N7lm5k9nN2K9j8o0k2J1N9J4m1m0j7K8N5%n0l6K2K6L5j6
4611Im8m2L4M7K5l4n9j1M1O2qm6l9J7M8K9nm3k7K9M2L4n9l5j0M8N3j1m1l6LN0
4643A7L1nn4j1K9M6Nm2l6mL9M8j5m4m9J5N8K3k6m4k2L1M0Rm0m5PL6L9j8n0l4K4
4676d2M6J8k3n3j2L1L9K6l0n2OL7K8j1l5k2J5M5K1j9n2rL6M8Rm1m0MM5L2nm1k6
4709b7K5N0J7l7m1j8L7L6Rk0o0J0K7M9j7n0k7L1M3J5l3m3j1K9M3Km3m4OM7L3k0
4741A8m6l5K0N2J9k9m6j1L8L8Nm0l9J1N5J9k8l7k9K4M8J0j9m0oL7L5Mm8l1J3N1
4773A3K7j0n7j9K6M3J4k2l1kK6M3jm5k7J1M3J0km4k5K9L5K8l6m5qL8K9j4k3n1
$$ plain form
4805 -47 -17 23 47 20 -26 -38 -30 39 39 -3 -41 -57 -19 13 13 -22 -50 -40 -7 15 -10 -54 -56 -18 12 13 -18 -57 -64 -21 12 15 -26 -49
4839 -49 -21 16 35 3 -23 -38 -7 31 44 14 -17 -16 10 65 42 13 -22 -14 38 51 32 4 -13 24 59 52 11 -18 -27 20 53 45 -8
4872 -8 -22 -15 11 41 12 -31 -49 -14 9 18 -19 -48 -51 -14 11 1 -48 -69 -52 -14 21 -21 -61 -58 -48 1 9 -14 -52 -48 -8 22 1 -29
4906 -29 -50 -17 26 37 13 -29 -30 -1 37 41 10 -15 -4 28 59 38 1 -4 5 48 68 39 3 -12 23 52 43 6 -21 -13 16 33 27 -4
4940 -4 -31 -19 21 34 -8 -43 -34 -10 18 7 -38 -69 -51 -13 4 -4 -40 -62 -46 -14 0 -18 -61 -63 -26 9 20 -26 -52 -30 0 18
4972 18 18 -18 -36 -10 27 29 1 -19 -20 14 42 43 -6 -9 11 38 59 39 0 -18 20 34 50 14 -1 -11 19 45 35 -8 -35 -10 17
5005 17 38 15 -16 -35 -11 17 27 -9 -35 -41 -16 14 -7 -25 -52 -29 11 7 -12 -41 -49 -39 4 1 -18 -50 -50 -11 11 2 -30 -61 -39
5038 -39 -1 18 8 -28 -38 -6 31 30 -1 -22 -29 10 40 43 16 -7 -1 27 43 21 4 -14 10 49 50 17 -22 -6 17 37 29 -1 -20
$$ packed form
4805d7L0M0K4k7m6j2QO9%m2l8j6L8L2%l5k8J0L3K2k5m4kL8L0Jl1l9pM3L3Lm1k3
4839d9K8L7J9l2k6j5L1L8J3l0l1JK6N5k3k9l5QN2J3j9k8j7L7L5pm1k9rM7L3qn3
4872hj4PK6L0k9m3j8L5K3Rl7k9lL7K5j0m9k1J7L8L5m2m0LJ0M9Qk3l8MM0L0k1l0
4906b9k1L3M3J1k4m2jK9L8Ml1k5J1L2L1k1l7nRM3K0k9l6j5L5K9rl7k7QK9J7ol1
4940dk7J2M0J3m2l5RK4K8j1m5l1J8L8J7ql6k2J6L2J4j8m3kL7L5J1m6k6K2L0J8
4972A8%l6j8K6L7Kk8k0jL4K8Jm9lK0K7K1k0l9j8L8J4J6l6j5j0L0K6j0m3k7K5K7
5005A7K1k3l1j9K4K8J0l6k6oK5L0k1j8k7K3M0mj9k9qJ0M3lj9l2%L9K2rl2l1K2
5038c9L8J9j0l6j0L2L7jl1k1pL9L0Lk7k3OK8J6k2j7j8K4L9Jl3l9J6K3K0ql0j9
$$ plain form
5071 -20 -10 3 27 7 -34 -38 -8 11 14 -16 -49 -37 -10 14 0 -42 -48 -43 1 7 -26 -46 -68 -32 -2 1 -44 -51 -36 -8 11 -3 -37 -56
5105 -56 -27 16 26 -4 -25 -26 3 15 19 -7 -27 1 12 36 20 -9 -24 -1 35 44 23 2 -11 17 45 39 2 -14 -11 32 23 13 -4
5138 -4 -11 -2 23 34 7 -22 -33 5 25 14 -12 -33 -32 -10 5 -8 -27 -48 -28 4 -1 -29 -46 -42 -16 -6 -3 -30 -42 -47 -8 1 -8 -21 -35
5173 -35 -15 14 13 -13 -34 -42 -11 25 9 -9 -13 -5 37 40 16 -2 -18 4 33 32 4 -17 -3 7 45 31 2 -19 -2 19 29 5 -7
5206 -7 -17 -6 13 32 -7 -28 -29 -8 14 -13 -42 -51 -37 -2 4 -18 -40 -49 -32 4 5 -24 -47 -34 -16 -4 -10 -43 -54 -21 9 13 7 -20 -33
5241 -33 -15 14 26 -3 -18 -13 17 30 17 -8 -15 -3 26 32 14 -4 -20 15 29 25 13 -10 -11 15 43 20 -13 -28 -13 16 24 0 -37
5274 -37 -36 -17 4 9 -16 -52 -41 -2 11 6 -35 -37 -34 -1 6 -26 -37 -40 -28 5 -1 -24 -43 -32 -3 9 4 -26 -34 -10 18 27 4 -27 -13 6
5310 6 20 15 0 -19 -3 29 30 21 -5 -30 -3 32 27 20 -10 -15 16 24 35 9 -25 -13 23 21 -2 -10 -28 -16 9 18 -1 -16 -31 -11 12 6
$$ packed form
5071b0J0J3K4k0m1mL0J9Ll0l3J2K7K4j4m2oNM4Ol3k0k2L6L0Lm5pJ5K8J9j4l4j9
5105e6K9M3J0l0k1jK9J2Mk6k0K8J1K4j6k9j5K3L6Rk1k1j3K8K8ol7j6LM3rj0j7
5138dpRK5J1k7k9j1L8K0j1k6k1JK2J5j3j9k1K0L2nk8j7MK6J0Lk7j2nL9Rrj3j4
5173c5K0K9jk6k1qL1L6j6j8mQM2Lk4j8j6K2K9jk8k1J4J0L8j4k9k1J7K1J0k4j2
5206gj0J1J9J9l9k1jK1K2k7k9rJ4L5Ok2k2rJ7L6Jk9k3J3J8J2ol3j1L3L0Mok7j3
5241c3J8K9J2k9j5NL0J3j3k5pJ2K9Oj8j8j6L5J4mj2k3jK6K8k3l3j5J5K9Qk4l7
5274c7JJ9K1Nk5l6J1L9J3nm1kLL3Pl2j1lJ2L3ok3j9J1K9J2nl0qK4K8Rk3l1J4J9
5310FJ4nj5j9J6L2Jrk6k5K7L5npl0nL1QJ1k6l4J2L6kk3qj8J2K5Rj9j5j5K0K3o
$$ plain form
5346 6 -23 -34 -27 -10 4 -5 -36 -35 -19 0 14 -13 -38 -43 -21 -3 7 -12 -39 -18 8 14 5 -11 -20 -3 10 6 -3 -39 -31 3 17 14 -9 -14 -15
5383 -15 3 23 14 -26 -15 4 19 24 6 -22 -14 11 24 9 -10 -14 -15 10 25 6 -14 -15 -6 20 16 -8 -19 -16 8 25 4 -18 -20 -14 8 18
5419 18 7 -18 -32 -3 21 15 -11 -28 -13 2 9 -6 -31 -33 -17 -4 20 5 -25 -17 0 8 25 -7 -20 -8 6 20 11 -22 -28 -10 17 11
5453 11 0 -35 -16 -8 15 23 -7 -23 -23 0 23 0 -8 -21 -10 15 12 0 -13 -21 -5 20 17 -17 -21 -19 1 22 15 -9 -18 5 21 9 8 -23
5489 -23 -7 6 20 11 -22 -36 -25 7 6 2 -19 -28 -10 3 4 -9 -19 -22 -7 26 0 0 -30 -13 2 9 8 -24 -29 -15 6 17 4 -20 -22 2
5525 2 28 14 -3 -27 -5 22 17 24 -11 -19 -4 33 33 8 -7 -12 12 19 21 -8 -15 2 21 19 7 -18 -30 -14 19 9 -10 -14 -18 -10 5 7 -22
5562 -22 -24 -14 -2 10 -13 -33 -39 -21 3 -3 -20 -35 -42 -12 4 -5 -15 -29 -21 4 10 9 -23 -25 -2 23 13 -8 -24 -9 10 24 26 -18 -19 -5
5598 -5 17 24 14 -8 -11 7 20 20 5 3 1 15 26 20 -6 -13 -9 15 21 9 -19 -20 11 10 -1 -5 -14 -12 12 11 3 -21 -14 -16 6 -1 3 -24 -20 -18 -9 12
$$ packed form
5346Fk9j1PJ7J4rl1JJ6J9J4k7k5nK2J8J0j9k7K1K6Orj6rJ7J3mrl6QL4J4lk3nj
5383a5J8K0rm0J1J9J5Nj8k8QK5J3j5j9mjK5J5j9k0jRK6mk4j1LK4J7k1k2kOK2J0
5419A8j1k5j4K9K4ok6j7J5J5Pj5k5kJ6J3K4j5l0QJ7QJ7l2j3J2J4J4rl3oJ8K7o
5453A1j1l5J9QK3Ql0j6%K3K3k3qj3J1K5lj2j3qJ6K5ll4mKK0K1pk4rK3J6j2jl1
5489b3J6J3J4rl3j4J1L2jmk1rJ8J3Jj3j0lJ5L3k6%l0J7J5Pjl2nJ4K1J1j3k4kK4
5525BK6j4j7k4K2K7nPl5qJ5L7%k5j5nK4PKk9pJ7J9kj2k5j2J6L3j0j9mmQJ5Kk9
5562b2kJ0J2J2k3k0oJ8K4oj7j5pL0J6rj0j4QK5Ojl2kK3K5j0k1j6J5J9J4Km4jJ4
5598eK2Pj0k2lJ8J3%j5kkJ4J1ok6pMK4Oj2k8jL1jj1mrKK4jqk4PkK2pMk7MKRK1
$$ plain form
5640 12 -9 -23 -18 15 20 23 -21 -25 -7 15 7 7 -21 -12 5 7 0 -7 -10 -11 10 14 12 -2 -11 -1 26 26 8 -10 -8 11 28 20 1 -18 -7 11 17 7
5680 7 -14 -15 0 6 15 0 -12 -20 0 4 14 -11 -16 -14 0 16 6 -13 -20 -8 8 5 -8 -15 -14 -1 12 9 -12 -9 -19 13 7 -1 -14 -15 -13 14 15 0
5720 0 -15 -12 12 28 -3 -7 -8 -6 22 14 -1 -9 -5 -7 11 9 -4 -12 1 9 24 12 1 -3 -5 12 25 11 -21 -16 -7 10 18 3 -15 -11 -8 11 2 -18
5760 -18 -31 -5 4 5 -2 -25 -18 -22 10 9 -13 -32 -23 -7 10 3 -14 -26 -17 8 8 4 -13 -16 6 16 7 0 -19 -4 -1 27 20 -16 -14 7 13 14 9 -21
5800 -21 -9 6 7 22 7 -9 -4 17 24 11 -7 -17 -1 6 7 2 -15 -9 -1 5 5 -9 -18 -1 -3 14 6 -7 -12 -15 6 6 1 -17 -31 -10 4 5 -25
5839 -25 -12 -18 1 13 0 -17 -25 -5 6 14 -5 -17 -20 -1 11 9 -14 -16 -7 7 7 -5 -7 -17 -9 8 24 9 1 -11 0 28 17 -2 -8 -8 9
5876 9 9 6 -2 -18 -4 -2 20 -7 -11 -15 3 3 7 -11 -21 -19 -4 -2 -7 -19 -12 -2 -2 1 -12 -17 -30 1 10 -2 -17 -17 -13 -1 8 -2 -9 -8 -4 6 5 -6
5918 -6 -20 -16 -1 13 -7 -7 -17 -3 17 19 10 -2 -8 7 10 10 -11 -23 -13 -5 3 -5 -11 -24 -1 1 3 -6 -14 -9 -11 8 0 -22 -31 -11 -7 -8 2 -23 -25 -15
$$ packed form
5640A2k1j4NL3NLm4mJ8K2q%k8RJ7KppljK1Mkj4rJ0K7%j8j8KJ9J7qj9j9J1J8Oj0
5680Gk1jJ5ORj5j2qK0MJ0k5nKJ4J6j0j9pJ2J6lj3pJJ3J3lk1Lj0L2oqj3jKK7Jj5
5720@j5LK4J6l1mjKK8qj5qMkJ8kj3qJ3QJ5j2j1mkJ7J3j4l2NRJ7Qj5j8MLJ9rk0
5760a8j3K6RJpk3PmL2jk2j9RJ6J7pj7j2RK5%mj7lK2J0rpj9J5LK8pl6KK1OJnl0
5800b1J2J5JJ5j5j6NK1Pj3j8j0J6PJnj7OQO%j4rJ7kJ7qj3nlK1%nj8j4K1J4Jl0
5839b5J3oJ9J2j3j7qK0J1Qj9j2lJ9J2kk3kRJ4%j2kj0QJ7J6j5qj2J1K8j1j9o%J7
5876I%lqj6J4KK2k7mmJ8%Mj8j0KJ5Knj2PJ0%Lj3nj3L1Rj2j5%MJ2Rj0pJMJ0jj1
5918fj4MJ5J4k0%j0J4K0Krj2oJ5L%k1j2J0QQqoj3K3KKrqNkJ9qk2rK0MjJ0k5kJ0
$$ plain form
5960 -15 2 -8 2 -9 -19 -1 8 10 -5 -11 -10 -3 12 7 -25 -26 -7 -3 7 -15 -21 -25 0 14 13 -12 -18 -8 -9 21 5 -23 -13 -3 1 17 -18
5997 -18 -26 -11 12 5 2 -14 -35 -11 5 7 2 -8 -10 -5 -3 -3 -3 -23 -11 -2 7 0 -21 -26 -8 -1 12 8 -9 -22 -2 19 7 4 -16 -22 -4 19 0
6036 0 -9 -16 3 3 18 6 -1 -6 -3 8 15 8 -10 -12 -2 11 1 -13 -15 3 9 9 -12 -28 -12 -13 -5 9 -12 -26 -17 -2 5 -5 -21 -21 -8 -5 7 -5
6076 -5 -17 -25 -8 -1 6 0 -15 -8 2 18 7 -1 -7 -10 7 -7 -6 -19 -11 -5 26 0 -2 -4 -6 2 3 15 2 -9 -6 24 16 3 -10 -13 4 -3 -6 -3 -6 -15 0
6119 0 5 1 -1 -31 -11 13 -11 -3 -11 -25 -5 10 -4 -15 -20 -14 -2 -1 0 -18 -23 -2 5 14 7 -8 -10 15 16 14 -8 -18 -6 13 12 19 -5 -14 -6 6 13
6160 13 7 -2 1 1 9 3 -6 -11 -7 5 10 -12 -6 -13 -6 0 6 -16 -29 -21 -7 -7 -10 -19 -21 -9 -6 -1 -15 -18 -23 -20 -2 -12 -17 -19 -25 -15 -3 2 -17 -20 -19 6 3 0 -6
6207 -6 -21 -6 1 5 2 -11 -7 2 8 10 -9 -19 5 2 24 5 -6 -8 1 12 10 8 -11 -10 1 14 0 -5 -14 -16 -2 3 -1 -19 -17 -19 1 -7 -10 -20 -15 -10 -6
6250 -6 -11 -25 -12 -17 -10 -1 -8 -27 -15 -14 5 -4 -1 -12 -3 2 4 11 -3 3 -1 12 18 1 2 -17 -2 10 18 4 -12 -10 12 14 12 2 -21 -5 7 10 0
$$ packed form
5960a5J7j0J0j1j0J8RKj5oJPJ5nl2jJ9MJ0k2omK5J4jk5oJ0jL0j6k8J0J0MJ6l5
5997a8qJ5K3plj6k1K4J6Knj0kNK%%k0J2RRpk1nJ8PJ3mj7j3K0K1j2lk0oJ8K3j9
6036@rpJ9%J5j2pnLJ1Ppj8kJ0J3j0j4kJ8O%k1j6J6jQJ4k1j4RJ5Pj0j6%J3LJ2j2
6076ej2qJ7PPoj5PJ0J6j1qolJ7j4Jj3QOL1k6kkkQJJ2j3j1LL0qj3j3lJ7plLlrJ5
6119@Nmkl0K0K4k4Qqj4K0J5j4j1nOJ2JJj8nK1PRpj5kK5Jkk2j0J2J9jPk4rQJ2P
6160A3orL%QornMJ2Nk2OpPOOk2j3QJ4%lrkJ2LNj4lnLJ8j0nkoJ0J2Nj9lJK5llo
6207fj5J5PMlj3MROKj9j0K4lK2j9j1kRJ1kkj9JJ1J3j4nrkJ4Nmj8KkK0qlj0NNM
6250fnj4J3nPRpj9J2JJ9rLj1RNKPj4OmJ3Oj7Jj9J5J2Qj4j6KK2Kkj0k3J6J2Lj0
$$ plain form
6291 0 -16 -10 -2 11 -5 -16 -13 -14 -2 -5 -12 -5 -19 -3 -12 -8 -9 -15 -19 -8 5 1 -20 -26 -13 -14 -1 -13 -14 -12 -9 -1 5 -3 -8 -8 -5 12 1 -5 -1 -5 2 9 -8
6336 -8 -35 -4 11 11 7 0 -13 0 -3 9 14 -9 -9 -5 7 17 -6 -10 -20 -3 7 -3 -8 -22 -16 -6 7 -6 -19 -27 -14 -1 6 -13 -21 -9 -12 -18
6374 -18 -11 -25 -23 -10 0 -10 1 -12 -10 -6 5 6 -6 -8 -14 -12 -6 5 -4 -4 -11 -7 -3 7 -15 -12 6 12 1 0 1 9 10 14 26 5 -8 -6 -5 -4 17 -14
6416 -14 -9 -2 -3 7 -5 -14 -18 -1 6 7 5 -6 -10 1 -1 -13 -14 -21 -21 -1 0 0 -8 -21 -1 -9 -1 -12 -17 -8 5 3 12 -13 -12 -13 -3 -5 -7 -4 -15 -19 3 -5 -14
6461 -14 -8 -4 -2 8 7 2 -2 2 13 11 2 -3 -4 -5 9 2 -10 2 -1 -5 8 -2 -7 0 -4 7 2 -4 -8 -4 -3 -4 2 -15 -13 -13 -3 -3 -9 -13 -21 5 6 -1 -5 -17 -11 5
6509 5 8 5 -17 -13 -17 -5 0 0 4 -10 -8 7 5 -10 -9 -7 2 24 7 -2 -9 2 8 9 2 -10 -10 6 1 8 -7 -13 -7 7 10 12 -4 2 3 13 11 3 -17 -21 -9
6554 -9 1 -4 -5 -6 -15 -9 -6 -4 -3 -17 -7 9 5 -11 -7 -13 -15 9 -3 -9 -12 -5 -4 0 -6 -21 -13 -6 0 13 5 -13 3 -2 -5 7 -1 -12 -10 5 7 12 1 1 -3 2
6600 2 -5 -4 -11 -12 0 2 11 4 -7 -9 -6 0 -11 -6 -9 -11 -3 -14 -9 -16 -14 -3 -6 1 -22 -14 -5 -1 -13 -7 -24 -6 -12 -3 -7 -7 -14 -15 -5 -6 -10 -6 -10 -6 2 9 -5 -6 -13 -11
$$ packed form
6291@j6OQJ3j6j1LjJ2lpPj4J6rMjomJ1J3mk1oJ3jJ3j2jKLQOqn%LJ7j1oMmPPj7
6336hk7L1J5%mpj3J3lJ2Nk3%MJ2J0k3mj0J7J0j0nj4OJ0J3j3j3qJ3J3Pj9qJ2lo
6374a8Pj4KJ3J0j0J1j3KMJ1Jj2koKOJ1r%pMMJ0k2LJ8Oj1jJQJMJ2k1j3KJJK1l1
6416a4NPjJ0j2rmJ7PJkj1mJ1kj2jp%K0J%qj3K0qQj1nRJ3kRk5JjJ0kkLj1mK2qr
6461a4OMKJ0jnmMJ1krnjjJ4pj2J2lmJ3j0nPmJ1nomMJjOj7K%J0%omqK6Jpmj2OJ6
6509ELlk2MmJ2N%Mj4KJ5kj5JKRK2j7rpJ1OJpj2%J6nPj5oOJ4LKj6OJJ0kqk0mJ2
6554iJ0njjrOLKJj4J0J6mj6MokK4j2olPJMoj5QPOJ3qj8J6nlJ2qj1KJ5KNj1%mN
6600BpJpjJ2KRpj1kLOj1NlkQj1NpKJ1lPk3QRMj2Oj7J8oRm%pjJ0jmMmMQPj4jpK
$$ [...]
8191E
##END NTUPLES=NMR FID
##END=
