##TITLE=1H_LR-675-R2-H1
 D2O, 8 sc, 
 2.7.2019
##JCAMPDX= 6.0         $$ Bruker NMR JCAMP-DX V2.0
##DATA TYPE= NMR FID
##DATA CLASS= NTUPLES
##ORIGIN= UXNMR, Bruker Analytische Messtechnik GmbH
##OWNER= root
$$ XWIN-NMR		Version 3.5
$$ Tue Jul  2 15:26:12 2019 Russian Standard Time (UT+4h)  she@DPX200
##.OBSERVE FREQUENCY= 200.13155
##.OBSERVE NUCLEUS= ^1H
##.DELAY= (6, 6)
##.ACQUISITION MODE= SIMULTANEOUS
##.ACQUISITION SCHEME= undefined
##.AVERAGES= 8
##.DIGITISER RES= 18
##SPECTROMETER/DATA SYSTEM= spect
##.PULSE SEQUENCE= zg30
##.SOLVENT NAME= D2O
##.SHIFT REFERENCE= (INTERNAL, D2O, 0, 15.7039)
##AUDIT TRAIL= $$ (NUMBER, WHEN, WHO, WHERE, WHAT)
$$ ##TITLE= Audit trail, XWIN-NMR		Version 3.5
$$ ##JCAMPDX= 5.01
$$ ##ORIGIN= Bruker BioSpin GmbH
$$ ##OWNER= she
$$ F:/spectra/data/she/nmr/H-F/1/audita.txt
$$ ##AUDIT TRAIL=  $$ (NUMBER, WHEN, WHO, WHERE, WHAT)
(   1,<2019-07-02 15:25:08.53 +0400>,<she>,<DPX200>,
      <created by zg, POWCHK disabled, PULCHK disabled
       configuration hash MD5:
       00 E9 B6 7A A2 85 ED C7 34 08 36 98 17 FE 4E 26
       data hash MD5: 16K
       FF 76 0B B4 21 3C B4 B6 EA 6C 89 FB FE BA F9 B3>)
$$ ##END=
$$ 
$$ hash MD5
$$ 98 7B 93 38 42 7B 6C 83 D1 1F C6 DD 07 92 47 33
##$RELAX= 
##$RELAX= 
##$RELAX= 
##$RELAX= 
##$RELAX= 
##$RELAX= 
$$ Bruker specific parameters
$$ --------------------------
##$DU= <F:/spectra>
##$EXPNO= 1
##$NAME= <H-F>
##$PROCNO= 1
##$TYPE= <nmr>
##$USER= <she>
##$AMP= (0..31)
100 100 100 100 100 100 100 100 100 100 100 100 100 100 100 100 100 100 
100 100 100 100 100 100 100 100 100 100 100 100 100 100 
##$AQSEQ= 0
##$AQ_mod= 1
##$AUNM= <au_zg>
##$AUTOPOS= <>
##$BF1= 200.13
##$BF2= 200.13
##$BF3= 200.13
##$BF4= 200.13
##$BF5= 200.13
##$BF6= 200.13
##$BF7= 200.13
##$BF8= 200.13
##$BYTORDA= 1
##$CFDGTYP= 0
##$CFRGTYP= 5
##$CHEMSTR= <none>
##$CNST= (0..31)
1 1 145 1 1 1 1 1 1 1 1 1 1 1 1 1 1 1 1 1 1 1 1 1 1 1 1 1 1 1 1 1 
##$CPDPRG= <>
##$CPDPRG1= <>
##$CPDPRG2= <>
##$CPDPRG3= <>
##$CPDPRG4= <mlev>
##$CPDPRG5= <mlev>
##$CPDPRG6= <mlev>
##$CPDPRG7= <mlev>
##$CPDPRG8= <mlev>
##$CPDPRGB= <>
##$CPDPRGT= <>
##$D= (0..31)
0 1.2 0 0 0 0 0 0 0 0 0 0.03 0 0 0 0 0 0 0 0 0 0 0 0 0 0 0 0 0 0 0 0 
##$DATE= 1562066707
##$DBL= (0..7)
120 120 120 120 120 120 120 120 
##$DBP= (0..7)
150 150 150 150 150 150 150 150 
##$DBP07= 0
##$DBPNAM0= <>
##$DBPNAM1= <>
##$DBPNAM2= <>
##$DBPNAM3= <>
##$DBPNAM4= <>
##$DBPNAM5= <>
##$DBPNAM6= <>
##$DBPNAM7= <>
##$DBPOAL= (0..7)
0.5 0.5 0.5 0.5 0.5 0.5 0.5 0.5 
##$DBPOFFS= (0..7)
0 0 0 0 0 0 0 0 
##$DE= 6
##$DECBNUC= <off>
##$DECIM= 24
##$DECNUC= <off>
##$DECSTAT= 4
##$DIGMOD= 1
##$DIGTYP= 9
##$DL= (0..7)
0 120 120 120 120 120 120 120 
##$DP= (0..7)
150 150 150 150 150 150 150 150 
##$DP07= 0
##$DPNAME0= <>
##$DPNAME1= <>
##$DPNAME2= <>
##$DPNAME3= <>
##$DPNAME4= <>
##$DPNAME5= <>
##$DPNAME6= <>
##$DPNAME7= <>
##$DPOAL= (0..7)
0.5 0.5 0.5 0.5 0.5 0.5 0.5 0.5 
##$DPOFFS= (0..7)
0 0 0 0 0 0 0 0 
##$DQDMODE= 0
##$DR= 18
##$DS= 0
##$DSLIST= <SSSSSSSSSSSSSSS>
##$DSPFIRM= 0
$$ [...]
##$SUBNAM2= <"">
##$SUBNAM3= <"">
##$SUBNAM4= <"">
##$SUBNAM5= <"">
##$SUBNAM6= <"">
##$SUBNAM7= <"">
##$SUBNAM8= <"">
##$SUBNAM9= <"">
##$SW= 24.9336996594482
##$SWIBOX= (0..15)
0 0 2 0 0 0 0 0 0 0 0 0 0 0 0 0 
##$SW_h= 4990.01996007984
##$TD= 16384
##$TD0= 1
##$TE= 0
##$TE2= 300
##$TE3= 300
##$TEG= 300
##$TL= (0..7)
0 120 120 120 120 120 120 120 
##$TP= (0..7)
150 150 150 150 150 150 150 150 
##$TP07= 0
##$TPNAME0= <>
##$TPNAME1= <>
##$TPNAME2= <>
##$TPNAME3= <>
##$TPNAME4= <>
##$TPNAME5= <>
##$TPNAME6= <>
##$TPNAME7= <>
##$TPOAL= (0..7)
0.5 0.5 0.5 0.5 0.5 0.5 0.5 0.5 
##$TPOFFS= (0..7)
0 0 0 0 0 0 0 0 
##$TUNHIN= 0
##$TUNHOUT= 0
##$TUNXOUT= 0
##$USERA1= <user>
##$USERA2= <user>
##$USERA3= <user>
##$USERA4= <user>
##$USERA5= <user>
##$V9= 5
##$VALIST= <valist>
##$VCLIST= <CCCCCCCCCCCCCCC>
##$VD= 0
##$VDLIST= <DDDDDDDDDDDDDDD>
##$VPLIST= <PPPPPPPPPPPPPPP>
##$VTLIST= <TTTTTTTTTTTTTTT>
##$WBST= 1024
##$WBSW= 4
##$XGAIN= (0..3)
0 0 0 0 
##$XL= 0
##$YL= 0
##$YMAX_a= 482375
##$YMIN_a= -617022
##$ZGOPTNS= <>
##$ZL1= 120
##$ZL2= 120
##$ZL3= 120
##$ZL4= 120
##$ABSF1= 10
##$ABSF2= 0
##$ABSG= 5
##$ABSL= 3
##$ALPHA= 0
##$AQORDER= 0
##$ASSFAC= 0
##$ASSFACI= 0
##$ASSFACX= 0
##$ASSWID= 0
##$AUNMP= <proc_1d>
##$AZFE= 0.1
##$AZFW= 0.1
##$BCFW= 1
##$BC_mod= 2
##$BYTORDP= 1
##$COROFFS= 0
##$CY= 11.3945322036743
##$DATMOD= 1
##$DC= 2
##$DFILT= <>
##$DTYPP= 0
##$F1P= 18.9103706918063
##$F2P= -1.10871071338519
##$FCOR= 0.5
##$FTSIZE= 0
##$FT_mod= 4
##$GAMMA= 1
##$GB= 0.15
##$INTBC= 1
##$INTSCL= 1
##$ISEN= 128
##$LB= 0.24
##$LEV0= 0
##$LPBIN= 0
##$MAXI= 10000
##$MC2= 0
##$MEAN= 0
##$ME_mod= 0
##$MI= 1.114404
##$NCOEF= 0
##$NC_proc= 0
##$NLEV= 6
##$NOISF1= 3.799351
##$NOISF2= 2.8
##$NSP= 1
##$NTH_PI= 0
##$NZP= 0
##$OFFSET= 15.70392
##$PC= 1
##$PHC0= -8503.235
##$PHC1= 11.60097
##$PH_mod= 1
##$PKNL= yes
##$PPARMOD= 0
##$PSCAL= 0
##$PSIGN= 0
##$REVERSE= no
##$SF= 200.130013532006
##$SI= 16384
##$SIGF1= 3
##$SIGF2= 2
##$SINO= 400
##$SIOLD= 16384
##$SREGLST= <1H.CDCl3>
##$SSB= 0
##$STSI= 0
##$STSR= 0
##$SW_p= 3612.71676300578
##$SYMM= 0
##$S_DEV= 0
##$TDeff= 0
##$TDoff= 0
##$TI= <>
##$TILT= no
##$TM1= 0
##$TM2= 0
##$TOPLEV= 0
##$USERP1= <user>
##$USERP2= <user>
##$USERP3= <user>
##$USERP4= <user>
##$USERP5= <user>
##$WDW= 1
##$XDIM= 8192
##$YMAX_p= 0
##$YMIN_p= 0
$$ End of Bruker specific parameters
$$ ---------------------------------
##NTUPLES= NMR FID
##VAR_NAME=  TIME,          FID/REAL,        FID/IMAG
##SYMBOL=    X,             R,               I
##VAR_TYPE=  INDEPENDENT,   DEPENDENT,       DEPENDENT
##VAR_FORM=  AFFN,          ASDF,            ASDF
##VAR_DIM=   8192,          8192,            8192
##UNITS=     SECONDS,       ARBITRARY UNITS, ARBITRARY UNITS
##FACTOR=    0.0002004,     1,               1
##FIRST=     0,             0,               0
##LAST=      1.6414764,     0,               0
##MIN=       0,             -617022,         0
##MAX=       1.6414764,     482375,          0
$$ Real data points
##PAGE= N=1
##DATA TABLE= (X++(R..R)), XYDATA
0 0 0 0 0 0 8 -8 8 -9 16 -19 24 -32 40 -48 56 -72 83 -102 120 -142 166 -191 225 -257 295 -339 385 -439
28 -439 500 -562 634 -714 802 -899 1000 -1118 1242 -1378 1532 -1698 1880 -2082 2304 -2553
44 -2553 2825 -3132 3484 -3876 4328 -4856 5473 -6215 7116 -8254 9730 -11731 14626 -19196
58 -19196 27533 -47702 198020 49107 -437102 -187955 56174 -23014 -182776 123046 482375
69 482375 369937 -131188 -344010 -168496 20456 -4003 27370 188773 252388 53266 -178538
80 -178538 -254998 -195380 -77689 120167 269296 186059 -66174 -186534 -143880 -171391 -267136
91 -267136 -105115 301632 449118 95962 -282945 -240958 -40056 -115871 -261949 -18044
101 -18044 428084 442779 -19721 -328762 -171938 35252 -46723 -125464 120754 400306 270912
112 270912 -122670 -285562 -125501 33019 48964 95614 218970 219177 22660 -179218 -230988
123 -230988 -165487 -29570 162608 287707 198956 -22281 -150906 -161216 -199205 -229523 -54611
134 -54611 260383 350646 88236 -190613 -197716 -100452 -147343 -194293 14930 308881 287160
145 287160 -40688 -254512 -167067 -34310 -46505 -31956 149500 286074 145572 -131916
155 -131916 -242049 -140825 -7596 76015 164639 237460 186268 7112 -163870 -218537 -154725
166 -154725 -8733 166796 268187 210913 45524 -98213 -168165 -192446 -150500 8263 202264
177 202264 244975 88707 -97985 -164471 -150451 -135605 -75211 77995 204575 149701 -45334
188 -45334 -189706 -191717 -120248 -39374 65751 175521 191984 63808 -118844 -218183 -187655
199 -187655 -71662 70154 189993 231978 158689 2591 -143788 -199028 -141750 -4979 143332
210 143332 225718 196083 75710 -65451 -155778 -154466 -63928 68472 165632 170979 85087 -43719
222 -43719 -150983 -178042 -102265 32095 137915 155661 88175 -29068 -151761 -220320 -177415
233 -177415 -33909 118480 184221 140987 29708 -99579 -198581 -212673 -115812 44784 170682
244 170682 193256 115449 -11769 -127059 -174283 -124161 -3049 118328 178322 154881 58042
255 58042 -70431 -151688 -121601 -3022 111957 159957 145442 81248 -34024 -155086 -181774
266 -181774 -71226 87967 173575 158065 90646 -4494 -125575 -214503 -181103 -27404 127242
277 127242 175442 121951 27690 -76519 -170362 -197841 -114428 33338 139939 145291 69878
288 69878 -36423 -127264 -157960 -103891 8078 109820 148669 111317 12843 -101752 -159209
299 -159209 -111613 10722 122075 168128 147262 71103 -47638 -155785 -169195 -62631 85224
310 85224 172943 170773 108807 10374 -105042 -178736 -144606 -15467 112532 156546 115178 29192
322 29192 -68352 -145373 -154798 -75752 44230 123689 116332 38446 -62217 -138313 -151473 -89017
334 -89017 20703 115701 142032 85882 -21962 -125426 -167083 -120444 -8787 107517 168655
345 168655 148513 58703 -59545 -144937 -147209 -62477 59342 149916 166814 108999 6006
356 6006 -92987 -135102 -94277 5615 103969 143953 109087 20852 -75169 -130131 -113632 -31441
368 -31441 69826 129823 113185 29658 -75012 -147765 -151560 -81799 28785 120348 140532 78269
380 78269 -31231 -129686 -168380 -128164 -28267 82995 146831 128037 39580 -66477 -132772
391 -132772 -128268 -57796 43575 124389 140247 81452 -15943 -94287 -111247 -60936 28554 110866
403 110866 141667 100501 7301 -85886 -125945 -91694 -3373 91640 144297 125841 41307 -67742
415 -67742 -142998 -142907 -69745 34587 116162 134838 80997 -19673 -116082 -155695 -116660 -23621
427 -23621 69618 115731 95341 21084 -69946 -128388 -118461 -44416 50105 110306 107222 46358
439 46358 -39803 -106739 -115161 -56110 39653 119620 140137 90523 -3041 -92208 -127478 -89786
451 -89786 -304 93292 145973 132005 53397 -53527 -127341 -124191 -52140 39636 104690 120729
463 120729 80116 -8320 -101173 -136555 -88767 2643 73898 95270 70360 8150 -75026 -132263
475 -132263 -114554 -26750 67639 109375 88242 26234 -53065 -118797 -129637 -65907 38514 118703
487 118703 132429 80593 -7406 -89785 -124793 -91215 -6034 83437 133175 120316 49437 -45410
499 -45410 -108391 -99913 -31609 48408 100412 108617 68372 -13115 -94242 -116135 -60190 27947
511 27947 88645 98897 65401 -2222 -83736 -132573 -106457 -17458 73134 112082 89195 23428
523 23428 -59499 -124037 -131617 -69655 26867 101209 115617 68979 -12106 -88326 -119155 -85990
535 -85990 -7624 72437 112832 94528 27920 -50361 -96352 -84112 -21308 57262 109671 106533
547 106533 47479 -33119 -89407 -94287 -48021 29053 101378 125444 78377 -13134 -90965 -114285
559 -114285 -83606 -19099 57922 114011 108277 32521 -65859 -120764 -108428 -52124 17427 76875
571 76875 99504 62252 -19700 -93441 -113009 -72917 781 70246 98137 67004 164 -60509
583 -60509 -91172 -84921 -31031 60515 128888 109826 19476 -58269 -79755 -73042 -56293 3125
595 3125 103731 156240 89467 -35266 -99101 -79372 -47671 -27518 28359 113815 131483 34805
607 34805 -83388 -114581 -68656 -20057 14236 59649 93259 61344 -28188 -102476 -110346 -59957
619 -59957 15839 80277 94744 48485 -18454 -63623 -87704 -94734 -48813 60214 145992 110446
631 110446 -7733 -77032 -61576 -49363 -70326 -30815 98726 176847 87109 -65419 -104895
642 -104895 -41111 -13624 -36307 5435 116120 145581 26337 -105383 -111871 -35720 9822
653 9822 19389 53684 94304 65456 -32519 -111805 -111458 -49650 29190 88371 93161 39570 -23478
666 -23478 -56797 -79743 -102806 -66030 56795 153612 102447 -32969 -85797 -40980 -32032 -82841
678 -82841 -51797 96294 179374 68546 -93801 -109081 -18260 6132 -37604 -2097 117751
689 117751 147072 14371 -120753 -110955 -18865 24401 24041 56791 100654 69840 -31324 -108894
701 -108894 -106528 -45034 34029 93160 93433 37125 -19372 -44962 -70739 -100028 -62897 59544
713 59544 145582 85091 -43292 -82198 -33811 -28157 -76812 -44234 93515 160624 47518 -102656
725 -102656 -109353 -20886 2261 -33403 7677 117069 131737 1414 -120467 -108010 -24552
736 -24552 18760 29231 63508 97417 63091 -29048 -99593 -98578 -39550 37758 90185 85607
748 85607 34736 -14192 -40049 -65391 -84859 -42507 64346 129485 70748 -39802 -74637 -40091
760 -40091 -35682 -62107 -17657 96321 135863 31374 -91743 -101133 -38787 -15426 -19461 29970
772 29970 108375 102753 -5311 -101923 -99704 -38744 7132 34847 68444 86371 47816 -30401
784 -30401 -87311 -84475 -32555 35845 83198 80795 35410 -15074 -47653 -66959 -65349 -14809 69046
797 69046 109552 60617 -23843 -64662 -58589 -51555 -39186 16320 91061 102539 25631 -63584
809 -63584 -88788 -62807 -33162 -2679 48701 92507 72355 -8150 -79667 -89642 -52018 -3367
821 -3367 41072 73223 71872 26538 -37548 -78113 -72612 -26227 35538 77870 76517 34867 -19220
834 -19220 -59698 -71914 -48137 8504 68433 91010 58699 -2912 -55491 -76093 -61877 -18100
846 -18100 40495 82332 78055 27133 -37357 -77524 -76882 -40111 15760 64450 77298 45645 -11186
859 -11186 -61349 -79428 -57925 -5811 49686 75758 58192 8632 -44773 -74856 -65855 -22195
871 -22195 33855 72933 73968 34903 -24894 -71781 -76833 -37977 18604 62718 77274 57417
883 57417 7048 -52430 -83874 -63295 -4206 51789 73517 60750 25289 -23696 -69234 -79117
895 -79117 -36770 29914 71585 66803 31190 -12795 -53657 -74568 -55923 -459 56722 77773
907 77773 52251 -333 -50237 -73732 -61518 -19009 33873 71263 71945 31472 -29351 -74050
919 -74050 -74503 -33536 20393 58909 70362 51952 5455 -51702 -81525 -57325 2279 53019
931 53019 68311 53943 20637 -26241 -68009 -71947 -26964 35727 71753 64121 27662 -17647
943 -17647 -56150 -71514 -48565 5931 59127 76018 48457 -3367 -50638 -72585 -59867 -16841
955 -16841 35820 69740 65636 24546 -31463 -70356 -69878 -32243 19089 57689 67627 43745 -4818
968 -4818 -54336 -73191 -48330 3136 49900 68371 53558 13037 -35808 -67692 -61479 -18497
980 -18497 35635 69171 65084 29013 -20107 -59708 -69062 -40193 12587 58609 71631 46674
992 46674 -1471 -48240 -70420 -56249 -11549 39376 68573 58741 17263 -32475 -64453 -63442
1004 -63442 -30688 19448 59793 66391 34473 -16162 -56155 -65964 -42722 1523 47629 69417
1016 69417 52529 5104 -44674 -67892 -54374 -13992 32737 64673 64363 28546 -23964 -62806
1028 -62806 -65697 -32655 16506 55568 66366 43468 -2556 -47563 -67419 -50358 -4823 43485
1040 43485 66636 52734 11786 -33465 -61214 -58966 -25609 23919 62021 64154 28433 -21189
1052 -21189 -56321 -62222 -38806 4230 48443 68977 49278 276 -47093 -65475 -50003 -11088
1064 -11088 32808 62548 60652 24113 -27243 -61872 -60715 -26930 18775 54302 62518 38970
1076 38970 -6343 -49343 -64916 -43726 1458 44459 63322 48782 9133 -35640 -62364 -56050
1088 -56050 -18900 28920 60757 58941 25292 -21151 -56016 -62179 -36211 9045 50520 64036
1100 64036 42194 -2913 -45312 -63133 -48185 -9090 35230 61640 54701 16913 -30033 -59551
1112 -59551 -55964 -23318 20329 54021 60453 34463 -11678 -51643 -61961 -37295 5764 44649
1124 44649 60835 46994 8005 -37642 -62965 -52011 -12119 32741 58162 54228 23567 -20245
1136 -20245 -55305 -61059 -31996 14786 51927 59207 35923 -5029 -43705 -60625 -45650 -5196
1148 -5196 38260 60568 48864 10527 -32567 -57609 -52458 -20397 22424 54301 57613 28714
1160 28714 -16698 -52605 -59062 -33670 8125 44710 58968 42812 2964 -39737 -60754 -47849
1172 -47849 -8954 33346 57250 51313 18972 -23842 -54413 -55564 -26075 16806 50973 57551
1184 57551 33027 -9086 -45890 -58002 -38860 521 39318 57717 45342 8251 -33812 -57978
1196 -57978 -50438 -15205 27561 54609 52273 23066 -17097 -49393 -56886 -33402 10145 49086
1208 49086 58922 35372 -4731 -38647 -53065 -43484 -10824 32573 60893 51833 10674 -32593
1220 -32593 -51873 -44949 -21055 13213 47414 59458 34140 -15012 -52540 -55766 -29432 6374
1232 6374 36134 51488 43425 9923 -34629 -61579 -50689 -8784 34316 52514 42607 16845
1244 16845 -14373 -44146 -57330 -36976 12784 56853 59325 23937 -14430 -33883 -41964 -41744 -17443
1257 -17443 32282 68804 53304 -245 -42002 -46541 -32624 -17548 7095 44079 64036 36745
1269 36745 -21455 -60258 -52351 -17493 12532 31277 44169 43340 14009 -34842 -65925 -50221
1281 -50221 -242 42106 49741 31907 11025 -9180 -37483 -59703 -41359 17937 66491 57420
1293 57420 10229 -22796 -27910 -32832 -42378 -22890 33818 75678 52128 -12075 -50452 -41392 -22034
1306 -22034 -15190 1494 41663 66945 36202 -28591 -65830 -48525 -8579 16764 27531 38243
1318 38243 41472 15347 -35231 -68826 -49412 7616 49322 46779 22430 6981 -5335 -34564
1330 -34564 -61060 -40464 24645 71692 53640 848 -26684 -23573 -27609 -41753 -22980 37721
1342 37721 78206 47730 -19445 -51835 -36594 -17443 -13945 2232 42361 65446 32454 -31647
1354 -31647 -65847 -45295 -3897 20270 26972 34260 37924 13564 -36538 -68776 -45513 12814
1366 12814 51277 43418 17484 4370 -6025 -34660 -59615 -36444 28774 71011 48269 -3083
1378 -3083 -26390 -23147 -29328 -40377 -16613 41284 73096 40220 -20372 -48876 -36640 -19532
1390 -19532 -10952 8069 42746 57850 25275 -31723 -61049 -42671 -4409 21106 30056 35060
1402 35060 32397 6495 -37102 -62314 -39362 13712 49209 43571 19155 3096 -11729 -38044
1414 -38044 -53815 -25899 31715 64004 43149 647 -22781 -28101 -33906 -33836 -4489 42074 62196
1427 62196 33009 -16206 -42736 -38870 -23837 -7137 17461 44097 47749 15709 -30457 -54047
1439 -54047 -41135 -7886 21303 35820 37091 24749 -3606 -38990 -54810 -32655 12309 43237
1451 43237 43009 23688 1400 -21607 -42561 -44164 -14437 29507 52866 40117 7721 -20146
1463 -20146 -35767 -38840 -24877 7408 41378 50502 26978 -10601 -37261 -42283 -28096 -780
1475 -780 28385 44417 36687 7554 -26663 -46759 -39425 -10993 21664 41140 39871 19070 -12544
1488 -12544 -39720 -45948 -26022 8236 36764 44819 29565 -990 -30925 -44482 -34540 -5913
1500 -5913 25935 43662 38268 12576 -19774 -42084 -40914 -16090 17183 38823 40187 22521 -6291
1513 -6291 -34484 -45359 -29213 4490 34512 43473 29924 2357 -25909 -42318 -37840 -12692
1525 -12692 21002 44316 41109 13620 -19493 -39528 -38987 -21785 5857 33145 44488 29750
1537 29750 -4786 -36232 -44049 -27075 318 24018 37691 35876 13419 -21716 -45485 -38982
1549 -38982 -8877 21792 37313 36402 20539 -6911 -34745 -44803 -26628 8415 37681 43763
1561 43763 26619 -753 -25348 -39103 -35210 -10672 22875 44695 38952 10651 -20963 -38044
1573 -38044 -35707 -18014 7334 31980 42246 26703 -8400 -38120 -42346 -23368 2338 24154
1585 24154 36900 33044 8150 -25951 -45545 -36457 -7055 22203 37191 34864 17608 -10253
1597 -10253 -36071 -42866 -23669 9980 36508 41408 25631 -696 -26024 -38936 -31237 -6130
1609 -6130 24241 42048 35735 9231 -20761 -36934 -33395 -14500 12049 34606 39676 21285 -10866
1622 -10866 -35928 -39885 -22881 3749 27703 38420 29476 3153 -27194 -42822 -34431 -7680
1634 -7680 20794 37174 35076 15394 -13722 -36891 -39459 -20049 9935 33115 38864 24476 -2424
1647 -2424 -27585 -37969 -27344 -1177 26101 39333 31096 7101 -20067 -36202 -33191 -11390
1659 -11390 17599 37216 36539 16661 -11653 -33898 -38609 -23099 4922 30590 39618 26552 -818
1672 -818 -27672 -39873 -31781 -8271 19367 36547 33555 11268 -17127 -36103 -35548 -16672 10278
1685 10278 31151 35452 20843 -5599 -29732 -37402 -23814 3314 28249 37505 28095 5148 -21005
1698 -21005 -36855 -32355 -8254 21113 38531 35472 15104 -11405 -32044 -36769 -21491 6955
1710 6955 32139 38805 24496 -1896 -25813 -36414 -28799 -6187 20382 35531 29771 7093 -19430
1723 -19430 -35222 -32870 -14000 11834 31051 33287 16502 -10274 -32432 -37312 -22520 3926
1735 3926 27913 36895 26583 2402 -23514 -37435 -30648 -7040 20419 36787 34057 14725 -11591
1748 -11591 -31066 -33946 -17573 9153 31142 36081 22306 -2257 -24640 -33740 -24413 -1139 23416
1761 23416 35259 27003 4354 -20445 -34340 -30875 -11353 14439 32926 33215 13993 -13288 -33298
1774 -33298 -36241 -21563 3466 26827 35997 25249 65 -25097 -36294 -28211 -6373 18288
1786 18288 33477 31268 12374 -13550 -31049 -30825 -13080 11330 30112 33218 19183 -4737 -25875
1799 -25875 -32406 -20450 3373 26343 35956 25944 2738 -21686 -34233 -29187 -9076 16451
1811 16451 33674 32587 12994 -13325 -32678 -35146 -20065 4043 25784 32989 21747 -2042
1823 -2042 -24816 -34643 -26174 -4694 18700 31154 26350 6537 -16474 -30704 -28682 -11260 13690
1836 13690 31692 32390 15650 -8913 -27407 -30992 -18124 4989 27767 37052 26991 2946 -21649
1849 -21649 -33403 -26446 -5545 17916 32178 30790 14209 -10547 -30676 -33494 -17026 8576
1861 8576 26437 27936 15820 -2643 -22069 -33575 -26847 -2425 23454 31638 19231 -761 -18102
1874 -18102 -28929 -29825 -14064 13785 34799 32831 10700 -13817 -27994 -29130 -18261 2226 25384
1887 25384 36659 27344 2487 -22537 -32397 -22737 -1169 18373 27978 26859 15060 -6944 -29293
1900 -29293 -33508 -11582 17617 30048 22185 9872 -967 -17316 -34102 -29863 1413 32610
1912 32610 34662 12993 -6524 -15934 -25243 -32053 -19188 13978 38690 32491 5611 -17482 -25967
1925 -25967 -25676 -18783 -848 21744 33998 24933 -11 -24181 -32112 -18705 3835 19530 23235
1938 23235 21269 14194 -5762 -31339 -35293 -6914 26921 33758 17618 5519 1614 -13641 -36013
1951 -36013 -33413 4738 40284 36786 8251 -8669 -10809 -20303 -33373 -22425 14116 40545 30051
1964 30051 84 -19170 -22881 -22036 -17480 -1901 19959 30697 20656 -4241 -27401 -32665 -16181
1977 -16181 8225 21079 20454 17425 12436 -6634 -34070 -37705 -4812 32130 35836 15435 4693
1990 4693 5092 -10201 -36986 -34628 7171 43422 36047 6167 -7125 -6010 -15971 -31322 -20101
2003 -20101 16141 39522 26117 -2876 -19239 -21075 -19882 -14308 1258 20370 27704 15620 -8404
2016 -8404 -30112 -34205 -16621 8866 22306 19902 15554 9747 -9719 -36087 -38973 -5554 29938
2029 29938 33268 14745 5601 4766 -11072 -34790 -29977 9055 40075 32160 5849 -5326 -5648
2042 -5648 -15046 -25226 -11926 20044 37424 23212 -3354 -18389 -21410 -19331 -10581 7589 24329
2055 24329 27199 13302 -9551 -30078 -34500 -18003 7463 21853 21362 15765 6505 -12756 -34825
2068 -34825 -35151 -6442 23046 27628 14664 5260 -484 -15145 -30171 -21591 9619 32941 27329
2081 27329 7367 -5247 -11202 -18800 -19783 -2277 23362 34092 21532 -180 -16680 -24493 -21641
2094 -21641 -7501 13142 27300 27069 13209 -8013 -26887 -31718 -17970 4280 20246 23253 15994
2107 15994 2171 -15553 -29754 -27325 -6604 15786 23583 16119 3620 -9390 -21587 -25467 -12704
2120 -12704 10425 25988 24305 10295 -6320 -19951 -24501 -15404 4456 23488 30314 22280 4276
2133 4276 -14864 -26203 -22638 -5399 15253 28019 26576 13202 -5906 -21171 -25992 -15814 3875
2146 3875 20453 24425 14636 -2195 -18146 -24810 -19041 -3578 12780 22123 18372 2064 -18331
2159 -18331 -28168 -22293 -6827 9071 20559 23794 13296 -8048 -27078 -29692 -14772 5326 20284
2172 20284 25868 21242 6103 -14010 -26592 -22283 -3636 16034 25925 23014 10978 -5225 -17922
2185 -17922 -20617 -10603 6849 22036 25727 13990 -5839 -20255 -21508 -12539 -58 14124 25025
2198 25025 21703 1462 -21983 -30438 -21008 -5579 8551 19223 23980 14441 -8469 -28612 -30163
2211 -30163 -14189 4345 16030 20533 17896 4519 -14792 -25906 -19633 -1811 15064 22670 19421
2224 19421 7062 -8695 -19143 -18333 -6731 10054 24622 26403 12893 -7572 -21103 -21438 -11831
2237 -11831 2304 17788 27594 22968 3024 -19515 -28417 -20589 -5541 8361 18764 22437 12988
2250 12988 -8437 -25873 -26591 -12696 3152 14225 18091 13453 -765 -17461 -24830 -17201 32
2263 32 15585 21711 16519 3039 -12535 -22097 -19922 -5677 12786 25745 25618 13039 -5441 -20156
2277 -20156 -22540 -12976 3974 19948 27520 21844 4292 -14366 -23010 -18211 -4724 10159 20431
2290 20431 20384 8828 -8889 -21564 -21545 -10171 5173 16187 18140 9406 -6062 -20677 -25242 -16347
2304 -16347 863 15925 21479 15709 1112 -15661 -26058 -22762 -7089 11814 23568 23152 11825
2317 11825 -4917 -18945 -22996 -13426 3860 19713 24403 17209 3065 -11111 -18663 -15216 -1539
2330 -1539 14328 22726 18409 5071 -9839 -19024 -18067 -6837 9150 20880 20781 9156 -7784 -21756
2344 -21756 -24913 -15625 836 16304 22199 15830 805 -16066 -25919 -22959 -8544 9265 19994
2357 19994 19026 8753 -5902 -18488 -21757 -12290 4723 18023 20454 12234 -843 -12822 -18248
2370 -18248 -13061 1289 17317 23930 17628 3059 -11447 -19444 -17550 -5293 11636 23757 23566
2383 23566 10787 -6725 -19861 -23140 -15104 816 15884 21964 15846 850 -14795 -23146 -19803
2396 -19803 -7001 8222 17271 15754 4863 -9180 -19584 -19809 -9596 5903 17525 18395 9112
2409 9112 -4941 -16939 -20328 -12742 2893 18128 24481 18014 3297 -12153 -20513 -17941 -5237
2422 -5237 12030 23768 23566 11942 -4278 -16496 -19835 -12069 2364 15963 20964 14335 -204
2435 -204 -13770 -19427 -15116 -3183 10070 17602 14162 1656 -13016 -21651 -19221 -7760 7104
2448 7104 17860 18223 7882 -7772 -20591 -23372 -14715 1206 16277 22275 16565 2627 -12235
2461 -12235 -20790 -17516 -5163 10518 20903 20820 10165 -4280 -14858 -16241 -7884 5791 17341
2474 17341 20061 12399 -1368 -13446 -17903 -11470 1832 14717 20133 14667 1266 -13002 -21837
2487 -21837 -19777 -7342 8780 19439 18668 7636 -7574 -19269 -23010 -15902 -611 14033 19880
2500 19880 13597 21 -12863 -19081 -15891 -5041 9056 17909 16741 6029 -7498 -16014 -15174
2513 -15174 -4933 8713 18092 18991 10984 -2356 -14841 -19687 -11649 4834 18681 21503 14566
2526 14566 2916 -9216 -19782 -20673 -7944 10941 21361 17042 5666 -5608 -14534 -19863 -15806
2539 -15806 -1020 14517 18522 8900 -4343 -13635 -16889 -13799 -3861 9345 17375 14217 2160
2552 2160 -11719 -19540 -16310 -3806 10687 18361 17245 10454 -1462 -15350 -22315 -13423 6478
2565 6478 20634 20141 12046 4694 -4304 -16610 -20926 -7130 14325 22719 13765 1787 -4289 -9181
2579 -9181 -16072 -14323 1496 18083 18844 4998 -8639 -14485 -15462 -12671 -3089 10484 18509 13833
2593 13833 234 -14411 -22383 -18570 -4376 9897 16246 14471 9551 0 -15194 -24604 -14812
2606 -14812 7299 20115 15881 7273 4419 -1169 -14380 -20372 -4969 18092 23897 10630 -1941
2619 -1941 -4146 -6821 -13872 -12247 5518 22654 20940 4536 -9718 -14575 -14881 -12035 -2077 12084
2633 12084 19618 14550 1028 -13786 -22548 -18876 -4709 8732 13652 11431 7837 -55 -15132
2646 -15132 -24133 -13724 7932 18420 11625 2974 1413 -2644 -14802 -19112 -2553 19780 23470
2659 23470 8654 -3540 -5595 -8198 -14489 -10619 7997 24429 21713 5439 -7825 -13303 -14532
2672 -14532 -11432 -577 12576 19327 14547 2266 -11666 -20004 -16350 -3105 9109 12062 9316
2685 9316 5565 -2242 -14848 -21542 -10853 8631 17214 10267 1184 -2015 -7255 -17024 -17808 -631
2699 -631 19104 21834 9164 -2504 -7410 -11830 -15282 -8725 8828 22317 19995 7510 -5132
2712 -5132 -11990 -14027 -9271 1453 13109 17513 12887 1991 -9853 -16421 -12924 -741 10383
2725 10383 13313 9259 2968 -5684 -15852 -18660 -7904 8398 16558 11998 3052 -4589 -12509 -18780
2739 -18780 -15276 -293 14932 18538 10470 -506 -9376 -14870 -14989 -6567 7418 17368 16450 7291
2753 7291 -3729 -11997 -13602 -7052 4398 13613 15672 10211 448 -9585 -14732 -9970 1836 12583
2767 12583 15985 11247 2105 -8227 -15779 -15335 -5361 7367 15672 14804 6383 -5383 -15135 -17673
2781 -17673 -11687 -224 10741 15260 11073 781 -10815 -16907 -13597 -3307 7093 12778 11973
2794 11973 5272 -5092 -14010 -14312 -5091 6616 14066 14094 8014 -2073 -11140 -14347 -9117 2102
2808 2102 13200 18077 13414 1964 -9372 -14717 -12726 -4539 6295 15025 16427 8260 -5196 -15035
2822 -15035 -15318 -7983 1256 8630 12804 10698 612 -12042 -16736 -11057 -387 7727 11371 9949
2836 9949 3316 -7391 -15600 -14351 -4912 7156 14585 14147 6631 -3771 -12137 -14796 -9720 1428
2850 1428 12569 17869 13380 1886 -9006 -13737 -10690 -2950 5909 13994 15551 7627 -5216 -13742
2864 -13742 -12336 -4967 3256 9571 12545 9100 -1313 -12587 -15926 -9760 823 9307 12519 9714
2878 9714 1290 -9347 -16439 -14895 -5263 6281 13596 13436 5902 -4677 -13146 -14751 -9548 719
2892 719 10767 15468 11520 1011 -8922 -12653 -9491 -1854 7186 13667 13516 5268 -5253 -12240 -11160
2907 -11160 -3510 5713 12704 13616 7721 -2459 -11798 -14328 -8927 1446 10630 14586 10729 1072
2921 1072 -9155 -15094 -13430 -5556 5157 12475 12993 5365 -5003 -12736 -13946 -8431 1028 9542
2935 9542 12897 8459 -731 -9566 -13039 -9443 -632 8993 13447 10564 2716 -6312 -12120 -11820 -4188
2950 -4188 6911 14423 14230 6569 -3291 -10525 -13015 -8899 834 11068 15494 10686 599 -8631
2964 -8631 -12692 -11119 -4135 5254 12280 12087 4294 -5853 -12548 -12520 -6221 2702 9911 11237 6508
2979 6508 -2466 -10645 -13797 -9681 386 10021 13366 9283 1154 -7080 -12629 -12380 -4774 6814 14763
2994 14763 13889 5513 -3551 -9677 -11560 -8045 926 11099 14868 9512 -137 -8168 -11017 -8751 -2205
3009 -2205 6456 12078 11101 3191 -6614 -12377 -11308 -4622 4177 10776 11161 5775 -3382 -11518 -14293
3024 -14293 -9575 625 9757 12846 8775 657 -7682 -12792 -12268 -4752 6065 13111 11937 4612
3038 4612 -3494 -9563 -10958 -7182 1991 10786 13273 8097 -993 -8185 -10682 -7555 -252 8207 12898
3053 12898 10844 2374 -6848 -11931 -10595 -3634 5427 11953 12322 6098 -3301 -11258 -13356 -8555 491
3068 491 9014 12231 8546 462 -8055 -12564 -10871 -3366 5704 11134 9795 3556 -4796 -10741 -10896
3083 -10896 -5433 3466 10283 11700 6352 -2158 -9071 -11333 -7622 713 9082 13266 9906 1872 -6882
3098 -6882 -11620 -10314 -3247 5749 11930 11975 5715 -3397 -10378 -11776 -6954 1189 8789 11622 7960
3113 7960 -345 -8491 -11706 -8922 -1511 6167 10567 9151 2616 -6239 -11633 -10746 -4025 4418 10431
3128 10431 10729 5524 -2593 -10067 -12175 -7561 1553 9249 12171 9139 1937 -6523 -11449 -10171 -2744
3143 -2744 6119 11600 10783 4594 -3167 -9297 -10410 -5788 2351 9436 11214 6610 -1472 -8488 -10976
3158 -10976 -8015 -729 6939 10936 8757 1418 -7189 -11847 -10526 -3815 4435 9857 10354 5807 -2727
3173 -2727 -10565 -12678 -7251 1649 8653 10425 7698 1565 -6073 -11340 -10099 -1772 7172 11007 8569
3188 8569 3196 -3213 -8562 -10072 -5309 4051 11381 11283 5062 -2152 -7577 -9812 -7540 -537 7956
3203 7956 12232 8992 934 -7287 -11125 -9303 -3171 4015 9664 10166 5247 -3149 -10712 -11810 -6029
3218 -6029 2499 8074 8694 6173 971 -6414 -12092 -9915 -679 8191 10432 6622 1441 -3324 -8382
3233 -8382 -10891 -5689 5102 12321 10755 3389 -3315 -7274 -9120 -7623 -841 8536 12856 8663 -238
3248 -238 -7235 -9912 -7671 -2721 4266 9418 9858 4882 -3637 -10501 -10903 -4129 3876 8017 7761 5279
3264 5279 547 -6704 -11964 -9523 789 9534 10010 5265 683 -3292 -8497 -11462 -5728 5677 12821
3279 12821 9982 2210 -3471 -6562 -8493 -7447 -629 8678 12411 7570 -1028 -7334 -8804 -6481 -1747
3294 -1747 4740 9234 9461 3987 -4516 -10517 -10170 -3048 4392 8404 7594 4746 -71 -7264 -12044 -9097
3310 -9097 1457 9579 9905 4900 353 -3700 -8634 -10773 -5232 5583 11917 9224 1671 -3734 -6688
3325 -6688 -8050 -6516 152 8542 11501 6644 -1627 -7404 -8733 -5811 -606 5593 9343 8794 3222
3340 3222 -4853 -10266 -9101 -2497 5134 8827 8082 4831 -888 -7105 -11226 -7715 1404 8911 9463
3355 9463 5166 278 -4523 -8755 -9489 -3963 5298 10652 8274 1601 -4232 -7515 -8360 -5208 1414
3370 1414 8132 10127 5587 -2105 -7883 -9026 -6083 262 6109 9201 7663 2230 -5139 -9915 -8756
3385 -8756 -2358 4794 9002 8265 4196 -1770 -7511 -9689 -6191 1520 8256 9397 5650 -122 -5816
3400 -5816 -8663 -7515 -1772 5402 9380 7799 2011 -4542 -8529 -8255 -3547 2864 7976 8928 5190
3415 5190 -1527 -7790 -9614 -5994 632 6722 9062 6844 1129 -5211 -9144 -8111 -2543 4805 8779
3430 8779 8213 3338 -2968 -7631 -8505 -4695 1703 7506 9139 5684 -761 -6825 -8799 -5971 -568
3445 -568 5119 8529 7506 2121 -4954 -9260 -8133 -2556 3751 7506 7901 4197 -1939 -7603 -9600
3460 -9600 -5842 930 6980 8652 5869 636 -5369 -8512 -7337 -2061 4600 8663 7962 2715 -3786
3475 -3786 -7834 -7496 -3302 2141 7207 8950 5651 -1279 -7209 -8431 -4959 717 5672 8315 7179
3490 7179 1983 -4768 -9216 -7846 -1796 4163 7572 7466 3793 -1970 -7302 -8919 -5136 1545 6998
3505 6998 8359 5181 -686 -5938 -8079 -6403 -1557 4647 8495 7416 1962 -4527 -8098 -7074 -2855
3520 -2855 2631 7159 8299 4863 -1512 -7376 -8776 -5044 969 6092 7887 6187 1471 -5011 -8367
3535 -8367 -6983 -1631 4187 7909 7254 2904 -2895 -7142 -7993 -4358 1618 6981 8529 4775 -1218
3550 -1218 -6175 -7959 -5720 -667 4847 8143 6988 1566 -4735 -8434 -6988 -2309 3199 7188 7614
3565 7614 4097 -1619 -7001 -8258 -4652 1452 6375 8002 5553 427 -4792 -7841 -6720 -1679 4637
3580 4637 8148 6969 2061 -3539 -7111 -6942 -3549 1901 6772 8032 4570 -1567 -6677 -8008 -4942
3595 -4942 -94 5064 7538 6506 1411 -4747 -8138 -6888 -1786 3617 7166 6993 3391 -2207 -6734
3610 -6734 -7970 -4554 1527 6725 7784 4540 -495 -4937 -7054 -5998 -1143 4639 8416 6862 1455
3625 1455 -4128 -7255 -6585 -2728 2405 6614 7812 4484 -1963 -6804 -7611 -4351 650 5127 7334
3640 7334 5759 1062 -5050 -7877 -6710 -1427 4117 7102 6111 2630 -2583 -6688 -7508 -4042 2002
3655 2002 6544 7354 3922 -1190 -5316 -7191 -5417 -758 4848 8079 6119 943 -4364 -7098 -5980
3670 -5980 -2315 2837 6713 7180 3506 -2029 -6783 -7152 -3748 1363 5362 7148 5252 523 -4909
3685 -4909 -7742 -5877 -880 4341 6926 5793 2126 -2938 -6773 -6932 -3224 2424 6481 7151 3624
3700 3624 -1617 -5579 -6964 -4655 108 4871 7408 5486 406 -4406 -7206 -5897 -1637 3336 6632
3715 6632 6437 3160 -2267 -6393 -6807 -3579 1303 5808 6856 4584 -704 -5123 -6884 -5003 -586
3730 -586 4248 7055 5639 1378 -3638 -6742 -6325 -2351 2402 6227 6717 3567 -1651 -5931 -6963 -3942
3746 -3942 694 5071 6759 5117 301 -4322 -6963 -5816 -1293 3759 6756 5957 2119 -2554 -6235
3761 -6235 -6468 -3114 2059 6068 6689 3810 -947 -5057 -6506 -4674 -284 4703 7196 5459 870
3776 870 -3995 -6774 -5783 -1963 3017 6118 6332 3150 -2081 -6243 -6766 -3463 1229 4948 6331 4088
3792 4088 203 -4518 -6923 -5387 -612 3996 6429 4885 1456 -2985 -6012 -6289 -2871 2387 6348
3807 6348 6479 3165 -1453 -5090 -6372 -4674 63 4875 7022 5172 329 -4124 -5958 -5172 -1707
3822 -1707 2784 6212 6412 2667 -2438 -6151 -5938 -2697 1522 4873 6061 4287 -304 -4712 -6944
3837 -6944 -4682 -88 4316 5915 4611 1224 -2895 -6169 -6337 -2292 3021 6332 5726 2265 -1773
3852 -1773 -4780 -6104 -4413 127 5216 7020 4390 -515 -4340 -5607 -4692 -1369 2882 6231 6056
3867 6056 2127 -3356 -6120 -5347 -1985 1834 4734 5954 3883 -800 -5651 -6792 -3979 771 4366
3882 4366 5457 4234 1077 -3051 -6286 -6081 -1655 3524 6038 5058 1745 -1742 -4599 -5897 -4169
3897 -4169 813 5579 6677 3530 -990 -4239 -5016 -4003 -1268 3095 6372 5950 1390 -3840 -5927
3912 -5927 -4489 -1391 1819 4690 6073 3974 -959 -5518 -6560 -3198 1367 4318 5138 4029 1261
3927 1261 -3367 -6354 -5737 -1415 3658 5921 4434 1349 -1967 -4649 -5690 -3745 1051 5455 6118
3942 6118 2881 -1479 -4453 -4812 -3758 -843 3184 6301 5589 818 -4190 -5983 -4316 -1211 1827
3957 1827 4638 5929 3672 -1419 -5772 -5916 -2616 1251 4252 4872 4041 1126 -3351 -5864 -4937 -701
3973 -701 3672 5629 4266 1033 -2342 -4600 -5158 -3018 1567 5440 5990 2599 -1717 -4427 -4922 -3485
3989 -3485 -591 3362 5982 4843 570 -4201 -5810 -4203 -1075 2260 4617 5429 2940 -1698 -5437
4004 -5437 -5564 -2444 1802 4387 4768 3491 281 -3608 -5367 -4271 -191 4064 5438 4034 684
4019 684 -2769 -4811 -4709 -2159 2065 5352 5595 2300 -2072 -4781 -5179 -3042 139 3580 5379 4323
4035 4323 182 -4072 -5601 -4217 -961 2593 4782 4527 2034 -1942 -4884 -5017 -2288 1736 4675
4050 4675 4838 2902 -568 -3759 -5008 -3489 162 3911 5745 4206 556 -3111 -4883 -4297 -1653
4065 -1653 2295 5269 5352 2590 -1789 -4770 -5116 -2957 575 3556 4954 3551 225 -3609 -5457 -4216
4081 -4216 -680 2715 4523 3982 881 -2544 -4784 -4720 -2386 1626 4534 4766 2313 -1416 -4336 -4850
4097 -4850 -3150 161 3977 5447 4165 606 -3314 -4925 -3876 -986 2433 4585 4798 2373 -1493
4112 -1493 -4534 -4997 -2417 1249 3871 4670 2998 -90 -3362 -4949 -3685 -210 3345 5094 3524
4127 3524 446 -2679 -4632 -4575 -2002 1927 4703 4902 2106 -1837 -4422 -4886 -3040 279 3412 4986
4143 4986 3685 495 -3383 -4982 -3638 -685 2562 4434 4166 1883 -1746 -4185 -4342 -1868 1827
4158 1827 4469 4439 2241 -515 -3527 -4612 -3450 63 3690 4934 3492 15 -2949 -4738 -4301 -1733
4174 -1733 1990 4595 4652 1976 -1866 -4459 -4759 -2585 495 3166 4475 3106 -44 -3199 -4576 -3549
4190 -3549 -289 2617 4407 3741 1238 -1967 -4266 -4263 -1430 2237 4804 4545 2168 -936 -3543 -4496
4206 -4496 -2857 395 3671 4952 3782 565 -3036 -4567 -3778 -1232 1955 4354 3877 1924 -1632
4221 -1632 -4517 -4467 -2245 964 3235 3778 2283 -462 -3475 -4934 -3397 -1 3162 3959 2885 517
4237 517 -2322 -4436 -4150 -1458 2170 4514 4422 2209 -1253 -3541 -4236 -2563 506 3711 4774 3655
4253 3655 205 -2961 -4221 -3041 -240 2390 3981 3775 1481 -1715 -4263 -4252 -1378 1640 3573 3553
4269 3553 1985 -663 -3501 -4768 -3229 297 3174 4290 2911 162 -2636 -4475 -3998 -1681 1957
4284 1957 4333 4072 1776 -1523 -3737 -4003 -2184 637 3149 4116 3076 -112 -2843 -4097 -2511 87
4300 87 2642 3967 3387 1008 -1953 -4033 -3848 -1225 2155 4075 3872 2113 -950 -3703 -4543 -2828
4316 -2828 245 3253 4043 2800 177 -2494 -4078 -3794 -1364 1786 3662 3539 1508 -1513 -3841 -3736
4332 -3736 -1710 866 3239 3894 2427 -486 -3068 -3987 -2481 392 2851 4211 3298 891 -2158 -4017
4348 -4017 -3508 -870 2335 3889 4068 2111 -1122 -3429 -3910 -2423 674 3071 3846 2820 192 -2598
4364 -2598 -4168 -3228 -697 1901 3277 3042 775 -2134 -3894 -3744 -1542 1174 3348 3509 1554 -1021
4380 -1021 -3517 -4071 -2698 473 3209 4122 3072 489 -2555 -3595 -3327 -1012 2002 4010 4157 1739
4396 1739 -1185 -3161 -3186 -1635 713 3003 3756 2466 -509 -2806 -3676 -2500 165 2359 3440 2823
4412 2823 714 -2279 -4012 -3568 -1270 1662 3684 3320 1565 -968 -3482 -4042 -2862 103 3077 3954
4428 3954 2532 -54 -2624 -3522 -3179 -1287 1682 3779 3526 1315 -1498 -3075 -2589 -1135 934 3158
4444 3158 3680 2221 -651 -2997 -3448 -1775 545 2472 3474 2983 697 -2284 -4065 -3427 -1008 1902
4460 1902 3411 3320 1447 -1069 -3133 -3978 -2576 70 2775 3480 2018 -677 -2473 -3182 -2762 -785
4476 -785 1798 3390 3114 423 -2255 -3333 -2597 -1088 1340 3228 4004 2274 -1087 -3408 -3315 -1421
4492 -1421 839 2729 3750 3173 709 -2292 -3714 -3168 -666 2011 3231 2972 1151 -1029 -2920 -3644
4508 -3644 -1949 628 2879 3199 1372 -804 -2712 -3115 -2527 -650 2076 3742 2752 -223 -2773 -3433
4524 -3433 -2432 -1109 973 3372 3739 2130 -1283 -3663 -3222 -1451 553 2283 3472 3184 924 -2295
4540 -2295 -3685 -2595 0 2059 3007 2758 1386 -1051 -2685 -2976 -1420 1231 3280 2926 985 -1238
4556 -1238 -2817 -3111 -2246 -365 2455 3848 2507 -330 -2842 -3392 -2508 -1228 547 3046 3700 1718
4572 1718 -1605 -3570 -2975 -1074 328 2033 3128 2752 159 -2344 -3366 -1938 700 2161 2746 2507
4588 2507 1035 -1446 -3019 -2979 -812 1633 3320 3282 1401 -1007 -2779 -3105 -2372 9 2462 3653
4604 3653 2526 -63 -2641 -3332 -2350 -1149 708 2764 3344 1437 -1732 -3455 -2746 -903 598 1878
4620 1878 2589 2182 -285 -2947 -3260 -1746 672 2312 2742 2126 469 -1459 -3045 -2601 -483 1968
4636 1968 3740 3293 1403 -1049 -2452 -2835 -1840 96 2630 3623 2467 -253 -2482 -2826 -2217 -795
4652 -795 976 2401 2706 767 -2040 -3335 -2663 -1000 978 1956 2544 1453 -1034 -3048 -3548 -1867
4668 -1867 509 2221 2914 2379 378 -2160 -3139 -2414 -665 1590 3253 3198 1319 -916 -2343 -2379 -1145
4685 -1145 535 2501 3238 2190 -267 -2159 -2611 -1450 87 1773 2813 2418 333 -1827 -3281 -2439
4701 -2439 -660 1184 2649 2584 1079 -1313 -2996 -3279 -2019 234 2105 2876 2069 101 -2180 -3118
4717 -3118 -2408 -856 1184 2774 2556 1145 -1285 -2616 -2435 -859 1120 2529 2676 1646 -354 -2188
4733 -2188 -2499 -1406 683 2397 3101 2199 455 -1645 -3018 -2700 -740 1554 3056 2749 865 -1064
4749 -1064 -2695 -2926 -1804 136 2021 2716 1894 -352 -2198 -2729 -1844 -368 1311 2362 2381 634 -1455
4766 -1455 -2721 -2313 -574 1541 2564 2450 1184 -492 -2178 -2765 -1495 666 2695 3272 2035 244
4782 244 -1562 -2638 -2453 -712 1768 3055 2619 1055 -1171 -2353 -2382 -1597 247 2085 2632 1245 -693
4799 -693 -2155 -2835 -1686 147 1523 2102 1552 145 -1667 -3148 -2504 -643 1649 2365 2418 1050 -752
4816 -752 -2351 -2959 -1880 625 2654 2991 1797 69 -1229 -2169 -1883 -522 1571 2956 2321 781
4832 781 -944 -1834 -1595 -726 860 2163 2400 1446 -827 -2339 -2788 -1214 399 2047 2355 1562 221
4849 221 -1747 -3263 -3012 -707 1673 2450 2070 755 -597 -2179 -3200 -1823 304 2289 2374 965
4865 965 -288 -1410 -2018 -1959 -302 1860 2649 2085 270 -1307 -2074 -1636 -467 1349 2441 2487 1369
4882 1369 -817 -2469 -2719 -1140 759 2297 2411 1791 408 -1741 -2839 -2545 -540 1607 2186 1572
4898 1572 519 -685 -2006 -2634 -1381 658 2354 2040 850 -878 -1831 -2318 -1622 176 1822 2667
4914 2667 1695 -23 -1814 -2557 -1907 -146 1334 2537 2606 1314 -445 -2335 -2614 -1095 959 2291
4930 2291 2454 1640 308 -1435 -2340 -1889 -195 1757 2088 1529 393 -1131 -2168 -1946 -863 794 2044
4947 2044 1712 510 -1060 -2108 -2389 -1592 292 1943 2277 1515 -242 -1955 -2714 -2201 -322 1493 2501
4964 2501 2247 942 -557 -1945 -2362 -1031 697 2190 2298 1433 -129 -1402 -1937 -1488 207 1731
4980 1731 2230 1711 226 -1335 -2107 -1798 -429 1254 2337 1843 483 -1054 -2228 -2454 -1406 224
4996 224 1892 2132 1303 -175 -1793 -2609 -2052 -530 1268 2111 1695 442 -867 -1889 -1744 -998 817
5013 817 2013 2031 1040 -503 -1723 -1871 -1018 428 1895 2400 1797 128 -1708 -2107 -1406 -259 1362
5030 1362 2266 2029 857 -868 -2209 -2246 -1052 327 1817 1894 1219 -211 -1589 -2438 -1802 -209 1425
5047 1425 1994 1320 123 -1405 -1999 -1770 -767 938 2110 2222 809 -1045 -1772 -1820 -1040 455 1715
5064 1715 2583 1801 147 -1800 -2226 -1143 -126 1063 2011 2102 1060 -748 -2085 -1901 -592 604 1773
5081 1773 1587 907 -197 -1598 -2167 -1484 190 1512 1814 1282 -266 -1239 -2079 -2020 -672 728 2124
5098 2124 2092 576 -1318 -2289 -1819 -834 167 1668 2326 1944 -266 -1795 -1955 -1084 393 1124 1543 1889
5116 1889 1063 -706 -1758 -1712 -184 1291 1880 1656 816 -207 -1535 -1983 -1133 377 2147 2086 1213 -506
5134 -506 -1734 -1764 -1715 -789 746 2159 2221 212 -1627 -2332 -1496 -867 -151 1199 1987 1562 -481 -2129
5152 -2129 -1991 -711 448 983 1410 1560 693 -1227 -2139 -1761 32 1421 1877 1691 769 -470 -1414 -1944
5170 -1944 -1146 528 1944 2262 1215 -302 -1545 -1473 -1462 -635 869 2099 1946 327 -1337 -1922 -1227
5187 -1227 -369 63 1195 1946 1309 -716 -2337 -1880 -601 481 1110 1510 1255 322 -1440 -2464 -1642
5204 -1642 100 1293 1904 1477 637 -511 -1673 -2011 -1027 711 1920 2118 1120 -284 -1214 -1278 -1058 -382
5222 -382 875 2000 1708 88 -1479 -1858 -1090 -281 470 1227 1602 1001 -980 -2374 -1872 -417 439 1022
5240 1022 1351 1268 123 -1396 -2397 -1716 -12 1170 1602 1334 538 -612 -1594 -1629 -904 629 1797 1917
5258 1917 716 -420 -1176 -1291 -825 191 1383 1903 1553 -143 -1447 -1601 -973 -63 662 1433 1724 719
5276 719 -1086 -1992 -1729 -273 454 1257 1519 1131 100 -1686 -2152 -1313 16 1063 1424 1237 278 -782
5294 -782 -1604 -1659 -540 573 1493 1599 481 -847 -1203 -1501 -713 232 1366 1773 1446 -207 -1422 -1668
5312 -1668 -1115 154 1072 1880 1727 824 -768 -1863 -1526 -681 745 1541 1481 863 -158 -1447 -1750 -1132
5330 -1132 -139 922 1434 1083 11 -1242 -1646 -1241 -286 954 1454 1207 355 -802 -1537 -1615 -684 610
5348 610 1322 1795 1099 -335 -1070 -1818 -1097 32 986 1656 1392 597 -727 -1439 -1460 -454 703 1525 1508
5367 1508 790 -412 -1463 -1426 -712 65 1173 1433 1061 -17 -1511 -1712 -1142 -93 875 1592 1271 480
5385 480 -793 -1771 -1852 -654 537 1290 1588 823 -272 -1068 -1563 -1207 -80 1167 1697 953 91 -696
5403 -696 -1261 -1220 -493 924 1716 1506 568 -618 -1233 -1069 -473 261 1280 1718 1118 -372 -1439 -1721 -1067
5422 -1067 -166 774 1437 1193 341 -801 -1573 -1825 -677 834 1435 1005 535 -259 -1123 -1655 -1385 197
5440 197 1440 1360 838 -8 -918 -1269 -1377 -241 602 1742 1411 89 -784 -1355 -1208 -518 458 1408 1655
5459 1655 1091 -137 -1416 -1577 -802 -109 1062 1490 1191 450 -724 -1590 -1544 -401 823 1305 898 457
5477 457 -474 -998 -1296 -1019 348 1419 1510 761 -447 -911 -1180 -1133 -380 811 1712 1390 154 -871 -1311
5496 -1311 -1035 -709 409 1071 1535 992 -303 -1307 -1375 -641 258 932 1215 1077 404 -938 -1588 -1295 -88
5515 -88 819 1143 776 412 -327 -1044 -1386 -792 339 1390 1605 613 -470 -1136 -1351 -1203 -332 1070 1589
5534 1589 1119 41 -783 -1281 -992 -424 415 1198 1446 780 -259 -1287 -1228 -674 367 1006 1276 968 161
5553 161 -702 -1428 -950 40 946 1317 744 214 -345 -1052 -1396 -701 593 1408 1452 420 -436 -1025 -1101 -1020
5573 -1020 -146 896 1462 1100 151 -910 -1286 -1006 -272 450 1222 1143 508 -593 -1369 -1352 -732 466 1172
5592 1172 1218 745 -86 -841 -1161 -889 308 951 1464 1083 364 -543 -1244 -1169 -399 591 1337 1315 755 -195
5612 -195 -1080 -1171 -636 104 907 1192 730 54 -861 -1349 -1039 -271 789 1075 928 224 -598 -1278 -1252 -540
5632 -540 360 1174 1208 568 -250 -1051 -1179 -728 105 764 1305 1220 159 -729 -1221 -958 -149 473 968 1205
5652 1205 752 -380 -1175 -1280 -411 492 1160 1160 734 7 -928 -1301 -961 -299 849 1323 907 -33 -550 -1360
5672 -1360 -1050 -494 252 1247 1286 442 -427 -914 -1000 -694 -74 636 1245 1304 204 -779 -1355 -882 -145 567
5692 567 1075 1040 634 -490 -1135 -1368 -389 520 1034 1130 607 -12 -877 -1090 -1056 257 912 1244 690 56
5712 56 -580 -1174 -1038 -723 496 974 1065 468 -554 -1044 -899 -623 8 747 1079 719 -116 -1101 -1147 -595
5732 -595 143 693 903 1021 369 -527 -1224 -1016 -300 657 1178 984 548 48 -910 -1240 -800 216 1015 1288
5752 1288 777 -75 -518 -843 -851 -601 412 1044 1128 462 -610 -1108 -943 -315 319 587 1084 867 -54 -1052
5772 -1052 -1217 -507 239 693 677 708 271 -628 -1252 -1211 -243 843 905 631 535 -198 -743 -1094 -971 259 1142
5793 1142 1077 639 -295 -685 -845 -922 -230 551 1189 1014 19 -754 -1091 -771 -475 111 674 1095 651 -236
5813 -236 -999 -1177 -481 331 704 877 765 272 -613 -1193 -1128 -97 678 998 691 404 -286 -847 -1145 -681
5833 -681 394 961 1153 521 -275 -771 -909 -812 -293 638 1166 940 133 -632 -974 -864 -246 303 897 1038
5853 1038 696 -241 -1221 -999 -442 343 836 957 672 261 -829 -1267 -1018 -113 753 838 647 235 -382 -832
5873 -832 -1224 -617 332 996 1069 329 -485 -694 -944 -673 27 647 1196 912 110 -766 -985 -816 -341 415
5893 415 937 937 686 -187 -1078 -1041 -279 395 662 796 649 175 -754 -1087 -774 -18 700 924 675 213 -327
5914 -327 -929 -1072 -570 450 894 979 397 -466 -838 -964 -369 52 778 1169 671 -87 -689 -1020 -648 -41
5934 -41 467 902 904 384 -366 -1100 -1170 -318 431 896 933 419 -173 -627 -847 -744 16 771 711 597 -51 -564
5956 -564 -951 -841 -377 303 998 802 483 -438 -701 -708 -499 83 807 773 537 -13 -732 -960 -704 35 424
5977 424 758 866 108 -595 -918 -733 -335 432 1087 894 352 -296 -724 -923 -621 78 695 972 688 185
5997 185 -561 -860 -861 -183 579 771 868 216 -228 -915 -891 -515 138 658 696 633 -164 -789 -866 -773 39 616 998
6020 998 700 189 -523 -881 -893 -414 413 883 833 415 -333 -786 -804 -496 -40 816 773 671 76 -721 -1027
6041 -1027 -485 27 638 884 736 295 -432 -997 -1021 -467 664 708 669 88 -170 -561 -830 -704 7 686
6061 686 861 378 -83 -421 -761 -704 -305 361 854 814 314 -310 -961 -626 -482 367 681 970 569 -134 -998
6082 -998 -722 -340 -20 652 905 493 140 -537 -772 -920 -177 393 861 718 186 -250 -622 -1057 -490 54
6102 54 860 949 519 -161 -512 -737 -596 -118 487 875 849 145 -583 -892 -674 -397 96 606 948 592 -249
6123 -249 -878 -814 -311 208 666 678 796 122 -374 -620 -855 48 617 1035 734 276 -324 -582 -699 -646 322
6144 322 848 932 288 -257 -438 -794 -599 -113 435 769 693 191 -586 -895 -614 -236 8 680 881 428 -368
6165 -368 -754 -962 -349 210 516 742 529 8 -396 -960 -809 163 573 789 618 260 -287 -671 -834 -262
6185 -262 85 937 785 513 93 -490 -653 -470 -97 570 790 529 -93 -430 -835 -607 -302 226 863 739
6205 739 379 -336 -873 -757 -458 177 352 697 421 -85 -476 -874 -677 -26 498 821 615 173 -404 -926
6225 -926 -651 -173 225 780 831 297 -258 -747 -731 -279 -35 509 818 680 32 -503 -602 -587 -17 491 558 697
6247 697 277 -262 -682 -831 -97 84 756 630 451 -50 -993 -738 -391 -109 562 833 424 178 -629 -796
6267 -796 -623 -65 570 566 569 151 -348 -697 -716 -182 269 719 704 308 135 -488 -811 -699 30 448 738 471
6289 471 62 -481 -800 -673 -246 338 773 655 373 -345 -799 -509 -477 45 440 630 606 183 -498 -662 -559
6310 -559 251 460 711 535 410 -197 -681 -641 -283 207 654 709 439 12 -340 -819 -634 -89 625 845 274
6331 274 -122 -522 -426 -623 -130 302 687 554 226 -460 -676 -435 -133 161 444 716 555 -149 -670 -877
6351 -877 -398 74 282 626 466 152 -679 -875 -764 -349 422 677 593 265 -340 -500 -750 -403 142 627
6371 627 672 295 -74 -346 -580 -602 -336 380 852 818 85 -578 -547 -481 -292 110 484 601 582 -152 -707 -704 -424
6394 -424 190 599 534 615 189 -360 -639 -733 88 376 646 330 125 4 -462 -442 -480 106 678 900 269 -238
6416 -238 -463 -402 -454 -131 569 814 543 125 -439 -541 -227 -153 267 421 671 515 -187 -734 -760 -209 75
6437 75 471 507 214 107 -403 -740 -575 -8 551 669 532 -80 -231 -332 -599 -335 224 607 450 101 -263
6458 -263 -538 -384 -604 -140 107 936 467 -146 -535 -765 -195 -159 170 614 682 342 -241 -543 -395 -236 262
6479 262 514 333 414 -10 -456 -732 -478 173 387 451 371 71 -314 -619 -586 -472 124 877 511 82 -409
6500 -409 -455 -620 -359 -91 632 826 460 -50 -561 -610 -368 121 460 594 641 211 -76 -494 -480 -281 258
6521 258 361 596 432 -43 -415 -594 -385 227 700 715 353 -47 -278 -662 -291 -326 334 793 529 80 -195
6542 -195 -614 -513 -241 -101 350 680 450 -113 -540 -473 -299 -25 373 734 457 27 -408 -473 -349 -117 324
6563 324 673 406 -62 -176 -462 -592 -455 -10 686 835 443 84 -327 -440 -416 -56 365 678 483 156
6583 156 -228 -601 -540 -316 234 301 548 409 -77 -491 -423 -406 86 486 724 544 -131 -361 -558 -293 187
6604 187 270 429 444 84 -108 -585 -407 -137 105 457 734 357 -102 -451 -651 -465 -191 510 576 669 192
6625 192 -429 -653 -481 -179 224 520 496 190 -197 -436 -660 -206 113 486 591 282 38 -408 -587 -606 -43
6646 -43 254 500 452 174 -219 -564 -297 -321 152 453 526 318 -105 -407 -585 -326 284 484 570 454 26 -304
6668 -304 -582 -505 -34 464 670 434 107 -172 -178 -375 -349 140 626 501 324 -92 -335 -559 -253 -39 190
6689 190 550 506 20 -512 -385 -398 45 185 475 470 201 -164 -512 -471 -288 229 237 376 385 -10 -183 -448 -595
6712 -595 -16 445 597 573 264 -5 -407 -466 -179 -13 553 486 279 -177 -428 -471 -373 -151 263 812 473 -39
6734 -39 -622 -659 -448 -249 186 465 604 293 -279 -590 -564 -60 106 443 305 418 159 -380 -556 -495 141
6755 141 437 491 192 212 -223 -421 -425 17 366 573 235 199 -121 -394 -408 -306 6 291 681 375 39 -526
6777 -526 -488 -502 -32 318 325 402 284 -127 -487 -515 -155 20 370 372 266 151 -422 -663 -290 -3 437 670 286
6800 286 84 -339 -269 -369 -127 357 549 720 254 -117 -445 -474 -298 118 309 594 375 66 -424 -575 -430
6821 -430 3 293 307 376 181 -4 -715 -578 -223 247 235 514 356 5 -538 -550 -376 68 279 446 377 25
6843 25 -387 -437 -470 8 404 461 583 128 -249 -398 -435 -391 160 346 494 336 -88 -464 -593 -322 33 309
6865 309 579 537 81 -195 -657 -583 -12 330 376 417 147 -194 -391 -476 -252 134 342 434 177 -37 -154 -549
6887 -549 -375 289 414 434 418 205 -114 -487 -429 -266 103 403 316 239 2 -233 -518 -518 151 669 533 224
6909 224 -103 -151 -291 -534 -34 179 437 353 -37 -180 -421 -569 -262 23 288 466 148 -164 -361 -381 -387 -76
6931 -76 189 403 370 151 -304 -501 -549 -350 153 364 262 203 -165 -331 -339 -269 21 521 507 170 84 -218 -439
6954 -439 -316 -94 377 508 542 74 -298 -470 -578 -71 16 454 628 253 -136 -475 -404 -333 53 93 436 189
6976 189 89 -312 -547 -439 -153 100 336 167 189 86 -239 -324 -522 152 523 541 245 -308 -186 -442 -386
6997 -386 5 270 539 360 63 -340 -381 -323 -36 47 327 302 180 -417 -556 -334 -112 155 227 437 395 -18
7019 -18 -160 -739 -460 -95 359 535 423 -174 -323 -387 -516 -301 -35 425 511 143 -276 -436 -348 -247 -156 151
7041 151 712 563 142 -399 -260 -233 56 116 441 555 139 -200 -498 -206 -7 210 443 577 394 -206 -519
7062 -519 -437 -85 20 293 512 204 14 -406 -450 -373 -88 116 524 286 142 -167 -395 -327 -237 34 275 558
7084 558 480 -230 -497 -153 -307 -37 206 305 591 127 -204 -565 -386 -121 281 398 447 296 -70 -221 -382
7105 -382 -191 52 452 372 332 200 -142 -287 -532 -153 172 393 369 141 -159 -350 -413 -276 -34 336 581
7126 581 565 -222 -517 -357 -115 -208 -45 450 363 59 -324 -474 -356 -86 288 362 487 157 -244 -238 -456 -244
7148 -244 -26 314 551 295 6 -271 -332 -416 -229 136 472 458 218 -357 -419 -132 -135 224 412 534 332 -440
7170 -440 -332 -518 -316 14 305 372 332 -85 -222 -479 -127 -5 228 554 591 187 -183 -268 -328 -364 -34 441
7192 441 316 370 -42 -287 -210 -182 -48 391 610 287 -8 -449 -303 -284 -326 -16 576 416 155 -36 -280 -439
7214 -439 -235 -4 60 364 303 11 -286 -505 -400 88 213 190 346 125 -164 -414 -291 5 57 493 343
7235 343 164 -109 -112 -368 -210 10 369 506 224 62 -213 -350 -337 -77 394 465 451 303 -204 -356 -323 -202
7257 -202 -89 248 408 125 76 -10 -185 -99 34 197 365 154 -42 -438 -321 -396 -59 -81 201 368 424 -100
7279 -100 -403 -405 -209 107 396 609 340 -7 -107 -493 -116 -78 165 538 402 131 -170 -345 -507 -82 387
7300 387 271 489 170 -114 -255 -347 -200 2 371 373 383 81 -219 -498 -285 -190 35 375 482 281 -88 -451
7322 -451 -487 -254 252 285 398 115 147 -215 -252 -410 -115 408 421 331 93 -30 -458 -499 -53 175 261 505 151
7345 151 -231 -526 -281 -211 -79 241 475 337 27 -546 -507 -361 -51 60 349 282 52 -192 -620 -505 -24
7366 -24 97 409 195 -25 187 -272 -609 -326 -146 277 242 180 115 -17 -161 -374 -266 164 603 356 202
7387 202 -155 -362 -361 -96 195 265 621 364 -1 -361 -360 -130 36 231 359 348 338 -246 -459 -262 -18 240
7409 240 381 344 33 37 -108 -448 -341 3 297 240 28 -271 -222 -258 -324 -84 149 475 350 254 -147 -435 -199
7432 -199 -267 115 292 389 414 109 -511 -290 -140 -241 328 309 207 -61 -165 -403 -507 -82 201 44 235
7453 235 201 -120 -255 -361 -304 181 309 387 414 -64 -211 -420 -283 12 482 336 265 0 -64 -491 -138 -272
7475 -272 226 355 409 133 -77 -253 -302 15 199 364 484 325 8 -432 -472 -413 -73 392 349 479 -9 15
7497 15 -464 -327 -254 134 352 121 -50 -128 -272 -288 -239 -67 247 320 316 -23 -355 -343 -277 -116 61 220 353
7520 353 76 -84 -264 -353 -195 287 325 223 348 94 -113 -513 -268 -31 319 415 478 276 -37 -339 -244 -222
7542 -222 62 347 275 153 -15 -448 -376 -159 -2 359 417 185 89 -225 -428 -160 -108 116 361 258 106 -120
7564 -120 -218 -411 -203 5 370 468 89 -183 -173 -350 -420 -35 176 343 451 -62 -296 -244 -391 -57 227 362
7586 362 462 45 -136 -357 -221 -76 163 196 341 181 76 -204 -364 -315 -24 95 355 126 81 -205 -574
7607 -574 -597 -228 160 420 529 -24 28 -264 -176 -198 134 272 388 140 -65 -289 -256 -44 -274 254 251 503
7629 503 -5 -219 -194 -358 -20 129 428 344 88 68 -107 -449 -140 -10 321 320 504 220 -262 -420 -312 57
7651 57 47 255 262 -52 -74 -355 -254 -199 -53 376 276 326 -171 -474 -374 -66 -121 166 480 98 359 -244 -595
7674 -595 -285 104 96 311 369 271 -109 -347 -359 -167 73 294 367 74 -73 -222 -509 -199 37 136 398 340 4
7697 4 -93 -234 -189 -190 -125 237 339 99 -248 -433 -237 -186 36 198 224 483 290 -209 -452 -322 120 206 262 320
7721 320 306 -82 -259 -450 -276 219 184 263 212 7 -193 -363 -261 -95 126 381 253 -22 -416 -303 -351 -172
7743 -172 32 393 542 241 42 -411 -242 -292 19 115 331 191 72 -273 -314 -272 15 106 201 101 137 26
7765 26 -268 -291 -147 238 465 221 98 -217 -373 -251 -188 27 204 483 327 -75 -240 -311 -326 -68 -19 311
7787 311 420 214 71 -369 -89 -79 229 154 22 189 112 -556 -511 -153 -106 104 275 239 124 -228 -365 -465
7809 -465 -92 98 329 455 56 -20 -208 -300 -296 -31 208 254 309 7 -229 -171 -347 -320 210 320 307 176 -104
7832 -104 -221 -308 -143 39 208 267 -13 -181 -137 -280 -287 -55 63 372 253 14 -106 -272 -529 -171 282 325
7854 325 310 81 -91 -269 -231 -289 35 294 320 157 221 -322 -447 -263 -115 228 449 295 231 -250 -342 -53
7876 -53 -172 75 82 477 271 -49 -218 -294 -305 -80 175 229 235 141 -380 -259 -495 -216 272 403 341 183 -140
7899 -140 -336 -256 -74 62 59 348 307 20 -133 -297 -228 77 291 247 315 -62 -206 -275 -209 -84 283 565 216
7922 216 291 -34 -196 -271 -99 51 273 325 -61 57 -542 -472 -281 -226 160 98 419 148 -265 -226 -198 -167 137
7945 137 203 449 77 -24 -252 -311 -231 -108 190 290 325 5 -91 -263 -216 -199 211 306 259 61 -182 -325 -234
7968 -234 -164 -48 218 154 195 36 -166 -377 -378 -102 65 144 120 250 -107 -164 -337 -61 123 296 269 92 -15
7991 -15 -201 -264 -460 212 177 314 227 -39 -57 -234 -215 -185 -60 306 344 51 -93 -174 -179 -179 6 133 159 314 -85
8016 -85 -214 -182 -402 68 162 276 334 -55 -298 -496 -488 -171 219 331 12 148 -10 -258 -346 -155 106 227
8038 227 212 245 33 -160 -335 -298 -108 -20 356 318 43 -227 -392 -190 -79 -26 239 248 142 -131 -246 -375 -177
8061 -177 -22 156 272 209 -60 -13 -303 -465 177 55 279 339 171 -39 -408 -341 -159 91 134 302 15 125
8083 125 -213 -267 -216 -49 206 377 274 -216 -136 -254 -139 73 151 265 353 155 21 -196 -232 -59 120 164
8105 164 347 258 -51 -292 -311 -35 -6 144 339 186 257 -64 -341 -391 -95 129 332 61 189 36 -203 -162
8127 -162 -174 63 95 306 406 -13 -231 -437 -284 14 112 376 166 114 -238 -345 -266 -55 176 301 196 169
8149 169 -39 -465 -260 -305 68 133 225 192 125 -139 -303 -144 -160 225 160 247 164 17 -228 -138 -224 241 62 437
8173 437 386 -38 -90 -409 -203 -8 216 292 337 -1 -104 -317 -101 -311 45 129 208 211
8191B11
$$ Imaginary data points
##PAGE= N=2
##DATA TABLE= (X++(I..I)), XYDATA
0 0 0 0 0 4 -8 0 -8 8 -8 16 -16 24 -24 32 -40 48 -56 68 -80 96 -109 128 -149 170 -196 221 -253 291 -325
29 -325 367 -415 464 -520 582 -651 725 -802 895 -992 1097 -1216 1346 -1491 1650 -1826 2031
46 2031 -2257 2515 -2818 3167 -3584 4088 -4709 5508 -6559 8030 -10233 13884 -21052 40466
60 40466 -201962 -617022 -184221 186438 121644 -52704 170472 390566 138164 -355197
70 -355197 -414793 -54092 212593 159453 105319 176298 154647 -75203 -246362 -178825 13194
81 13194 159279 256398 252045 61410 -197582 -248650 -99846 -15660 -31827 106640 360505
92 360505 309279 -142287 -462470 -281987 36433 30873 -87133 104018 389578 223978 -294314
103 -294314 -495379 -178048 125096 61129 -41751 132261 287453 54954 -321689 -345856
113 -345856 -36138 178919 150641 106018 137079 72041 -126919 -242048 -147450 38345 186531
124 186531 274420 249258 56299 -173528 -226705 -116715 -31550 14033 164293 342534 260859
135 260859 -91807 -330964 -222942 -15097 9429 -16983 134455 292275 132091 -232642
145 -232642 -359892 -145120 65605 59202 26370 119893 149962 -54091 -291693 -274208 -46807
156 -46807 127585 157334 140354 105589 -10457 -175683 -245627 -155176 17803 174594 258471
167 258471 222052 59324 -126499 -201929 -149774 -51819 57119 189820 273140 184826 -41207
178 -41207 -199378 -169170 -50275 28778 87823 169694 184032 37748 -166766 -232562 -124105
189 -124105 19998 99748 133980 134061 49346 -116961 -245881 -226845 -81975 77107 170457
200 170457 176400 95915 -50056 -191390 -240392 -165163 -12586 135239 208411 172819 46568
211 46568 -99020 -181127 -160287 -54534 81640 180728 188121 99498 -31099 -128599 -144085
222 -144085 -68916 60941 172861 193208 110001 -19336 -125375 -167499 -125371 -3159 142591
233 142591 214189 157483 14986 -123659 -197696 -189302 -98302 46315 168858 188117 90645
244 90645 -57934 -173120 -205353 -146467 -23123 101818 157999 118963 14949 -99200 -170229
255 -170229 -152120 -38997 100236 166654 128878 37253 -53567 -126395 -150438 -74989 83479
266 83479 208012 198796 84606 -34511 -111116 -149869 -127161 -8949 153546 233203 166218
277 166218 21495 -96323 -151389 -151537 -85652 41825 158514 173240 76556 -55179 -145382
288 -145382 -163301 -109039 -3413 98086 131806 80014 -21777 -121809 -172728 -137146 -20904
299 -20904 105276 155628 108637 11498 -85447 -155717 -164544 -77772 74257 188221 184495 85579
311 85579 -29068 -111218 -148995 -118557 -4881 135919 202319 150107 32606 -70215 -121600
322 -121600 -114922 -46482 64239 150616 149008 59774 -54162 -127324 -130650 -67514 32499 117949
334 117949 136720 73023 -39018 -138247 -172502 -122627 -12677 99531 151064 114554 13076
345 13076 -100398 -172187 -165298 -77271 49354 142924 152558 80307 -27855 -117060 -146388 -98845
357 -98845 4863 109342 153543 115169 21378 -72034 -116875 -92011 -9351 89417 148656 131063
369 131063 44941 -59903 -125407 -118792 -44681 59775 140254 151584 81944 -33087 -131165
380 -131165 -161076 -110393 -8269 94216 145351 117114 20486 -92033 -158528 -145403 -65124
391 -65124 36921 110530 119928 58314 -41160 -121129 -135322 -77068 17932 97958 123193 81638
403 81638 -6355 -93115 -127533 -86686 7612 102792 148447 122343 37616 -63640 -129088 -120508
415 -120508 -40100 68680 145817 152460 87415 -15553 -106563 -140021 -96913 47 95231 135700
427 135700 102160 17416 -74470 -128820 -118647 -46618 46813 106698 97361 27839 -60768 -121956
439 -121956 -125117 -66182 26192 101802 116791 61918 -31412 -113293 -139900 -94125 1426 95946
451 95946 140046 114391 34177 -62945 -128395 -122388 -42356 63525 132396 133194 77636 -4464
463 -4464 -82929 -117853 -78656 17804 105519 126289 79995 6344 -61831 -104703 -96065 -23951
475 -23951 73295 124199 93544 11062 -70083 -117754 -118184 -62999 31262 110815 121940 57425
487 57425 -39411 -116527 -139899 -99140 -11239 78990 122660 99124 23713 -64580 -122528 -114713
499 -114713 -40486 54271 111258 105849 54218 -16767 -81073 -104767 -59504 34862 111253 119188
511 119188 66584 -5818 -68398 -101650 -81865 -3333 90459 134314 100337 17432 -64973 -114370
523 -114370 -112465 -54310 37389 110686 119240 59887 -30145 -103720 -127717 -90600 -10525 69415
535 69415 105384 79350 7979 -69520 -112829 -97459 -31303 48503 98247 92149 33949 -45070
547 -45070 -99431 -96935 -40250 37461 99728 116996 75682 -10126 -91102 -113796 -66924 12923
559 12923 83073 118977 107407 41811 -53108 -117839 -106254 -32369 49184 96695 100260 60551
571 60551 -14283 -89158 -115129 -72829 6104 73333 95507 62237 -9891 -79073 -104078 -78933
583 -78933 -24276 41675 97849 100160 24484 -79252 -123220 -85872 -23756 22093 70027 116699
595 116699 98756 -10600 -122006 -127386 -42278 30512 55441 80589 108040 68506 -47590
606 -47590 -131437 -96337 4142 67438 76885 75024 59116 -2409 -82404 -107964 -54807 29455
618 29455 89679 100216 55378 -23481 -85015 -92987 -63353 -22987 34989 105819 118986 24144
630 24144 -103455 -135562 -65787 -6952 -343 32989 113666 119712 -14558 -150952 -131731 -10886
642 -10886 45340 23228 40819 102973 79067 -57641 -150629 -88920 35003 83211 62091 53561
654 53561 53190 540 -84711 -111404 -47258 46853 104519 105099 52749 -27407 -81849 -80067 -52043
667 -52043 -26318 26456 112037 135525 26560 -114452 -129946 -38021 8402 -17869 10293 113837
679 113837 126988 -25515 -167167 -123138 16383 56623 7304 19823 95085 74409 -71911
690 -71911 -163660 -84603 50526 89331 53921 44023 49596 -2937 -90169 -113690 -46186 47924
702 47924 105275 106972 52641 -27962 -75848 -67597 -44702 -27228 25590 113063 131079 19252
714 19252 -110724 -112267 -20937 15716 -14037 12912 107256 110925 -36445 -162152 -110357 22902
726 22902 57264 10843 24298 88027 56007 -84024 -160651 -80198 44341 81914 55730 46417
738 46417 41288 -13516 -90439 -108286 -45797 42492 98834 98589 44284 -27749 -66773 -59854 -39926
751 -39926 -18486 34456 106730 111925 9798 -98019 -95727 -18442 16000 3279 35067 103568
763 103568 85674 -45124 -142001 -94622 12083 48712 30410 46496 76887 29566 -83198
774 -83198 -136862 -73205 25721 68501 61272 50437 29385 -26097 -86987 -95369 -40065 35624
786 35624 84614 84118 36170 -28700 -67565 -64428 -38724 -3643 48613 96646 83730 -935 -81521
799 -81521 -85366 -33569 7107 28760 63248 91466 53290 -43497 -108160 -82424 -10571 36694
811 36694 53789 67479 62627 7434 -72888 -106134 -62927 9888 57453 69786 56043 17023
823 17023 -39963 -82340 -77685 -28169 33964 75101 73373 28782 -31110 -70835 -71422 -39428 11330
836 11330 61862 85146 58882 -4999 -64219 -81279 -53404 -2812 48363 80551 76048 28945
848 28945 -37240 -80439 -74733 -28731 28689 70750 79137 46288 -12384 -63773 -78445 -51240
860 -51240 1242 52752 76490 57213 4419 -50939 -77864 -64149 -18260 36215 70852 66587
872 66587 25641 -31428 -75012 -79693 -39745 22086 68133 74747 44087 -5566 -54467 -80662
884 -80662 -63620 -6479 57320 84378 61846 12349 -33906 -63115 -67045 -34245 27650 78736
896 78736 79551 32481 -23613 -57215 -63674 -42830 2879 56065 80897 56030 -2122 -55788 -75654
909 -75654 -55896 -9733 40119 70131 64501 24472 -32899 -76112 -78292 -35732 24990 66477
921 66477 68208 37271 -8207 -52580 -77487 -61641 -4779 56823 78149 50967 4223 -36141
933 -36141 -61733 -63622 -28873 31664 76820 71784 24795 -28087 -59564 -61962 -37099 10231 59491
946 59491 78868 51452 -5323 -55607 -72255 -51591 -6273 42568 71481 63671 21069 -33664
958 -33664 -71258 -69973 -30079 25238 63538 65946 35075 -12303 -55562 -72809 -50205 2615
970 2615 52947 70297 48115 2763 -42279 -67277 -58971 -17827 36104 70224 64242 22623 -28496
983 -28496 -62651 -65015 -34386 16232 61071 73301 44960 -6777 -52407 -69091 -50041 -4651
995 -4651 44372 71141 59127 15031 -36295 -66638 -60378 -23510 24949 60811 65195 33111 -18910
1008 -18910 -60516 -67320 -38477 8351 49108 65487 47588 1512 -48329 -71672 -54887 -8998
1020 -8998 38519 64435 57934 21939 -27695 -64664 -66379 -30421 21777 60275 66080 38470 -8206
1033 -8206 -49982 -66128 -46497 -655 46732 69141 53419 9095 -38007 -62322 -53590 -17778
1045 -17778 27931 61818 63827 28798 -23464 -60998 -62715 -31654 12478 50043 64256 45343
1057 45343 -1439 -50434 -70438 -50016 -4410 38891 60954 53646 18505 -29972 -64702 -63174
1069 -63174 -25871 23830 57404 60059 32110 -11764 -51203 -64495 -42251 4446 48232 64700
1081 64700 46256 4059 -39381 -61800 -51694 -13848 32822 62846 58998 22689 -25061 -58213
1093 -58213 -59627 -30126 15225 53140 64110 40240 -5742 -48569 -64144 -45079 -2767 39664
1105 39664 61589 51528 13505 -33060 -61819 -56418 -19864 25309 55834 56863 29004 -15191
1117 -15191 -53303 -62499 -36664 9764 48891 60602 41167 1672 -39763 -61918 -50768 -10016
1129 -10016 36803 62010 52733 17091 -25490 -55221 -57584 -28925 17480 55131 61141 33392
1141 33392 -10746 -47196 -59175 -40880 -840 40739 61071 47643 7368 -36366 -59794 -50835
1153 -50835 -15483 26863 55097 54571 24799 -19665 -54468 -59562 -31721 12805 48731 58154 37756
1166 37756 -2061 -41539 -60433 -46069 -5752 37641 59618 49254 13983 -27943 -55242 -53552
1178 -53552 -22425 21105 53546 57011 29890 -12490 -48245 -57591 -35687 5411 43341 58245
1190 58245 42290 4277 -36230 -57936 -48227 -11880 30923 56635 51163 18243 -23223 -51871
1202 -51871 -54117 -29190 12056 48835 59199 35043 -9399 -46116 -55517 -37461 -3739 32232
1214 32232 55781 50584 12784 -35402 -60183 -47115 -11988 22534 45673 51426 31366 -11803
1226 -11803 -52695 -60914 -30408 14501 45057 50767 35064 4095 -32456 -56703 -49633 -10419
1238 -10419 37046 60316 46155 9441 -25597 -44806 -46834 -29083 8827 50855 64549 33059
1250 33059 -19766 -50726 -46180 -25153 -3724 24115 54570 56641 12770 -45165 -64885 -37988
1262 -37988 173 22601 35890 46526 35692 -9454 -58450 -65681 -24381 25211 46579 41135
1274 41135 26883 5417 -27105 -56648 -53185 -9383 43690 63608 39118 -1700 -27889 -36249
1286 -36249 -39726 -32086 3665 54338 70498 28099 -32550 -54597 -35377 -15262 -6277 16713
1298 16713 55086 61672 9889 -55255 -68517 -28293 11165 21650 27562 43233 38879 -9166
1310 -9166 -63688 -67460 -17744 33404 46994 34370 20356 5286 -23589 -54693 -53994 -7700 49997
1323 49997 66732 32797 -11022 -28580 -28823 -34532 -32893 3889 58674 71923 21515 -40583 -54444
1336 -54444 -27289 -9072 -6982 14601 55980 62214 4724 -60999 -66723 -21035 15341 20361 24869
1349 24869 41769 36160 -12197 -64451 -65254 -13741 36434 46906 30135 14905 2712 -23084
1361 -23084 -53712 -52248 -4178 52369 64554 26784 -15683 -28805 -26617 -32289 -30954 6527 59857
1374 59857 68953 15594 -42948 -51571 -24442 -8675 -5377 19277 57052 55699 -1182 -58407 -60456
1387 -60456 -19293 14166 22554 28869 39695 28644 -16469 -59836 -57617 -11099 34596 45812
1399 45812 31184 13936 -2409 -26821 -49929 -44339 320 49890 59861 25257 -15005 -30389
1411 -30389 -30646 -32689 -23850 14260 58153 58916 10547 -38336 -47163 -28208 -12241 1330 27779
1424 27779 53198 42715 -6261 -50744 -53124 -21389 9705 25894 35118 37236 17649 -22776
1436 -22776 -53847 -47973 -9715 29686 44999 35006 13300 -10397 -33406 -46587 -34343 5444
1448 5444 45337 52687 24752 -10977 -31627 -37667 -33437 -13137 22746 51615 46484 9207 -29538
1461 -29538 -43987 -34814 -14495 10582 36334 47711 29617 -9476 -41928 -45976 -24168 6098
1473 6098 31733 42903 33773 5653 -26858 -45577 -38510 -8752 25403 44519 39040 13951 -16769
1486 -16769 -39597 -43343 -23938 9994 38811 45220 26788 -5640 -34530 -45379 -32875 -3299
1498 -3299 27609 43778 35785 8276 -23370 -43011 -40250 -15377 18275 41326 40134 17838 -11821
1511 -11821 -34777 -41815 -27232 4711 36143 46424 29672 -1722 -29451 -41372 -32734 -7436
1523 -7436 23389 44214 41553 14843 -21247 -43047 -39346 -15598 12995 34513 41064 27424 -3812
1536 -3812 -35605 -47186 -29433 4118 30965 38508 28529 7130 -20396 -42509 -41426 -12636 24265
1549 24265 42880 34934 11927 -13559 -34168 -41138 -26050 6929 38064 46133 26210 -6196
1561 -6196 -31624 -39199 -28811 -5802 23121 43329 39889 12169 -22833 -42150 -35858 -11829 14937
1574 14937 33670 38038 24562 -5244 -36154 -45397 -25162 8643 31952 36209 25849 4521
1586 4521 -23339 -43269 -38381 -8225 25625 41398 32963 9808 -16096 -35708 -40203 -23451 9081
1599 9081 37274 43007 23590 -6811 -30778 -38854 -28342 -3211 24933 41272 35325 8976 -22477
1612 -22477 -39552 -32980 -9274 17366 35409 37058 20405 -9337 -35240 -39870 -20601 9411
1624 9411 32608 38659 25911 648 -26847 -41669 -33646 -5789 24849 39576 32698 10045 -17520
1637 -17520 -37721 -39525 -19668 10968 34250 37720 20449 -7315 -31258 -39294 -26870 -318
1649 -318 26355 38402 29135 3546 -23151 -37129 -31511 -8901 19142 37802 36201 15025 -13912
1662 -13912 -34223 -35916 -18559 9539 33656 40819 26656 -1829 -28444 -38991 -28024 -2866
1674 -2866 23537 38341 33166 10325 -18424 -37193 -35221 -14412 13189 32579 34182 17549 -8784
1687 -8784 -31282 -38028 -23937 3082 28076 36692 24214 -715 -25088 -37250 -31105 -7926 20680
1700 20680 38752 34286 11303 -16510 -34487 -34708 -17811 9404 33110 39924 24642 -3765 -28241
1713 -28241 -35964 -24694 -1238 23605 36913 31113 7819 -19402 -35049 -30549 -9677 15496
1725 15496 32748 32739 14884 -11648 -32732 -36601 -20540 6047 29009 35584 22589 -2391 -27104
1738 -27104 -38494 -30488 -6225 20987 36446 31721 9803 -16783 -34212 -34191 -16603 10301 31803
1751 31803 36078 20748 -5082 -26687 -33088 -21730 1818 25224 36275 28005 4234 -20692
1763 -20692 -33084 -26976 -6185 18375 34617 33194 13597 -13557 -33427 -34541 -17334 8280
1775 8280 28945 35049 22833 -2551 -27722 -38595 -28615 -4475 20021 32804 27583 7875 -17152
1788 -17152 -34067 -33003 -14220 11333 29390 30874 15449 -8240 -27921 -32619 -19528 4775
1800 4775 26836 35076 24663 1045 -22717 -33464 -25714 -3797 20659 35825 33255 13317 -13482
1813 -13482 -32017 -32439 -15059 9707 29896 34779 21763 -2379 -25267 -34383 -24527 -2040 20592
1826 20592 31695 24955 4096 -19114 -32462 -29022 -10569 12541 29116 29000 11823 -13280 -31482
1839 -31482 -32659 -17432 5991 26343 33426 22775 -815 -24833 -35468 -26320 -2879 21429
1851 21429 34129 30131 11586 -11983 -28970 -30942 -14805 11339 31499 33369 16778 -5260
1863 -5260 -21988 -27629 -21097 -1483 23060 35075 23930 -2066 -23134 -29392 -23296 -8818 11710
1876 11710 30324 32113 11328 -18241 -35003 -31485 -14782 5704 22912 31201 22866 -549 -25593
1889 -25593 -36554 -26131 -1613 21428 30489 23672 7604 -9705 -24753 -29911 -15619 13995
1901 13995 35783 31529 8358 -10883 -17580 -20738 -19975 -2991 27632 42939 24450 -9133 -26792
1914 -26792 -24124 -16913 -9504 8785 32957 37849 12065 -22205 -36371 -27512 -10966 4233 18773
1927 18773 28088 21869 -1007 -26144 -36622 -24743 496 22289 26658 15179 1411 -10066
1939 -10066 -22827 -30809 -16915 17149 40799 29567 -524 -16519 -15240 -17093 -22065 -5575 31153
1952 31153 49673 24685 -14667 -28184 -17903 -11963 -11199 5871 35159 41995 12034 -23625 -33306
1965 -33306 -20291 -5920 4551 16894 26350 20146 -1993 -26347 -34750 -21600 4801 25243
1977 25243 25150 10127 -3662 -11698 -23365 -32637 -18389 18950 43853 28013 -6066 -19911 -14252
1990 -14252 -16838 -25848 -9515 31357 50616 22563 -17404 -26781 -13626 -9649 -11929 5056 34631
2003 34631 39712 9424 -23378 -29409 -15304 -1775 7612 18827 25640 17065 -5061 -26132 -32402
2016 -32402 -18621 7565 28190 27214 9703 -5574 -13961 -24608 -33158 -18634 18824 42339 26344
2029 26344 -6424 -19174 -14932 -18932 -25811 -8651 29086 44155 17436 -17296 -24100 -13226 -9564
2042 -9564 -8891 8356 32710 33483 4669 -23311 -26679 -13488 216 11942 23933 27282 14716
2055 14716 -7558 -25720 -29810 -16407 9162 29556 29474 12532 -4003 -14713 -25308 -30174 -14742
2068 -14742 17226 36087 23117 -3503 -16728 -17733 -20524 -21261 -3476 24664 33262 11436 -15805
2081 -15805 -24084 -17748 -12057 -3690 14354 30206 24530 -148 -22238 -26732 -17162 -1586 15802
2094 15802 28414 27663 12611 -8164 -23717 -26727 -14616 8247 27811 30258 17037 -825 -15026
2107 -15026 -23889 -22618 -7129 15858 28929 21063 1097 -14991 -21508 -21284 -12605 5668 22977
2120 22977 24249 7717 -13103 -25102 -25374 -15389 2251 20171 26790 17463 -1807 -20146 -28572
2133 -28572 -22892 -5289 15903 28801 26054 10295 -9029 -22313 -23843 -12587 6685 23732
2145 23732 28454 17862 -988 -16837 -22061 -14459 953 16870 24417 19451 4068 -14586 -25846
2158 -25846 -21638 -4088 14532 22622 19738 8374 -8987 -26156 -31063 -17294 5821 22531 24367
2171 24367 14361 -1576 -17944 -28112 -25283 -7476 14564 26165 21531 6175 -10342 -20832
2183 -20832 -21054 -10155 7020 21316 24821 14906 -3482 -19777 -21751 -9420 7616 19171 23487
2196 23487 20025 5745 -15714 -28765 -21111 576 18507 23897 20507 10768 -5977 -24726 -31258
2209 -31258 -16835 7181 22231 21724 11728 -1195 -15606 -26339 -23726 -6151 13729 21969 16040
2222 16040 1569 -13316 -22136 -20522 -7594 8587 20702 22317 11090 -8228 -23365 -23511 -9542
2235 -9542 8139 20727 25276 20266 4711 -15763 -27343 -20024 212 18041 24674 21902 12362
2248 12362 -3919 -21203 -26050 -12622 8317 21037 20425 11481 -1607 -15602 -23383 -18054 -1389
2261 -1389 15279 21107 13663 -1538 -16580 -24191 -20683 -7135 10298 22177 20921 7481 -11052
2274 -11052 -24541 -25328 -13341 4906 19973 25136 18435 2168 -15663 -24631 -18561 -1865 14719
2287 14719 23329 21525 9853 -5969 -18699 -19127 -7035 9708 20870 20846 10777 -4432 -17246
2300 -17246 -21238 -13051 3493 18460 22759 14172 -1816 -17367 -25619 -21539 -6671 11527 22994
2313 22994 20613 6647 -10769 -23335 -25099 -15107 1910 17781 22945 14318 -1768 -15694 -21117
2326 -21117 -15971 -2591 13173 22124 18738 4682 -10470 -18458 -15474 -3461 11813 22759 22256
2339 22256 10685 -6382 -19135 -20831 -10606 6202 20537 24927 16588 336 -16089 -24282 -20385
2352 -20385 -5750 11688 21942 19625 6214 -9925 -20965 -22638 -13862 1952 15995 19202 9416
2365 9416 -5656 -17398 -20305 -14447 -1016 13259 20829 15387 -114 -15041 -21169 -16150 -2981
2378 -2981 12418 23410 23143 10534 -7334 -20135 -20697 -10126 6148 20580 25282 18271 2101
2391 2101 -13406 -20598 -16276 -3102 12319 21016 18121 5857 -9171 -18611 -18830 -8819 5847
2404 5847 16771 17207 6922 -8014 -19503 -21667 -13511 1423 15161 20723 13587 -2208 -17299
2417 -17299 -23886 -18858 -5124 11157 22121 21394 8968 -7797 -19557 -20253 -10404 4811 17940
2430 17940 22451 15962 1340 -12515 -17898 -12176 890 14005 19967 16316 4398 -10228 -18593
2443 -18593 -15848 -3776 10483 19506 18176 7104 -8710 -20688 -22498 -12773 3010 16302 20929
2456 20929 13329 -1561 -16711 -24076 -19421 -6155 9278 18757 17661 6478 -8362 -18921 -18948
2469 -18948 -9037 4981 16386 18802 11147 -2366 -13887 -17042 -9901 3563 16409 21327 15488
2482 15488 1859 -11846 -18584 -14936 -2418 12464 22793 21184 8542 -7849 -19264 -20315 -11808
2495 -11808 2418 15839 21111 14041 -1222 -15687 -20996 -16439 -4827 7988 15943 14424 3386
2508 3386 -10582 -19368 -17845 -7340 6847 15817 15682 6274 -6352 -16136 -18710 -11510 3402 18488
2522 18488 23005 13989 -857 -12335 -17203 -14963 -4913 11577 24653 23098 8073 -7986 -15264
2535 -15264 -14680 -9120 1526 15113 22118 14203 -2500 -15336 -16899 -10543 -1050 9044 15694 13146
2549 13146 1304 -12946 -20601 -17561 -5322 9345 17637 14582 3467 -8407 -17075 -20996 -15351
2562 -15351 1404 19041 23356 11108 -4160 -11739 -14241 -15497 -9241 8653 24815 21836 3631
2575 3631 -10737 -11979 -8895 -6626 685 15178 23186 13163 -6272 -17023 -13879 -5407 2803 11302
2589 11302 17582 14669 1520 -13803 -21321 -17183 -4060 11378 19352 14732 3163 -7141 -14867
2602 -14867 -20670 -17630 -742 19270 21946 7059 -7400 -10262 -10486 -14532 -10992 7282 24494
2615 24494 19100 -2134 -14812 -11062 -5520 -5084 1116 16252 24007 11722 -9490 -18910 -13387 -3850
2629 -3850 4224 12968 19821 16375 2690 -12668 -20297 -16612 -3736 12151 19431 14210 3127 -5511
2643 -5511 -12101 -18579 -16527 -99 18668 19639 3068 -9996 -10427 -9298 -13130 -9972 8141 23466
2657 23466 15758 -6410 -17936 -13047 -6912 -5386 2028 17307 23565 9990 -10803 -19309 -14023
2670 -14023 -5043 3771 13407 19767 16119 3044 -10516 -17307 -14458 -2075 12391 19150 13176 2771
2684 2771 -4618 -9765 -14695 -11760 3434 19044 17940 1923 -10411 -11658 -10462 -11554 -5880 10729
2698 10729 21968 13339 -6853 -17995 -15791 -10685 -6232 3422 16898 20147 7705 -9709 -18076
2711 -18076 -15438 -7290 2723 12579 17427 12847 1197 -9833 -14854 -11561 -611 12311 17826
2724 17826 12187 1666 -6373 -10885 -12267 -6596 7209 19176 17494 3818 -8613 -13289 -13316 -10173
2738 -10173 -867 13211 19933 12273 -3362 -14864 -17149 -13382 -5571 5456 15105 15426 5319 -7951
2752 -7951 -15812 -15237 -8114 2758 12288 14664 8328 -2349 -10837 -13876 -9880 574 12692 17140
2766 17140 11728 730 -8761 -13541 -11894 -3042 9333 18086 16999 6820 -5953 -14586 -15427 -8767
2780 -8767 2842 13281 16781 11338 290 -11107 -16605 -13641 -3358 8137 13869 10716 2375
2793 2375 -6908 -14037 -14956 -7447 4605 13139 12616 4683 -5509 -12870 -14773 -9403 1459 12121
2807 12121 16602 11800 504 -10868 -15925 -11721 -1549 9020 15913 16115 8623 -3694 -13964
2820 -13964 -15434 -6586 5623 13156 14184 9852 1684 -8681 -15236 -11584 388 11209 13662 8588
2834 8588 1204 -7246 -14025 -14210 -5521 6666 14255 12926 3852 -6981 -14827 -15686 -9175 1209 11200
2849 11200 15402 11075 -134 -11599 -16760 -12232 -1913 7635 13229 13172 6862 -4221 -13549 -14068
2863 -14068 -4626 6668 12602 12303 7995 213 -9360 -14011 -8735 2739 12624 14881 9404 630
2877 630 -8662 -13889 -12634 -4051 7931 15017 13488 4658 -6459 -14300 -15281 -8726 1662 10542 13879
2892 13879 9656 -485 -11083 -15616 -11247 -1804 7245 11812 10968 3911 -6072 -13373 -12354 -3813
2906 -3813 6446 12815 12637 6465 -3157 -11287 -13025 -7324 3129 12709 15675 10792 760 -9222
2920 -9222 -14155 -11130 -2419 7724 13996 13679 5891 -5247 -13110 -13937 -7270 2446 10062 12357 7775
2935 7775 -1683 -10657 -13808 -10091 -897 7972 12238 9041 336 -8599 -13379 -11657 -4010 6145 13252
2950 13252 13227 5431 -5454 -12459 -12708 -6830 2250 11311 15589 11433 974 -9582 -13261 -9325 -1143
2965 -1143 7571 13102 12769 5582 -5035 -11879 -11332 -4740 4509 11036 11873 6195 -2818 -10450 -12805
2980 -12805 -8618 497 9787 13319 8500 -1212 -9720 -13706 -11295 -4308 5253 13181 13125 4568 -6871
2995 -6871 -13165 -12400 -6732 1292 9590 13952 9880 -681 -10064 -12543 -7988 -294 7468 12309 11153
3010 11153 3709 -5758 -11664 -10114 -2886 6361 12052 12147 5813 -3550 -10660 -12276 -7515 1688 10662
3025 10662 13920 9115 -608 -9210 -12978 -10860 -3675 5377 12579 12109 3907 -6412 -12240 -11445 -6304
3040 -6304 1724 9105 12047 7613 -1950 -10104 -11884 -7380 390 8102 11812 9911 1827 -7432 -12251
3055 -12251 -9833 -1988 7000 12489 12166 5443 -3842 -10976 -12224 -6651 2662 10684 13265 8956 -226
3070 -226 -8206 -12288 -9759 -2225 6444 11496 10409 2879 -5840 -11607 -11025 -4843 3209 9746 10784
3085 10784 5259 -3548 -10497 -12094 -7320 1104 8980 12047 8772 283 -8279 -12344 -10064 -2248 6563
3100 6563 12164 11953 5301 -3897 -10597 -11231 -5730 3150 10331 12325 8124 -67 -7772 -11260 -7995
3115 -7995 -99 7728 11340 9163 2169 -6169 -11211 -10337 -3477 5039 10548 10199 4328 -4066 -10463
3130 -10463 -12215 -7439 1373 9241 11671 7562 -756 -8264 -11822 -10181 -2946 5986 11499 10557 3594
3145 3594 -4863 -10266 -10233 -5009 2790 9743 11428 6901 -1597 -8542 -10446 -6556 923 8118 11362
3160 11362 8809 1610 -6732 -11231 -9631 -2281 5941 11177 10179 4411 -3378 -10196 -11913 -7116 2037
3175 2037 9724 11282 6442 -682 -7235 -10747 -9724 -2735 6510 11629 9071 1279 -5808 -9293 -8877
3190 -8877 -4921 2790 10221 11742 5406 -3744 -9470 -9607 -5593 1070 7772 11902 9212 918 -7666
3205 -7666 -11514 -8593 -1429 6166 10606 9911 4540 -3026 -9806 -11383 -6164 2699 9834 10221 5173
3220 5173 -1330 -6461 -9913 -9170 -2250 7334 12183 7592 -1040 -6862 -8645 -8019 -5040 2553 10998
3235 10998 12156 4175 -5625 -10111 -8760 -4990 188 7109 12002 9613 391 -8485 -11173 -7233 -386
3250 -386 5835 9770 9186 4279 -3357 -9689 -10453 -4712 4458 10095 9445 3934 -1813 -6070 -9326 -8476
3266 -8476 -1282 8866 12762 6648 -2275 -7229 -7906 -7633 -5145 2295 11241 12001 3255 -6764 -10144
3281 -10144 -8056 -4628 -174 6268 11291 8737 -640 -9181 -10830 -6237 166 5482 8755 8306 3427
3296 3427 -3991 -9661 -9935 -3611 5302 10527 8733 3175 -2361 -6243 -8937 -7863 -198 9497 12533
3311 12533 6836 -2336 -6793 -7498 -7280 -4297 3262 11317 11483 2608 -6353 -9660 -7557 -3868 649
3326 649 6657 10462 7522 -1360 -9048 -10292 -5918 583 5899 8561 7194 2195 -4876 -9512 -9431 -3045
3342 -3045 5597 10154 8630 2709 -2950 -6822 -8911 -7004 556 9115 11649 6190 -1835 -6615 -7866
3357 -7866 -6947 -3098 4024 10349 9773 2228 -6071 -9065 -7442 -3423 1813 7109 9285 5548 -1954
3372 -1954 -8524 -9830 -5575 909 6779 8954 6685 877 -5581 -9284 -8674 -2573 5288 9868 8381
3387 8381 2828 -3221 -7524 -8647 -5289 1543 8208 10318 6291 -1224 -6620 -8355 -6171 -953 5367
3402 5367 9582 8176 1889 -5041 -8849 -7928 -2888 3687 8250 8432 4187 -2297 -8075 -9495 -5818
3417 -5818 1036 7154 9010 6079 93 -6148 -9200 -7775 -2222 4805 9140 8129 2713 -4016 -8297
3432 -8297 -8344 -4295 2181 7427 8870 5253 -1308 -7040 -8958 -5860 628 6494 8719 6872 1489
3447 1489 -4556 -8918 -8127 -2183 4703 8971 7873 3394 -2620 -7328 -8648 -5332 1349 7546 9196
3462 9196 5645 -635 -6107 -8490 -6823 -1391 4799 8626 7776 2240 -4503 -8733 -7915 -3028 3107
3477 3107 7047 7962 4704 -1166 -7384 -9225 -5473 1473 6630 8218 5777 1103 -4690 -8697 -7870
3492 -7870 -2103 4994 8975 7328 2534 -2928 -7248 -8221 -4886 1663 7461 8843 5045 -1109 -6641
3507 -6641 -8224 -5654 -530 4985 7926 6939 1744 -4833 -8716 -7505 -2263 3584 7183 7475 3812
3522 3812 -1754 -7472 -9001 -5175 1419 7074 8286 5523 61 -5032 -8207 -7009 -1355 5095 8576
3537 8576 7081 2192 -3465 -7212 -7304 -3518 2252 7114 8284 4874 -1318 -6716 -8141 -4901 434
3552 434 5463 8053 6257 1183 -4792 -8582 -7290 -1852 4197 7627 7134 3012 -2640 -7108 -8408
3567 -8408 -4724 1405 6900 8265 5063 -585 -5706 -7832 -6009 -1078 4470 8149 7209 1992 -4263
3582 -4263 -7663 -6692 -2608 2724 6741 7679 4274 -1537 -6943 -8073 -4703 1278 5956 7531 5611
3597 5611 881 -4637 -8066 -6775 -1354 4542 7857 6728 2501 -2705 -6597 -7236 -4153 1515 6791
3612 6791 8040 4600 -1516 -6083 -7325 -5017 -652 4456 7685 6655 1422 -4807 -7663 -6379 -1892
3627 -1892 3237 6615 6970 3977 -1958 -7244 -7932 -4241 1549 5940 7187 5061 387 -4912 -7841
3642 -7841 -6241 -1037 4613 7683 6382 1722 -3226 -6407 -6901 -3675 2066 6818 7593 3797 -1995
3657 -1995 -6046 -7098 -4592 -37 4667 7354 6043 877 -5153 -7697 -5959 -1490 3528 6891 6778
3672 6778 3354 -2224 -6800 -7543 -3641 1951 6217 7206 4487 -205 -4750 -7180 -5543 -368 4816
3687 4816 7321 5947 1494 -3549 -6762 -6334 -2732 2535 6700 6998 3360 -1859 -6250 -6976 -4244 476
3703 476 5361 6968 5247 277 -4875 -7302 -5683 -1468 3750 6621 6279 2503 -2817 -6746 -7151 -3383
3719 -3383 1842 5996 6645 3988 -753 -5509 -6905 -4728 12 4730 6987 5447 912 -3961 -6778
3734 -6778 -5879 -1812 3191 6780 6612 2947 -2091 -5878 -6854 -4007 1310 5775 6899 4532 -107 -4726
3750 -4726 -6882 -5576 -987 4027 6663 5702 1744 -3216 -6367 -6242 -2883 2118 6019 6613 3690 -1752
3766 -1752 -5802 -6544 -4242 402 4791 6803 5339 565 -4167 -6933 -5654 -1225 3464 6527 5987
3781 5987 2678 -2338 -6031 -6801 -3438 1999 5581 6324 3955 -539 -4475 -6537 -5213 -539 4491
3796 4491 6867 5257 952 -3403 -6062 -5547 -2527 2378 6236 6490 2870 -2264 -5783 -6250 -3727 470
3812 470 4557 6733 5106 12 -4793 -6750 -4908 -676 3387 6126 5904 2605 -2443 -6182 -6164 -2537
3828 -2537 2393 5573 5955 3559 -540 -4738 -6662 -4654 303 5012 6494 4556 550 -3408 -5760
3843 -5760 -5764 -2254 2746 6516 6216 2217 -2793 -5486 -5643 -3471 531 4686 6571 4400 -607 -5305
3859 -5305 -6148 -4173 -485 3062 5543 5490 1925 -3216 -6436 -5703 -1676 2744 5147 5255 3249 -773
3875 -773 -4806 -6544 -4122 1157 5367 6214 3877 228 -3428 -5519 -5315 -1728 3362 6953 5883 1477
3891 1477 -2660 -5243 -5197 -3004 729 4766 6658 4041 -1320 -5590 -5964 -3348 -181 2946 5208 5374
3907 5374 1723 -3551 -6787 -5396 -927 3023 4890 4584 2974 -974 -5232 -6733 -3810 1576 5398
3922 5398 5599 3315 -27 -3340 -5457 -5406 -1468 3765 6847 5037 993 -3110 -4892 -4610 -2603 793
3938 793 4915 6270 3440 -1737 -5454 -5632 -2917 367 3093 5556 5073 1231 -4198 -6743 -4936 -532
3954 -532 3518 4893 4720 2811 -974 -5371 -6477 -3367 1824 5306 5182 2833 -33 -3331 -5198 -4730
3970 -4730 -837 3704 6320 4872 737 -3141 -4754 -4311 -2041 1488 5237 5992 3156 -2083 -5340
3985 -5340 -5202 -2485 854 3427 5288 4317 864 -4229 -6405 -4682 -556 3060 4600 4395 2283 -1630
4001 -1630 -5307 -5981 -3018 1891 4989 5055 2620 -673 -3840 -5036 -4168 -244 3887 5861 4361 441
4017 441 -3233 -5049 -4159 -1397 2271 5087 5491 2547 -1919 -5158 -5226 -2548 1424 4129 5185 4054
4033 4054 373 -3893 -5776 -4253 -391 3496 4835 4133 1528 -2203 -5002 -5079 -2305 1654 4772 4765
4049 4765 2398 -1549 -4187 -5273 -3350 229 3788 5150 3933 212 -3634 -5295 -4180 -952 2689
4064 2689 4945 4928 2261 -1878 -4913 -5195 -2569 1482 4550 4992 3364 -11 -3490 -5153 -3737 -371
4080 -371 3269 5044 4043 832 -2589 -4754 -4180 -1806 1749 4495 4800 2190 -1866 -4702 -4842 -2779
4096 -2779 466 3741 4976 3661 87 -3546 -5505 -4102 -754 2853 4758 4289 2087 -1602 -4641
4111 -4641 -4745 -2255 1521 4507 4820 2761 -617 -3330 -4524 -3276 201 3634 5055 3708 324
4126 324 -3153 -4590 -3895 -1177 2218 4531 4775 2187 -2169 -4932 -4733 -2752 724 3612 4547 3442
4142 3442 -70 -3550 -5236 -3989 -697 2731 4305 3442 1168 -2008 -4251 -4523 -1902 1778 4369
4157 4369 4700 1965 -1339 -3620 -4078 -2654 276 3861 5220 3670 38 -3095 -4620 -3644 -757 2493
4173 2493 4813 4653 2051 -1801 -4399 -4655 -2197 1236 3717 4389 2658 -287 -3519 -4706 -3574 -503
4189 -503 2960 4604 3128 225 -2455 -4282 -4103 -1734 2076 4387 4326 1473 -2021 -4111 -4176 -2732
4205 -2732 634 3672 5025 3451 85 -3158 -4637 -3600 -519 2487 4483 4254 1839 -1546 -4169
4220 -4169 -4102 -1718 1485 4069 4224 2315 -671 -3392 -4484 -3096 35 3520 4451 2906 -243 -2963
4236 -2963 -4443 -3772 -1324 1753 4503 4234 1484 -1961 -4240 -4359 -2337 679 3461 4411 3189 -41
4252 -41 -3160 -4488 -3195 -166 2733 4043 3744 1595 -1571 -3722 -3911 -1556 2262 4387 3978 1624
4268 1624 -1057 -3195 -4283 -2583 501 3687 4672 2842 -229 -3090 -4347 -3766 -1230 2208 4064
4283 4064 3941 1445 -2157 -4308 -4132 -2291 556 3258 3846 2318 -309 -3268 -4282 -3088 -43 2934
4299 2934 3780 2942 741 -2086 -3952 -3634 -1087 2603 4273 3792 1638 -1335 -3319 -3829 -2504 793
4315 793 3819 4600 3034 -47 -2878 -4123 -3186 -931 2224 3945 3541 1333 -1843 -3861 -3887 -1804
4331 -1804 957 3289 3312 1793 -810 -3324 -3977 -2872 204 2808 3807 2658 -102 -2754 -4256 -3428
4347 -3428 -952 2298 4292 3784 1556 -1525 -3528 -4036 -2188 1013 3647 4145 2862 6 -2721 -3537
4363 -3537 -2806 -251 2551 3828 3224 939 -1941 -3533 -3415 -1162 1416 3539 3395 1249 -1505 -3698
4379 -3698 -3956 -2454 364 2865 4068 2626 -189 -2952 -4229 -3477 -1012 1958 3716 3702 1566 -1645
4395 -1645 -3668 -3616 -1668 1265 3029 3708 2394 -226 -2572 -3584 -2147 483 2965 3801 2586 466
4411 466 -2119 -3618 -3179 -828 2180 3911 3538 1081 -1476 -3614 -3796 -2485 444 3043 4027 2508
4427 2508 -350 -3173 -3975 -2994 -1016 1684 3060 3213 1155 -1923 -3850 -3280 -1330 1216 2711 3094
4443 3094 2037 -631 -3159 -3534 -2127 951 3235 3701 2390 420 -1998 -3546 -3081 -624 2632 4064
4459 4064 3598 1354 -1322 -3180 -3376 -1973 474 3076 3926 2443 -374 -2894 -3364 -2050 -452 1433
4475 1433 3025 2882 594 -2357 -4098 -2927 -532 1343 2713 2711 1736 -1018 -3605 -4251 -1843 1094
4491 1094 3012 3241 2374 462 -2078 -3703 -3349 -406 2459 3798 3322 1218 -1081 -2884 -2954 -1697
4507 -1697 904 3263 3515 1954 -790 -2575 -2826 -1570 316 1884 3362 2793 245 -2732 -4148 -2697
4523 -2697 -313 1683 2554 2903 1649 -1077 -4135 -4119 -2022 1248 2877 2698 2006 199 -2286 -3773
4539 -3773 -3020 -196 2466 3506 2550 622 -1244 -2534 -2686 -892 1512 3225 3480 1559 -1092 -2787
4555 -2787 -2671 -1361 555 2325 3650 3034 123 -2907 -3819 -2616 -28 1750 2581 2939 1608 -1224
4571 -1224 -3684 -4190 -1685 1025 2283 2333 1616 35 -2238 -3526 -2834 0 2503 2890 1788 101
4587 101 -1493 -2787 -2762 -819 1658 3427 3262 1305 -1316 -2683 -2854 -1359 752 2875 3530 3216 282
4604 282 -2593 -3528 -2140 319 1578 2727 3006 1758 -1096 -3478 -3204 -1003 1371 2317 2085 1185 -429
4621 -429 -2389 -3407 -2397 448 2741 2732 1461 -326 -2143 -3363 -2899 -898 1772 3020 2952 891 -1338
4638 -1338 -2898 -2906 -1303 784 2550 3424 2772 236 -2362 -3108 -1783 448 1924 2832 2507 1111 -1037
4655 -1037 -2957 -2583 -578 1650 2568 2367 1124 -595 -2566 -3413 -1809 697 2624 2984 1601 -277
4671 -277 -2254 -3426 -2836 -794 1529 2951 2724 971 -1472 -2891 -2947 -1343 687 2143 2765 2014 -81
4688 -81 -2293 -2852 -1633 584 2181 2786 2197 575 -1601 -2878 -2235 -250 2043 3085 2721 1257 -1256
4705 -1256 -2817 -2980 -1668 717 2528 2921 2044 -298 -2348 -3143 -2496 -585 1518 2470 2343 729 -1530
4722 -1530 -2919 -2680 -1105 735 2126 2461 1085 -858 -2277 -2764 -1349 581 2459 2909 1960 -54
4738 -54 -1888 -2661 -2016 -194 1906 3245 3031 1290 -1271 -2653 -2587 -1226 707 2414 2988 2066 -150
4755 -150 -1980 -2866 -1770 -115 1597 2338 1792 265 -1616 -2834 -2535 -698 1180 2357 2121 644
4771 644 -1254 -2540 -2834 -1663 424 2295 3052 1649 -258 -2144 -2735 -1983 -562 1430 3137 2924
4787 2924 1088 -1111 -2520 -2305 -834 900 2422 2745 1839 -243 -1955 -2406 -1446 517 2021 2394
4803 2394 1684 175 -1672 -2427 -2383 -722 1628 2901 2393 491 -1393 -2589 -2788 -1873 185 2252 2870
4820 2870 1657 -677 -2184 -2443 -1863 -365 1168 2654 2622 498 -1452 -2445 -1904 -419 1082 2270
4836 2270 2329 1214 -580 -2096 -2477 -1157 1064 2577 2901 1654 29 -1617 -2453 -2211 -415 1864
4852 1864 3031 2212 494 -1273 -2178 -2502 -1921 70 2137 2858 1198 -822 -2068 -2238 -1714 -593 1293
4869 1293 2257 1757 -67 -1702 -2369 -1785 -255 1325 2248 2103 1055 -1064 -2286 -2453 -1197 1071 2744
4886 2744 2655 1484 -53 -1425 -2284 -2104 -279 2045 3013 2370 301 -1050 -1709 -1837 -1332 438 2324
4903 2324 2364 1095 -891 -1948 -2080 -1137 168 1628 2314 1542 -339 -1912 -2677 -2066 -312 1408 2313
4920 2313 2001 630 -1217 -2350 -2558 -1292 829 2402 2418 1527 -231 -1520 -2069 -1804 -128 1736 2669
4937 2669 1923 340 -1217 -1625 -1642 -624 1007 2430 2500 676 -1177 -2070 -2169 -1150 545 1990 2209
4954 2209 1494 -220 -2044 -2576 -1947 -404 1439 2525 1831 361 -1299 -2271 -2435 -1240 659 2043
4970 2043 2103 869 -469 -1436 -2154 -1314 21 1681 2250 1628 25 -1368 -1920 -1570 -243 1548 2405
4987 2405 2350 711 -1099 -2183 -2152 -993 768 2287 2591 1447 -304 -1908 -2510 -1977 -249 1359 2128
5004 2128 1807 410 -1319 -2235 -2118 -905 496 1572 1777 767 -821 -1960 -2032 -1249 560 1633 2077
5021 2077 1369 -119 -1615 -2368 -1667 1 1684 2541 1931 806 -896 -1982 -2204 -996 881 2470
5037 2470 2247 1200 -222 -1440 -1977 -1563 -360 1409 2081 1591 -37 -1291 -2027 -1446 -538 802 1787
5054 1787 1823 609 -977 -2239 -2180 -880 775 1626 1739 1299 -117 -1853 -2578 -1739 74 1691 2026
5071 2026 1717 572 -772 -1908 -2284 -956 1118 2083 2032 930 -402 -1375 -1356 -1093 360 1674 2240
5088 2240 1536 -114 -1462 -2043 -1225 -73 1091 2094 2004 736 -1280 -2534 -2198 -621 762 1535 1871
5105 1871 1348 -191 -1774 -2745 -1637 262 1330 1597 1142 320 -692 -1857 -2183 -609 957 2138
5121 2138 1379 381 -358 -1451 -1565 -958 473 1876 2076 1215 -370 -1879 -1838 -1250 49 1140 1901 2078
5139 2078 902 -1227 -2523 -1757 -487 855 1192 1274 1379 -15 -1674 -2510 -1363 454 1373 1345 834
5156 834 -13 -1009 -2008 -1838 -357 1177 2026 1322 131 -907 -1568 -1727 -905 470 1923 2266 1449 -386
5174 -386 -1748 -1659 -966 258 1052 2002 2112 996 -1174 -2165 -1568 -122 826 1273 1376 1118 -168 -1765
5192 -1765 -2362 -896 751 1650 1129 529 40 -1226 -2348 -1891 -306 1520 1758 1225 142 -1026 -1903
5209 -1903 -1779 -977 569 1863 2010 1091 -483 -1468 -1833 -1052 191 1116 1740 1739 687 -1102 -2004 -1187
5227 -1187 319 1094 1440 1255 926 -248 -1941 -1948 -705 1173 1632 1356 835 53 -1104 -2304 -1848 -66
5245 -66 1418 1925 1214 20 -851 -1675 -1729 -924 404 1448 1645 712 -658 -1676 -1561 -774 198 1174 1806
5264 1806 1509 254 -1136 -1853 -865 283 1246 1724 1292 672 -726 -1920 -1935 -618 920 1751 1511 1025
5282 1025 -190 -1063 -1974 -1329 172 1347 1766 1285 145 -946 -1646 -1488 -623 591 1581 1402 453 -899
5300 -899 -1710 -1610 -479 351 1304 1400 1161 -64 -1576 -2021 -1064 112 1281 1558 1353 406 -712 -1863
5318 -1863 -1746 -570 797 1605 1615 902 -294 -1100 -1658 -922 375 1225 1562 1235 -8 -993 -1496 -1307
5336 -1307 -81 814 1342 1354 190 -943 -1574 -1577 -786 587 1535 1369 898 -450 -1404 -1941 -1229 115 1274
5355 1274 1588 1311 189 -987 -1749 -1385 -530 655 1665 1529 755 -483 -1292 -1267 -663 280 1143 1653
5373 1653 999 -193 -1113 -1578 -1001 121 1115 1529 1115 512 -996 -1688 -1569 -669 842 1602 1528 661 -468
5392 -468 -1451 -1599 -1190 -74 1258 1462 1030 -220 -1166 -1441 -1087 -404 602 1357 1430 489 -783 -1384 -1051
5411 -1051 -373 404 1184 1432 857 -359 -1255 -1702 -991 104 1349 1602 1365 298 -1014 -1321 -1592 -667
5429 -667 748 1708 1380 506 -537 -1161 -1305 -1090 -179 1082 1445 808 -312 -1237 -1242 -780 -233 691 1326
5448 1326 1364 88 -1072 -1708 -1105 -371 641 1409 1408 933 -231 -1268 -1615 -907 367 1268 1587 1187 138
5467 138 -608 -1345 -1452 -355 842 1601 1468 574 -660 -1045 -1122 -765 -13 1294 1461 1026 -560 -1449 -1224
5486 -1224 -822 -352 715 1501 1255 270 -1184 -1744 -1253 -230 674 1090 1175 742 -117 -1294 -1681 -836 320
5505 320 1392 1377 826 154 -686 -1182 -1138 -504 999 1468 1395 1 -628 -799 -921 -705 376 1378 1541
5524 1541 778 -413 -1312 -1114 -788 71 1038 1439 1344 129 -1167 -1413 -1056 -232 472 1147 1206 651 -388
5543 -388 -1308 -1489 -607 405 1141 1234 664 -195 -977 -1253 -1235 -44 1016 1465 955 90 -808 -1107 -946 -518
5563 -518 566 1141 1580 644 -387 -1250 -1285 -631 100 1032 1300 997 -152 -1104 -1510 -966 -163 461 1082
5582 1082 1001 651 -539 -1116 -1386 -835 469 1084 1247 673 -353 -1002 -1316 -887 -24 887 1234 1037 131
5601 131 -714 -1316 -1014 -260 205 1166 1182 587 -322 -828 -1178 -659 196 1085 1188 864 120 -819 -1452 -766
5621 -766 159 770 1100 1172 261 -768 -1301 -1217 -559 513 1229 1387 622 -586 -1076 -1437 -899 -56 892 1178
5641 1178 1043 186 -925 -1283 -888 -312 638 1146 1109 410 -386 -934 -1341 -573 488 1025 1167 469 -271
5660 -271 -851 -1029 -882 -208 749 1353 806 85 -758 -1016 -983 -432 568 1192 1267 437 -455 -1201 -1240 -645 121
5681 121 817 1111 882 131 -947 -1486 -982 -62 790 898 712 336 -428 -1262 -1268 -420 521 1218 1031 411
5701 411 -480 -873 -1051 -930 -99 942 1370 876 -178 -968 -1100 -932 -73 366 1057 1194 532 -501 -1411
5720 -1411 -968 -318 501 919 866 760 279 -821 -1209 -1036 42 922 1039 468 208 -429 -1098 -1270 -347
5739 -347 703 1278 1180 148 -485 -868 -999 -743 6 1082 1377 753 -212 -824 -970 -941 -258 334 1246 1266
5759 1266 487 -718 -1305 -922 -238 373 735 866 619 3 -779 -1262 -794 375 914 930 626 -54 -434
5778 -434 -1197 -1119 -454 897 1269 907 251 -298 -690 -959 -674 158 1189 1302 950 -186 -877 -748 -543
5797 -543 -316 647 1033 914 298 -751 -1308 -826 -265 278 764 795 730 -56 -904 -1390 -701 350 986 882
5817 882 527 22 -476 -1002 -973 -311 775 1378 921 -164 -505 -561 -881 -570 229 916 1161 523 -270 -1023
5837 -1023 -820 -450 20 392 887 1006 273 -485 -1176 -787 -31 489 741 800 594 -104 -714 -1400 -739 330
5857 330 1036 906 377 30 -552 -1002 -967 -145 695 1289 656 -154 -595 -657 -805 -682 327 1171 1294 497
5877 497 -551 -932 -833 -390 47 648 1026 955 111 -707 -923 -708 155 582 773 904 505 -321 -877 -1147
5897 -1147 -484 557 906 922 398 -203 -524 -798 -836 6 898 1080 862 -8 -727 -868 -759 -291 423 1012
5917 1012 1212 355 -374 -929 -886 -352 136 677 884 573 132 -700 -1089 -907 -17 677 797 721 440 -363
5937 -363 -962 -1085 -356 621 977 840 566 -75 -828 -880 -552 304 897 918 758 -164 -654 -911 -662 -245 656
5958 656 1028 859 396 -350 -620 -795 -463 217 825 1005 475 -131 -789 -805 -674 -11 630 963 703 102
5978 102 -528 -903 -855 -399 342 1099 852 388 -371 -867 -907 -650 -60 740 1050 591 -141 -638 -973 -710 -244
5999 -244 717 921 695 234 -405 -888 -920 -500 621 833 856 398 -60 -630 -989 -498 -73 650 921 564
6019 564 46 -625 -859 -531 -166 526 994 998 346 -396 -898 -682 -401 343 696 947 514 -138 -697 -928 -609
6040 -609 283 552 689 517 254 -405 -824 -862 -428 474 817 816 198 -210 -822 -578 -566 -71 856 989 685
6061 685 -100 -665 -826 -435 -130 442 765 674 282 -500 -1024 -832 -233 389 589 623 626 -24 -649 -1041 -617
6082 -617 167 746 681 506 189 -410 -731 -694 -57 442 948 634 60 -348 -707 -651 -472 126 793 848 480
6103 480 -191 -777 -862 -465 117 547 660 800 211 -508 -912 -730 -202 263 455 816 248 -196 -814 -1046
6123 -1046 -683 108 657 757 272 -79 -500 -863 -738 -20 662 843 627 173 -625 -733 -651 -379 243 703
6143 703 886 476 -312 -791 -769 -416 239 554 815 640 219 -577 -1012 -596 -72 460 608 532 207 -4 -915
6164 -915 -1077 -377 378 801 661 417 -46 -495 -860 -732 -53 628 672 568 144 -390 -797 -802 -328 439 677
6185 677 775 419 -190 -712 -804 -549 98 741 736 697 -117 -636 -687 -649 122 424 727 707 221 -323 -797 -960 -347
6208 -347 347 810 661 194 -237 -514 -647 -552 21 659 908 547 -130 -459 -920 -652 -406 470 830 748 404
6229 404 -203 -614 -807 -249 167 699 836 499 -84 -624 -721 -431 209 649 933 669 174 -499 -706 -544
6249 -544 -309 327 623 553 426 -179 -798 -860 -377 -11 731 709 383 -1 -440 -704 -486 37 530 780 597
6270 597 290 -335 -639 -638 -327 218 670 698 356 -78 -567 -775 -470 27 545 766 668 66 -560 -809 -671
6291 -671 -173 290 709 640 381 -335 -610 -720 -364 254 603 823 502 -18 -511 -841 -620 -11 510 697
6311 697 449 169 -279 -675 -733 -265 579 778 870 218 -162 -445 -769 -665 21 354 985 493 -71 -579 -746
6332 -746 -328 -183 255 717 687 -85 -257 -732 -409 -266 204 523 662 252 -93 -618 -943 -306 112 591
6352 591 631 513 41 -275 -778 -943 -300 488 612 523 9 -430 -559 -440 -500 -70 435 842 351 -256 -502
6373 -502 -398 -373 4 385 607 727 112 -478 -767 -622 19 350 584 758 376 -308 -708 -480 -464 294 431
6394 431 654 510 79 -376 -693 -344 -165 595 652 364 -81 -297 -438 -316 -468 178 546 714 397 -276
6414 -276 -505 -542 -70 -84 414 428 630 -40 -555 -856 -471 -142 466 654 613 464 -314 -539 -739 -465 181
6435 181 559 498 303 -48 -376 -677 -575 -42 497 781 552 47 -497 -596 -364 -207 204 485 735 317 -477
6456 -477 -633 -487 -186 89 520 615 481 29 -566 -533 -385 -152 374 501 574 238 -208 -517 -565 -191 399
6477 399 534 494 230 -103 -254 -718 -524 89 604 819 327 -186 -477 -474 -525 -255 143 537 700 343 -538
6498 -538 -574 -527 -31 -27 368 649 349 -61 -656 -758 -389 106 298 331 515 239 -343 -615 -619 -27 379 592
6520 592 526 265 -160 -614 -592 -354 30 599 683 626 -99 -267 -613 -231 -114 203 561 735 279 -378 -758
6541 -758 -588 98 120 483 685 406 -25 -488 -595 -326 186 469 529 413 113 -319 -730 -619 -325 373 630
6562 630 403 80 -273 -670 -665 -181 -22 531 832 494 -77 -415 -506 -393 -126 236 581 538 134 -236 -479
6583 -479 -363 -273 145 520 420 262 -232 -570 -447 -360 127 384 625 433 -67 -344 -673 -503 -128 387 611
6604 611 465 18 -564 -470 -574 -285 144 431 667 177 -158 -522 -438 -460 46 406 674 325 208 -349 -710
6625 -710 -471 -106 274 557 372 310 -108 -353 -589 -387 224 341 587 226 -5 -316 -651 -436 -48 486
6645 486 516 539 3 -415 -643 -361 -147 59 498 428 286 -123 -402 -461 -117 179 419 449 437 51 -331 -560
6667 -560 -396 46 309 520 367 240 -41 -368 -422 -172 422 441 666 402 -64 -237 -572 -443 -20 456 433
6688 433 316 -33 -382 -606 -394 -79 303 463 416 83 3 -663 -620 -194 123 625 445 202 59 -341 -542
6709 -542 -426 -90 471 642 406 73 -259 -530 -174 -326 164 447 620 261 -135 -564 -526 -176 223 321 568
6730 568 309 -10 -334 -597 -479 48 420 328 398 111 -166 -715 -698 -303 214 517 419 219 -53 -412 -671
6751 -671 -599 -68 546 603 343 1 -400 -421 -367 -87 214 628 679 285 -228 -422 -567 -240 283 442 708 563
6773 563 127 -444 -551 -314 33 533 448 370 242 -164 -602 -433 -381 248 431 386 65 -125 -368 -406 -422 -12
6795 -12 350 493 369 51 -135 -470 -434 -87 276 701 270 -103 -206 -504 -391 -255 253 451 476 459 -151
6816 -151 -367 -529 -448 78 402 582 220 238 -247 -528 -643 -314 329 645 598 312 -161 -424 -357 -470 42
6837 42 473 581 266 -88 -373 -444 -365 -334 331 607 585 -4 -299 -486 -515 -19 147 489 488 375 -102 -503 -455
6860 -455 -115 -27 197 524 477 72 -256 -469 -177 -143 279 586 250 186 -320 -378 -407 -314 273 420 594 112
6882 112 -75 -290 -360 -681 -194 327 444 429 76 -371 -537 -467 -55 348 428 578 341 -133 -553 -444 -302
6903 -302 40 415 500 227 -73 -259 -342 -414 -46 315 444 312 78 -302 -409 -426 -105 129 405 509 370
6924 370 -72 -406 -482 -255 246 538 362 317 44 -366 -413 -697 -151 87 586 354 73 -92 -340 -490 -266
6945 -266 23 310 354 195 -236 -335 -421 -162 -236 302 489 279 132 -177 -309 -437 -103 61 463 554 124 12
6967 12 -340 -463 -305 33 413 481 350 263 -284 -432 -493 -173 276 384 356 69 -163 -432 -277 -234 83 465
6989 465 326 115 -73 -488 -576 -208 -8 9 628 427 189 -416 -529 -226 9 343 372 407 349 -117 -350 -504
$$ [...]
8191b06
##END NTUPLES=NMR FID
##END=
