##TITLE=1H_LR-675-Me3SiO
 CDCl3, 8 sc, 
 28.5.2019
##JCAMPDX= 6.0         $$ Bruker NMR JCAMP-DX V2.0
##DATA TYPE= NMR FID
##DATA CLASS= NTUPLES
##ORIGIN= UXNMR, Bruker Analytische Messtechnik GmbH
##OWNER= root
$$ XWIN-NMR		Version 3.5
$$ Tue May 28 13:56:35 2019 Russian Standard Time (UT+4h)  she@DPX200
##.OBSERVE FREQUENCY= 200.1315
##.OBSERVE NUCLEUS= ^1H
##.DELAY= (6, 6)
##.ACQUISITION MODE= SIMULTANEOUS
##.ACQUISITION SCHEME= undefined
##.AVERAGES= 8
##.DIGITISER RES= 18
##SPECTROMETER/DATA SYSTEM= spect
##.PULSE SEQUENCE= zg30
##.SOLVENT NAME= CDCl3
##.SHIFT REFERENCE= (INTERNAL, CDCl3, 0, 15.7039)
##AUDIT TRAIL= $$ (NUMBER, WHEN, WHO, WHERE, WHAT)
$$ ##TITLE= Audit trail, XWIN-NMR		Version 3.5
$$ ##JCAMPDX= 5.01
$$ ##ORIGIN= Bruker BioSpin GmbH
$$ ##OWNER= she
$$ F:/spectra/data/she/nmr/H-F/1/audita.txt
$$ ##AUDIT TRAIL=  $$ (NUMBER, WHEN, WHO, WHERE, WHAT)
(   1,<2019-05-28 13:55:24.76 +0400>,<she>,<DPX200>,
      <created by zg, POWCHK disabled, PULCHK disabled
       configuration hash MD5:
       00 E9 B6 7A A2 85 ED C7 34 08 36 98 17 FE 4E 26
       data hash MD5: 16K
       D4 21 B6 6E 33 FD 75 E9 BA 04 44 25 39 48 C0 4A>)
$$ ##END=
$$ 
$$ hash MD5
$$ 81 3E 37 3B 87 BF C3 6E 46 A8 13 F5 A5 56 F3 BF
##$RELAX= 
##$RELAX= 
##$RELAX= 
##$RELAX= 
##$RELAX= 
##$RELAX= 
$$ Bruker specific parameters
$$ --------------------------
##$DU= <F:/spectra>
##$EXPNO= 1
##$NAME= <H-F>
##$PROCNO= 1
##$TYPE= <nmr>
##$USER= <she>
##$AMP= (0..31)
100 100 100 100 100 100 100 100 100 100 100 100 100 100 100 100 100 100 
100 100 100 100 100 100 100 100 100 100 100 100 100 100 
##$AQSEQ= 0
##$AQ_mod= 1
##$AUNM= <au_zg>
##$AUTOPOS= <>
##$BF1= 200.13
##$BF2= 200.13
##$BF3= 200.13
##$BF4= 200.13
##$BF5= 200.13
##$BF6= 200.13
##$BF7= 200.13
##$BF8= 200.13
##$BYTORDA= 1
##$CFDGTYP= 0
##$CFRGTYP= 5
##$CHEMSTR= <none>
##$CNST= (0..31)
1 1 145 1 1 1 1 1 1 1 1 1 1 1 1 1 1 1 1 1 1 1 1 1 1 1 1 1 1 1 1 1 
##$CPDPRG= <>
##$CPDPRG1= <>
##$CPDPRG2= <>
##$CPDPRG3= <>
##$CPDPRG4= <mlev>
##$CPDPRG5= <mlev>
##$CPDPRG6= <mlev>
##$CPDPRG7= <mlev>
##$CPDPRG8= <mlev>
##$CPDPRGB= <>
##$CPDPRGT= <>
##$D= (0..31)
0 1.2 0 0 0 0 0 0 0 0 0 0.03 0 0 0 0 0 0 0 0 0 0 0 0 0 0 0 0 0 0 0 0 
##$DATE= 1559037324
##$DBL= (0..7)
120 120 120 120 120 120 120 120 
##$DBP= (0..7)
150 150 150 150 150 150 150 150 
##$DBP07= 0
##$DBPNAM0= <>
##$DBPNAM1= <>
##$DBPNAM2= <>
##$DBPNAM3= <>
##$DBPNAM4= <>
##$DBPNAM5= <>
##$DBPNAM6= <>
##$DBPNAM7= <>
##$DBPOAL= (0..7)
0.5 0.5 0.5 0.5 0.5 0.5 0.5 0.5 
##$DBPOFFS= (0..7)
0 0 0 0 0 0 0 0 
##$DE= 6
##$DECBNUC= <off>
##$DECIM= 24
##$DECNUC= <off>
##$DECSTAT= 4
##$DIGMOD= 1
##$DIGTYP= 9
##$DL= (0..7)
0 120 120 120 120 120 120 120 
##$DP= (0..7)
150 150 150 150 150 150 150 150 
##$DP07= 0
##$DPNAME0= <>
##$DPNAME1= <>
##$DPNAME2= <>
##$DPNAME3= <>
##$DPNAME4= <>
##$DPNAME5= <>
##$DPNAME6= <>
##$DPNAME7= <>
##$DPOAL= (0..7)
0.5 0.5 0.5 0.5 0.5 0.5 0.5 0.5 
##$DPOFFS= (0..7)
0 0 0 0 0 0 0 0 
##$DQDMODE= 0
##$DR= 18
##$DS= 0
##$DSLIST= <SSSSSSSSSSSSSSS>
##$DSPFIRM= 0
$$ [...]
##$SUBNAM2= <"">
##$SUBNAM3= <"">
##$SUBNAM4= <"">
##$SUBNAM5= <"">
##$SUBNAM6= <"">
##$SUBNAM7= <"">
##$SUBNAM8= <"">
##$SUBNAM9= <"">
##$SW= 24.9337058887773
##$SWIBOX= (0..15)
0 0 2 0 0 0 0 0 0 0 0 0 0 0 0 0 
##$SW_h= 4990.01996007984
##$TD= 16384
##$TD0= 1
##$TE= 0
##$TE2= 300
##$TE3= 300
##$TEG= 300
##$TL= (0..7)
0 120 120 120 120 120 120 120 
##$TP= (0..7)
150 150 150 150 150 150 150 150 
##$TP07= 0
##$TPNAME0= <>
##$TPNAME1= <>
##$TPNAME2= <>
##$TPNAME3= <>
##$TPNAME4= <>
##$TPNAME5= <>
##$TPNAME6= <>
##$TPNAME7= <>
##$TPOAL= (0..7)
0.5 0.5 0.5 0.5 0.5 0.5 0.5 0.5 
##$TPOFFS= (0..7)
0 0 0 0 0 0 0 0 
##$TUNHIN= 0
##$TUNHOUT= 0
##$TUNXOUT= 0
##$USERA1= <user>
##$USERA2= <user>
##$USERA3= <user>
##$USERA4= <user>
##$USERA5= <user>
##$V9= 5
##$VALIST= <valist>
##$VCLIST= <CCCCCCCCCCCCCCC>
##$VD= 0
##$VDLIST= <DDDDDDDDDDDDDDD>
##$VPLIST= <PPPPPPPPPPPPPPP>
##$VTLIST= <TTTTTTTTTTTTTTT>
##$WBST= 1024
##$WBSW= 4
##$XGAIN= (0..3)
0 0 0 0 
##$XL= 0
##$YL= 0
##$YMAX_a= 251030
##$YMIN_a= -327089
##$ZGOPTNS= <>
##$ZL1= 120
##$ZL2= 120
##$ZL3= 120
##$ZL4= 120
##$ABSF1= 10
##$ABSF2= 0
##$ABSG= 5
##$ABSL= 3
##$ALPHA= 0
##$AQORDER= 0
##$ASSFAC= 0
##$ASSFACI= 0
##$ASSFACX= 0
##$ASSWID= 0
##$AUNMP= <proc_1d>
##$AZFE= 0.1
##$AZFW= 0.1
##$BCFW= 1
##$BC_mod= 2
##$BYTORDP= 1
##$COROFFS= 0
##$CY= 11.3945322036743
##$DATMOD= 1
##$DC= 2
##$DFILT= <>
##$DTYPP= 0
##$F1P= 18.9103706918063
##$F2P= -1.10871071338519
##$FCOR= 0.5
##$FTSIZE= 0
##$FT_mod= 4
##$GAMMA= 1
##$GB= 0.15
##$INTBC= 1
##$INTSCL= 1
##$ISEN= 128
##$LB= 0.24
##$LEV0= 0
##$LPBIN= 0
##$MAXI= 10000
##$MC2= 0
##$MEAN= 0
##$ME_mod= 0
##$MI= 1.114404
##$NCOEF= 0
##$NC_proc= 0
##$NLEV= 6
##$NOISF1= 3.799351
##$NOISF2= 2.8
##$NSP= 1
##$NTH_PI= 0
##$NZP= 0
##$OFFSET= 15.70392
##$PC= 1
##$PHC0= -8888.529
##$PHC1= 57.00027
##$PH_mod= 1
##$PKNL= yes
##$PPARMOD= 0
##$PSCAL= 0
##$PSIGN= 0
##$REVERSE= no
##$SF= 200.130013532006
##$SI= 16384
##$SIGF1= 3
##$SIGF2= 2
##$SINO= 400
##$SIOLD= 16384
##$SREGLST= <1H.CDCl3>
##$SSB= 0
##$STSI= 0
##$STSR= 0
##$SW_p= 3612.71676300578
##$SYMM= 0
##$S_DEV= 0
##$TDeff= 0
##$TDoff= 0
##$TI= <>
##$TILT= no
##$TM1= 0
##$TM2= 0
##$TOPLEV= 0
##$USERP1= <user>
##$USERP2= <user>
##$USERP3= <user>
##$USERP4= <user>
##$USERP5= <user>
##$WDW= 1
##$XDIM= 8192
##$YMAX_p= 0
##$YMIN_p= 0
$$ End of Bruker specific parameters
$$ ---------------------------------
##NTUPLES= NMR FID
##VAR_NAME=  TIME,          FID/REAL,        FID/IMAG
##SYMBOL=    X,             R,               I
##VAR_TYPE=  INDEPENDENT,   DEPENDENT,       DEPENDENT
##VAR_FORM=  AFFN,          ASDF,            ASDF
##VAR_DIM=   8192,          8192,            8192
##UNITS=     SECONDS,       ARBITRARY UNITS, ARBITRARY UNITS
##FACTOR=    0.0002004,     1,               1
##FIRST=     0,             0,               0
##LAST=      1.6414764,     0,               0
##MIN=       0,             -327089,         0
##MAX=       1.6414764,     251030,          0
$$ Real data points
##PAGE= N=1
##DATA TABLE= (X++(R..R)), XYDATA
0@%%%%Qj6J6j6J6k4L2m0N1n9P2q8J05j29J53j77K11k51K89l30L85m43N03n73O53
29C48p41Q37r42J057j185J322j472J642j828K028k248K493k760L053l379L744
45A969m152M607n123N713o395P190q134R279j0695J2505j4917J8309k3457L2309
59A9008n1673J68099j33518k48336L59152J38298k77190j59459K86119J09013
69B09513k50414j27582K30095Q6524j99177o9553K14814N2903k19063q5302K05084
80D7842Q6245j68145p3662J64712N9454j58717o4728J48660O3680j23600m8962
91f7221J23906L4197j45729o1906J49401R4558j32221j14551J17359J18899j17268
102e76j35861J12579J55248r0764j54363P1629J29960q0695j19874R9126J32301
$$ y = [0, 0, 0, 0, 0, 8, -8, 8, -8, 8, -16, 16, -24, 27, -32, 40, -48, 57, -72, 81, -96, 115, -136, 153, -177, 208, -235, 268, -305, 348, -393, 444, -498, 559, -626, 696, -776, 866, -962, 1066, -1182, 1311, -1449, 1604, -1775, 1969, -2183, 2424, -2699, 3014, -3381, 3809, -4325, 4954, -5741, 6764, -8153, 10156, -13301, 19008, -32665, 135434, 1916, -246420, 112732, 251030, -26160, -185619, 100500, 209513, -40901, -168483, 61612, 148136, -51041, -120594, 94220, 147123, -71940, -157242, 47842, 134087, -34058, -107720, 56992, 116446, -42271, -106999, 41661, 105341, -18259, -67221, 56685, 90882, -54847, -116753, 32648, 127206, -5015, -119566, -2207, 116692, -576, -136437, -23858, 131390, 40626, -113737, -42108, 87852, 7157, -112717, -13591, 118710]
113A18710r7567j40309Q9760J37158r2035j35118J04097J49457j03633j61925
123a31405Q7450J48174q8136j27155J08607J23026j24426j28490J23200J24646
133A15491j20155j12733J27126J13462j29849j27505J11204J30776q3933j14364
143i0480P6995J03874p8742j05054P3479J07145o1321r7440N9699Q8472o9683
154F944r5557O8319J08271n1089j05702L7506R5889l6712r6114L8020J04182k8687
166D5270j06166K1500R8598k7238r8121L8334J12171l6079j20534K5942J17767
177G1444k3492j12846K7143J15848k4942j20673J3862J15173j0236j06175J7627
188c7267J07608k2783j15782J8512J16010j4409j10289J8535J07331k3809j11018
$$ y = [118710, 21143, -119166, -29406, 107752, 15717, -119401, -15304, 134153, 30520, -131405, -43955, 104219, 16083, -111072, -2465, 120561, -3865, -132355, -9155, 115491, -4664, -117397, 9729, 123191, -6658, -134163, -22959, 107817, 23884, -90480, -13485, 90389, 11647, -93407, -19928, 87217, 25896, -71544, -11845, 76627, 6944, -88613, -20294, 87977, 36888, -68814, -31308, 64581, 27869, -68245, -30225, 73957, 45270, -60896, -39396, 59202, 31964, -66157, -27823, 84348, 48269, -72265, -46323, 71444, 47952, -64894, -37751, 78097, 53155, -67518, -53656, 61517, 51281, -54894, -37267, 70341, 47558, -68224, -49712, 66298, 51889, -58400, -39865, 67466, 43657, -67361]
199f7361K0502J09756j3575r9694J4858R1048j9516r3090J8090R4175j1055r0359
211d6221O720Q4494q624q6941P044R1484J57q9363n589Q2735L566q1346k589Q3602
225C9129P017q3930j2480P8926J3728p7129j2231Q0814J4802q3195k0819Q0360
237B4992K2164p8026j9883P9610J9220q2645k2033Q0748K3825p7012k1070P6076
249B5966K0031p7993k2244P6268K5663p2230k4820P0677K3396p1936k4126P2506
261B1158K6871o9234k6322O6176K4778o6495k4030O5968K6591o2771k7304N9079
273A4465K6753n7756k6345N8240K9176n5966l1955N3537L2415n1876l2636N2979
285A1031L4431n1865l6578M9915L7453m7907l6079M7269L6794m6792l8519M5322
$$ y = [-67361, -46859, 62897, 49322, -50372, -35514, 55534, 36018, -57072, -38982, 55193, 44138, -46221, -39501, 44993, 36369, -50572, -43528, 47956, 48113, -41250, -46839, 35896, 39462, -41884, -44473, 39129, 46146, -37784, -50264, 28662, 42390, -34739, -46970, 33844, 48646, -34549, -55368, 24992, 47156, -30870, -50753, 28857, 48077, -34568, -56601, 24147, 47972, -29040, -50110, 25966, 45997, -31996, -54240, 22028, 47691, -24539, -49359, 21318, 44714, -27222, -51348, 21158, 48029, -21205, -47527, 18649, 43427, -23068, -47098, 18870, 45461, -17310, -44614, 14465, 41218, -16538, -42883, 15357, 44533, -11433, -43388, 10149, 42564, -9312, -41948, 11031, 45462, -6403, -42981, 6934, 44387, -3520, -39599, 7670, 44464, -2328, -40847, 4475]
297D475L9108m3384l9107M3058M0274m3639m1285M3094M2165m1880m1436M0801
309B244M1357m1198m1260M0078M1772l8984m1180L7843M0631l7183m0880L5747
321a013M1788l4349m2815L3116M2133l2290m2797L1806M2721l0746m3223K9765
333e904M2133k8696m1854K7640M1441k6767m1709K4793M1697k3759m1715K2481
345a0219M2508k2402m2805K0941M2852j9985m3268J9101M3213j9216m2859J8119
357a4020M2858j7545m3019J6762M2279j5579m2042J4413M2046j3896m2173J3131
369a6785M1876j1787m2372J0983M2553j0435m2457J0113M2267r387m2116Q734
381a8813M1884q016m1189P240M0953o106m0559M954M0651l973m0435L293M0628
$$ y = [4475, 43583, 199, -38908, 4150, 44424, 785, -40500, 2594, 44759, 2879, -38557, 2244, 43601, 2403, -38857, 1221, 42993, 4009, -37171, 672, 41303, 4120, -36760, -1013, 40775, 6426, -36389, -3273, 38860, 6570, -36227, -4421, 38300, 7554, -35669, -5904, 36229, 7533, -34321, -6681, 34760, 7993, -33716, -8923, 32774, 9015, -32700, -10219, 32289, 9887, -32918, -11977, 30875, 10890, -32378, -13277, 29936, 10720, -32139, -14020, 28838, 11293, -31726, -14964, 27315, 11736, -30306, -15893, 26153, 12257, -29916, -16785, 25091, 13304, -29068, -18085, 24468, 14033, -28424, -18311, 23956, 14569, -27547, -18813, 23071, 15055, -26134, -18894, 22059, 15953, -24606, -19652, 20999, 17026, -23409, -20116, 20512]
394B0512k369m0516K204M0479j301m0296J149L9945k32l9514j78L9570P72l9270
408a9045j064L9324J698l8468k333L8233L413l8279l760L8626L939l7861m331
421a9908L7823M980l7326n330L6763N744l5808o431L5364P434l5120p486L4309
434A5008Q722l4592r103L4138R799l3858j0169L3418J0924l3467j1492L3080J1828
447B4236l2522j2326L1509J3042l1321j3145L0409J4215l0782j5098L0518J5288
459B4023l0722j5461L0188J5627l0210j6502K9683J7066k9806j6600K9130J6476
471B2892k9368j6746K8798J6644k8092j7186K7430J7707k7662j8283K7157J8675
483B1966k6784j8652K5999J8487k5862j8718K5362J9062k5061j8907K3877J9091
$$ y = [20512, 18143, -22373, -20169, 20310, 19009, -21287, -20138, 19807, 19575, -19939, -20117, 19453, 20225, -19045, -20109, 19215, 20913, -17555, -19888, 18345, 21758, -16521, -20281, 18345, 22284, -15577, -19908, 17915, 22895, -14431, -19761, 17002, 22746, -13062, -19493, 15871, 23305, -11815, -19301, 15008, 23730, -10862, -19965, 14173, 23972, -9886, -20055, 13363, 24287, -9180, -20672, 12408, 24236, -8286, -20612, 10897, 23939, -7382, -20527, 9882, 24097, -6685, -21783, 8735, 24023, -6699, -22160, 8028, 23655, -6555, -23057, 6626, 23692, -6114, -22714, 6416, 22892, -6476, -23222, 5576, 22220, -5872, -23058, 4372, 22079, -5583, -23866, 3291, 21966, -4818, -23470, 2529, 21016, -4846, -23564, 1798, 20860, -4201, -23108, 769, 19860]
495A9860k3645j9354K3558J9558k2588k0461K1756K0657k1136k0888K0830K1312
507A9459k0143k1816J9475K2244j9271k1839J9396K2337j9356k2898J8445K3790
519A9823j7842k3746J7581K3793j6849k4550J7074K4510j5999k4151J6222K4071
531A9937j6668k3862J6162K5459j5928k5208J5263K5400j5328k5240J5224K6018
543B1229j4419k5683J3747K5094j3697k4650J3951K4897j3034k5183J2337K4899
555A9488j2305k4349J2584K4996j1844k5356J0256K4824r512k3827R550K4328
567A8833r355k5070Q235K4983p508k4576P951K4336q081k5360O557K6088n425
580A1608k5038N423K4077n497k5342M955K5754m003k4941L594K4079m332k5059
$$ y = [19860, -3785, -23139, 419, 19977, -2611, -23072, -1316, 19341, -1795, -22683, -1853, 19459, -684, -22500, -3025, 19219, -52, -21891, -2495, 19842, 486, -22412, -3967, 19823, 1981, -21765, -4184, 19609, 2760, -21790, -4716, 19794, 3795, -20356, -4134, 19937, 3269, -20593, -4431, 21028, 5100, -20108, -4845, 20555, 5227, -20013, -4789, 21229, 6810, -18873, -5126, 19968, 6271, -18379, -4428, 20469, 7435, -17748, -5411, 19488, 7183, -17166, -4582, 20414, 8570, -16786, -6530, 18294, 8782, -15045, -5495, 18833, 9478, -15592, -7357, 17626, 10118, -14458, -6507, 17829, 9748, -15612, -9055, 17033, 11608, -13430, -8007, 16070, 10573, -14769, -9814, 15940, 11937, -13004, -9410, 14669, 10337, -14722]
593a4722L829K5804k544k5644J753K4765k633k5005K779K5930j919k5953N08K4746
607A1694r25k4361J711K5208j304k5926k48K4662L73k3751L59K4096J20k5474
621a3766j188K4388J858k3041j137K3622K19k4441j914K4443L097k2525l335K2675
635H955K292k3671k921K3475M810k2050m902K1578L661k2181m126K3508N659k2422
649h335o170K1144N403k1468m969K2482O384k1471p803K0349O764j9807n709K1521
663H315O693k1136q535J9604Q178j8734p015J9902P847k0048r906J9304R621j7563
677c473q131J8583P901j9363r836J8689J0603j7029r187J7034Q833j8612r884
690a3872J8348J1213j6316j0310J5406R061j6316j0412J7100J2302j5955j2007
$$ y = [-14722, -10893, 14911, 12367, -13277, -11524, 13241, 10608, -14397, -11618, 14312, 12393, -13560, -13052, 11694, 10769, -13592, -11881, 13327, 12023, -13903, -14151, 10511, 10884, -12867, -12508, 11588, 11708, -13766, -14954, 9434, 11292, -11749, -12886, 10736, 10955, -13486, -15400, 9043, 12140, -10385, -13720, 8955, 11247, -12424, -15345, 8130, 12940, -9110, -14012, 7566, 11227, -10954, -15080, 8428, 14087, -8335, -14505, 6639, 12042, -9426, -14395, 8087, 14471, -7000, -14803, 5546, 12310, -7497, -13206, 8315, 15008, -6128, -14663, 4941, 13119, -5615, -12630, 7272, 15119, -4929, -14835, 4469, 14090, -3473, -11604, 6979, 14880, -4483, -14319, 4370, 14973, -2056, -11243, 5791, 14624, -3988, -13872, 4476, 15689, -627, -10937, 4469, 13530, -2786, -13198, 3902, 16204, 249, -11758]
702a1758J4340J0883j5087j1531J6440J3231j5072j4178J3780J2057j4214j1756
714a2865J5426J3371j5364j4184J3308J3235j3128j2504J4661J3135j5063j4494
726a4466J2919J4257j1972j3084J2967J3125j3755j4727J2476J4571j1112j3318
738a2119J1617J3192j3223j4397J1860J5302j0635j3863J0063J2998j1057j3497
750a3759J0443J4588q856j4069Q455J2487r023j3095R298J4397p780j4780P150
763d544J2848o897j3143P411J4835o253j5391N046J3746m638j3432N362J5168
776A0118n157j5975L700J5491l397j4902N020J5228m635j6532L695J6546k854
789F346j5204L426J5474m386j6846M239J6682k946j5153L110J5039l938j5651
$$ y = [-11758, 2582, 13465, -1622, -13153, 3287, 16518, 1446, -12732, 1048, 13105, -1109, -12865, 2561, 15932, 568, -13616, -308, 12927, -201, -12705, 1956, 15091, 28, -14466, -1547, 12710, 738, -12346, 621, 13746, -9, -14736, -2260, 12311, 1199, -12119, -502, 12690, -533, -14930, -3070, 12232, 1597, -12266, -2203, 10795, -262, -13759, -3316, 11272, 2416, -11653, -3198, 9289, 266, -12829, -3531, 10866, 3086, -11694, -4544, 8304, 1407, -11736, -4325, 10510, 4257, -11134, -6088, 7658, 3020, -10412, -5050, 10118, 4961, -11014, -7314, 8177, 4780, -10122, -5102, 10126, 5491, -11041, -7346, 9200, 6346, -8858, -5432, 10042, 5656, -11190, -6951, 9731, 6785, -8368, -5258, 9781, 5843, -9808]
802i808L311J6577k436j5463K527J4139l071j4682L769J5140k243j4503J554J3299
816H110k098j3138K439J4026j621j3556Q9J2629l75j1932J009J2380l61j2443
830d842j361J1783J568j0929j238J1530J573j2444k950J1936L605j1635k900J1437
844E133L383j2631m437J2765M729j1794m584J1806M182j2982m766J3267N103j2489
858c315n025J2349M052j2438m739J3047M949j2900m639J1906M112j2090l747J2103
872C625M641j2099n017J1022M645j1038m170J1361M391j1213m827J0147M528r211
886c215m502R506M950r633n588Q707N670p923n545Q114N415p703o499P682O675
901F111o809o544O720O930p108p261O450Q265o287p856O182P866o365q328O734
$$ y = [-9808, -6497, 10080, 7644, -7819, -5292, 8847, 5776, -8906, -5137, 10003, 7760, -6743, -5189, 8110, 6012, -7126, -4687, 9339, 7718, -5838, -5749, 6880, 6505, -5427, -4418, 7962, 7601, -4842, -6203, 5580, 7148, -3781, -5019, 6511, 8084, -4360, -7310, 4626, 8231, -3404, -6304, 5133, 8516, -4115, -8552, 4213, 8942, -2852, -7436, 4370, 8552, -4430, -9196, 4071, 9174, -3315, -8340, 4009, 8061, -4377, -9116, 3931, 8880, -4020, -8659, 3247, 7359, -4731, -8478, 3625, 8266, -3833, -8850, 2172, 6817, -4221, -8391, 2970, 7361, -3852, -8679, 1468, 5996, -3215, -7717, 1789, 6739, -2894, -8482, 225, 5895, -2028, -7573, 541, 5956, -1747, -8246, -564, 6111, -698, -7242, -522, 6408, -700, -7961, -1511, 6754, 467, -7389, -1207, 6659, 294, -8034, -1300]
916a300Q963o566q736N998R131o586q781O958R271o932r034O342R002o642q324
931g236O644Q944o764q766O293Q394n860p885N844Q184n812q380N492Q242n089
946B245p480M929P203m686p625M270P638l856p028L006P569k923p899L046P781
961F190k526p623K194P372j790q059J596Q176j528q260J212Q187q85q343P94Q550
977E257j032q926M72R198q81q914Q34R134o12r420M02R327l84r260N78Q978n53
994D198r335N58Q747j50q821J51Q388M4q777L62Q303K3q407j77Q569l49p943l34
1012d950P653O44p483l88P204N33p094q14O680J491o766j597O733J887o513k716
1028e496P159K284o637k575O799K498o639k447O610K924o677l098O322L503o918
$$ y = [-1300, 7663, 1097, -7639, -1641, 7490, 904, -7877, -919, 8352, 1420, -7614, -1272, 7730, 1088, -7236, -592, 8352, 1588, -7178, -885, 7509, 1649, -6236, -392, 7792, 1980, -6400, -908, 7334, 2245, -5235, -306, 6897, 2211, -5414, -1144, 6494, 2638, -4390, -1384, 6185, 3262, -4637, -1591, 6190, 3664, -3959, -1765, 5607, 3817, -4242, -2646, 5530, 4002, -4258, -3046, 5141, 4256, -4087, -3293, 5257, 4225, -4701, -4229, 4969, 4088, -4826, -3992, 5142, 4530, -4890, -4488, 4839, 4455, -4805, -4227, 4751, 4198, -5137, -4579, 4168, 4018, -4803, -4652, 3736, 3780, -4997, -4635, 3668, 3691, -4716, -4893, 3676, 3327, -4616, -4950, 2703, 3347, -4136, -4524, 2680, 3213, -3881, -4695, 1985, 3476, -3290, -4887, 1846, 3733, -2780, -5496, 1663, 3947, -2690, -5265, 1534, 4032, -2607, -5054, 1556, 4480, -2197, -5295, 1027, 4530, -2388]
1043b388l097P000L310o600l762O723M179p112l121O424L498o429l464O498L670
1058E329o474l705O264L889o446l392O370L183n473m205O186L776n481m376O063
1073A508L660n388l738N272L879n192m060N138M140m819m390M760M564m741m443
1088c850M274M795m638m673M225N021m056m780L749N169m531m595L930M820l679
1103A181n381L631N472l440o012M057N264m032m967L409N348l497n480L530N544
1118D627l442n699L428N387l059n929L173N704l150n479K722N805l154n373K689
1133a750N608k834n275K343N306k410n480K372N210k208n234K054N295j832n219
1148d054J817N229j811n332J870M969j369n371J476M928j180n022J296N299j070
$$ y = [-2388, -5485, 1515, 4825, -1775, -5537, 1186, 5365, -1747, -4868, 1556, 5054, -1375, -4839, 1659, 5329, -1145, -4850, 1414, 5303, -1143, -4535, 1835, 5018, -455, -4660, 1526, 5302, -179, -4555, 1508, 5168, -220, -3958, 1314, 5193, 1, -4059, 1079, 5219, 400, -3990, 770, 5334, 593, -3850, 424, 5219, 581, -4092, 133, 5154, 1098, -3682, 67, 5236, 705, -3890, 40, 4860, 1181, -4200, -569, 4903, 1463, -4549, -492, 4772, 740, -4227, -818, 4530, 1033, -4447, -917, 4627, 1185, -4514, -1086, 4301, 1242, -4687, -1514, 4190, 1040, -4439, -1717, 4088, 934, -4439, -1750, 3858, 1024, -4251, -1908, 3398, 988, -4492, -2120, 3090, 882, -4352, -2298, 2997, 1165, -4054, -2237, 2992, 1181, -4151, -2281, 2688, 1319, -4052, -2576, 2352, 1172, -3850, -2554, 2745, 1675]
1163A675n348J065N126r42n058O17N694q99n425N73N247k49n323O83N116P1n254
1180b631M5N416k47n369L68N139N8n313O7N369J4n366J35N447l00m844m04N328
1198B912L25n463N4N294lm667l55M734O89n283k59M832N47m786m83M832K05m727
1216a602n90M718K86m054o38M205Q66m628r64M168J307m025j407M355R58m085
1232a130j357M127J665m044j935M304J305l733k003M211J641m247j602L813J869
1247B884l976j807L793J919l830k297L529K625l692k398L972K186m322k226L859
1262B19K517m051k056L742K026l681k099L461K520l806k279L822K014l392k384
1277c427L657K218l508k199K972K609l280k177L455K101l331k249L183J739k560
$$ y = [1675, -3673, -2608, 2518, 1576, -3482, -2865, 2829, 1930, -3495, -2922, 2325, 2076, -3247, -2564, 2552, 2623, -2631, -2586, 2830, 2583, -2786, -2418, 2721, 2779, -2534, -2467, 2902, 2916, -2450, -2315, 3132, 2832, -2012, -2416, 2912, 3237, -2226, -2172, 3122, 3119, -1548, -1903, 2831, 3520, -1763, -2022, 2810, 3357, -1429, -1912, 2920, 3125, -1602, -2192, 2526, 2812, -1242, -1880, 2325, 3191, -1437, -2401, 1767, 3074, -951, -2358, 1997, 2955, -1130, -2487, 1640, 3305, -739, -2674, 1630, 2935, -798, -2801, 1410, 3051, -1196, -2798, 1015, 2884, -1092, -2899, 894, 2813, -1017, -3314, 215, 2840, -852, -3250, 722, 2908, -1414, -3640, 219, 2736, -1315, -3371, 371, 2397, -1284, -3383, 78, 2598, -1208, -3487, 335, 2349, -1043, -3427, 230, 2448, -1060, -3259, -287, 2322, -958, -3135, 320, 2421, -910, -3159, 24, 1763, -797]
1292g97k325K940K331k523k674K527K497k578k054K179L083k654k649K413K536
1307B252k177k231J767L095k223k740J510L193j934k610J885K957j861l363K229
1322b51K822j525k831J699K683j788l161K291K864j435l181J998K488j810k879
1337b016J567L585j930l117J936K582j853k285J366L104j724k981J712K416j351
1352A011k717J458K949j602k519O77K982j309k275J277K598j421k935Q40K723
1367A737m2k999M81L134j178l111R48K419k17k732L09L067q64l064N02L077r7
1384A370k833Q0K547j63l101N4L605k64l034L27K440l31k977O53K876k92k639
1401a682n0K626O2k990M28K903J44k954m46K747k06k208K86K467P9k778k04J978
$$ y = [-797, -3122, -182, 2149, -374, -3048, -521, 1976, -602, -2656, -477, 2606, -48, -2697, -284, 2252, 75, -2156, -389, 2706, 483, -2257, -747, 2446, 512, -2098, -213, 2744, 883, -2480, -251, 2571, 1046, -1785, -86, 2597, 809, -2352, -61, 2803, 1368, -1813, 185, 2673, 863, -2016, -449, 3136, 1206, -1911, 25, 2607, 754, -1531, -165, 2939, 1215, -1766, -54, 2362, 1011, -1706, -248, 2701, 1099, -1420, -743, 2239, 930, -1345, -68, 2530, 1109, -1826, -986, 1737, 1695, -1304, -823, 2311, 1133, -1978, -1030, 1389, 1172, -1560, -1251, 1816, 952, -2112, -1610, 1467, 1370, -1463, -1383, 1164, 1001, -2100, -2046, 1559, 1295, -1739, -1412, 1028, 697, -2280, -1627, 1249, 957, -1682, -1732, 894, 956, -2034, -1606, 1297, 1441, -1513, -1959, 788, 582, -1626, -1340, 1127, 1206, -1572, -1776, 202]
1419B02O95k248o5K394L7k459m81K529O91k104p54K593K54k441o71K361Q35k145
1437g77q69K350P24k253j072K577J199k264p72K223P34k546p33K465J075k417
1453c56r50J839J161k363r37K850R17k140j252J790J604k485j007K586J008k023
1469B42j690K067J348j944j012K251R95k306j375K119J129j753j151K093O99j654
1485E8j657J718J245j155j259J698Q06j635r10J193J627j581j379J253J639j595
1501F6j433J192J733j431j494J052J573j318j385R68K203j311k200J160K037j529
1517a17j698J361J784j042k091Q00K021r95j635J274J557r61k316J094K046p47
1533C35j778P50J969j467k189J456J760q16j425Q32J357r70j573J126J452n16
$$ y = [202, 897, -1351, -1416, 978, 1015, -1444, -1925, 604, 1295, -809, -1563, 1030, 1284, -1157, -1828, 533, 1368, -777, -1646, 704, 1428, -825, -1897, 680, 1879, -385, -1157, 1066, 1800, -746, -1479, 986, 2061, -356, -1306, 533, 1694, -669, -1606, 1244, 2161, 21, -1231, 559, 2163, -322, -1329, 1257, 2265, 242, -1448, 619, 1967, 23, -989, 1262, 2257, -49, -1424, 695, 1824, 71, -1080, 1013, 1712, 58, -1599, 119, 1364, 209, -1050, 648, 1454, -181, -1091, 102, 1729, 148, -1231, 22, 1661, 66, -1367, -175, 1558, 127, -1367, -315, 1258, -60, -1445, -477, 1726, 415, -1785, -625, 1412, -117, -1815, -454, 1330, 288, -1803, -1003, 1018, 23, -1612, -338, 1219, 258, -2058, -964, 1082, 335, -1443, -693, 1276, -191, -2380, -924, 836, 20, -1405, -573, 784, -186, -1759, -633, 819, 303]
1549C03j635P33J501r17j747J093J878q01j867M62J782p79j244L27J849l13j928
1566a303N26J322j20j498K42J987k91j652P6J574j96j412K96J262L48k038M8J840
1584A011L33k091K46K102l86k285L39J765J93j469j55J693K5k167j75K371l08
1601A042j290k72J778N3j971q8K125j35j653MJ464O0j573n04J798M78j571m18
1619f73J859l36j534O0J646K81j716o80J674L79j676j86J397L95j521o73J765
1636D61P77j738r02J885O37j744q34J764Q10j782r42K060O35j849r80J794Q95
1653I47j663p62J548R79j677j012J754J329k130r05J636N65j488r70J971N89j098
1670c87j194J371J164j496p22J091R84j205r82J217R42j271j125J478J100j701
$$ y = [303, -1332, -599, 902, -15, -1762, -669, 1209, 408, -1459, -997, 785, 6, -1238, -911, 938, 625, -1303, -777, 545, 425, -1073, -831, 1156, 865, -787, -711, 863, 667, -745, -449, 813, 1161, -877, -829, 1011, 1344, -747, -501, 1601, 1215, -1070, -731, 1034, 1227, -242, -397, 1296, 1321, -846, -1021, 1350, 1042, -248, -520, 1258, 1311, -660, -748, 1377, 1242, -411, -407, 1057, 1117, -456, -960, 838, 1316, -255, -673, 1186, 850, -684, -624, 1022, 1303, -413, -1093, 581, 960, -716, -902, 495, 890, -631, -1304, 461, 1238, -500, -1402, 483, 1120, -624, -1458, 306, 1116, -666, -1608, 452, 1087, -762, -1742, 52, 947, -716, -1478, 70, 1049, -628, -1640, 114, 1443, -687, -1592, 44, 609, -879, -1849, 122, 711, -387, -1581, -210, 954, -542, -1264, -173, 811, -394, -1376, -159, 783, -488, -1613, -135, 965, -736]
1686g36l55R16J316j204r67P72J241q86j414J118J221j145r37J275Q53q39j268
1703a039P64J611r79j577J239J203q18j408P71J687j040j333Q44J485p68j743
1719a101J008J553o98j896J135J582j217j209J073J522j118j625Q91J778j056
1734F22j391M28J934j239j102N21J641n37j584P77J008m76j477N46J589p34j431
1751i05N33J514o17j214L05J204kj598N00J290o57j225K98J417m16j209J2J687
1769I17j54j728M76R26J20j705L11J537m86j439j9K081l69j429L15J316j32j465
1787i27J95J731q02j271K13J508k40j539m6J727n52j234K42J760n38j361R1J669
1805F26j1j482l61J845J57j730r2J401K95j346l1J188J76j108n67J453J29r11
$$ y = [-736, -1091, -175, 1141, -63, -1030, -258, 983, 97, -1317, -199, 1022, -123, -1060, 215, 1068, 229, -1039, -275, 1336, 357, -1220, 19, 1222, 404, -1004, -233, 1454, 414, -919, -75, 1410, 642, -1101, -93, 1460, 762, -1134, 1, 1583, 366, -843, 230, 1752, 634, -991, -100, 1678, 622, -769, -341, 1593, 354, -748, -227, 1414, 877, -707, 70, 1078, 602, -875, -329, 1260, 526, -905, -372, 1142, 525, -689, -384, 820, 818, -780, -280, 1010, 353, -872, -574, 843, 427, -782, -770, 917, 763, -965, -489, 437, 557, -1148, -837, 700, 214, -1225, -1244, 837, 468, -961, -646, 670, 538, -927, -732, 999, 197, -1074, -861, 647, 407, -1132, -1178, 549, -3, -1237, -995, 765, 227, -1134, -1043, 626, 615, -867, -1228, 617, 774, -956, -1048, 353, 648, -698, -729, 459, 635, -473, -1040, 413, 542, -369]
1823c69n79J454O6r52o17J315L99j195j00J063M71j245k24R25N67j295n66J567
1841F85L17j247q04J699M17j246m49J398K47j176k04J119N40j264q27J090R20
1858A215j311o29J515K46j192n08J124N50j232n92J341K53p42n68Q39Q08r11j074
1876h68J046O74r31n16R09L06o68o77Q38R39j250p17Q85O58p75o03Q19O73q44
1895a02j049J057Q88q12q08P35Q16q13q11Q44N71m31j049O36Q58r68l47K29J357
1914H01n65j125N69Q35m16j315P02Q38l94j104P92P45m43p91M02R58n96p14M54
1933c67O57k76q84O98P74o07p37M47J100o39j086P46Q76n16p47L36P77l43p68
1952e59L80Q03o43p50O06Q44j99r42m8Q66J81j300N50Q20j05q83j23J060k91n90
$$ y = [-369, -948, 506, 572, -380, -997, 318, 717, -478, -578, 485, 956, -289, -513, 412, 979, -316, -882, 685, 1002, -245, -1049, 650, 1067, -179, -628, 770, 1017, -159, -363, 756, 1296, 32, -795, 295, 1215, -96, -725, 790, 1036, -156, -664, 460, 1010, -222, -814, 527, 780, 38, -530, 309, 1117, 206, -868, 178, 852, -79, -595, 314, 620, -48, -725, 113, 1052, -198, -915, -30, 628, -147, -750, 69, 742, -102, -1151, -94, 794, -18, -826, -91, 725, -88, -899, -55, 516, 85, -964, -328, 530, -438, -785, -556, 801, 236, -889, -320, 515, 99, -1216, -514, 324, -70, -1174, -382, 363, -80, -871, -469, 489, -107, -821, -367, 290, 14, -870, -172, 602, -5, -742, -295, 805, 166, -920, -174, 702, 186, -561, -225, 552, 209, -559, -179, 624, -19, -769, -163, 681, 482, -460, -508, 358, 539, -761, -211, 609, 504, -379, -502, 558, 267, -323]
1972c23p4J003j77p28J14R73k00r56N2Q72K39j108j87J171j11n50j54Q26L6r50
1992b32k8J019j77q80lR40r0o83r2P58K55j056J08P89J55j039j48J200j77r59
2012c40Q5N78M83j045PN07L52p40m10O91L8o65J09N85jl23k40L15N10p17k38R42
2034D83n38m22k67P06M87o69k09M75jn64l00N53O80p99k37P64J28l65q90Q56M26
2055B97o95l37N02N23p11n57R59O63n63m25L80pL4p88O92K99n88k02K71O58p05
2076c00m31M62O48k36o94M87M51l24k25N5P10p62j19K58O73j10q60O0Q40l46o89
2097d52L19Q08m68p42P59N9J04q51M66N92k80l61NQ81n95n34L33N93j20n55J79
2118A40M08l04n08N38L62j66q34J14R86l20p06J93N78N4o08r9O33Jp29K52P19
$$ y = [-323, -397, 606, 429, -299, -185, 788, 588, -368, -316, 556, 795, -313, -500, 671, 560, 10, -144, 682, 718, -232, -260, 759, 582, -298, -301, 639, 549, -134, -226, 532, 787, -269, -161, 628, 783, -256, -404, 796, 619, -340, -255, 323, 806, -239, -232, 275, 627, -113, -523, 168, 206, -459, -350, 235, 234, -89, -329, -14, 496, -221, -459, 483, -55, -477, -744, -38, 449, -220, -429, 46, 45, -519, -819, -266, 414, -385, -622, 142, 270, -95, -985, -129, 297, -398, -735, -233, 290, -421, -978, -19, 644, 81, -344, 36, 29, 63, -725, -33, 266, -322, -524, -253, 405, -300, -731, -269, 379, 143, -551, -64, 387, 63, -162, -107, 603, -159, -278, -20, 653, 543, -317, -257, 583, 237, -452, -133, 675, 207, -535, 224, 283, 387, -464, 2, 594, 314, -47, -42, 839, 244, -290, 43, 636, 516, -39, 140, 548, 244, -264, 274, 636, 470, -364, -250, 736, 416, -290, -97, 481, 535, -73, -172, 461, 462, -267, -15, 704]
2139G04k89o92K06Q01m09n58k4P17j05o13m45J185k42o30K62N82n3j021K68N32
2159A76K80r36J34O01N2p03KK80ql06l44P13M56p83q8P89j5o05J13J93j6n33L18
2182b30J98K73q88oQ32l01L3m60P11P7l95m91P50r4m04J8P20k35p62M74M81R0
2204C91n50k08L50L26o94K29K85J22o02r5L81K16l94J43L20J58l38l11M56K13
2224C98k77m98P94L0l64m11N48r7k91k46R06M5k89o93O16K35m92j17M14K46m39
2245A8j41N0R35p24k32L13L76n52j25M44J59o76j7O50Q6n15l73N60M18p58k77
2266c81P73J24n40j97K32L79l42l48P47Pm55j19J31K20m86M2L58M23q48j5K03
2287i2J77L4n47K97L15k42n57Q79M3l43k50K14L06l03k70J93M17k49m64K03M25
$$ y = [704, 415, -277, -71, 730, 321, -237, -261, 456, 351, -262, -707, 478, 236, -394, -132, 450, 397, -624, -356, 176, 456, -480, -346, 255, 307, -396, -394, -114, -122, -428, -772, -59, 397, -386, -474, 315, 300, -305, -192, 1, -15, -548, -230, -32, 241, -647, -653, 179, -122, -89, -549, 162, 239, -156, -647, 103, 9, -395, -377, 343, 108, -654, -180, 301, 391, -159, -367, -17, 309, -385, -156, 129, 251, -351, -446, -65, 151, -243, -100, 220, 378, 40, -271, 185, 398, 121, -377, 417, 447, 83, -328, 220, 123, -168, -414, 492, 537, 248, -445, 171, 406, -86, -203, 211, 457, 18, -123, -73, 862, 138, -94, 219, 595, 43, -82, 362, 521, -155, -172, 478, 564, 49, -324, 236, 654, -104, -381, 392, 516, -24, -221, 11, 390, 48, -300, 447, 454, -1, -120, 11, 231, -255, -213, 145, 568, -280, -295, -92, 85, 119, -428, -131, 184, -58, -615, 264, 307, -36, -286, -72, 234, -69, -339, -146, 271, 22, -442, -239, 186]
2308A86l16m14K44N83n96k17K42N12j91o46M31J76k08J8j87O98k76q42P23K78
2328A98j35l88MM27K2o52L63M66k57n9k57N67j35m15J86M42n28k03J35N65j24
2349B22o43M41J67q9k13O8M04m8m19M49o2p5k99j06O99j57p15L50M70j14j97j00
2371C3L19K79q00K57K73l52p1L85J22mn83JJ70J94m53L56J25Q3n11K43L39k28
2393A77n13K90J86M9n07J57O61l30k55l35O52j18j93l0J80K33n13m23O62J3k95
2414b52k96P09J56n38m18P35l1n06Q1L16K13n20l7N47N3o12o8N00K56l97r3K57
2436E5M3m77k12Q22l10k98J91R8O02o24k92O35ln15j91N35j2l96J77j43O81m04
2458c8n41Q76j39l40k11K97L00m84j58N12j56j03m48Q39J88o26k7N61L67q26j03
$$ y = [186, -130, -544, -300, 283, -313, -530, -288, 224, 33, -613, -182, -6, -214, -196, -383, 315, 39, -803, -80, 198, 63, -325, -321, 106, 128, -524, -161, 305, 48, -11, -268, 299, 164, -251, -65, 377, -151, -354, -219, 346, 222, -421, 20, 187, 98, -115, -47, 357, 309, -110, 339, 277, 202, -97, -203, 496, 339, -376, -26, 444, 330, 133, 33, 352, 631, -169, 88, 361, 9, -62, 323, 445, 441, -142, -141, 29, 223, -230, 126, 251, 334, -177, 66, 405, 177, -336, -46, 140, 189, -318, -161, 500, 170, -85, -420, 232, 114, -79, -109, 71, 304, -209, -632, 30, 43, -252, -548, 161, 317, -221, -639, 96, 65, -441, -360, -44, 169, -351, -388, 159, 212, -400, -468, 32, 288, -109, -202, 55, 98, -379, -591, 231, -79, -377, -186, -88, 514, -110, -402, 233, 230, -285, -476, 59, 47, -349, -172, -315, 366, -38, -579, 297, 158, -182, -393, -96, 204, -280, -438, 74, -82, -185, -633, 206, 394, -232, -259, 302, 669, -157, -260]
2479b60O5O14k89l07J55K25K07m82N6N02o67r2K08M0p5o5M21N7l61p9M10N62j158
2502c13L2N13l8O6l17O12k78k22l3k75N58k65l5k4K32n8k68K42L74j46n77R6M07
2525B83J9n32K25M90p07LJ59K25j54j12j7K21j69k96L11J0J68n03K73M20n51P0
2547a64K36m2l57Q0K79j92N2L2PK41k53l15N30J36j50k42p7K83k87J9k00O11m32
2570b05k0l9K55N7p01M26K69p3m45J76K40k9k69j08N27P5n77J22M80l14J85mN
2593C3L7j00N9O9J91o01J34M17m94K00kK61j62j60j19L43j64L6k43N14j51k22
2615a24m4M05j23l7k31N08K6o86j0L65o5R7j93M94J12l16j43L5R9p6l4K71j3l05
2639A2O1Q7nJ16j65r2J88j88l1p4M75n61K20o5L90m72j91N18K32m91m5K23j85
$$ y = [-260, -195, 419, 130, -177, -22, 203, 410, -72, -16, 486, -181, -273, -65, -25, -100, -165, 256, 313, -48, -127, 283, 845, -313, -281, 232, 194, 260, -57, 555, 277, 55, 22, -253, 305, 40, 5, -19, 213, 155, -113, 129, 503, 357, -220, -124, 283, 302, -230, -5, 485, -222, -219, -60, 165, 11, -101, -118, 103, -66, -362, -51, -41, 127, -376, -103, 317, -234, -164, 72, 30, -327, -247, 32, -160, -108, -76, -69, 172, -81, -396, 134, 270, 120, -122, -199, 84, -203, -184, -384, 227, -205, -225, -264, -9, 48, -653, -227, 42, -31, -476, -300, -60, -89, -358, -466, 61, 136, -441, -319, 161, -153, 32, 28, 33, 70, -30, 29, 98, 289, -312, -178, 239, -255, -55, -57, 204, 42, -118, -237, 106, -58, -22, -265, 249, 98, -124, -168, 237, 114, 77, -154, 354, 380, -306, -316, 49, -16, 81, -112, 382, 494, 178, 35, 70, 169, 93, 59, 330, 317, 12, 73, 160, 155, 271, 106, 14, 202, 14, -17, -91, 384, -177, 43, -22, 368, -104, -295, 223, 455, -36, -81, 142, -43]
2662d3O1m96M14M41m10l89M67J33k77l1L12Q3l75l24N38J8k30q0M58Q7n28j5K18
2685C2j7k55j37L83M58l69m61K35K22R5l54N7L32j78l44J07J64Qm13L18R7j59
2707a79j63K54K84k31K8N1j11N6k71L49mq0m11K56M71n45k09L85N0J08k02P1K62
2730B19j82p2L5L44n40J51K0Q5Q1k83J83J55l00j63M23J50j74l13M50r5q5J74
2752B63k63J46M3k3j72L92N7l83j50M95j11r3N2j97J78j42l58O18k18j54n5J75
2774A00J28l27l9K33K5k94N17j22nm7j58M44l32j53k61N22m6m88J27J72o4L58
2796B90k43J28n8n16K41M47l24k23K24M22l86j85j1l2M73k95l31L60LL2k88L37
2818F5j63J83l72LJ55p7L1N24l23K01l55L51j05n53M38l36N63k52l68J89P3j64
$$ y = [-43, 18, -478, -64, 377, -33, -422, 45, 178, -99, -130, 182, 265, -110, -434, 104, 122, -108, -188, 270, 357, -171, -186, 32, 15, -240, -377, 6, 464, 95, -366, -131, 91, 186, -168, -111, 221, 43, -301, -194, -30, -22, -435, -117, -20, -179, -342, -88, 196, -35, -7, 44, -67, -11, -282, 67, 63, -17, -428, -172, 299, -246, -455, -70, -20, 88, -114, -43, 219, 37, -35, 0, 344, -196, -45, -25, 60, 141, -142, 41, 196, -104, -267, 156, 306, 132, -181, 269, 174, 89, 263, 0, 146, 189, 166, -6, 386, 443, 60, -90, 405, 294, 201, 253, 56, 234, 92, -266, 352, 134, -20, -75, 100, 228, -99, -138, 95, 120, -174, 343, 221, 216, 169, 11, 455, 123, -30, -291, 231, 185, -303, -176, -4, -68, 290, 47, 175, 117, -399, -158, 289, -35, -258, -34, 388, 2, -183, -194, -226, 247, -48, -379, -19, -16, 16, -272, 65, -98, 85, -287, -284, -129, -206, -175, 349, 26, 227, -128, 223, 118, -435, 3, -333, 230, -22, -390, -201, -128, -292]
2840b92O4L45k3l75j16O53k72k58j2K28k3m9pK13K18j86l45K82J37m30L22j52
2862g8L45m18L35j18j16J84m14L10J33r0J0RJ10j2l41K03J73p2P9k99M56m37m4
2885i2L20J13n66K09J86J54k13k33K65j56j2j59J70L61Lk47L3j27K18n43N02q9
2907I7q3j08M0%J03l77K78K41K69r20O82k03l4k1l6M06n48R7L63n6l47LM6O33
2931E25n34k81L46K27j54l92j9L44l10Q1o3J11J31k60L11L2j0j27L0l6O1k52L6
2954b03L0K36k84K88K13o36OM47p2m03J99J91J38N7n05M08q1O4l10N0R3j11j7
2977b02j62L40Pj32n4M26k99o0k07M34Q3l98K45K75j64l98M68m85L66l54N8L17
2999A04O6j07l2R3k45K14k61M68k44jJ11K27n13K5J72n2pR1j42K7K55o22L27N6
$$ y = [-292, -228, 117, 94, -281, -397, 256, -16, -274, -286, -58, -81, -130, -137, 76, 294, 108, -237, 45, 182, -248, 74, -78, 267, -151, 184, 66, -50, 134, -280, 30, 163, 73, 83, 92, 202, 190, -151, 52, 225, 153, 232, -67, 389, -48, -92, 228, 341, -225, -16, 170, 324, 111, -122, 143, -13, -25, -184, -14, 347, 350, 103, 136, 9, 227, -316, 186, 97, 14, -94, -54, -54, 49, -328, -50, 191, 460, -460, 222, 19, -15, -36, -72, 334, -214, -117, 246, 190, -157, -154, -108, 525, -9, -290, 56, 283, 129, -263, -282, 62, -248, -167, -230, -119, 12, -248, 63, 95, 85, -42, -12, -48, 13, -239, -203, -173, 63, -221, 67, 280, -356, -350, 97, 25, -378, -179, 12, 150, 207, -298, 110, 29, 93, -217, -167, -74, -185, -202, -364, -24, -17, -149, -203, 223, -76, -136, -343, 91, 174, -224, 21, 296, 132, -266, 202, -283, 83, -271, -213, 104, 170, 63, 31, 124, -121, 93, -168, 300, 56, 55, 166, 393, -120, -95, 77, 25, 18, 109, -33, -6, 249, -373, -46, 10]
3023A0J76k08m2J06j6j80K46L6j59j83p8M96r6j05J00MJ86k53j44m2M51k79l1
3046eK16r3j6k19K84M6j22q4q8O5l98O04k14l3q8J30J75n8k06M5j01L69j9k17
3070b7l7k30n6M06P8j00j49K65l31J03j14K33M5j07K9k54K02j38J65J67j16j21
3092h7m3j27O22l56r2j05P8L01j82k10K79J42l00R1k6J46k07J75n2nK2k19N8k3
3116a20L25j74L0N7P7n61N32j53k20q2N48r7k70r5p3M11k27K04j84L34q7L3q1
3139A27m9Q0K3l71N16j78j57L17L9k16l64J71kJ29j64M98j27l8l20J98L55n07
3161d0J27r0K28j62k40J84J81q9k66N5L73rj24j32Q7J11j03m1l7L46p41L97j78
3184a63L12m63K76K54j99J41j13Kj22k48R0L08k56Nj4J78l72K74j34K87l6l24
$$ y = [10, 186, -22, -64, 42, 26, -154, 92, 128, -31, -214, -292, 204, 108, 3, 103, 107, 293, 40, -104, -146, 305, 26, -5, 211, 118, 102, -117, 167, 213, 91, 7, -81, -16, -414, 190, -24, -57, -145, -15, 160, 102, -104, -59, -160, 209, 190, -27, -64, -294, -350, 56, 134, 34, -115, 150, -181, -78, -192, 41, 86, -21, 8, -246, -44, -182, -17, 150, 34, -87, -130, -257, 365, 9, -83, -188, -110, 191, 9, -201, 78, 220, -80, 11, -15, 131, -76, 99, 47, 42, 64, -155, -97, -120, 205, 31, 61, 118, 195, -366, 166, 13, -207, -289, 259, 162, -108, -203, -276, 135, -92, 112, -72, 262, 175, 208, 127, 78, 158, 181, -190, 326, 148, -9, 308, 347, 131, -233, -62, -64, 65, -99, 399, 272, 234, -86, 112, 467, -40, 87, -3, 225, 63, -177, 7, 188, 99, -167, -112, 261, 252, 128, -4, 83, 194, 91, 50, 13, 359, -382, 15, -163, 149, -314, -38, 216, 17, 158, 45, 47, -75, -323, -233, 75, -181, -176, -190, -12, -384, -110, -244, 43, 7, -317]
3206c17M66j64j46K70L9P9k06r4NJ04j43j0j9K34Q8l11J53j32J71j63O1k91J37
3229a89J69q5P3L4K6Pn9j83L31N6m51L06j80K67j76Q9n2j74N9M48l40J94j56L32
3253C46j54o18L12L01k8n8N9j40k0q5L86k23l41n2L44j47K74l18J55J96k32J92
3275A49j07M3j54p5K76m4k3p0J4J35r9l2j29m3K37Kj30K35j78l2l0R4K52j92p1
3300B8L64m52k4j52L02N5l39K40o8j45M21l23J38K40k66j21k2K03n43O28n84P9
3322c41M16L1K99m79O3J3J66k19n1J1K15k15Q6l99K66n0n3Q8K3N8l86L91n4M6
3346g5J07n3J0%p1o8K7J56l18K06K74k04j52K39j32N9j40K81m7j71j58L97k1j9
3370A27k30O0K27J55j73k36K84NM7m06M34k92j50J95j45N8j90K34j33J97r8j33
$$ y = [-317, 149, -15, -161, 109, 148, 227, 21, -73, -68, 36, -107, -117, -136, 98, 186, -125, 28, -104, 67, -96, -35, -326, -189, -20, -105, -32, 2, 28, 35, -24, -207, 124, 180, -271, 35, -145, 122, -54, 35, -17, -191, -132, 316, -24, 170, 14, 346, 192, -426, -114, 187, 159, 101, 160, 20, 0, -85, 301, 78, -263, -315, 29, -118, 156, -162, -7, 189, -43, 149, 42, 85, -69, -144, 132, 88, 65, -5, 9, 144, 45, 13, -116, -159, 78, 80, -50, 185, 7, -25, -55, 39, 291, 99, 28, 392, -60, -84, -236, 66, 121, -218, 22, -46, -191, 230, -93, 45, 285, 19, -102, -124, 79, -464, 164, -420, -341, 75, 106, 405, -74, -11, 2, 168, -51, -102, -91, 124, -91, -5, -404, -138, -188, -241, -153, -130, -72, -458, -67, -121, -75, 32, -21, -11, -11, -82, -150, -123, 33, -285, -79, 195, -9, -161, 78, -54, 5, -135, 146, 99, -72, -230, 167, 146, 127, -103, -43, 184, 339, 166, -70, 214, 219, 266, -140, 294, 2, -148, 47, -98, -40, -230, 4, -129, 68, -30, -163]
3392a63L25k08j83k8K08L8K71j50j90K49p8j59J81k17J45P4k64P8J70q2J38p6
3414G9j41L15m61N59l96J01M2J17k51k3J47k07L74j05k41R0r4j68M54j47j88K34
3436I0l3l3j75Q8j84M12j4P5k45m9Q2m77K63M29k60R4o7P7j92k41L12k6j09oK45
3461E6L63p16J64r9K93P3l25J80Kj98JK8K31n3%o4l3J22k86K08j74L04K33l21
3485a1L35k68l7r0N5k52K13K5p9L77j35m6j4j99Q0J00l02J49KJ47Q4l93L12n04
3509d51M98o1O6q7J03j94LM19l5j43K2k50J38j03K84k96K82k54J65k31L84k49
3531A0Q1l71K87pJ59J47k98l7j63j3J02L20m23J29M91k90l67M13j13k27K35j11
3553d6O6l6K5L5k16LK58Rk20L23k63J76rK5l51M40N2k39J18j14K39l35k09k0L14
$$ y = [-163, 162, -46, -229, -257, -49, -11, 260, 110, -80, 169, 91, -68, 113, -104, 41, 115, -149, -71, 99, 17, 155, 79, -62, 253, -208, 351, -45, 56, 98, 215, -36, -59, 88, -119, 255, 150, -91, -1, -95, -263, 191, 44, -144, 90, 57, 24, -151, -63, -247, 165, 151, 226, -19, -68, 14, -463, -200, 229, -31, 63, -4, 73, -119, -360, -48, -74, -183, -189, 56, 419, -297, -133, -232, 61, 134, -191, -11, -9, -207, -206, -178, 53, 0, 0, -64, -97, 25, -261, -53, -227, 77, 310, -11, 324, 56, 19, -71, -16, -268, -55, -30, -109, 268, 133, 87, 73, -126, -46, 54, -248, -99, -97, 50, 134, -259, 53, -451, 47, -14, 52, -35, 68, -126, -123, 296, 261, 118, 140, -110, 28, -75, 209, -87, 195, -59, 106, -125, 259, 10, 91, -280, 7, 0, 159, 306, 8, -29, -192, -205, -103, 217, -206, -77, 414, 124, -243, 170, 57, -170, 65, -46, 20, -16, 9, 44, -172, -169, 89, 98, -122, 201, -62, 114, 105, 130, -221, 219, 271, 32, 150, 36, 275, -60, -269, -289, 25]
3578B5k7N6k39K35K3j00j8L22l36j34J41M6J52p3j72O6J9j49L16l69J24k7J43
3601B4K30l16l7K0N8j0k26M7L44l91J39jK07K64m99Q0J31k88O5J03R3k87J86L52
3625B88l5j4k72q8K82l56J74j04J47K0q1j59J94P2k00O9J81k88O0K59m1j8q3J61
3649A68j89L40j52m95M15J4M3j07j97J10K48m49N63k41l0K09r0j03l14L11j94
3670a40M24m25L65k38N6N5k36K98k1k49L49l18p2R8Q3L5r3MJ01J40k86p9K62n9
3694E4K79j04q4n5j48RJ94N5K17m16n0n4Pj28J98J33j24J08p7P1j71Q0j57K51
3718H8J23k30o9J98q6l1o4J90k72J04J3K44l23K54R3k67k40K72P0q1k29K15Q4
3741E6P6j95r7J58J60O3m34j4L04m12L34m8rK25l27j41N95k09j46j72m6L75N9
$$ y = [25, -2, 54, -185, 50, 73, -27, -45, 277, -59, -193, -52, -6, 146, 73, -99, -33, -14, -163, 153, -216, -92, -119, 24, 254, -62, -99, -79, -21, -31, -257, -210, 134, -257, -118, -119, 88, 352, -147, -67, 64, -224, -159, -56, 37, -250, -64, 288, 253, 239, -33, -121, 161, -195, -21, -125, 22, 42, -39, -198, -4, 68, -132, -63, 118, -170, -110, 149, 108, 90, 7, 168, -21, 319, 167, -328, 87, 101, 144, 37, -160, -50, 198, -251, 312, 71, 41, 250, 160, 57, -257, 54, -140, 284, -141, 224, -14, 42, 97, -139, 159, 138, -111, 238, -80, -152, -54, 29, 64, -29, -25, 76, 216, -70, -149, 113, 54, 333, 229, 145, 90, -58, -49, 145, 200, 417, 1, -49, -103, -96, -224, -26, 107, -17, 91, 14, 85, -86, -6, -163, 88, 211, -19, -88, 110, 24, -7, -71, 119, -153, -49, -36, 208, -115, 139, 232, -35, -275, -3, 67, -14, -243, -28, 56, 132, -63, -160, -2, 158, 221, -213, -227, 77, -335, -1, -49, -58, 167, -160, -301, 294, 85, -61, -233, -279, 96, 155]
3764A55l76L24j59j80M08j45K13j40q0LJ6l3k97J43L25k56R6k50K36M9j6q3n2
3787i9J94J61l49J87q5r4J24j48K28j0m09K59Q1n1K56j83mj74K58k1m6n3k73J98
3811e3Q4r3M6j29J91j6n8r0J28j20K18k28j00L03j11k3k47N42o98N03J59m31L90
3834A67j34L5p8J88m19K09K50j03k19j71P3J33j5m6K11l88K22K56k37K45j62j00
3856h3Q1J00Q7J1l58J98k14Q5j25L24N4j46j34N6r2L42k19m8J08k84j75L01J71
3879D0j63J54l19L69k44K91m27L17L1j10P1J48L7l12K07kJk7j3Q7j45J49K02l56
3903a4J53p6j38K7K06k19L34l19n7L2k35N39J76n62P0J53J7o6O0j97J83m0N5O1
3927A43k48J75O8n02P54k68l46J82K80N0k97J6O7l12J33L03K5j10l19J61K16j94
$$ y = [155, -221, 103, -56, -236, 172, 27, 240, 100, 20, 23, 39, 6, -291, -148, 177, -79, 17, -233, 3, 52, 36, -47, -99, 95, 256, -93, 94, 9, -85, 39, -109, 119, 109, -300, -41, 40, -11, 245, 62, 58, -116, 142, 121, 75, 22, -251, -53, 31, -62, -16, -145, 46, 30, -28, -118, 10, -110, 108, -120, -220, 83, -28, -51, -298, 244, -454, 49, 208, -223, 167, 33, 68, -10, 178, -241, -32, 218, 115, -104, -275, -202, -69, -84, -130, 81, -307, -85, 171, -66, 179, 17, -83, -2, 98, 185, 196, -162, 36, -178, -93, -218, 106, 160, 14, -120, -64, -156, 186, -33, -81, 27, -257, -432, -131, 40, -123, 31, -288, 81, -163, 128, -299, 18, 49, -61, 10, 158, 195, -117, 90, 88, 89, 62, 49, 136, -9, 140, 342, -14, 139, 63, -75, -48, 158, -61, 273, -46, -103, -71, -306, 233, 409, -153, -83, 70, 87, 21, 81, -116, 67, 27, 82, 143, -105, 70, 138, -364, 390, 122, -224, -42, 238, 288, -9, 7, 74, -238, -105, 198, 223, 113, -206, -45, 171, -23]
3949b3J8j3J0O1J54l16O3K74k82K72j39m2j73J71j19J66J8j96j3j27K93j51j55
3972b49J82j16M67l54M37k29l90M23k37j70M83k19J39m0J9l14K81l7l4Q0j42L7
3994A7L63n71L09k17J01q8K89l0p11M42o0K34j52k35N00k61J25J3k36n7k2K37
4016a0o0J45l91N08n24M13J01K2J93n06K87j80K61k16j11K46J10k44ql10K68K07
4038B01k10K21j51j83J56K5q4j85K56Q1K21m87Q9%J69l24L22K14k58j35J61k26
4060a27Q0Oj97Q7N5j04n9K39J53j33j42oK71j72k4K80j8j13l35L92k22Q7K20%
4084B18j93j27N0Rk4J72k09L04l56J32N4n5Pj28j61K51k79N85j18l53L47J82k07
4107A01j94R0J63m89L10K80j08l44N4J99j72J94j29o5L23k63LJ3R7M8k88j9p5
$$ y = [-23, -5, -18, -8, 53, 207, -109, -46, 228, -54, 218, 79, 37, -136, 35, -84, 82, 100, -96, -109, -236, 57, -94, -249, -67, -183, 284, -70, 367, 138, -252, 171, -66, -236, 247, 28, 167, 127, 146, -168, 113, 76, 42, 122, -20, 17, 380, -191, 118, -99, 2, -86, 203, 173, -538, -96, -156, 78, -74, -309, 191, -70, 55, 68, -168, -225, -247, -10, -70, 75, -316, 192, -332, 81, 182, 204, 397, -109, 178, -2, 259, 43, -68, 178, 288, 44, 36, -274, -6, 201, -9, 212, 61, -122, 34, 59, -25, -210, 46, 127, 348, -139, -50, -50, 119, -205, 117, 331, 73, -62, 99, -127, -47, -41, -238, -151, -96, -200, -259, -20, 133, 0, -142, -148, 123, -49, -73, 207, 189, 76, -259, 133, -89, -2, 218, 218, 25, -102, -52, -43, -67, 105, -104, 200, -156, -24, 30, -25, -18, -146, -307, -56, -335, 250, 132, -221, 126, 308, 101, -93, -3, 160, -329, -19, 261, 153, -191, -137, 62, -110, 84, -45, -110, 213, -50, -47, -34, 63, 111, -177, -196, -271]
4130b71L18j8J08N6k22M12k49O3r5k49L04m24L41k94M88l08j3J88%m32J31L76
4152B10l18O2J82N9l20L99n46L10M67n44J63j10L18l7l08J12J27m97L00k8J20
4173A21j77K29j59KM8k68P2l1K27K96k26O9J17m54K70j68L90j12m45L62k76J05
4195hk3m0L17q1j28L02l08N03l99o75N62l8k5J59j68p6J81j41J68L1J0j78K02
4218A47q1j11J16j33l9Q4l43M85R3l3j37m2k76J77l6R4J14j11K04k57K56k30N2
4241go8J02j8j28K84K9j73q7q9K38j52Q7l21N41l10k9Q5J41k40J81k0L7K07j84
4265A06J35j03k32J27Rl5j21j04L24J08l85K37J36l58K06m55K57J99j24r5L26
4286A58l6k04j34M41l28J44J32o4l67M35k81l65M58m0n6K38j16q3L0m1K99k55
$$ y = [-271, 47, 29, 137, 193, -29, 383, 134, 197, 102, -147, 157, -267, 74, -220, 268, -40, -53, 135, 135, -297, -166, 210, -108, -46, 136, 195, -125, 274, -272, 38, 505, -39, 124, 14, 332, 295, -13, 99, 226, -271, 29, 1, 121, -56, 173, 14, 16, 64, -204, -132, -163, 64, 360, 134, 203, 320, -134, 136, -32, 358, 246, -199, 163, -113, -8, -31, -71, 246, 165, 37, 339, 31, 534, 135, -540, 22, -16, -41, 118, -50, -126, 55, -86, 82, 113, 123, -55, 147, 66, -45, 71, -62, -101, -17, -360, 125, 218, 185, 48, 6, -270, -93, -129, -35, 79, -32, 172, -85, 171, -59, -7, -75, 27, 9, -119, 165, 194, 21, -66, -155, 83, -69, 18, -303, 238, -72, -101, -16, 125, -115, 66, 46, 83, 290, 106, 241, 138, -94, 33, 42, 7, -114, -218, 106, 214, -171, 66, 202, -156, 50, -405, -148, 51, -73, -168, 158, 122, -82, -216, 225, -103, 41, 173, 109, -258, 177, -104, -469, -11, -51, -107, 131, 15, -68, -38, -79, 220, -35]
4308c5J17j44M7K5j7QK19m75L30j0j43l2n4K81r2Oj3k55nL69K7m72J12L97p9j49
4334c7j66J17J73N5k64K44j25l0P8j03k2L98o11L22n4P2o3l1J15J18j04j07j41
4357a66L25j48J60j82pj13M69k59k50M9J32l91M45J27j27k77K6mL96k36J15K14
4379B98m22J24K1J96l52P8l0j7J78k81K04K00l37K60j83J77k38R6K42k01k52N34
4401B95p3q4j87q8L00j06Q5r0r2K85l52K20K52n66J46j42K92k4j42R0r9L75k98
4424cj76L55l28M5j47m0L55K8o4mJ07J04j45n7j53Kj43L83k35L87k59L5l1J49
4448A65O2J08l53l2p4QQ6J50n9m9k92J60R8O0K0k05J52R6ql66L89J27k55p5r2
4473a79K57M4R6l29Q1N3p3R0J09l88O9Q1J43l12M0L56m13L28j20Q5PM0P3l42J39
$$ y = [-35, 82, -62, -15, 10, -7, 1, 220, -255, 75, 65, -78, -110, -164, 117, 25, 31, 18, -237, -242, 127, 154, -318, -206, 191, 112, -37, -203, -86, 87, 142, -122, 122, -3, -33, 45, -58, -80, 318, -293, 29, -25, 47, -16, -47, 68, 186, 82, -25, -166, 159, 11, 171, -11, -18, -131, 338, 79, -171, -122, 10, -381, 64, 191, 64, -213, -187, -191, 205, -31, 84, 298, -124, 0, 21, 217, -135, -57, -87, -104, 74, -207, -3, 197, -140, 120, -63, 114, -124, -28, 214, 13, -239, 295, 222, 138, -49, -137, 163, 57, 142, 52, -40, 245, -107, 113, 365, -201, -55, -197, 95, 71, -71, 19, -80, 295, -3, -179, 176, -152, -107, -254, -294, 61, 89, 25, 21, 128, 232, 87, 30, -123, -121, -264, 119, -116, 271, 12, 47, 16, 165, 227, 335, -18, -50, -124, -116, -30, 120, 61, 12, -280, -120, -22, 38, 58, -147, 5, 101, 93, -273, 116, 243, -12, -87, -179, 78, 122, 218, -111, -30, 23, -50, 40, 149, -239, -170, -89, 54, -258, -218, 138, -275, 53, -67, 18, 25, 65, 138, -204, -65]
4498f5J79l35K80J89l52J57l34M45N5j69r3m8M03k74Ml00K74Qk45N2J19k02K66
4521A4j0J47k52N6r2K13j31J4M4j46n5L70K25l23j06K74ok79J14n0q3J36j33j02
4545a61J56R4K00k53K35J96n48k7J35k27J4J73p0J93J42q0k66J83l64J33K09J64
4567B31j26j75K1j21L02r9N2j6M4K4k0l2O9p3k1j15N2j59J63k22J37L06k40j7
4591c5j04j53L55Q1j48Jk06J68L10n01J96lq3K44n9k13K71j88jO0Q2j01l09K65
4615g1K59k18k25K36j6n0M31m49N3k08K41j48L77l52K39o66P17l24K14r2j19p7
4637b48J94J59k11k0J31K76j49M3k75R3K3K95k94o8L41n00K75k0l45K47j5q5K43
4660I0r8p8j2N7Q4j04Q6r5L1KJr1K51j65J91j36Q4l28K9K55k47P2K48l18K70r1
$$ y = [-65, 114, -221, 59, 248, -104, 53, -281, 164, 219, 50, -43, -91, 312, 38, 42, -258, 16, 24, -221, -169, -50, -252, 14, 4, 151, -101, -45, -137, 76, -55, -41, 3, -143, -198, 172, 397, 74, -32, 242, 236, -43, 71, 21, -62, 74, -59, -161, -5, 89, 289, 36, 271, 467, -81, -108, 27, -200, -186, -13, -83, 110, 252, 172, -94, 89, -275, -142, 67, 231, 105, -70, -49, -170, 132, 33, 85, 69, 113, 137, 117, 85, 154, 81, 60, -55, -3, -162, 1, -221, -84, 222, -18, -35, -139, -292, 63, 144, -4, -3, -209, -41, 269, -232, -36, -39, -122, 122, 63, -150, 121, -67, -68, -8, 74, -27, -336, -71, 188, -30, -255, -19, -35, -85, 346, -103, -50, -258, -17, -165, 212, -140, 99, -567, 150, -174, 40, -52, -171, -248, -54, 105, -106, -126, 5, 281, 132, 175, -100, -7, 16, 311, 17, -51, 290, -210, 65, 45, -300, -53, -68, -153, 90, -8, -86, -98, -41, 43, -61, 25, -70, -39, -37, -36, -127, 124, -41, 150, 14, 98, -230, -201, 54, -193, -121, 127, -191, 79, -12]
4686a2k65L84l59K71q9P7O7m66L72r6j68N32m93N40n3r4q3K13m09K35k23oK43
4709A18k82P0J5J91P6j5r1k65L65p6n2r3k96N28l88L05J84l88J77p8j24j05N32
4732C08j99l57M07m00K77J86k82k4R8J04J00k42Nj07J54O4q8j37NJ09R7p9j00
4755a01K37j13Q6j92K4K43p0l27J99p7Q7J87k57J10o7J75j59k26K83J6j09L3l29
4778c47K03P1L9J72M7k74L61j36l56K51kr8P5j35l2j23L31l17J62K33k07K75m27
4801b34J49J17k83L00l18M27j93j35L03j22r3K26m09J53L69m24r3K73j50L37j58
4822D2j69J47N7Q0p8n1J53l00L61j38m9k37K97k63J38J69p3k20L39l13J36K36
4844B64l51K64j74j51L38k7j57J54m69L64l9N0j70J58O2j69J7J11n31M65Lq9J58
$$ y = [-12, -277, 107, -252, 19, -70, 7, 74, -392, -20, -116, -284, 248, -245, 295, 242, 148, 65, 278, -131, 104, -119, -125, 118, -164, -94, -79, 112, 188, 173, 82, -183, 182, 106, 54, -39, -335, 193, -195, 110, 294, -94, 83, 5, -119, -224, 308, 109, -248, 159, -241, 36, 222, -60, -84, 14, 118, 218, -24, -19, -126, 28, 92, 4, -133, -128, -19, 78, -1, -101, 136, 23, 109, -83, -59, 184, 114, -213, -14, -91, -4, 183, -74, 36, -31, 144, -15, -241, 42, 58, -51, -18, -347, -144, -73, -34, 138, 185, -89, 272, 136, -220, 31, 29, -69, 6, -129, -161, -284, 47, -270, -108, 125, -82, 193, -234, -85, 32, -251, 49, -269, 158, -35, -170, 133, 11, -82, 144, -265, -112, 257, -167, -260, 13, -137, 200, 42, -127, 20, 77, 157, 79, 28, 181, -119, 242, 104, 55, -182, 115, -148, -10, 159, 86, -134, 205, -108, 28, 264, -87, 177, 3, -148, 190, 163, 6, 160, -309, 55, 16, 66, -104, 54, 116, -53, -36, 75, -456, 9, 12, -77, 81]
4867H1m0L93j76k40j15N0j41J96R1j94Q9J26l22K94r0L3j39j14M6K83r2k14J21
4890g4n3o2J14L05J29l54K0k92J39L07k78M48j25l02K57k52k05J17J87j84K94
4911A36k91K68R5m65J72l8r2J31j58K14L21j98oJ64n32L14M3K02j21j0j9J41m57
4934a86J40R1M2j30p0J20j66L23n9j39L0J2j77J85k33M41k48J90J72j57m17J75
4956f1j7j89M20j89j7O3J62Pj05k31K36j19L63k68j36L11l37j33N4J49L3m1j95
4979b40K50N1j88Q4J6j06L22P8l27L1j87M09j35n9qp9K52J72m97K55k06J48K1
5002E7l21M71o5k10K30l24r2L14L5j51Q7R1P8k44J5J19o7k51k5j7J32J86o1J33
5026A20q9J06j17k68K70L9l25L04P5p1Q1j53j5K38m0k18j88L46k64R3k1J36J7
$$ y = [81, 41, 434, 258, 18, -97, -47, -188, 8, 99, -95, -6, 120, -202, 92, 2, 35, -104, -218, -172, 111, 19, -195, -74, -127, -189, -75, 230, 359, 5, 25, -267, -128, 179, -99, 349, 224, -78, 179, -73, -278, -161, 26, -158, 136, -155, 113, 208, -257, -85, -123, -215, -84, -242, -28, 293, 95, 89, 253, -279, 35, 78, 280, 159, 149, 130, 271, -186, -46, 45, 87, -43, -113, 7, -159, 164, 105, -34, -4, 8, -169, 16, -217, 224, -24, 166, 338, 181, -236, -61, -78, -267, 153, -36, -53, 10, 172, 179, 74, -157, 79, -40, 323, 55, -81, 230, -107, -240, -186, -37, -4, -45, -240, 10, 61, -127, -43, -27, -133, 189, 267, -60, -29, -216, 193, 58, -1, -9, -88, 164, 336, -161, 94, -112, 36, 57, -264, 207, 142, -68, 162, -162, -254, 60, 95, -56, 31, 122, 200, -44, -29, 90, 23, -228, -253, -270, -138, 48, -13, 120, 31, 137, 20, -248, 22, 61, -264, 40, 115, 44, 125, -28, -43, 195, 155, -63, -251, 95, -169, -76, -97, 39, 56]
5049E6J1m23N60j33k22Q1q7L5m9J03j72J59j10K36j53J62j70J69k09K01l88L43
5071@J44n6J43k55mn3L19l06r8M49l50R9j39j4J37J54l39M0N3L39k80j75K88j30
5095c4q6L1m4m1L21J9p5l14M95k70J61K19n25K10J53k43j25M34m07J22J4o7J30
5118G8K36k37j62P6J06Jj58O6O8k43L47j2q8k06L00m42K56q0L73m99O6J18n5L86
5142B95p0k51J42j47n8J5j03O8K92l21P2L84j88j29oQ1r3k6N3k16k4L88j12M3
5166H9p9j06J61k13K68K0l41K57KJ37lk72N9o7K43k36K63q6K44k63k93K19j35
5189a32L3j28K14k7K57j35O9j5pQk07L02j69J48k42K19j25N4k14J95l49J89M68
5212D06k98K7L1l54L27j74K79p9n3J46m72n8L71Jk16L90j4l18j6k76K86J32JJ62
$$ y = [56, 67, -356, 204, 71, -151, -70, -157, -122, -171, -68, -240, -81, -191, 45, -108, 54, -116, 53, -156, 45, -343, 0, 144, 88, 231, -24, -28, -81, 238, -68, -166, 283, -67, 32, -107, -121, 16, 170, -169, -129, -76, 263, -17, -192, 96, -34, -120, -89, -133, -174, 147, 166, 91, -223, 272, 2, 163, 382, -143, 67, 220, -23, -148, 286, -121, 1, 15, -52, 78, 314, 77, -85, -9, 97, 98, -60, 6, 74, -169, 178, 166, 78, -128, 172, -270, -14, -94, 279, -220, -154, -36, -91, 295, 225, -26, 116, -31, -89, -74, -177, -109, 183, -138, -66, 318, 130, 1, -5, 76, -17, -43, 10, -206, -230, 158, 46, 89, 10, -96, 65, -148, 120, 140, -201, 56, 58, 195, 192, -80, -21, -88, 155, -81, 182, 96, 340, 77, -216, 3, -132, -99, -227, -13, -40, 217, 82, 151, 136, 129, 137, -70, 232, 63, 211, -31, 188, 63, 117, -97, 98, -251, -62, 406, 108, 135, 166, -188, 139, -35, 244, 165, 112, 258, -214, -272, 99, 100, -116, 274, 260, -58, -74, -350, -64, 68, 69, 231]
5236B31m29K45j27J61M7j00j02k7L6J16j8L4K03m1l2P2k78J5K9L9mM1p3L7j01
5261b6j01L69R4m37j56k6M16l37j22K64J48o6k04J94J60l17%N07n95M89o2K5l4
5284A83k68J15j06K16q9L6j00k2K37j71n6L84l45K9Q9L1n1k61K23k82K01j08K97
5307A82l54J03K68k29R2j13j06K36l6j10L32m55K24J86l67J26j48L77j57K32k46
5328C7R6k73K46J89l80K61k37L98j92r5j76J56R8j92j45K14j06l3L10k53L03j91
5350C5j70O1J36k27j45L57R0j84J2K15m08K31L85n46p7L64n4r5K78m28J45L52
5372C27l83j52J18J76n4j89k18M63J1j63L01j20m2J82k04O5j46K07k37N3q2K75
5394A88l08RJ23j96K39M8k57J30K2J5PJo6J84k73M5L67k07J72n00O7J83j56K35
$$ y = [231, -198, 47, -80, 81, 128, 28, -74, -101, -65, 51, 33, 67, 270, 229, 197, 269, -9, 6, 35, 74, 70, 111, 38, 75, -26, -127, 242, 336, -101, -257, -283, 133, -204, -326, -62, 86, 20, -184, 10, 170, -147, -147, 360, -235, 254, 192, 217, 183, -85, 30, -76, 140, 51, 87, -13, -35, 202, 31, -25, 359, 14, 43, 132, 163, 112, -149, 74, -208, -7, -115, 182, -172, -69, 199, -30, 62, -51, -157, 79, 43, -67, 265, -190, 34, 220, -147, -21, -169, 208, 51, 283, 37, 133, -140, 106, 295, -85, 176, -61, 337, 145, 50, -126, 30, 128, -64, -209, 5, -101, -134, 176, -77, 226, 35, -135, -74, 62, -165, -310, 47, 137, -47, -35, 180, -228, 3, 388, -158, -235, 129, 75, -20, 258, -170, -25, 327, -56, -208, -90, 86, 32, -157, -375, 88, 99, -64, 237, 117, 75, 257, 53, 118, -28, 179, -58, -5, -87, 188, -120, -111, 12, -184, 55, 103, -154, -24, -2, 13, 20, 21, -45, 139, -134, -89, 278, 71, 243, -257, -190, -7, -163, 72]
5418G2k34K67k04M0R2j26O7K63k78p4j32K94J68L1k7k1k67j34K18k38L50K58l40
5441D5j74K8o4K22l0J76l49L33j63M4k75K49J38l02K80j30P2k95O37m58k69L67
5463H2m7Mo3m7K18k00j30N5K47J14l49K30n4j8k44K48j8j72Q5k6K3P0J78n0l44
5488b08J54J53k76J13NP5L7J3o1j70K93j02K0k6kk03J04J74j85M95n04j43N29
5511B85l97O1R6j55j77K77J65j56j97K48k4K9j49l64M02K26r8j90J48J43K22k78
5533A17k74P9m5j35N42o18J20Q1O3j38K60r7M8R7l3j27J10Qr4K6J52k8o7P0K54
5558C71k64L7q6J20l31pJ33q4J93l26J45qQ9j05M51k64N2j40J31j59j71L71J9
5581A67j47k7j82l4L20Q3k8l17J87J11PQ9n21L41J7j72j59N47m17K25q1m9j82
$$ y = [72, -162, 105, -99, -59, 33, -93, -26, 237, -41, -115, -247, 47, 215, 246, 219, 198, -69, -203, 15, -223, 127, 385, 45, -129, -101, -165, 57, 27, 203, -146, 187, 24, 68, -207, 42, 180, -122, 158, 28, 100, -195, 442, -16, -285, 82, 35, 39, -24, -71, 147, -53, -183, -128, 119, 233, -116, 114, 60, 42, -202, 46, 28, -144, -59, -85, -62, 8, 186, 136, -208, -54, 99, -177, -64, -59, 16, 53, 66, 5, -165, 128, 26, 46, 20, 18, -185, -81, 93, -92, 403, -101, -244, 285, -112, -51, 45, -110, -287, -10, 155, -1, -198, 50, 26, 55, -94, -458, -56, 170, 72, -118, 30, 173, 395, 117, -157, -78, -123, -258, 284, -334, -214, -133, -70, -208, 52, -45, 3, 100, 67, -60, 50, 58, -36, -10, 142, 114, 47, 117, 371, 107, 144, 58, 178, -153, -160, -27, -111, 82, -244, -99, -107, -18, -123, 328, 64, 116, -24, 107, -52, -223, 148, 167, 20, -7, -189, -223, 97, 180, 152, -165, 22, 133, 140, 229, -292, 49, 66, -106, -265, 282, -135, 90, 9, -40, -222]
5604b22K92j97q9J83J33j65j98J90j80L09l49J16M43j03k73j00K71j87J60K7n21
5625d60J78L73J91l30k4J9k6R6j92Q1R3k3J30J3k23J05%%R0k64L11k98N7K31o8
5650F0j7pm9L64m25o3n9J17L05m77K46p5Q1j61J24j05P1R7o8o2J99J53o12O47
5674B84l77o6K25q6k6J69o1j38K97k04l5k0j04j47J80R1L1L1j52K55j42pJ20L
5698A21k15J78J17j04q0j3j71J15Q2j22k7r6K38k1k0QJ92Pk58J02j69J65K11j53
5722H7J3J2k33K81j06o5L93m81n2J14J2K89l16j79J74Q9j43M64k28j89K11K3m1
5745A29m41L60j26N2K52J17j24q0j50K38j88j12N4o4j96L8J4M0K94m62K96J95
5767A36j75J95j16J38O6j45k30j80J10K90K39k08mk96K11Kj73R8R8n7J07m3j30
$$ y = [-222, 70, -127, -216, -33, 100, -65, -263, -73, -253, 56, -293, -177, 266, 163, -110, -210, 61, -126, 34, 61, -460, -282, 91, 282, -48, -72, -53, -79, 17, -175, -94, -1, -24, 106, 119, -104, 1, 1, 1, 91, -173, 138, -160, -103, 128, 60, 43, 36, -13, 351, -74, -137, -196, -79, 226, -251, -5, -80, 1, -160, -36, -141, -70, 27, -41, -103, 96, 249, -363, 284, -93, -159, 66, -20, -46, 123, 62, -76, 221, 17, -18, -38, -142, -289, -109, -18, 13, 44, -108, 147, 5, -2, 118, 121, -94, 84, 201, 97, 17, 4, -167, -52, 30, -92, -119, -215, 23, 2, -18, -10, 182, 189, -69, 33, -136, 29, 240, 87, 100, 112, -121, 160, 54, -11, 382, -99, -151, -37, -25, 264, -52, -231, -57, 32, -111, 353, 125, -64, 147, 170, 129, -312, 48, -78, -26, 226, 343, 219, 139, -11, 227, 39, -73, -19, -83, -279, -241, -227, -187, 107, -355, -59, 136, -39, 156, 40, 178, 244, 99, -131, -311, -201, 89, 328, 120, 116, -180, 31, 33, -140, -42, 56, -1, 106, 63, -67]
5790f7M4J83l14J3K10k60o5J15J76rl2M7j16M8l4M7J01l48K05K73l40K77k14q6
5814a46K29o6J00j14K37m3k30K0K31k88L82m40R6kJ66j97P4K13l61J88k23J30
5836d4Q7q0J2k80O74n17RJ23K0M18k41k62J36N6l11K01l5L9Q7k62M07k61K75l04
5860e3j6n1K37j4k86P2J46q2J12Kp6l9m22N41k41J90jn0n8L1m1K50j70p6mL0J76
5887A07j61j56K84K01k47K0J02o0J5k69j01O07j49L3l07N4O0K16j68q2J15J10
5909B24n67K47J67j60J96k74P4J70K6%O1M9q8k78K21R6k12KJ67l37M72P7o20K00
5933h7j04n8P91l33j09J47l60o8J03Oj04J42l29N31K4Pj1j39j2K4r5N0K01n0l11
5958a44N30k48m0M5m51L97j80M5O1J87j09j73j56K96o3j96J82K15K7j02j2j87
$$ y = [-67, -23, 160, -154, -141, 69, -191, -256, -141, 35, 26, -6, 41, -75, -27, -61, -14, 87, -261, -56, 217, -123, 154, -60, -146, 83, 17, 117, 3, 240, 197, -33, -13, 218, -70, 312, -128, -32, -34, 132, -65, 9, 222, -139, 49, -174, -44, 43, -37, -25, -305, 369, -148, -139, -16, 4, 422, 181, -81, 55, 111, -200, 1, -34, 5, 92, -170, 237, -24, 251, -53, -69, -120, 117, 103, -183, -111, 35, -47, 65, 67, -9, -48, -470, 71, -170, 20, 19, -31, -89, -58, -99, 151, -19, -95, -99, -69, 107, -54, -210, 74, 275, 28, 48, 150, 90, 105, -164, -265, 342, 193, 226, -81, -27, 33, 249, 81, -1, 114, 224, -343, -96, 71, -89, 107, -167, -93, 77, 103, 103, 164, 213, 125, -153, 68, 164, -48, -46, 121, -216, 256, 333, -287, -87, -191, -249, 542, 209, 100, 247, -113, -181, -78, -72, -176, -34, -363, 168, 192, 199, 188, 49, 37, 61, -34, 16, 217, 167, -144, 386, 138, 98, 143, -308, 89, -91, -46, 15, 202, 93, -80, -236, 60, -3, -199, -17, 198, 225, 123, 111, -76]
5980g6L45j07j65J6J63j14j7l5k46K25R8j71k54M57k03J70j18m4J54j91K12j40
6002d1j87J5M38k35m0k36K21J60o6k42K42J49j05p2O0J16k78N5L09k09K54l94
6024h6K12l09J39n2m7K48l49K10J72K75m87J11N7k05K46k13R2J37k29J53k0j27
6046g2m7J5j3K78j56J42r9P4j38J27j40L10j36j25N1M5O7o4m00L41j3j08KK3n
6071d1k6l2K80m55K41MJ5j51L89j37q4o2K66l03J04l24M27l14l22O05k6o5J19
6094A08k77K65l0k92L02Kj34J88k57K36k04j8j02K37J9P8k80K18j10J12j1j11
6116f1K58j24Pj59R7P9K62l10m6j54N33o6m33L14j51J8r7J41p8r1k01J69q0L65
6140A92l67j08M74k02J90j32j94K71l5J5j90K94j96j21K78l67L11L3M5k60K68
$$ y = [-76, 269, 162, -3, 13, 176, 62, 45, 10, -236, -11, 87, -84, -338, 119, -84, 86, -32, -76, 78, -113, 99, -41, -228, -213, 225, -10, -50, -286, -65, 95, 29, -213, 29, 178, 73, 1, 61, 177, -101, -46, 263, 54, 308, -86, 126, -183, -44, -96, -143, 105, -244, -34, 138, 413, -74, 37, 94, -111, 135, -78, 14, 151, -78, 75, 55, -72, -119, -104, -117, 161, 5, 147, 48, 122, -16, 111, -29, 281, 145, 20, 71, 116, 183, 119, -281, 60, 47, -61, -59, -36, -41, -67, -99, 181, -274, -33, -29, -14, -165, 224, 87, 3, -59, 207, -96, 8, -316, 111, -203, -525, 80, 54, -11, 108, -169, 96, 66, -226, 76, 78, -56, 132, -125, 111, -93, -111, -213, 24, 43, 121, -159, 59, -51, 61, 50, -61, 197, 73, 80, -79, 18, 97, 359, 49, 3, -151, 382, 316, -117, 197, 46, 64, -33, 108, 30, -61, -262, -93, -173, 192, -175, -283, 191, -11, 179, 47, -147, 124, 89, 104, -86, 208, 12, -109, 169, -198, 113, 146, 191, -69, 199]
6161A99j23k0j28j40N06m22K48j42j1o3R2j56K50j33J78n1J22l08J28O8J04j68
6183C0K23l63K59j07N2M6j61J12J7O9l82L72k89J84k46R4L53k58K71l12N5Q6j38
6206c3J9J22k04nj42L71O4k28K01k99J94k06K33r8j16rM7o2k78P3M42N9l63M00
6230A82j91J0j07J77m1o42P51l45K23J18R5l70K61q3Q2J37k83N8J71m20r9L86
6252G0j55K75r9K23l18j55P4p9j56L1J41K02j26j0N9j4J26P9k68L92l73K90l5
6275A74j79J41nk20K49k27K2K21j78J78l20J81j9l3K18k47K13j7k03K75o3k72
6297a11J35j52l4J95j7j53J06J75l53K52L91k29m09M32m06O0k12L58M0Nk61K79
6319I1l05K89Q1m23M26j82p5M3K36j62q3q5J86j77K45j19k33L78l40J94j7J74
$$ y = [199, 76, 56, -72, -212, 294, -128, 120, -22, -33, -96, -4, -160, 90, -43, 135, 84, 206, -102, 26, 94, 198, 30, 253, -110, 149, 42, 94, 140, -21, 91, 108, 177, -205, 167, -122, 62, -184, -90, 263, 5, 276, -36, 19, 105, -33, -14, 108, -96, -101, -243, 128, 192, -36, 165, -134, 60, -146, 87, -11, -127, -136, -89, -151, -429, -356, 86, 145, -218, 182, -9, 1, -106, 71, 30, -612, 139, -206, 17, 135, 230, -140, 121, 38, 120, 257, -26, 32, 203, -217, -316, 70, -85, 190, 91, 314, -4, -159, -85, -164, -320, -289, -148, 54, -72, -82, -23, -37, 89, 168, -100, 292, -81, 209, 174, -5, 136, 131, -89, 160, -67, -45, 176, -2, 176, -144, 37, 18, -15, 203, -44, 169, 152, -51, 224, 161, -111, 24, -128, -162, 33, 16, -137, -31, 144, -209, 43, 434, 205, -204, 228, -178, -118, -330, 28, 68, 73, -188, 91, -214, 75, 156, -267, 159, -23, -98, -55, 181, 19, -64, -149, 37, -140, 105, -14, -247, 131, -209, -15, -32, 142]
6341A42o5j6P3l81K68J37j40O6K5M3J14j64l44K54P3k93K77j57J70P0l97M01N3
6364B09m02L54k59K02p0K0oN8P7k09K44o29L92J19k65N7Nj22L37m2k19L94m09
6387a64l6L4o6K30k64M54k82j2J71J48l69L39k64J75J27m2m34M04k99K09p4J91
6409A76Q6k19k53K89q6j02N1l3J19r7j7P2j04J86j92L23j38j49p2K25J5q8l4J31
6433H9N1l37L30k80k80L23L56k98K22P5l81mJ66m1J12j81L03m85M0K30K16m95
6455b69P7L66l24l29N85n1j16J55n4k09M6P8n8K13j38L72l59J54k5m0l43J52P6
6478d1J27j10j14R4J35j25j59L43j71j49k4N6K95j0q3k2k83J80n9J61j82p6L08
6501I1k09J50j58J48j09J18J01j3j93J68j46q7L33j23j37J90k67p6K78k73J27
$$ y = [142, 77, 61, 134, -247, 21, 158, 18, 84, 109, 152, 266, 102, -242, 12, 85, -208, 69, -88, 82, 152, -245, 156, 209, -193, 161, -98, 104, 34, 54, 48, 106, 183, -26, 218, -411, -19, 100, -165, -108, -103, -225, 112, 70, -149, 245, -164, -200, -166, -232, -2, -266, 188, -94, -106, 65, 213, -156, 183, -81, 94, 221, 179, -255, 149, -150, 59, -15, 176, 262, 43, -210, 79, -7, -109, -58, -91, 28, -69, -86, -14, -118, 68, -124, 199, 61, -88, -160, 65, 80, -8, -42, 89, 140, -197, 133, -147, -427, -104, 252, -46, 176, 251, -130, -134, 32, -9, 103, -78, 225, -260, -220, 10, 226, -269, -192, 174, -150, -479, 106, 55, -61, 94, 40, -169, -123, -45, -103, 110, -28, 344, -15, 139, 114, 74, -269, -117, -41, 86, -24, -138, -44, 91, -34, -193, 150, -21, -170, -194, -138, 157, 147, 64, 42, -241, -61, -120, 41, -141, -217, 91, -118, 32, -126, 22, -87, 31, 132, 119, -74, 94, -52, -139, 194, 71, -66, 124, -143, -219, 59, -214, -87]
6522h7J88k70NK07r9J39n5J76m2m52m8N63m28L13m17O7J92r0J79k09K64j06J25
6545A15j17K81j80k12J9O4P9Jk13L65l6r5j24q9J08j47L18r2l93K65k06K40L57
6568C08n15Q3j05J85J26k09J30j53J71%J5J4m7lr7o9O2O0P0K89j84j8j48K01M6
6593B12j20j23l4L32N1o14J81L2K50j56j42M30n00M55k17n6K17k57j90L44j10
6614a5jR5j17K80l78R6m7q2K60M3n4l0M2n2l52%M47k05LJ29P3j48ol1KN32n96
6641a12p8M19m53L54j78j7j35Q5K48q6L8k52K30J51R0n53K22P8J26j46Q2o9R3
6664A37k05j41R2o9l00M33j0J28j93K47j63r8K39j99JR3j30L17j60n0Mj04J60
6687B9j40J52L20m45M9L3R7j25P1Rj78K90m17L46j62O1j53K10L1k71J98J90j18
$$ y = [-87, 101, -169, -164, 43, -56, 83, 28, 204, 162, -290, -338, 225, -203, 110, -307, -240, -48, -138, 41, -168, 96, -10, 115, -2, 279, 99, -113, -94, -30, 49, 50, -163, 202, 166, 71, -53, -142, -34, -181, 137, 45, -348, -83, -289, -49, 308, -207, -124, -229, -44, 82, -127, 3, -150, 21, 21, 36, 50, 3, 0, -97, -166, -104, -44, 26, 315, 131, 113, -35, 166, 212, 92, -31, -65, 267, 318, -296, -115, -83, 167, 11, -131, 299, -201, 254, 37, -19, 198, -59, -249, 95, -15, -16, 79, -38, 242, -136, -40, -87, -169, 91, 134, 80, 50, 92, 40, -312, -312, 135, -70, -67, 62, 135, -13, -19, -50, -48, 484, -112, -190, 229, -224, 130, -48, -65, -200, -115, 133, 47, 85, -167, 63, 214, 304, -249, -27, 51, 177, 31, 113, 44, 137, -68, -209, -117, -186, -486, -53, -63, 65, -128, 119, -44, -142, 97, -102, -101, -8, -138, 179, 19, -31, -27, -131, 29, -111, 41, 361, -84, -35, -2, 95, -30, 41, 50, -128, 162, -255, 91, -71, -10, -163, 47, 78, -193, 5, 195, 77]
6710G7q5j99J83p6J7p1J55Qo9mNL27l65l7K39k47K91j22K33j7k4m6j35J81o42
6735d23M16Kl0Q0L02j76j42l48K46Q2R6p3l2J51j12k11J28R8k32J50m1Q6N2j58
6759h9j45R4L32k70J92k31L89m90K02K6p3Q5n3j36k10M67rj60K88j77K98k07j39
6782a6k08o8L49p5j02K62j17k98N8L39r3o0j97J06rM16l85J07j42J42J80Pj48
6805D8Q1j05J41k36j7j25K48j10J92l90K04J92o3Q9j89k8O4j95K3J04K62j45j99
6828a54J68j2J31Nk90K5K55J62l82K97q3l89L41J2k23j85J90K29j51k6K13q7L8
6851H4J54j39N4k7k27o2J27k78K15M8j73J60k6J24K3p5l1L55l71J46j66J45r5
6874c5K29l05JK35m03N01k55O8n0J21j62J29j61J11P3J7j03j62K45k28K04k3L3
$$ y = [77, -8, -207, -24, -100, -83, -154, 1, 9, -60, -64, -59, 268, -97, -134, 105, -142, 149, 27, 260, 243, 219, 173, 38, 219, -423, -7, -5, -35, 45, 347, 171, 29, -319, -73, 9, 105, 32, 0, 151, 39, -172, -44, 54, -178, -28, -69, 17, 69, -89, -234, -140, 192, -78, 114, -117, 272, -218, -16, 10, -63, 22, -31, -167, -377, 90, 81, -79, 209, 32, 330, 123, -16, -224, -292, 57, -18, -120, 142, 25, -273, -215, 124, 31, -29, -226, -120, -129, 287, -98, 9, -133, 9, 189, 196, 48, 129, 24, 165, -71, -88, -213, 35, -75, 117, -273, -69, 123, 60, 149, -40, -68, -4, -199, -176, -72, 190, 45, -154, 14, 2, 133, 138, -152, -127, 128, 290, -92, 205, 122, -267, 74, 86, -137, -322, -132, 97, -54, -80, 133, 46, 84, 238, 99, 153, 126, -101, -163, -36, -314, -99, -51, -224, -64, -90, 34, 57, -18, -49, 306, -65, 81, -85, 60, -35, 194, -111, -110, 125, -278, 223, -32, 36, -14, 107, -55, 74, -87, 24, 97, 114, 11, -151, 94, -134, 70, 47, 80]
6897H0j06R5O0l85L13N9j02j56L65k61m2L18m22n9K07K84l66j45M02m86N21l63
6919a89M6J78R1l07M82j31j31J8J10Q0k56o8N0l2L74m05K48k04R1L9o5r8K87j30
6943G8k79L49k24j29L02n53M9M93j29Q3j83J01J04j3o9J78k52K76j3L6l29M42
6965C18l76k8K15n8r5r3j21L21j89P7m0L20k33R1k18lJ07j01J4L12m83L91j38
6988a0j99K60ok08K72J83n74K42J3p1k8J46J39j32r1n4J97j12k09P2R8P5l7J10
7012G6N1Oj01L08k72j08K12j46k90N0L06j93j28K39Qk5r0J44L7l47K97K13l21
7035g4M9j92Q3L43n04O76j68j38k8L5Qr6Qj13k02J77J46oP1j79L2N4j05J67p4
7060c0J02j08O7k58J00J58J98j85P6Q5l18J13Q4j46J97m5k68L52j97K01j16k26
$$ y = [80, -26, 69, 129, -256, 57, 116, 14, -142, 223, -38, -80, 238, -184, -243, -36, 248, -118, -263, 139, -347, 174, -189, -143, 35, 126, -181, 301, 170, 39, 57, 167, 247, -9, -77, -27, -59, 315, -90, 158, -46, 45, 84, 19, -79, 208, 78, -201, 148, -76, -205, 97, -456, -407, 86, -43, 40, -143, -42, 62, 49, -20, 158, -94, 182, 169, 205, -124, 318, -58, -86, 129, 71, -24, -117, -238, 83, -106, -29, -69, 251, 18, 109, -109, -112, -5, -106, -92, 220, -263, 128, -10, -209, 51, 45, -163, 109, 292, -282, -40, -27, -98, -126, 20, 159, 27, -64, -118, 79, -33, -242, -170, -72, 3, -34, 76, 127, 133, 32, 340, 68, -40, 172, 26, -264, -214, 92, -101, -229, 10, 18, -7, -97, 47, 84, -263, 34, 247, -74, -25, -217, -134, 209, -295, 381, 213, 75, 47, 82, 90, -6, 2, -111, -313, -136, 10, 4, 75, -104, -72, -18, -123, 44, -30, 72, -36, 31, -227, -127, 31, 229, 44, 120, 205, -113, 0, 84, -62, 135, 90, -178, 174, -23, 178, 62, -164]
7082a64J90j75O5O2N4m5p6K62j54j87q2J23J95j33J83Pl3j18k02L18K8nk62K42
7106I3mj9P6J12k26j43K36J19N1k67j39J57K17l45j71M27j35J26N2l89J14p9K28
7129I1j32NK06k61qK47k14n7K48L0l4l52N5R9K92p4J11j67k74K56j7j60jK65l54
7154b00J65j33L92m35L28O8l07J62j35L25j14j66L08l74R7j9O5J96m32k9J3j22
7176c47N11l25K12J15j74J91j9m01L98J28l62K32M5j93n3J51O8m00K62k58J10
7197a09J83K3k41L43j85J09j37j78K98l22M53j83k6J15r5m8L24j23k00j6r7L22
7219B10l81K93j86R7K37j23j09J70j92k06K21p2k2M1Q0k09j7Np7K74j26l60K68
7242a84K04k18L59k78Q9o0P3k54O2M9K84j67K6K91n46L13M6M4JQ7k37K09j26l0
$$ y = [-164, 26, -149, -84, -22, 32, -13, -89, 173, 19, -168, -250, -127, 68, -65, 118, 125, 92, -26, -228, 90, 118, 113, -149, 93, 89, 70, 146, 258, 32, -111, 125, 244, 295, 28, -111, 46, 263, -82, -253, 174, 39, 165, 217, -172, -58, -137, 91, -41, -36, 170, -91, -99, 148, -66, -123, 125, 155, 121, -231, -176, -77, 215, 141, 252, 85, -189, 67, 50, -110, -111, 154, -200, -35, -168, 224, -211, 117, 185, -122, 40, -95, 230, 116, -50, 258, -116, -19, -38, 27, 223, -209, -238, -225, -347, 164, -161, 51, 166, -8, 183, 164, -237, 161, 289, -73, 159, 204, 11, -42, 109, 177, -223, 39, -219, -109, 74, 97, -144, 199, 14, 123, -14, -192, 106, -216, 237, 54, 28, 143, 48, 0, 324, 201, 1, -15, -112, 210, -171, 122, -64, 33, 270, 147, 38, 208, 16, -190, 31, -41, -63, -22, 58, -151, -168, -163, -240, 34, -92, -452, -184, 20, -198, 161, -117, -28, -88, -15, -269, -207, -158, 126, -41, -15, 276, -270, 43, 89, 133, 134, 221, -16, 193, 67, 37]
7266C7j43k1K75r7o6o7J58m65J93L2J49J47k98P7L8K59k90J99j85l8K18k64O6
7289h6L1J19J87j03l64K81O6r6k45Q3K19k8J26j68l00L02R8kL0j03l2k27K93k26
7313a45Q7J55J83j09k45M03m88K49n4j59J10R7j39K85J0j85Ol36K2N7M5J10q5
7336a26M9O6qO4R1r8m4P6J15j88J41j68qJ44P1k86o6O8J47j40P6R4k12P9J31m12
7362c44K82J69J6P5m75L29m1m8k00K25L83k82J18q0l99J35J25Q3k10K46k36J00
7384b9J50m01L79n0m5m4k20L90K74k27j19O4N1j48P0l70N34j20J12m11j70K18
7406a12J98J69k28J44l42K56J20k24l8K53J00k30J6j6J39l79K25k16M73k02j67
7427f1P7J6m27K70P7m7M67k85o7J51q1o6L7P8k6j42K03lj95p7K23k73q9K1r5L91
$$ y = [37, -106, -127, 148, 51, -15, -82, 76, -389, -196, -164, -15, 132, -166, -89, -51, 208, -82, 117, -68, -106, 112, -152, -86, -55, 64, 251, 148, -216, 65, 131, 35, -210, -127, 92, 64, 190, 22, -278, 24, 122, 120, 150, 47, 15, -212, 81, -145, -58, 97, 280, 171, -74, 329, -159, 90, 36, -123, -13, 84, -55, 230, 240, 55, 61, -275, -253, -196, -151, -41, -126, -77, -11, -19, 45, 136, 38, -6, 70, 185, -3, 138, -30, -38, 106, 177, -109, -175, -107, 40, -100, -24, 70, -142, -63, 68, -344, -62, 107, 123, 198, -277, 52, 11, -37, -237, -12, 371, 89, 207, 127, -272, -137, -12, 71, -139, 107, -129, -29, 121, -280, 99, 49, 4, -40, -260, 130, 404, 177, 58, 122, 173, 25, 95, -275, 259, 139, 251, -160, -330, -112, 86, 255, 27, 171, -171, 85, 205, -19, -57, 196, 296, 66, 82, 66, 205, -174, 51, -165, 308, 106, -61, 16, 32, -395, -125, -48, -95, 372, 87, 20, 171, 90, 24, 61, 139, 113, -29, 174, 171, -24, -101, 122, -151, -240, -219, -314, 77]
7453G7Om9k06M81n83J23K5Q5K58n01J50M9j28J70J0J09J2l20L1J79J17j8J58k04
7477C1P0K08j84k07N27k67n71M26j51K37J3r7K61m26J89q6r9j08K67J73m63L00
7499D3P4k7q6j06l2N6J53J64k36j37K67n8n7R9J04l00J06k5j59k7N54m13l52N92
7523A97k63R4o7m5K02J77l05j48J14j70K03m1R0P8l51K95J43n04lN92l26m1k08
7546b87L30K9P7M0k91J50j1o7m7R7J9k66N0M12k34J88j66m8J62j33L36l25K1l61
7570c25L12P8J40j83J77m94M04l13J58M3L7J52j48j36K74j62j90L2J20K4j3J01
7592H8j71L79m02M28l51p5L62j68j52l19L04N9j42J55on9k40K74k35K70rK59m54
7615b05L95n3J93n01J26j7K87l48L20m09J34r8L12J10l00J27N4k26R4L51o20L83
$$ y = [77, 83, 34, -172, 309, -274, -151, -126, -41, 217, -284, -134, -85, -213, -43, -33, 76, 88, -232, -201, -22, 95, 77, 235, 31, 101, 309, 125, -82, 445, 178, -393, 33, -118, 119, 132, 35, 296, -130, 59, -27, -126, -234, 33, 206, -257, 43, 117, 90, 4, -102, -134, -78, 75, 239, 3, -134, 133, 75, 18, 117, 221, -79, 27, 2, -157, -184, 370, -43, -395, 197, -66, 28, -39, -84, 118, 295, -10, -158, -44, -214, -11, -52, 38, 116, -235, 60, 203, -301, -304, 288, -38, -79, -287, 43, 72, 149, 189, -102, 48, 37, -30, -77, 20, 39, -227, -177, 235, 1, 189, 23, -25, 137, 4, 340, 15, 36, -325, -13, 65, 205, 22, 199, -295, 109, -204, -46, -3, 34, 186, 38, -98, 176, 14, -176, -144, -24, 0, -13, 88, -83, 296, -106, 322, -29, -104, 258, 90, -62, -381, -77, -18, -160, -5, -11, -70, -310, -36, -271, -1, -10, 249, -205, 190, 137, 330, -171, -45, -62, 225, -123, 197, -212, -78, -176, 136, 246, -54, 73, 127, -99, -5, 346, -274, 109]
7637A09J39m14J39L5K90k32l95K58J48j69j21K53K01j55n9l08L18r2m6K15L8j11
7659D1o2J63J64k15k6p8J05j91M6LJ88l49M25j79n3J97J45n25J37J90J10o6n8
7682A12J58k0k4l2O2j87J17j40R7l58K96J5p5P6j56o2K93l58N28k96j71K13J55
7705B43l52N8R5J99k69J33P3j03j82J30%k1M1l00O40l55PJ22n4o8k78L35j05j0
7729b1J8K02k14L25k70M9j94K08O7k28p2J93J1k13N03o25J24p6N38j10o1j97Q
7752c5J3O4K1j94K55l31K04m6oJ85j41j26K08j73J43k19K82m26M17k9o6l02M48
7775A46p3Nq1K87m08k38K50K62n07M11k01R6L11m58K55K59k17j03J27n2K91o14
7797b52K57M7K06l12p6L0m81O01m2k39K94k94O75k72l8j09n3k88M98l07J74K33
$$ y = [109, 248, -166, -27, 8, 298, 66, -329, -71, 77, -92, -213, 40, 241, 86, 27, -281, 37, -55, -101, 114, 152, 41, -21, 142, 306, 91, 65, -13, 92, -99, -53, -50, 138, -211, 214, 35, -18, 179, 324, -201, -64, 126, 236, 170, 112, 270, 250, 226, 194, 256, 69, 186, 46, 143, -215, 81, 96, 21, 97, -59, -121, 172, -186, 342, 46, -125, 88, 243, -109, -51, 44, 243, -26, 107, 180, 77, -105, 25, 25, 4, 45, -255, 385, 30, 37, 159, 105, 37, -241, 94, -11, -21, -3, 199, -15, 310, 40, 89, -105, 103, 170, -58, -130, 63, 74, -139, 364, -261, -137, -213, 325, 215, 154, -43, -35, -22, 42, 63, -131, 124, -207, -3, -49, -55, 130, -11, -137, 71, -102, 41, -178, 104, -322, 95, 66, 0, -302, 146, 73, 78, -3, 284, -124, -362, -112, 150, -357, 54, -147, -51, 260, -198, 57, 316, 99, -4, 123, 71, 362, -252, 5, 52, 258, -54, -130, -100, -581, 20, -22, -261, 33, -261, 414, 142, 104, -5, -58, -346, 152, -155, 19, 252]
7819B52n4l1j04o0P2r2j18M2N54n84q5QR6Q0nJ60k69M37j79l95L84k75j23L63
7843G4j98J72o7o3M4j95K26K66j22j71J5K30n45M75k25L51k00O3k9j78l1O5r5
7866a38j11M52l6r8N6q1K77k28j35J03j05m7J93k55K63P3k09%p9k4K46j93J78
7889A02k47K13m1k10Q2J27K00l26Q2k4k2J09j52K14j38J71M4l87O5J52R6%K8j36
7913Bj35j14P2L85j57j59M3N9j47L14j85J87j15P3k43P0k03J86K83m24M7K33J85
7936B57o55M71p1J40Pll37K31N1Q8j96k45L21k85J36k8p6K89k09j54P6J38J18
7959F4k79K6L22J33j79j00O0j45n0Q1J88m4j48p2J99j54L51k75K67m37J92L93
7981C93l09j43K92l13L9L8l04K45Q1k01K86N8j83L44j76k4l10K96k55n4K81r3
$$ y = [252, 198, 167, 63, 3, 75, -17, -135, -93, 461, -123, -208, -200, -104, -24, -29, 131, -138, 299, 120, -275, 109, -166, -289, 74, -124, 48, -19, -82, -38, -233, -7, 259, 137, -34, -19, 211, -334, 141, -84, 267, 67, 130, 101, -77, -108, -43, -138, -249, 203, 167, 69, 125, 44, 321, 93, -42, 61, -44, -91, 102, -153, 110, 183, -26, -26, -105, -129, 117, -76, 102, -145, 68, 27, -183, -101, 26, 226, -100, -18, -42, -64, 45, -107, 107, -31, 140, 184, -203, -138, 14, 110, 110, 138, 2, -133, -247, -175, 210, 53, -106, -63, -4, -151, 163, -22, 165, 50, 123, -120, -50, -253, -67, 216, -208, -161, 72, 257, -398, 73, 2, 142, 149, 146, -191, 40, 91, 179, -17, -262, 59, -226, -90, -118, -194, 95, -114, -268, -192, -54, 64, -215, -189, 133, 266, 87, -13, 47, -98, -148, -67, 121, 77, -71, -143, 56, -98, 253, -22, 245, -192, 0, 393, 84, -59, 233, -80, -41, -3, -307, -62, 19, -182, 104, 162, -21, 323, 147, 123, -187, 109, -146, -200, 81, -12]
8003a2l6L00l90J52K71m06M5J27k04J19m6j8jJ99k83l9L85l97J26J82j65K16k04
8026g9j38L20n4j32K9K21p9M6k64J49l0J35k5M1r1j77M8J70k87J17o9j42J91j00
8050b00K64J8j29o5R7r5p6nL99k96N27n39K76o6M6j24J2J19P4o12K92pJ09K30
8074B49l19qq1J57J26ql57K23k57M27j41K73l41Q0q3M07j99r1Q9l6j55j3N1j58
8098a65J76J11l3lj26j62K68n7J64k9l0r7k13L46j89J04j06P2j60K82j17q7p7
8121a28k44N06k0j07%K0n50K80K07j4Q9o0K02m72K35P4j36M36m61K74R0j89L27
8144C59o51K50K47j81j65O8PJ26k07J53j64P4K24k08j4M3J8j50M74j25k93K80
8166A65k58J91J07l43L12l03m04M95K5J70j7l25K05k27J35P1m2m00M96J32l43
$$ y = [-12, -48, 252, -138, 14, 285, -121, -76, 51, -153, -34, -80, -98, -99, 100, -183, -222, 163, -234, -108, 74, -91, 125, -79, -217, 103, 49, -83, -54, 167, 88, 134, -130, 19, -11, 124, 99, 140, 49, -128, -80, 90, -197, -80, -149, -291, -100, -200, 64, 82, -47, -112, -15, -110, -186, -191, 208, -88, 439, -100, 176, 110, 156, 32, 44, 163, 237, -375, -83, -90, 19, 249, -70, -78, -159, -2, 124, 116, -241, -18, -275, 152, 11, 284, -57, 23, -60, 347, 148, 57, 146, 110, -45, -58, -7, -165, 11, 122, 89, 86, -40, -202, 66, 9, 173, 144, 114, 17, -196, 150, -39, 65, -41, 31, -129, 153, 36, -51, -128, -372, 134, 114, 7, 7, 27, -523, -243, -36, -50, 39, -21, 181, -291, -56, 18, -118, 318, -143, 131, 221, 32, 359, -292, -42, 205, 24, -141, -73, -66, 60, -147, 6, -158, -84, 140, -68, -82, -39, -21, -171, 303, 178, -115, 165, -93, 98, 205, -138, 174, -129, -533, -38, -13, 157, 140, -185, 20, -207, -72, -1, -43, -443, 53, 185, -158]
8187a58K45p6P9m21
$$ y = [-158, 87, 11, 90, -331]
8191c31
$$ Imaginary data points
##PAGE= N=2
##DATA TABLE= (X++(I..I)), XYDATA
0@%%%%%%%Qj6J6j6K3l1L2l8M6n6O4p2Q8j04J20j40J64j88K14k44K78l17L57m00
31b12M49n05N65o29P02p82Q67r60J065j178J302j442J599j772J964k184K435k721
49a437L055l452L931m520N263o240P587r566J2756j8728L3571j33826k15483L69688
63D2599J71079k96054j57629K91526J27326k62109j22365K47502J06798k07142
73e8469p9402K06413N4361k18115p0045K17581Q8487j83457q2377J65093O3783
84A03853j60802o1207J56376O6074j34415n7771J20110L8293j33030m4241J52590
95D5830P9890j41746j06765J23018J16529j16077j26580J16927J46239j04856
105C2409j58836P7956J42813p3191j21340R1130J25237j00717j38086R3717J40679
$$ y = [0, 0, 0, 0, 0, 0, 0, 0, 8, -8, 8, -8, 15, -16, 16, -22, 24, -32, 32, -40, 48, -56, 64, -76, 88, -100, 114, -130, 148, -169, 188, -212, 237, -268, 297, -332, 370, -412, 455, -505, 560, -618, 684, -758, 841, -931, 1033, -1151, 1284, -1437, 1618, -1834, 2097, -2423, 2840, -3400, 4187, -5379, 7377, -11351, 22220, -111606, -327089, 42599, 213678, -82376, -240005, 51521, 178847, -83262, -205627, 41875, 148673, -58469, -137871, 68542, 122903, -95212, -165257, 52324, 140811, -42646, -125023, 40070, 103853, -56949, -118156, 38220, 104294, -30121, -87892, 32218, 70511, -62519, -106760, 45830, 125720, -16026, -122791, 227, 116756, 679, -125901, -8974, 137265, 32409, -126427, -48471, 94342, 21151, -100189, -9059, 116178, 15461, -122625, -28908, 111771]
116A11771q8338j34185R8298J41070j05803j57849R6610J58139q4194j35876R7215
127c142J23451j18995j26641J25359J28105j21206j18709J22713J10288j31261
137a0038j20258J23560J31799r5821j24046P8313J07289p7144j03658P7808J07751
148I5555o6948j03357N8399R1484o4035q9467P1001J02938o1041j09364M2417
159c2418J00546l5973r4932L7873R9782l4933j06964K3285J02305k2561r6385
170f0375L3827J04593l9219j18183L0374J20563k3133j14236K4785J13451k7234
181D5213j19820K0046J19554j0882j09535J2386J04916k1628j12187K1099J17068
192F6230j5736j13954J5722J07140k1989j08897K3173J12178j7093j05007J2823
$$ y = [111771, 23433, -110752, -12454, 128616, 22813, -135036, -38426, 119713, 35519, -100357, -3142, 120309, 1314, -125327, 32, 128137, 6931, -111778, 10935, 121223, -10038, -130296, -6736, 125063, 29242, -94804, -16491, 90798, 13654, -90004, -12196, 95555, 28607, -74750, -16351, 75133, 11098, -78369, -7368, 95570, 34529, -74835, -32418, 68128, 32155, -62777, -24904, 74878, 39945, -67019, -43734, 58571, 36010, -60375, -26548, 78045, 38826, -79357, -48983, 71580, 48447, -65789, -41004, 72447, 45213, -74607, -54561, 64993, 54111, -55424, -43038, 61878, 40250, -71937, -50838, 66230, 50494, -63460, -47738, 59402, 37413, -71484, -48311, 63867, 46774, -58233, -45410]
203d5410R4153j7411r1132K0078R4386j4656r2883P657Q7242p393q5146R569Q9178
216D8232m088r1514l921Q6029N521q1714k496Q2458M146q4403j0101Q2012J3701
229D3862p6882j2356P8410J2700q2048j8352Q2947K2478p8551k0997P8203J9377
241D8791q1265j9985Q2111K3098p8234k2776P6195J9884p7079k0935P8160K4313
253E2278p4300k5403P1284K4029p0766k3557P2601K5826p0778k7415O7378K5833
265D7010o6019k3727O6435K5161o4144k7751O1149K7196n8046k6326N7875K7589
277D6402n7160l1178N5202L2481n3256l2440N2629L3586n2905l5742N0763L7061
289D5443m8251l7008M7364L6124m7404l7570M5954L8993m3949l9183M2405L9393
$$ y = [-45410, 48743, 31332, -59800, -39722, 54664, 40008, -52875, -45218, 42024, 34631, -50515, -40946, 48232, 44144, -47370, -51291, 34738, 40259, -41455, -43951, 38507, 42653, -41750, -51851, 30161, 43862, -33020, -45376, 33034, 45734, -36314, -54666, 28281, 50759, -27792, -48789, 29414, 48791, -32474, -52459, 29652, 52750, -25484, -48260, 27935, 47819, -29260, -50195, 27965, 52278, -22022, -47425, 23859, 47888, -22878, -46435, 26166, 51992, -18786, -46201, 21177, 47010, -19009, -42736, 23699, 48860, -15284, -43035, 18114, 45310, -12736, -39062, 18813, 46402, -10758, -41936, 13266, 45747, -7509, -39949, 12680, 46266, -6639, -42381, 8382, 45443, -2808, -39816, 7548, 43672, -3732, -41302, 4652, 43645, -304, -39487, 2918, 42311]
301D2311m3439m0561M3179M1560m2368m2316M1339M1681m1394m1955M1058M2037
313D1132l9971m1976L8497M0837l8183m0159L6263M1662l5676m2328L3388M2189
325C5675l2195m2822L1756M2936l0936m3205K9865M2602k8804m1954K8005M1538
337C2461k7328m1774K5775M2039k4624m1549K3450M1729k2313m2562K1700M2691
349B9695k0422m2701J9635M3372j9589m2813J8941M3070j7957m2713J7143M2484
361B8145j6081m2078J5143M2158j3835m2111J3328M2107j2071m1927J1426M2676
373B6880j0773m2422J0641M2091r315m2158Q872M1925p897m1269P159M1088o110
386A8712m0275N051M0628m148m0980L986M0415k801m0245K059M0714j528m0590
$$ y = [42311, -1128, -41689, 1490, 43050, 682, -41634, -295, 41386, -8, -41963, -905, 41132, 1161, -40815, -2318, 38519, 336, -39823, -3560, 38102, 2426, -39902, -6514, 35675, 3480, -39342, -7586, 35350, 4414, -38791, -8926, 33676, 4872, -37082, -9077, 32461, 5133, -36641, -10866, 31173, 6549, -35000, -11550, 30179, 7866, -34696, -12996, 29695, 9273, -33428, -13793, 29579, 9990, -32823, -13882, 29188, 11231, -31482, -14339, 28145, 12064, -30014, -14871, 27287, 13452, -28659, -15331, 26776, 14705, -27222, -15796, 26880, 16107, -26315, -15674, 26417, 17102, -25056, -16184, 25741, 17844, -23425, -16266, 24822, 18712, -21563, -16512, 24116, 19968, -21012, -17026, 23389, 20588, -19657, -17598, 23116, 21588, -19002]
399a9002J589M0102j018l9782k3L9903M55l9240j523L9080J881l8903k402L8846
413A9963K891l8781k931L7824L744l8098m427L7266M802l7054n280L6778N390
426B2087l6032o378L5636O774l5170q005L4609Q271l4440q882L4011R605l4340
439a2254r912L3537J0312l3244j1210L2592J1706l2497j2174L1659J2658l1290
451a0117j3404L1215J3612l1342j4418L0662J5051l0556j5266L0356J5671l0024
463h560j6397L0253J6231k9458j6877K9272J6492k8615j7016K9042J6975k8770
475g428j6981K8030J7397k7678j7593K7297J8324k6898j8706K6295J9038k5663
487d566j8420K5111J9111k5004j9107K4379J9119k3500j9033K3530J9306k2445
$$ y = [-19002, -17413, 22689, 21671, -18111, -18134, 21769, 22224, -17016, -18539, 20541, 22422, -16481, -18883, 19963, 22854, -15927, -18858, 18966, 22710, -15388, -19815, 17451, 22253, -14801, -20081, 16697, 22087, -13945, -20323, 15313, 22087, -13083, -21088, 13521, 21792, -12648, -21530, 12481, 22086, -12254, -22166, 11371, 21683, -11561, -22771, 9821, 21527, -10970, -23144, 8515, 21173, -10117, -23521, 7694, 21306, -10036, -24454, 6208, 21259, -9297, -24563, 5793, 21464, -8560, -24957, 5296, 21527, -7931, -24808, 4464, 20956, -7659, -24675, 4367, 21342, -7428, -24409, 3621, 21018, -6660, -24253, 3044, 21368, -5530, -24236, 2059, 21097, -4566, -22986, 2125, 21236, -3768, -22875, 1504, 20623, -2877, -21910, 1620, 20926, -1519]
499a519k0427K2144K1143k1223k0873K0883K1427k0458k1587J9725K2267j9540
511A962k1813J9480K1877j9061k2734J9130K3569j8085k3581J7356K3788j7579
523D309k3617J7051K4523j6650k4454J5984K4338j6517k3717J6624K4744j6241
535F377k5364J5975K4721j5725k4790J5187K5810j4989k6020J3999K5359j3348
547G192k4960J3772K4520j3342k5685J2830K5015j2047k4725J2636K3864j1903
559G167k5254J0798K5092r856k4528R499K4140j0104k4529R129K4902q122k4593
572a6259P825K3838p929k4882P154K6097o345k5514N254K4554n867k4473N585
585a0962K5301m433k5498L457K4137l501k4601M333K5826l618k6017K038K4994
$$ y = [-1519, -21946, 198, 21341, 118, -20755, 128, 21555, 1097, -20490, -765, 21502, 1962, -19851, -371, 21506, 2445, -20289, -1159, 22410, 4325, -19256, -1900, 21888, 4309, -19308, -2257, 22266, 5616, -18838, -2854, 21484, 4967, -18750, -2126, 22618, 6377, -18987, -3012, 21709, 5984, -18806, -3619, 22191, 7202, -18818, -4819, 20540, 7192, -17768, -3996, 20524, 7182, -18503, -5673, 19342, 7295, -17430, -4794, 19070, 7167, -18087, -7289, 17803, 7947, -16581, -7082, 17058, 6954, -17575, -8446, 16456, 8334, -16259, -8434, 15404, 7475, -17407, -10253, 15844, 9499, -16015, -10761, 13793, 7926, -16547, -10962, 14339, 9906, -15592, -12135, 12002, 8501, -16100, -11767, 14059, 10441, -15576, -13538, 11456]
598A1456j820k4270K193K5617k267k6031Q21K5344n17k4343J545K4958j817k5838
612a4969O60K5340N54k4083M86K3878r46k4698j55K4990J516k3558j293K3003
626A0725P41k4044q25K4512K891k3550k887K2463K404k3192k222K3340M698k2915
640g861n336K2211L749k1456l713K3048N214k3063o099K1304N392k0471m475K1717
654A0161N557k2264p411K1247O913j9514n881K0726N887k1353q176K0867Q503
667A5262j9249p399J9389P307k0843r028K0244R979j8149r193J8065P627j9358
680e346q688J9761J0135j8098j0063J6902Q471j8027q982J8589J0952j7365j1382
693a3141J5295J0258j5765j0214J7234J1233j6388j2864J4884J1817j4981j1159
$$ y = [11456, 9636, -14634, -12441, 13176, 10909, -15122, -14301, 11043, 10526, -13817, -12272, 12686, 10869, -14969, -14309, 11031, 11585, -12498, -12012, 11866, 10920, -13778, -13933, 11057, 12573, -10985, -12278, 10725, 11466, -12578, -13403, 11109, 14000, -9550, -12437, 10026, 12430, -10762, -12984, 10356, 15054, -7861, -13197, 9014, 12763, -8693, -12406, 10642, 15856, -7207, -13306, 7998, 13390, -7081, -11556, 10161, 15718, -6546, -13957, 7290, 14203, -5311, -11192, 9534, 15421, -5932, -14108, 6759, 15262, -3987, -11386, 8003, 15310, -5533, -14561, 5683, 15662, -2487, -11680, 6385, 14012, -5346, -14034, 5727, 15862, -2236, -12299, 4603, 13074, -4953, -13935, 4654, 15606, -1759, -13141, 2154, 12412, -3353, -13567, 3667, 14900, -1488, -14352, 532, 12349, -2632, -13791]
705a3791J6110J2202j6157j3839J4223J3652j3904j2156J4866J2415j5843j3837
717a6059J4266J3744j2792j2563J3697J2705j5310j3760J4195J4044j1704j3785
729a3322J2357J2709j3573j3840J3342J5289j1880j3863J1016J2929j2678j3198
741a4712J2676J4908j0949j4778J0158J2916j0121j3142J1011J4644r818j4415
753a1622Q112J3236q733j2239R231J3972r062j4199P287J3549o510j2472P340
766b110J3448o999j4883N389J4719m216j3624N310J3965n427j5779M296J6223
779A0312l432j4774L694J5200n314j5565M126J7071l324j5421K811J5313m466
792F231j5959M520J6872l302j6388K605J5577l940j5647M415J6298l258j6080
$$ y = [-13791, 2319, 14521, -1636, -15475, -1252, 12400, -1504, -13660, 1206, 13621, -2222, -16059, -1793, 11951, -841, -13404, 293, 12998, -2312, -16072, -1877, 12167, 463, -13322, -965, 11744, -1829, -15669, -2327, 12962, 1082, -12781, -1765, 11164, -1514, -14712, -2036, 12872, 1923, -12855, -2697, 10219, 98, -13044, -2033, 12611, 2793, -11622, -3510, 9726, 993, -11246, -2015, 11957, 2895, -11304, -4017, 9532, 3022, -9450, -2110, 11338, 4339, -10544, -5155, 9564, 5348, -8276, -2966, 10999, 5572, -10207, -5911, 10312, 6880, -7894, -4200, 11000, 5686, -9879, -5753, 11318, 7994, -7427, -4616, 10697, 6231, -9728, -5208, 11664, 8362, -8026, -5421, 10156, 6216, -9431, -5016, 11282, 8024, -8056]
805h056K297J4928l077j4480L492J5245k747j5192J503J3851j708j3058K389J3286
819H673k129j4205J056J2960l45j1915R72J1745q52j2657n72J2021J473j0935
833d710j633J1470R62j1950k439J2728K776j1445l562J1568K617j2366l197J2552
847C371M558j2158m806J1883M084j2555l941J3022N404j3451n245J2323M835j2439
861e115m125J3054M641j3181n168J2126M798j1592m280J2540M095j2338m848J1665
875B272M821j0973l933J1146M392j1142n043J0583N012r251m862R387M348r063
889b306n123Q992N520p991m987P599N153q029n601P798O863p169o929O289P181
904G260o938o886O894P858o491p900O186P443n981q120O994Q341o424r181O377
$$ y = [-8056, -5759, 9169, 6092, -8388, -4896, 10349, 7602, -7590, -6087, 7764, 6056, -7002, -4613, 8673, 6544, -7661, -6605, 6355, 6010, -5905, -4933, 6812, 5960, -6697, -7269, 4752, 6225, -4710, -6343, 5127, 6089, -5861, -8300, 4428, 7204, -4241, -7803, 3765, 6382, -5984, -9181, 3371, 7929, -4229, -9035, 2848, 6932, -5623, -9564, 3458, 8862, -4589, -9834, 2489, 7324, -5115, -9240, 3814, 8455, -4726, -9894, 2232, 7030, -4562, -8842, 3698, 7793, -4545, -9393, 2272, 7093, -3880, -7813, 3333, 7725, -3417, -8460, 2123, 7135, -2116, -6978, 2409, 6757, -2306, -7429, 1563, 7083, -908, -5895, 1704, 6857, -1172, -6773, 1025, 7888, 719, -6210, 79, 7260, 322, -6564, 330, 8188, 1697, -6203, -17, 7426, 1445, -6675, 319, 8660, 2236, -6945, -568]
919e68Q972o604q589O890Q917o959r305O601R198o565q599O769Q298o682r028
934g254O704Q515n933q484O448Q082o325q291N603Q299n501p693N125P193m956
949A532p691M702P605l848p652L230P821l651p481K973P789l214p385K308P702
964D740k175p830J885Q268j978q554J611Q488j625q146Q60Q574o70r010Q32Q721
980C991o13q953P26Q865l24r495N65R145m63q971M18R013k97r189M22R168m18
997C590q649K18Q715m14q548K94Q491m6q216j03Q165J60q208O7Q037J81p356o14
1015d236P311R50p108j026P223J298p145j715O973J998o856k067P134K150o879
1030a995k439O637K821o700k487O504K892o736k670O416L235o723l068O922L401
$$ y = [-568, 8404, 1800, -6789, 101, 9018, 2059, -7246, -645, 8553, 1988, -6611, 158, 8456, 1774, -7254, -550, 7965, 2032, -6452, -4, 8078, 1753, -6538, -935, 7364, 1863, -5830, -705, 6488, 1532, -6159, -1457, 6148, 2300, -5352, -2122, 5699, 2048, -5433, -2460, 5329, 2115, -5270, -2962, 4740, 2565, -5265, -3380, 4888, 2910, -5644, -4033, 4455, 2830, -5316, -4456, 4118, 3448, -5562, -4730, 3991, 3378, -5575, -4849, 4016, 3692, -5803, -5238, 3907, 3444, -5527, -5109, 3904, 3607, -5582, -5160, 4008, 3590, -5059, -4841, 3874, 3460, -5088, -4794, 3697, 3651, -4565, -4668, 3497, 3657, -4551, -4484, 3553, 3734, -3622, -4236, 3075, 4025, -3083, -4109, 3114, 4412, -2733, -4448, 2525, 4523, -2333, -4400, 2734, 4884, -1995, -4434, 2203, 5024, -1676, -4163, 2341, 5233, -1503, -4173, 2243, 5478, -1245, -4313, 2609, 6010]
1045F010p068l682P133L364o584l485O704L442o348m061O622L960o801l439O169
1060A936L784o327l956O282L944o088l981O228L824n988m097N487M155n599l927
1075d323N593L517n182m009N159M089n260m104M861M504m774m588M322M567m397
1090b5m909M623M518m369m658M165M758l871n196L754N057l666n182L757N311
1105D067l886n261L942M951l327n462L106N564l372n460L480N489l510n325L293
1120a711N614l464n177K748N513k773n894L291N544k865n600K783N610l011n114
1135d506K812N362k288n801K778N361k465n262K065N715k147n359K016N340j945
1150A676n230J554N438j640n109J484M984p64n528J550M754r23m884Q55N047l93
$$ y = [6010, -1058, -4740, 2393, 5757, -827, -4312, 2392, 5834, -514, -4575, 2047, 6007, -794, -4233, 1936, 5720, -607, -4563, 1719, 5663, -425, -4406, 1822, 5646, -342, -4439, 1048, 5203, -396, -4323, 1270, 4787, -395, -4404, 755, 4844, -416, -4520, 341, 4845, 71, -4517, -195, 4372, -25, -4934, -311, 4207, -162, -4820, -655, 4103, 232, -4964, -1210, 3847, 181, -5001, -1244, 4067, 181, -5080, -1138, 3813, 486, -4976, -1870, 3694, 322, -5138, -1658, 3831, 321, -5004, -1711, 3903, 439, -4738, -1990, 3523, 750, -5144, -1853, 3691, 826, -4774, -1991, 3619, 608, -4506, -1694, 3668, 1380, -4421, -1643, 3718, 1253, -4009, -1944, 3771, 1624, -3735, -1719, 3621, 1676, -3554, -2000, 3438, 1798, -3311, -1827, 3157, 2393, -3135, -1585, 3169, 2246, -2638, -1783, 3264, 2871]
1166B871n530P29N542n90n412O67N239o17n371Q73M742j86n275Q4N692l07n283
1183b132p1N627j26n745M27N270O4n202j82N529k66m945l34N018J29n011n83N243
1201B710M58n127j77M766O51n654kM720M78m954o36N182P0m803l28M695O77m613
1219a887r19M548O97m596o65M090J092l983j512M113J225m178j211L903J789m210
1235a704j782M330J332l839j640M144J750m282j758L751J780l733j906L963J825
1250B231l574k109L662K296l703k168L794K221m121j835L640K509l582k493L527
1265B95K116l626k233L881K472l931k303M075J733l222k515M109J936l371j993
1280b577L083K164l128j952K966K371k972k298K519K698k949k184L090K093k604
$$ y = [2871, -2659, -1930, 3612, 3022, -2390, -1723, 3516, 2899, -2472, -1599, 3143, 2957, -2318, -2234, 3458, 3151, -2132, -2203, 3424, 3298, -2447, -2020, 3250, 3314, -1888, -2070, 3459, 3193, -1752, -2086, 2932, 3061, -1950, -2533, 2710, 3168, -1959, -2136, 2630, 3281, -2373, -2375, 2345, 2823, -2131, -2767, 2415, 2485, -2318, -2646, 2049, 2726, -1887, -2806, 1742, 2439, -2157, -2822, 1268, 2360, -1623, -3135, 978, 2203, -1975, -3186, 717, 2506, -1704, -3486, 844, 2176, -1663, -3303, 841, 2591, -1691, -3449, 302, 2082, -1651, -3557, 406, 2231, -1343, -3452, 210, 2506, -1197, -3365, 429, 2650, -1471, -3306, 334, 2843, -739, -3232, 295, 2411, -1215, -3448, 433, 2905, -1026, -3329, 746, 2479, -743, -3258, 851, 2787, -584, -2577, 506, 2670, -458, -2410, 556, 2927, -45, -2343, 176, 2874, -75, -2259, 831, 2924, 320]
1295C20k494K355K668k183k608K490K299k419k631K808K289k388k329K375K377
1310B929k283k773K390K693k202k609J989K562j712l159J883L348k110k886J976
1325C6K865k000l272K190L151k189k868J686L240j931l351J966L290j731l464
1340b382J694K845j655l136K225K981j834l020J320K975j634k523J290K565j401
1355C10k518J198K416r87k382Q48K905j308k890Q33K761k78k953Q73K611r33k731
1372b225M36K852k33k754O16K366p37k603N27K862j33k616r1K784l72k607J64
1389a764L518m40l098J71K813l04k708K68K891L4k877j38K648L78l011L80K930
1406A691j48l366J82L027k97k200n4K615p9k579l42K751M65k288l37K184J31k204
$$ y = [320, -2174, 181, 2849, 666, -1942, 548, 2847, 428, -2203, 605, 2894, 506, -1823, 552, 2929, 646, -2127, 263, 2956, 754, -1855, 134, 2696, 984, -2175, -292, 3056, 946, -1940, 36, 2901, 901, -2371, -181, 2970, 781, -2087, -401, 2839, 908, -2443, -477, 2813, 1082, -2382, -688, 2157, 502, -2634, -409, 2572, 738, -2282, -962, 2013, 379, -2144, -854, 1711, 310, -2208, -1010, 1406, 419, -1963, -1115, 1790, 482, -2408, -1575, 1186, 908, -2045, -1172, 1439, 506, -2225, -1789, 1063, 830, -1924, -1308, 1058, 321, -2282, -1755, 1107, 974, -1642, -1733, 1051, 679, -1928, -1764, 1754, 1314, -1784, -1613, 1200, 896, -1812, -1544, 1347, 1381, -1496, -1634, 1014, 1392, -1619, -1239, 1691, 1543, -1823, -1641, 1386, 1089, -1111, -1165, 1450, 1371, -1208, -1550, 1201, 1666, -622, -959, 1225, 1356, -848]
1424h48m28K750L70k314n04K273R1k329k71K427P73k274o52K055M94k037n19K320
1442A377J038k633j051K176J224k356j056K398J181k544j229J975J073j934j189
1457a550K543Q17k069j605K619R51k118j033K248J154k672j221K382J294j890
1472a50j165J971J044k304j283K224J272k016q42J408J126j926j195K086J516
1487A766j922j303J471Q44j317j461J593J643j713j525J318J539j420j485J697
1502b75J489j329j606R93J620j181j469J358J822j437j800R32J835j065j515J380
1518b48J861j669k329J702J801j357j398J309K090j611k066R92K354j090j788
1533a447J178J725j180k071J152K073q09j643P00J841j113j585Q31J744o10j532
$$ y = [-848, -1276, 1474, 1844, -470, -974, 1299, 1390, -939, -1210, 1217, 1990, -284, -936, 1119, 1613, -424, -943, 1377, 2415, -218, -1269, 907, 2131, -225, -1281, 1117, 2298, -246, -1475, 500, 1573, -361, -1550, 993, 1810, -259, -1864, 755, 1706, -412, -1445, 803, 1957, -715, -1936, 446, 1740, -150, -1315, 656, 1700, -604, -1887, 337, 1609, -407, -1249, 159, 1285, -641, -1836, 250, 1766, -156, -1459, 12, 856, -461, -1922, -329, 1314, -399, -1924, -606, 933, -487, -1972, -275, 1214, -115, -1721, -728, 892, -289, -1758, -400, 1422, -15, -1815, -883, 952, -113, -1628, -248, 1613, -56, -2385, -683, 1118, -239, -1637, -328, 1762, 151, -1915, -923, 1431, 341, -1447, -269, 1456, 276, -1795, -643, 1430, 621, -1022, -322, 1519, 406, -1179, -348, 1396, 786, -746]
1549g46N31J468p18j696J035J491k84j674K68J672o61j356M24J921o52j577J33
1566d21J578K2j761M12J735l70j760J93J243L96j921L77J953n28j835j16J991
1583A188K69k125k2J981k46j935K54J903P5k278J34K121j81k393J18K210O8k268
1601a127K02K016k5k329J30J908M22k063LJ610j87j495n9J599L10k118p1J662
1619C88L40j702k29J701j0j329j58J178K71j474l1J206L87j575p07J769O83j459
1637g51q41J727N69j380p87J351R52j333r13J497P35j559j129J957J038j727q51
1654a445J842O50j625q90J891N73j544o00J268J206j753j022K004M61j379q76
1670a239J603Q23j605p10J432J078j540p28J294Q29j035r37J187R74j450r06J164
$$ y = [-746, -215, 1253, 535, -1161, -126, 1365, 1081, -593, -325, 1347, 686, -670, -246, 1675, 1023, -554, -421, 1157, 1179, -582, -170, 1565, 1195, -565, -372, 871, 1267, -654, -277, 1676, 1148, -687, -803, 1188, 1457, -668, -690, 1291, 1045, -890, -636, 1267, 1342, -936, -802, 1319, 1138, -1255, -1137, 1073, 1141, -1127, -925, 1091, 1066, -1263, -1133, 775, 1197, -866, -863, 747, 560, -935, -994, 605, 915, -1203, -1274, 388, 728, -974, -1203, 498, 488, -841, -999, 179, 450, -1024, -1055, 151, 538, -1037, -1744, 25, 708, -751, -1592, 135, 704, -676, -1463, -112, 840, -493, -1406, 91, 826, -733, -1862, 95, 1133, -594, -1445, 397, 1047, -578, -1468, 423, 996, -548, -1148, 120, 1326, -427, -1449, 555, 1016, -363, -1239, 364, 1187, -418, -1128, 304, 1382, -158, -886, 408, 1237, 202, -735, 452, 1426, -24, -930, 234]
1687B34J035j397m28J027O43r75r66J295O65p22q38P91R92j137o48Q22J123r40
1705E76j222R12J102q44j362P50J577j165j009Q23J539j234j468Q02J419q58j527
1722a189J276J424j072j349P32J341q13j542O94J663j053j021N08J316q00j064
1738i49N60J208l12k058J437J169p44j593P31J549j099j139L82J527n35j458N30
1755g94J563l97j707P23R47N5j413L32J196j91j486K10J665l63j072L4J186N2
1773E40j751L52R17M17j959O61J594n74j068r9J799k21j672P6J712m33j295K00
1791h04J511Mj736L27J303j68j176mJ605l36j175J1J246L89j519P2J024J74j215
1810d67j67J564O6j696M11J398l61j085l06J370M24j340J4J172Q1j169n44J204
$$ y = [234, 1269, -128, -556, 471, 1114, 139, -827, 468, 1133, 411, -427, 364, 1356, 219, -429, 393, 1516, 576, -646, 266, 1368, 524, -838, -88, 1489, 324, -685, 138, 1677, 443, -1025, -223, 1196, 338, -1189, 87, 1511, 439, -910, -178, 1163, 350, -1192, -498, 1165, 112, -909, -401, 915, 115, -949, -389, 819, 507, -1551, -114, 1055, 311, -1282, -551, 998, -101, -1240, -858, 669, 134, -1324, -794, 769, 372, -1335, -612, 335, 390, -1023, -691, 505, 314, -1172, -962, 703, 340, -732, -698, 488, 540, -1211, -859, 58, 475, -1484, -823, 771, 197, -871, -970, 829, 608, -1064, -988, 724, 291, -1004, -804, 707, 711, -1025, -698, 605, 437, -739, -743, 862, 526, -649, -638, 608, 997, -522, -450, 574, 748, -467, -634, 930, 996, -700, -289, 1109, 748, -337, -643, 727, 1151, -189, -175, 997, 1078, -91, -635, 569]
1828E69M78j137m49J183M13j200m52J230O71j269m51R81K74q83l83Q70O26j389
1846c18n49J384M30j048o72J228M26j011o42J190O05j614l06J534L20j472k17
1863g32J045O87j360p00J255M29r63k74N73N06r37o93J260P70j053r33J317M90
1881F87q96q29P36P13o80n09N97Q57j057m35P29N36r45l09M13J295r16r93O94
1900c12P96l91r01N19P19n18o11L46Q29o47p56P60Q04m98j065P00J444j013r78
1919g73N06J022q69n03J33J252q18j027R03P40j44r31J25J248j41j400N00Q72
1937F95l32j326N96J163k84r24M99Q65p22r70Q37P63n47p84N02P82l24r10K84
1956a37Q46j85q86J52R56l05o93J90Q61j51p03k12R95n1j073K97P15Rj186M63
$$ y = [569, 1047, -90, -539, 644, 1057, -143, -595, 635, 1306, 37, -414, 567, 841, -42, -425, 445, 1071, -318, -867, 517, 947, -101, -773, 455, 881, -130, -772, 418, 1023, -591, -897, 637, 957, -515, -732, 313, 1000, -360, -1060, 195, 624, -339, -613, -40, 466, -471, -1164, 96, 866, -187, -1120, 197, 687, -209, -1038, -302, 411, -269, -778, -181, 676, -381, -816, -87, 449, -496, -805, -392, 903, -13, -1006, -312, 484, 93, -808, -289, 430, -88, -699, -353, 476, -171, -927, -167, 637, 139, -926, -226, 1218, 205, -773, -267, 755, -114, -617, -484, 768, -50, -1077, -174, 566, 422, -509, -384, 864, 723, -677, -177, 695, 363, -963, -367, 796, 512, -412, 87, 952, 230, -740, 97, 860, 313, -471, 31, 813, 489, -421, -137, 709, 524, -362, -210, 746, 441, -252, -62, 799, 648, -55, -267, 728, 677, -396, -99, 616, 625, -561, -98]
1976i8Q83j52r13K69N21J57j278q0J203K3r93j08J015L8q35j49J200L0j257J08
1996d16O14L48j029j72Q54J86r01j61R52K31r37q2O78p2p33lN74K92q43p4Q05
2017A11L55r33j46P09L17p91l01R46k04p95L3P80L80p74l49R55L9p74k2M94L21
2038C51o40k99N71K86n22k66R36p0n47l35L62N82m25m02N76N02o02p35R78J89
2058D90l14m23M79N35j109j38O14L94n14l31N32K13o50j92N21P14q89r8M90K18
2078E42n44l52M71O46m96n82O18M21q58j85K94O10k25o39L89K06j81m92N43P02
2098H88m72o51K72N09o70o8K86M70k35n74Q6N81mr48N68L77k57r14M10R07l63
2119A98n85N38L90n36p89O33N35m02k78L79K67k29j131Q16K90j09m65K04O87m82
$$ y = [-98, 785, 633, -280, -11, 510, 667, -611, -691, 512, 535, -458, -566, 449, 487, -348, -497, 703, 733, -524, -416, 198, 546, -483, -655, 199, 385, -516, -677, 275, 506, -431, -513, 165, 93, -640, -643, -69, 223, -620, -694, 111, 466, -467, -613, 96, 413, -378, -679, 267, 63, -732, -699, 81, 461, -313, -662, 293, 332, -442, -464, 30, 351, -289, -588, -17, 269, -253, -519, 417, 347, -200, -535, -173, 409, -16, -418, 158, 660, 58, -677, 301, 490, 176, -247, 232, 767, -342, -480, 134, 528, 14, -317, 215, 428, -222, -414, 107, 821, -68, -166, 324, 542, -2, -354, 117, 763, 267, -315, 303, 724, -134, -319, -25, 585, 360, -279, 110, 316, 135, -357, 186, 888, 416, -235, 37, 546, -124, -192, 94, 564, 329, -245, -159, 422, 418, -530, 38, 415, 158, -756, -346, 561, 198, -387, 151, 541, 5, -784, -151, 384, -18, -296, 83, 350, 121, -1010, -194, 96, -13, -478, -274, 413, -69]
2139f9l78J3O72m04k63K17O85l98p25L34P40k64k37m45O91q1q33P8Q18L42p91
2160b98l9O60k24m65K52J06L32m78m42L80L60o70Q3O70L4p49j50J021n7n53l24
2181e51Q56j81n29m0N90l6m44K87N38k84o95R4R08l4m62N1M87j52m46k22M29M20
2203E84o63p3P55j56l98l08M22M60o70o09J081j59l77p6P19r3p23L37j2N13o77
2224a23J43M67Om84k36O90Q8p56QL66M76n32l62M09J23n29J00N67M8n48n20O22
2246B3N44p42l76L38P77n84m08K24N90l28n35M87N99p49l18N63K16l72l54L70
2266c5k1l54M0K55J73m38n02J147j58k81j96L40M26n31%P2J94k19k49L93K25n44
2288b63l52M59L59j37n80J41N75l97l23J07N49l84J46P1P8n3k35p4O79l89m18
$$ y = [-69, -447, -434, 238, -166, -429, -212, 473, 75, -650, -316, 424, 160, -77, -522, 169, 88, -745, -667, 151, 493, -298, -337, 323, 99, -366, -114, -8, 324, -154, -596, -216, 144, -526, -443, 227, 261, -488, -638, 383, 326, -227, -551, 305, 124, -405, -445, 145, 109, -335, -48, 490, 206, -489, -395, 513, 479, 17, 68, 555, 403, -43, -265, 164, 584, -79, -152, 603, 447, 49, -259, 163, 623, -47, -656, 425, 266, -111, -187, 532, 439, -284, 53, 41, 554, -123, 20, 487, 493, 9, -227, 463, 551, -205, -197, 169, 645, 113, -249, 160, 283, -246, -146, 421, 469, -79, -599, 23, 567, -175, -551, -213, 564, -20, -428, -204, 386, 58, -477, 10, 609, -140, -458, 105, 321, -51, -405, -35, -56, -410, -370, -115, 58, -380, -882, 265, 107, -174, -370, -30, 396, -135, -135, -63, 131, -88, -337, 56, 281, -263, -615, -156, 203, 66, -514, -373, 202, -195, -518, -411, 138, -246, -100, -29, 49, -4, -239, -313, 366, -23, -441]
2309d41M24K38J06p52J60N38k9l50J02N01l38l44L6M52j08m54L24M70l88k96n2
2330b01Q20n03p7j86O07k11j54j28M31j70k18P6L51q5l27J91M61l24m33pN21J1
2352D45l84j46M79j87n48M33Q4l4j51k83R11n93j00j87L26j75j73J13L05M72o90
2373h3P6J86j36l48q5N07K22o95K11j5M07l64r0O25j17p84J39N59m4o47K37P44
2395E05m92l96k3L67j93r3O9L84j19k75J02J72K7l07P8K76J29p81J93O40m40k31
2417d08J96M04k09m2j84O2L00j64j76K59Q9m72J64L94m0n29R0N63o9o93L84K1
2439f0L01m90K29l3M04l12j48J43J87l80K84O0M12p57l1L90K3l49j09P62k46j50
2461A30m03O67K19o40m14R13l6m29k53L57M30m86k77O10J67n38P0J54k5j60l44
$$ y = [-441, -17, 221, 327, -425, -265, 273, 244, -106, -4, 497, 159, -185, -149, 303, 195, -259, 65, 535, 147, -149, -201, 619, 116, 39, -147, 460, 249, 95, -33, 398, 228, 10, 86, 437, 352, 25, 216, 677, 353, -80, -87, 434, 445, 61, -85, 394, 207, -341, 92, 176, 142, -9, -292, 619, 26, -74, -261, 65, -110, -283, -170, 135, 607, -83, -7, 179, 43, -305, -390, 117, 339, -356, -145, -160, 247, -117, -207, 418, 301, -483, -344, 215, 171, -476, -239, 505, 13, -383, -406, -39, -232, -325, -256, 128, 9, -266, -164, 8, 35, -272, -194, 82, 211, -570, -377, 263, -177, -408, -212, 192, -17, -59, -243, -181, 119, -45, -221, 38, 127, -345, -181, 213, 173, -356, -266, 297, 228, -465, -81, -60, 241, -249, -20, -53, 351, 39, -109, 34, 221, -159, 125, 185, 597, -160, -191, 199, 222, -127, -236, 526, 280, 130, -273, 394, 613, -27, -441, 472, 436, 7, -246, 111, 541, 55, -222, 388, 555, 17, 87, 241, 216, 56, -288]
2482b88M97J70n28K34m3L83m39n5M3K34k73l24N29j2l05l7K21J97j79l67P01o9
2504B90m15r1KN00m25R6J00K19k64j01P6L14l94m9K46R8k55l17L78K43o8o19L
2527d33N22J94q58L84M28j59n43L83J61k6k12j68P36j79o58L09J96o9k32LL10
2548H9J1m86L26L10n31p0O76N2p8n85L3L43j47j60J98M47m30O8l60N72j40m44
2570c06L38J17P3n27J64M25J88p53L22M95l03k64N0l1K04k72N8L63m43J19k32
2591b15M83m2m55L8N85j21k14J86oJ56j93k38J41J95n57J03K62j86rq0K62K75
2613C70n25K40kL25l05l86O45m00m02L84M8j54P8J75%K66l06O8R1N0k21l52M79
$$ y = [-288, 209, 379, -149, 85, 42, 425, -14, -69, -26, 208, -65, -389, 140, 128, -177, -214, 7, 204, 25, -342, 359, 290, -125, -216, -214, 286, -139, -43, 57, 276, 12, -89, -13, 301, -93, -142, 104, 202, -53, -370, 8, 251, 183, -436, -433, 89, 283, -575, -191, 237, 78, -465, -82, 79, 53, -159, -327, 409, 230, -428, -119, 77, 8, -224, -221, 89, 100, -386, -60, 250, -281, -351, 325, 377, 299, -286, -253, 90, -57, -217, -19, 428, -2, 66, -294, 278, 138, -306, 32, 149, 222, -305, -141, 284, 472, -281, 41, 536, 233, -31, 19, -12, 192, -80, -22, 341, -102, 17, -215, 268, 226, -229, -191, 394, 273, 59, 245, 239, 395, 202, -36, 105, 300, -257, -154, 108, -78, -87, -167, 95, 370, -155, 85, 83, 408, 103, -283, 362, -38, -440, -56, -8, -162, -84, 91, 91, 357, 51, 119, 210, 260, 39, -313, 166]
$$ [...]
8191b26
##END NTUPLES=NMR FID
##END=
