##TITLE=1H_LR-675-C1-C2
 CDcl3, 8 sc, 
 31.5.2019
##JCAMPDX= 6.0         $$ Bruker NMR JCAMP-DX V2.0
##DATA TYPE= NMR FID
##DATA CLASS= NTUPLES
##ORIGIN= UXNMR, Bruker Analytische Messtechnik GmbH
##OWNER= root
$$ XWIN-NMR		Version 3.5
$$ Fri May 31 16:33:03 2019 Russian Standard Time (UT+4h)  she@DPX200
##.OBSERVE FREQUENCY= 200.13155
##.OBSERVE NUCLEUS= ^1H
##.DELAY= (6, 6)
##.ACQUISITION MODE= SIMULTANEOUS
##.ACQUISITION SCHEME= undefined
##.AVERAGES= 8
##.DIGITISER RES= 18
##SPECTROMETER/DATA SYSTEM= spect
##.PULSE SEQUENCE= zg30
##.SOLVENT NAME= CDCl3
##.SHIFT REFERENCE= (INTERNAL, CDCl3, 0, 15.7039)
##AUDIT TRAIL= $$ (NUMBER, WHEN, WHO, WHERE, WHAT)
$$ ##TITLE= Audit trail, XWIN-NMR		Version 3.5
$$ ##JCAMPDX= 5.01
$$ ##ORIGIN= Bruker BioSpin GmbH
$$ ##OWNER= she
$$ F:/spectra/data/she/nmr/H-F/1/audita.txt
$$ ##AUDIT TRAIL=  $$ (NUMBER, WHEN, WHO, WHERE, WHAT)
(   1,<2019-05-31 16:31:59.10 +0400>,<she>,<DPX200>,
      <created by zg, POWCHK disabled, PULCHK disabled
       configuration hash MD5:
       00 E9 B6 7A A2 85 ED C7 34 08 36 98 17 FE 4E 26
       data hash MD5: 16K
       9C 3B 87 60 62 06 7A C3 19 57 E6 1C 08 54 86 61>)
$$ ##END=
$$ 
$$ hash MD5
$$ B0 B2 32 03 FF 1C 9D 3C 03 D2 A3 7C BA 6C 0F B1
##$RELAX= 
##$RELAX= 
##$RELAX= 
##$RELAX= 
##$RELAX= 
##$RELAX= 
$$ Bruker specific parameters
$$ --------------------------
##$DU= <F:/spectra>
##$EXPNO= 1
##$NAME= <H-F>
##$PROCNO= 1
##$TYPE= <nmr>
##$USER= <she>
##$AMP= (0..31)
100 100 100 100 100 100 100 100 100 100 100 100 100 100 100 100 100 100 
100 100 100 100 100 100 100 100 100 100 100 100 100 100 
##$AQSEQ= 0
##$AQ_mod= 1
##$AUNM= <au_zg>
##$AUTOPOS= <>
##$BF1= 200.13
##$BF2= 200.13
##$BF3= 200.13
##$BF4= 200.13
##$BF5= 200.13
##$BF6= 200.13
##$BF7= 200.13
##$BF8= 200.13
##$BYTORDA= 1
##$CFDGTYP= 0
##$CFRGTYP= 5
##$CHEMSTR= <none>
##$CNST= (0..31)
1 1 145 1 1 1 1 1 1 1 1 1 1 1 1 1 1 1 1 1 1 1 1 1 1 1 1 1 1 1 1 1 
##$CPDPRG= <>
##$CPDPRG1= <>
##$CPDPRG2= <>
##$CPDPRG3= <>
##$CPDPRG4= <mlev>
##$CPDPRG5= <mlev>
##$CPDPRG6= <mlev>
##$CPDPRG7= <mlev>
##$CPDPRG8= <mlev>
##$CPDPRGB= <>
##$CPDPRGT= <>
##$D= (0..31)
0 1.2 0 0 0 0 0 0 0 0 0 0.03 0 0 0 0 0 0 0 0 0 0 0 0 0 0 0 0 0 0 0 0 
##$DATE= 1559305918
##$DBL= (0..7)
120 120 120 120 120 120 120 120 
##$DBP= (0..7)
150 150 150 150 150 150 150 150 
##$DBP07= 0
##$DBPNAM0= <>
##$DBPNAM1= <>
##$DBPNAM2= <>
##$DBPNAM3= <>
##$DBPNAM4= <>
##$DBPNAM5= <>
##$DBPNAM6= <>
##$DBPNAM7= <>
##$DBPOAL= (0..7)
0.5 0.5 0.5 0.5 0.5 0.5 0.5 0.5 
##$DBPOFFS= (0..7)
0 0 0 0 0 0 0 0 
##$DE= 6
##$DECBNUC= <off>
##$DECIM= 24
##$DECNUC= <off>
##$DECSTAT= 4
##$DIGMOD= 1
##$DIGTYP= 9
##$DL= (0..7)
0 120 120 120 120 120 120 120 
##$DP= (0..7)
150 150 150 150 150 150 150 150 
##$DP07= 0
##$DPNAME0= <>
##$DPNAME1= <>
##$DPNAME2= <>
##$DPNAME3= <>
##$DPNAME4= <>
##$DPNAME5= <>
##$DPNAME6= <>
##$DPNAME7= <>
##$DPOAL= (0..7)
0.5 0.5 0.5 0.5 0.5 0.5 0.5 0.5 
##$DPOFFS= (0..7)
0 0 0 0 0 0 0 0 
##$DQDMODE= 0
##$DR= 18
##$DS= 0
##$DSLIST= <SSSSSSSSSSSSSSS>
##$DSPFIRM= 0
$$ [...]
##$SUBNAM2= <"">
##$SUBNAM3= <"">
##$SUBNAM4= <"">
##$SUBNAM5= <"">
##$SUBNAM6= <"">
##$SUBNAM7= <"">
##$SUBNAM8= <"">
##$SUBNAM9= <"">
##$SW= 24.9336996594482
##$SWIBOX= (0..15)
0 0 2 0 0 0 0 0 0 0 0 0 0 0 0 0 
##$SW_h= 4990.01996007984
##$TD= 16384
##$TD0= 1
##$TE= 0
##$TE2= 300
##$TE3= 300
##$TEG= 300
##$TL= (0..7)
0 120 120 120 120 120 120 120 
##$TP= (0..7)
150 150 150 150 150 150 150 150 
##$TP07= 0
##$TPNAME0= <>
##$TPNAME1= <>
##$TPNAME2= <>
##$TPNAME3= <>
##$TPNAME4= <>
##$TPNAME5= <>
##$TPNAME6= <>
##$TPNAME7= <>
##$TPOAL= (0..7)
0.5 0.5 0.5 0.5 0.5 0.5 0.5 0.5 
##$TPOFFS= (0..7)
0 0 0 0 0 0 0 0 
##$TUNHIN= 0
##$TUNHOUT= 0
##$TUNXOUT= 0
##$USERA1= <user>
##$USERA2= <user>
##$USERA3= <user>
##$USERA4= <user>
##$USERA5= <user>
##$V9= 5
##$VALIST= <valist>
##$VCLIST= <CCCCCCCCCCCCCCC>
##$VD= 0
##$VDLIST= <DDDDDDDDDDDDDDD>
##$VPLIST= <PPPPPPPPPPPPPPP>
##$VTLIST= <TTTTTTTTTTTTTTT>
##$WBST= 1024
##$WBSW= 4
##$XGAIN= (0..3)
0 0 0 0 
##$XL= 0
##$YL= 0
##$YMAX_a= 568958
##$YMIN_a= -773104
##$ZGOPTNS= <>
##$ZL1= 120
##$ZL2= 120
##$ZL3= 120
##$ZL4= 120
##$ABSF1= 10
##$ABSF2= 0
##$ABSG= 5
##$ABSL= 3
##$ALPHA= 0
##$AQORDER= 0
##$ASSFAC= 0
##$ASSFACI= 0
##$ASSFACX= 0
##$ASSWID= 0
##$AUNMP= <proc_1d>
##$AZFE= 0.1
##$AZFW= 0.1
##$BCFW= 1
##$BC_mod= 2
##$BYTORDP= 1
##$COROFFS= 0
##$CY= 11.3945322036743
##$DATMOD= 1
##$DC= 2
##$DFILT= <>
##$DTYPP= 0
##$F1P= 18.9103706918063
##$F2P= -1.10871071338519
##$FCOR= 0.5
##$FTSIZE= 0
##$FT_mod= 4
##$GAMMA= 1
##$GB= 0.15
##$INTBC= 1
##$INTSCL= 1
##$ISEN= 128
##$LB= 0.24
##$LEV0= 0
##$LPBIN= 0
##$MAXI= 10000
##$MC2= 0
##$MEAN= 0
##$ME_mod= 0
##$MI= 1.114404
##$NCOEF= 0
##$NC_proc= 0
##$NLEV= 6
##$NOISF1= 3.799351
##$NOISF2= 2.8
##$NSP= 1
##$NTH_PI= 0
##$NZP= 0
##$OFFSET= 15.70392
##$PC= 1
##$PHC0= -8497.149
##$PHC1= 13.40022
##$PH_mod= 1
##$PKNL= yes
##$PPARMOD= 0
##$PSCAL= 0
##$PSIGN= 0
##$REVERSE= no
##$SF= 200.130013532006
##$SI= 16384
##$SIGF1= 3
##$SIGF2= 2
##$SINO= 400
##$SIOLD= 16384
##$SREGLST= <1H.CDCl3>
##$SSB= 0
##$STSI= 0
##$STSR= 0
##$SW_p= 3612.71676300578
##$SYMM= 0
##$S_DEV= 0
##$TDeff= 0
##$TDoff= 0
##$TI= <>
##$TILT= no
##$TM1= 0
##$TM2= 0
##$TOPLEV= 0
##$USERP1= <user>
##$USERP2= <user>
##$USERP3= <user>
##$USERP4= <user>
##$USERP5= <user>
##$WDW= 1
##$XDIM= 8192
##$YMAX_p= 0
##$YMIN_p= 0
$$ End of Bruker specific parameters
$$ ---------------------------------
##NTUPLES= NMR FID
##VAR_NAME=  TIME,          FID/REAL,        FID/IMAG
##SYMBOL=    X,             R,               I
##VAR_TYPE=  INDEPENDENT,   DEPENDENT,       DEPENDENT
##VAR_FORM=  AFFN,          ASDF,            ASDF
##VAR_DIM=   8192,          8192,            8192
##UNITS=     SECONDS,       ARBITRARY UNITS, ARBITRARY UNITS
##FACTOR=    0.0002004,     1,               1
##FIRST=     0,             0,               0
##LAST=      1.6414764,     0,               0
##MIN=       0,             -773104,         0
##MAX=       1.6414764,     568958,          0
$$ Real data points
##PAGE= N=1
##DATA TABLE= (X++(R..R)), XYDATA
$$ [...]
3310a775L063j059k475K505K676l362j812M696K295o928l738P796M863o473m745
3325d473N372L254n490k195O185J889o089j432L954r11l088L193N722m616p098
3340e823M000O775l546n129M528L879o507m124O488L526n732j010O786n65r973
3355f427M49J0462R80r585m00P504j983p663L778R405k772q454K176N169l960
3370a321l024P749M255r965n229Q749M627p974j228R590O5j1832j167J0942R76
3385E213q493J981Q140n804j0794O653J1850l964j0257M570O472q834n835J1113
3399B011Q137r551p602P507K582q201P85J2344j55j4744j227J1599k81r609N303
3414a102J0808p541j3416N901J1692m491p488Q306N618j3283p801J3839J0028
$$ y = [-1775, 1288, 229, -2246, 259, 2935, -427, -2239, 2457, 4752, -2176, -5914, 1882, 6745, 272, -4473, 899, 4153, -1337, -3532, 2653, 4542, -1547, -2979, 975, 64, -3024, 169, 5891, 1275, -5823, -1823, 4952, 1406, -3723, 805, 4684, -1823, -5947, 541, 4067, -1665, -2675, 4111, 3546, -6427, -5978, 4484, 5464, -4121, -4521, 2983, 1000, -6663, -2885, 6520, 3748, -4706, -2530, 2639, -1321, -4345, 3404, 7659, -2306, -7535, 1214, 5841, -2133, -3361, 6229, 6294, -5538, -6705, 4237, 5213, -3280, -1299, 6841, 1037, -9757, -3104, 8746, 4782, -5475, -905, 5567, -3267, -9102, 2011, 10148, 597, -7005, 502, 3084, -5117, -4332, 8012, 7857, -6887, -8114, 3485, 3204, -6405, -1102, 9706, 2165, -11251, -5350, 6342, 1851, -5637, 2669, 8287, -4996, -12797, 1042, 11070]
3427A1070j0381o002R357N27j3120J186J6344J558j4584j872J0377l266j0179
3440h985Q936J3819q936j5259N752J1559o996p020J1988P231j5586r935J3026
3453d06Q193r885j973J2994k029j8344n87J9077K888j4039N80J0665p422j3573
3467a3861R991J6935o464j4704N406P722j0305o010J6797R528j6524j1307J2330
3480d66O559j1695k18J7120l60k0339k728J6507J267j0884N819J2784j1294j8063
3494a5991R539J8613n839j2538Q487O809j5331q574J8030J2243j4272r231J0511
3507B456J532j4577K544K1032Rk0659k834J5056k008j2263R152J6644j0856j9673
3521a4445O466J5335n994q353J2410P496j9047j1473J6986J2700j1735o206J3070
$$ y = [11070, 689, -5313, 4044, 4571, -8549, -7363, 8981, 10539, -4045, -5917, 4460, 1194, -8985, -49, 13770, 4834, -10425, -4673, 6886, -110, -7130, 4858, 12089, -3497, -13432, -406, 7787, -2098, -4071, 8923, 6894, -11450, -12037, 7040, 9928, -4111, -3531, 7134, -288, -13861, -3870, 13065, 6601, -8103, -2697, 5025, -5280, -11290, 5507, 15035, -1489, -12796, -466, 6093, -5602, -5820, 11300, 10940, -9399, -12127, 4380, 5647, -5237, 582, 13366, 2072, -15991, -6452, 12161, 6322, -6216, 2271, 9080, -6251, -14825, 3205, 15448, 1176, -8055, 2456, 3988, -10589, -8045, 12987, 12996, -7663, -10497, 4559, 2551, -9712, -560, 16084, 5228, -14445, -7979, 7356, 1362, -6991, 5419, 12915, -6132, -17605, -619, 12081, 346, -5860, 7210]
3534G210j053j9096K54K1724L852j6739j774J1843o532j3589J1727J9056q516
3547H367j9256N828J1993r406p704J6337J0949j8390j3428J3059R862j0993j574
3560d356J6351j958k1956k114J9899L741j3929K668J1727r390j6993R723J9682
3573A3095n744j4492O205P318j2846p678J7988J2456j5981j1794J1691M864j2880
3586g798J39J9043J094k0188m005J4266R28j0367P516J3635j0747j8333O888J7256
3600I327m683j0343R188P200j5533j0055J5823J2651j1171q324J0582J63j4938
3613a0113O06J9260K801j6519l205J1502k432j1905P877J5890o946j6791L706
3626f269J1201n676o060J1865P305j5530j0831J2818R551r569l765J1792j39j6330
$$ y = [7210, 6157, -12939, -12685, 9039, 12891, -3848, -5622, 6221, -311, -13900, -2173, 16883, 8367, -10889, -5061, 6932, -2474, -10178, 6159, 17108, -1282, -14710, -1651, 8211, -2782, -4356, 11995, 10037, -11919, -14033, 5866, 9607, -4322, -1654, 10073, 683, -16310, -6587, 13095, 7351, -7141, -936, 6382, -6464, -14142, 3846, 16302, 321, -11473, 218, 5082, -7798, -7659, 11384, 12478, -7710, -11715, 2551, 3479, -6888, 628, 14263, 3516, -14817, -7929, 9327, 4644, -5699, 3489, 10689, -4844, -14899, 924, 13575, 2404, -5920, 4662, 4825, -10113, -9507, 9753, 12554, -3965, -7170, 4332, 1900, -10005, -2128, 13762, 6816, -9975, -6269, 4932, -744, -6804, 5061, 12366, -3164, -13995, -1177, 8374, -1195, -4960, 6832, 6693, -9637]
3640i637j725J6791L718j2486K27R109n433j2211Q025J4475n278j2679N011P653
3654E560q774o104J2915Q999j2144r417Q544N050q596M29J2398k30j5552k223
3668i145J3213J536r708L593R668p243j2529O081J2480l814q918N228N550r624
3682c632n895J1202P673r438n493P497J248r563K07J2894O93j2023j743Q731j010
3697A348p183N370R131o176j0994M336Q989l741n463O667M592r418n997Q962O135
3712F558o431l392O603L75q602l29R956J055q022o1O366k949o982M579Q867m086
3728C505q095K813M969m057m011P479M206p920n203O087M203n293j789O412K28
3743C534p976p67P729Q54o172J205N445l178n905K912O590k854n104L265L422
$$ y = [-9637, -11362, 5429, 9147, -3339, -3112, 5997, 564, -11647, -3622, 10853, 5575, -7104, -2093, 5560, -3214, -9318, 3597, 12596, 452, -8965, -421, 4629, -3967, -3538, 8860, 8630, -6922, -9145, 4068, 5604, -4104, -511, 9157, 1914, -10615, -4534, 7946, 4132, -4786, 442, 5992, -3632, -9527, 1675, 9348, -90, -5583, 1914, 3162, -6401, -6194, 6700, 7393, -4630, -6373, 2358, 1348, -5835, -465, 8666, 2490, -8504, -4168, 4821, 1080, -4383, 2284, 6876, -2542, -8539, 423, 6558, 127, -3265, 3338, 3713, -4889, -5218, 4738, 5793, -2229, -2290, 4076, 1127, -5855, -1276, 7591, 3505, -4590, -1777, 3192, -865, -4876, 2603, 6809, -1111, -6314, -227, 3976, -1317, -3106, 3306, 3534, -4442, -5209, 2520, 3374, -2798, -1593, 3852, 674, -5231, -2319, 4271, 1417, -3687, -422, 3000]
3758C000m439l424N532M156m719l731L925J978m333m13O252J72o661n90N569K04
3774B478m518J380M369k074m850J684M771j820l099K443K456l609k449L558K598
3789C318l632j683L197O86l861j087M856O02l503j151K667K14k568R71L075j474
3805F27l356J516K682j714j963K288J736k203k308K573K126k203j304J933O44
3820A074j802o29K265R1j931M29K114q55k285O27L025o76k549M10K033o44j351
3837f54J003J281j243j081R63M56p44n56J525n04j119j30J568K81j897k72J301
3854A78L50j167MK59L6r7L83K90j207k10J331P09j108j210J420R79j171p22Q59
3873i4J039j143l8j48Q03R1k76K14r75k67J097P35j004q82O21J606o54o02l01
$$ y = [3000, -1439, -4863, 669, 4825, 106, -3625, 300, 2278, -2055, -2468, 3784, 3956, -2705, -3295, 2274, 2478, -2040, -660, 3709, 1635, -3215, -1531, 3240, 1420, -1679, 764, 3220, -389, -2838, 720, 3318, -314, -1997, 1200, 1886, -1975, -3062, 1794, 2396, -1107, -2258, 409, 623, -1945, -974, 2101, 627, -2729, -1213, 1469, -245, -2208, 80, 1816, -387, -2695, -122, 2004, -199, -1503, 430, 1074, -728, -1357, 908, 999, -932, -503, 1611, 756, -1529, -902, 2123, 1447, -1102, -692, 1341, 697, -654, 349, 1630, 387, -694, 269, 725, -19, -575, 950, 446, -673, -803, 765, 1046, -851, -1123, 178, 528, -639, -635, -376, -340, -437, -54, 236, -971, -1181, 150, 859, -249, -1459, -39, 940, -231, -953, -94, 945, -198, -236, -384, 419, 510, 234, 448, -527, -794, 303, 1038, 34, -848, -227, 1379, 725, 123, -178]
3892a78O14J49j98m3j31n77L92R20k85j448O26J363k94j530j39J262O38j636p65
3911a260O62P32q2n19k59O1O00O92n88j510K82J539M67j525k93J050M70p52m35
3930f68J067m03j91K27L68k80p83J043O38r57r14J164R64q09j209O81J085o05
3948D18p59K60J11j49O27Q42p21j628J136J703j182k291J053K022p91j811K85
3965h75J646n71r67M04Q27j290m97J463M42k027r7K475o43j977L68K351K47k359
3983a080K12J437o24j222J673J159k203j623K490J676k176j271K586J465l233
3998g34j698L098J486k284q55K012L65k741O56L034j133k574J228K397k435k913
4014c091L481L097k743k994K082K267l200j305L998J215m564j719M225N22l613
$$ y = [-178, 436, 585, 387, 344, 213, -364, 28, 948, 663, -785, -159, 1204, 910, -620, -759, 503, 1141, -495, -1260, -598, 134, 52, -467, -726, -665, -65, 627, 39, -1471, -1189, 350, 817, -708, -1001, 49, 519, -233, -668, 399, -4, -195, 32, 400, 120, -663, 380, 1018, 61, -853, 311, 1275, 466, -743, -62, 1023, 418, -341, -81, 30, -119, 508, 1350, 629, -999, 137, 1840, 658, -1633, -580, 1442, 651, -1160, -875, 771, 200, -767, -363, 464, -826, -1323, 140, 582, -1445, -1542, 933, 290, -1687, -1319, 1032, 1279, -1080, -868, 569, -55, -1277, 396, 1555, -648, -2271, 219, 1895, -281, -1552, 1034, 2499, -734, -2432, 666, 2152, -132, -987, 1025, 1390, -1351, -695, 2339, 1206, -1368, -140, 2257, -178, -3091, 390, 3487, 744, -2250, -168, 2099, -1101, -2406, 1592, 2807, -1757, -3476, 749, 1271, -2342]
4029b342O35M123o68n404P43M841m82l739J364L499k873l836L598M026l412k179
4045b106L491J572n294j334O010K196n493k239M675M0n087K196O009j432o617
4060c413Q58N428j995m120L972M633n201n309M244M587l067l079N078J199o804
4075b989k052P094K121n890o58N804j930o942J952Q459j249p587J565N095l557
4090g64n250O304O036n767o299M568M770n075k457P435K340q714l127P531K315
4105C846n922N27P248k761q904J837Q963j302o594L024N462o476o465P017P861
4120G361m789o658M652L259p239j886R999K482r546l214P582N54p538K990R908
4135G917l505j0899J510Q687k342n781N336O077q138q121P397P880n714m204P026
$$ y = [-2342, -1707, 2416, 1748, -3656, -2913, 1928, 1446, -2293, -929, 2570, -303, -4139, -541, 3485, 73, -2106, 1385, 2957, -2337, -3671, 2339, 4535, -958, -3197, 1478, 1518, -3569, -1373, 4636, 3204, -3413, -2555, 2873, 878, -3242, 730, 5363, 162, -5147, -903, 3684, 617, -2462, 2616, 3815, -2989, -5041, 2053, 4174, -1716, -2374, 3430, 1500, -5442, -3490, 4969, 3720, -3867, -2302, 2793, -764, -6014, 290, 6326, 559, -5740, -1172, 3598, -1477, -3934, 3501, 5841, -2873, -6000, 1531, 3846, -2076, -1549, 5699, 2938, -5966, -4129, 4834, 3532, -3062, -38, 5424, -1052, -7517, -500, 7361, 2572, -4086, 566, 3825, -3414, -5300, 4699, 7181, -2365, -5579, 2003, 2557, -4981, -1991, 7917, 4412, -6487, -4977, 3710, 1368, -4413, 923, 7000, -1138, -9259, -1862, 6018, 304, -3900, 3126]
4150C126J558j0491k923J1899M516r145k255P146j344r120L422J1962k356j1220
4164e225J448P790m403o498Q746Q139q719r888O596P461o290l601R606K090j2051
4179d799m432J1284M166q339j2Q905l684j2311L574J2919j205j0116K499O701
4193E150p232p337R742J0004q704q596O773M166q827j899J2705L152j3056n112
4207i071J0473K391q395K405J1053l994j3499J993J1722j459p843N775O810r989
4221a628q836R257J0735o866o939O593K723j1372k328J3914M300j1741l748R390
4235C454j093r709L940J3312l175j4003J270J0033l144o979P923Q466r724j0748
4249a0177P677R011o810l900Q994K101j3507l921J3168N236r959j629Q838k905
$$ y = [3126, 4684, -5807, -8730, 3169, 7685, -1460, -3715, 3431, 2087, -7033, -3611, 8351, 5995, -5225, -3777, 4013, -390, -6888, 1858, 9997, 1278, -8610, -2014, 5447, -843, -4444, 5162, 7252, -4799, -9231, 2053, 6219, -2120, -2132, 6773, 3089, -9222, -5648, 7271, 6066, -4050, -1551, 5150, -2082, -9419, 323, 10327, 1623, -6973, -200, 3966, -4861, -6760, 5945, 9097, -3959, -9071, 1402, 3793, -4602, -2197, 8856, 4862, -8637, -6644, 5078, 3619, -4224, 1551, 8361, -1628, -10464, -1207, 9528, 2662, -4277, 2316, 5039, -6333, -8661, 5253, 9553, -2188, -5936, 3454, 2361, -7348, -3408, 9904, 6729, -7274, -6004, 4029, 885, -6094, 1829, 10295, 571, -10177, -2500, 6511, -299, -4199, 4795, 6896, -6611, -10532, 2636, 7872, -2087, -3716, 5122, 2217]
4263B217j1665L696J4013j710j2128K410P956n900p921R958J0388q682j0454O455
4277a367O392p244k981J1100L235j2733n213J0317L716q093J558R336m455j2656
4291i088K515J2670j268r189L818O724p765q328R261J0199o913q323O216M082
4305D611r176k867J2242M076j1213m449Q359J409q243K282J1017l121j2201J184
4319f090R570j913o437N789O817q457q797P659Q729n562n218O785K664r942m020
4334h423J1497N049q718l339P298n74r007K537J0957j394j0217O39P051l163n839
4349e646O337P509o805q430N488N660m930l160P719K271r826l291Q681L523o814
4364a714m59O709k161q656J717R086r61p053J443N953m831n684O003P220m997
$$ y = [2217, -9448, -5752, 8261, 6551, -5577, -3167, 4789, -1111, -9032, 926, 11314, 2632, -7822, -1367, 5025, -2219, -5200, 5900, 9135, -3598, -8811, 1506, 5222, -2871, -1313, 8023, 3568, -9088, -6573, 6097, 4829, -4360, -542, 6182, -1583, -9911, -650, 9549, 2636, -5687, 529, 4611, -4565, -7432, 4810, 8886, -2327, -6776, 1583, 2992, -5251, -2969, 8048, 4927, -7274, -6090, 3480, 1567, -4870, 919, 7736, -721, -9518, -1859, 6870, 1308, -3910, 2875, 5539, -4403, -8423, 3074, 8123, -595, -3934, 3364, 2790, -6217, -3680, 7277, 5883, -4334, -3695, 3356, 193, -5646, 691, 8200, 1395, -7035, -1547, 4113, -817, -3977, 3742, 6013, -3813, -7104, 1577, 5100, -1714, -2173, 4536, 2375, -6281, -4564, 4522, 3561, -3492, -2049, 3904, -927, -6611, -608, 6612, 1615]
4379A615o300M054L517n332k067P689K349p735k903O239J738n207J294O492k158
4394C285q092J124P332j121n302L093M443m883m930M374N616l804l935L432K133
4409B765n549k028O478L311n931k589M987M74n031J216N803j127n759K61M355
4424A636j313l698L974L867m605m661L822M140l121k934L845J950n209k006M999
4439F86K628m212p05L627n16m246M29N371p96m281P36L750k048k722K452L243
4455C396k252l390K273J914k722j028L462J058m706j003M046J110l531l96L723
4470A954l06l901L6L467n3k266N82K222j614k263K183J997j847j714J603J072
4486A152k530j181L126J678k960j231K420O22k189n5K623n22k786L28K655l13
$$ y = [1615, -4685, -631, 2886, -2446, -4513, 3176, 5525, -2210, -5113, 1126, 2864, -2343, -1049, 5443, 3285, -4807, -3683, 3649, 2528, -2774, 319, 4762, -121, -5051, -677, 4939, 1135, -2800, 632, 2765, -2784, -4812, 1666, 4977, -954, -3543, 1444, 1918, -3113, -1897, 3906, 2779, -2980, -2719, 1636, 323, -3375, 599, 4466, -139, -4800, -978, 3162, 41, -2893, 952, 2902, -2307, -4313, 686, 3314, -898, -1603, 2024, 1508, -2738, -2309, 3062, 2266, -2015, -1279, 2471, 423, -2299, 153, 3396, 1144, -2246, 27, 1941, -781, -1809, 1653, 2711, -1995, -2998, 1048, 2158, -1373, -1769, 1954, 1648, -2253, -2217, 1250, 1197, -1069, -487, 1735, 121, -2142, 41, 2038, 191, -1523, 80, 1152, -1378, -2559, 567, 2245, -715, -1946, 474, 1096, -1093, -1148, 1475, 953, -1833, -1505, 1150, 837]
4502H37k392J195K311p07k206N09K052m39j691R22R08j506q39J727L14j469K00
4519b74J563n43j822P2K220l54k299J54J772R0j790N58J848o72j146J05J330p61
4537E1p19M62R20q03r36R76O71o71n17M52K18p13J42L81k98l20O90J000j179r89
4557a182J150J422p39j597N09J670m09j262j9J478p6q28L98j10J22p5j79M0p57
4576d44K72N33l18p13M30P03k18p79M07L80m68m95O30L41n61p16P09R72n78q03
4596g16R04Q17q09p80r5Q48J0r74M60N67m86K90j87k00n9P07k68n22n90R92Q67
4617G76o93r01J290P72p47n96M09N56p45j29N08L2o25l98J258k3q40KQ8L60n92
4638b38k99M82k81J02k12M52m82l8J159k30j381o9J712o2j421l3J172L66j669
$$ y = [837, -1555, -360, 1951, 1244, -962, -453, 1599, 1160, -531, 391, 1299, -207, -1046, 681, 995, -474, -274, 1289, 746, -1076, -1004, 1216, 862, -1437, -1283, 489, 579, -1211, -653, 1195, 523, -623, -518, 812, 51, -668, -206, 714, -89, -1025, -49, 622, -49, -566, -114, 104, -609, -467, -86, -384, -704, -14, 986, -193, -1182, -32, 1390, 651, -946, -437, 1233, 824, -438, -457, 1021, 945, 117, 515, 405, 527, 452, 273, 313, -444, -172, 361, 43, -670, -240, 463, 245, -534, -127, 253, -215, -710, -80, 261, -300, -1016, -307, 665, 87, -716, 188, 1005, 196, -584, -679, 169, 179, -795, -335, 232, -254, 36, -151, -351, -410, 297, 29, -493, -1083, -91, 776, 83, -818, 472, 1244, 497, -99, 310, 866, 121, -8, 500, 532, -93, -491, 767, 744, -96, -94, -6, 354, -238, -537, -55, -336, -234, -446, 6, -476, -514, 645, 415, -966, -1035, 677, 615, -806, -839, 333, 699, -970]
4657i70J24J380K59j129l10J329q83n85O47M32l78j003J276L42p64j62J195j0
4675G90j128J46O42J96j371L77K125j121j992J059K063o10j831O27J236r65k017
4692a774J200J733j147j220J279O03j245p19J737M08j776m22J524k93j369O44
4708h37K393q74k425J507J399r95j778J751J644k269k239K787J565j801j382K509
4724I55Q68k806r47K602P90k772J55K650j048k804J660L152r48k453J041J791
4740A886k044k070K624K822k945k569K878J338l006o40M169m4m327j011M138Q
4756A207l301P46L681j052m462J343M136j416l064K321K344l327k737L500L448
4771C367l181k521L521J144m260o98N309N92m485j465L924l19l865J855N029j856
$$ y = [-970, -846, 534, 793, -336, -646, 683, -200, -785, -138, 294, -84, -1087, 189, 531, -233, -395, 800, 790, -338, -192, 450, 646, -725, -348, 1777, 656, -1336, -277, 1786, 1176, -655, -28, 1208, 243, -1774, -574, 1159, 12, -1208, 71, 674, -571, -1290, 447, 855, -921, -1343, 181, -112, -1481, -837, 1556, 682, -1743, -236, 1163, 168, -1610, 141, 1785, -484, -2723, 64, 1629, -172, -1554, 955, 1823, -983, -1930, 672, 1462, -1310, -1155, 1495, 447, -2357, -697, 2455, 1507, -946, 95, 1886, -158, -2228, 396, 3218, 273, -2296, 582, 1920, -1086, -1726, 2443, 2399, -1928, -2939, 1199, 1207, -2094, -1348, 2333, 1281, -3181, -1838, 2298, 882, -2182, 139, 2483, -844, -3581, -81, 3367, 186, -2335, 1186, 2330, -1930, -2628, 2681, 3273, -1212, -2677, 1247, 928, -2937, -1082, 3947, 2091]
4787B091n604J780M518k052l556L439L637l988m241L883L407l289j889M387R94
4802C517n707j453N671J650m877r15M460j589m967K080O055j738n045J487L828
4817B457l553l131M956M258n260m641M619L299m417j279N995J043o785k077O062
4832A546J287m753J94N416j866o755K154O429j277n376K669L923m839m364N618
4847FN534n137l811M386K193n824n14P120J390p287k524O416L18n751J986O929
4863E430j971p707Q44O494j611m533L565M177o060n041N673N290m684k987N339
4878B218J371p494j603Q247K538p151j481N796r74o521K632Q550k174p886J578
4893b354N426k927m812N612N382o073o346N007M722m078k168O103J559q601j983
$$ y = [2091, -3513, -1733, 2785, 733, -2823, 616, 4253, 265, -3976, -93, 3314, 25, -1864, 2523, 3517, -2190, -3643, 2028, 3678, -1199, -2114, 2346, 757, -4210, -2130, 3925, 2187, -2858, -1371, 2457, -1096, -4227, 729, 4987, -273, -4914, -295, 3004, -1413, -2692, 3303, 4346, -2439, -4516, 1546, 2833, -1920, -1726, 3690, 1824, -4931, -2777, 3652, 2375, -3001, -332, 3591, -1248, -5612, 6, 5540, 403, -3408, 978, 3171, -2653, -3167, 3953, 5343, -1944, -4468, 1948, 2266, -3485, -1499, 5430, 3459, -4248, -3404, 3090, 1479, -3054, 511, 4688, -1372, -6413, -740, 4550, -134, -3121, 2218, 3589, -3905, -5508, 2739, 5277, -1874, -3355, 2441, 1467, -5054, -2422, 6128, 3954, -3932, -2354, 3072, 145, -4667, 945, 6327, 254, -6092, -1085, 3637, -441, -2609, 3494, 5053, -3548, -5531]
4908e531P656J317n400O66N856k728p820L063Q737j942p089K245M861m919m976
4923f004O340O087n882n526M519L233n469j645P953J755q364k109O387R71n373
4938c127J606P068k993p977J656P789j723n348L158N062o496n609O725O099m951
4953I39m872N603J947p137j542Q150K666p659k127O260o07n875K486P649k252
4968C629p802J208O586k906m469N020M696o320n852N394N536n097k834O029J285
4983D103p884j974P851K468o339r69N806j597p398K916Q002j428p110J697N317
4998C461m170m355N445O067n628n817M549L744m491j731O239J825p745k656O678
5013A415J769n632P59N880j990p160J724P192j194n265K242L977m344m842N350
$$ y = [-5531, 2125, 3442, -1958, -1292, 4564, 1836, -5984, -2921, 5816, 3874, -3215, -970, 3891, -1028, -6004, 336, 6423, 541, -4985, -466, 2767, -2702, -4347, 3606, 5361, -3003, -5112, 1275, 2246, -3127, -1521, 5547, 2554, -5423, -3767, 4022, 2299, -3049, 109, 5171, -1325, -6934, -209, 5890, 939, -3933, 1670, 3617, -3520, -5062, 3088, 5754, -1905, -4032, 2228, 1621, -4254, -1768, 5881, 3629, -4173, -2965, 3621, 715, -3754, 1266, 5962, -358, -6210, -816, 4720, -377, -3211, 2818, 4103, -3781, -5755, 2096, 4564, -1775, -2744, 3062, 1465, -5933, -3017, 4985, 3557, -3553, -1856, 3461, -709, -5064, 381, 6448, 820, -4997, -448, 3296, -1195, -2926, 3313, 5138, -2607, -5263, 1415, 3184, -2448, -1689, 4191, 2201, -4959, -3235, 3957, 2763, -2502, -260, 3717, -627, -5469, -119]
5028a19N613m198m943M331K457n344j883O733K238o364k728N159O16m395Q81O070
5044D124j598o715J131N415j321m264L056M386m571m917M484M686l711k818M189
5059A556J916n835j781O152J807n260j112M421Ln347J402N787p50n455J96M280
5075A980j905l141L278L495l518l724L451K989l508j329M335R75n394j625N142
5090A501J655m464k73L870o00m957J354M427p02m023J014K963k369k906L252L421
5106C163k807k999K384J952k786j160L662R77l702j248L471M78k878M36L897r71
5122A869m468J008M171n46l724O41L458k013k543J269L131j747j446J429Q46k379
5138a044n97K931N37l014m71K873l1k597M41K729m50k711K28K217q41j922J302
$$ y = [-119, 5494, 1296, -3647, 684, 3141, -2203, -4086, 2647, 4885, -1479, -4207, 952, 1568, -2827, -1946, 4124, 2526, -4189, -3058, 2357, 1036, -3228, -172, 4214, -357, -5274, -790, 3896, 185, -2633, 1556, 3472, -2363, -4144, 2008, 3815, -1445, -2557, 1864, 1867, -3480, -2078, 3709, 2959, -2496, -2300, 1980, 75, -3066, 212, 3707, 189, -3535, -84, 2905, -603, -1932, 2403, 3378, -2016, -3641, 1501, 3156, -1308, -1581, 2289, 1689, -3268, -1914, 2513, 1811, -2212, -1198, 1765, -604, -3510, -258, 3163, 356, -2643, -259, 1693, -1093, -2253, 1409, 2386, -1316, -2564, 907, 1385, -1493, -1057, 2840, 1869, -2599, -1591, 2580, 2034, -1690, -1049, 2409, 396, -2147, -878, 2253, 506, -940, 489, 1335, -1044, -1641, 1290, 1827, -1187, -1658, 1215, 1184, -1413, -972, 1757, 1307, -1404, -1176, 1041, 200, -1722, -420]
5155d20K329k070k086J826K248j941j512J638J029j890j152K064J066j657k35
5170g63J669m80j442O38K042o53k361J040J668j117j682J636J806j593j559J106
5186d5J365j159j038J074Q25j565n76J643K79j114n39J690K47j631k31J510q8
5203F47j044J06Q01l65q10M32J143j057j039J815N99j811j150J874P66j466q13
5220a372J201Q07p51n40O74M29j149K89O88m68k09M12O95n35p07Q41P48p00o26
5239b73M14O13o68l76M47L47o64k29R48m8p46j87J139n9j070j20J056j0j169K82
5259c73N32K3r4J28j14k34K04r7K92o00m33R06L5o21j50P03L15j106P2L44M06
5280A38o80%L74J36l72L26M11K7o61K17N29l7o72K94L29j54l60Q8N63l37k11N59
$$ y = [-420, 1909, -161, -2247, -421, 1827, -114, -1626, 12, 1041, -849, -2001, 63, 1129, -528, -763, 906, 426, -1016, -378, 1664, 1011, -1350, -310, 1358, 241, -1441, 195, 2001, 408, -1151, -45, 1320, 161, -877, 197, 1022, -543, -1119, 524, 803, -311, -850, 840, 1087, -544, -775, 735, 647, -397, -291, 510, 145, -665, -233, 910, -147, -1186, 629, 1228, -583, -1733, 141, 907, -559, -1372, -171, 636, -115, -655, 19, 448, -701, -412, 276, -192, -401, 11, 706, 171, -536, 305, 1053, 353, -273, 141, 754, 86, -290, 157, 504, -160, -389, 559, 511, -235, -422, 717, 658, -412, -532, 524, 514, -655, -373, 159, 182, 88, 216, 102, -132, 72, -25, 267, -333, -766, 140, 175, -446, -596, 107, 422, -684, -612, -268, 138, -542, -542, -168, -32, -404, -78, 333, 360, -301, -84, 445, 408, -264, 30, 359, 205, -155, -67, 496, 159, -52, 507]
5302E07j90l87k46N88j57p83L33Q24l59l76K46K94j52n30K9P14m70j99L13J25
5322A24j03o16P68M13p75q0K68K33q79M71M70l64o76M32N92j89n82N36N92o15
5342B0n93L51O20k46n22N49L71p97m7Q53j7k52k16J81N08j041j37Q74l7r20L89
5363a09Q61n76r24J067P22j099p61P65O95o12n85J100N4j158j18J120J17j269
5381g10K76J065l65j047M37J079m14j317O87R41n94r49Q32Q98j234p55J367L87
5399E84j030j35J199L23j603JJ636m47j426M45J948j274j565Q58J905q40j283
5416g04J209R26j518j261J614J120j586j023J829N65k037l80K245K14k081pJ733
5433H58m34k009J343J711j208j466P02K153k080j365K376J379k308j710J969J624
$$ y = [507, 317, -70, -316, 272, 115, -668, -335, 489, 130, -246, 0, 294, 142, -388, -359, 355, -115, -314, -1, 124, 21, -595, 173, 586, -189, -269, -1, 232, -647, -176, 294, -70, -746, -314, 278, 89, -493, 43, 635, 20, -573, -222, 398, 152, -370, 179, 550, -247, -294, 559, 542, 290, 74, 255, 763, -278, -415, 459, 422, -498, -109, 752, 176, -748, 319, 1041, -58, -819, -54, 641, 29, -556, 544, 598, -560, -678, 442, 559, -710, -434, 631, 266, -781, -344, 735, 321, -996, -309, 632, 38, -911, -79, 819, -415, -1170, 197, 584, -446, -581, 618, 941, -662, -661, 975, 528, -898, -453, 1495, 221, -1344, -486, 1419, 579, -704, 505, 1431, -87, -1348, 266, 1386, -200, -1223, 606, 1171, -866, -1246, 999, 1213, -868, -875, 858, 424, -1585, -242, 1469, 261, -1205, -503, 1650, -430, -1795, 581, 1960, -348, -2058, -89, 1535]
5449A535k118p49K010M90k346j84K232O43k328J55K123r95k540J532K643j297
5465H06k161J129J823j945j557K334J902k480j738K319R00k760q6L510J05l845
5481a744l81L232K44k819P07L090j609k967J038L069j164k289J955J684k990j926
5497b870L314K175l141j536K712J033l856K43M277J35m187l03L396l79l500J594
5513h93M048j894m521J929L867k071k673K728K713l821k353L082K472k697j202
5528a286L388j16l914m46M462M42m312L11L815j856l687K225M405j835m089J650
5544h43K929k450k690L931K789m311k565L364K032l723o83M284P97m764r13M336
5560A520K23l297R66L455k222m593K474M549j546m055K614K599l509k856M026
$$ y = [1535, -583, -1332, 678, 1168, -1178, -1362, 870, 1513, -815, -660, 1463, 468, -2072, -540, 2103, 806, -1355, -226, 1597, -348, -1905, 429, 2331, -149, -1887, 432, 1332, -1428, -1514, 1996, 2101, -1744, -2125, 1107, 1351, -1468, -761, 2329, 720, -2247, -1209, 1860, 696, -1593, 362, 2046, -944, -2870, 444, 2619, -522, -2058, 654, 1687, -2169, -1926, 2351, 2486, -1701, -2004, 1392, 1013, -2487, -893, 3155, 1261, -3260, -1331, 2536, 465, -2208, 520, 3233, -588, -2941, 141, 2613, -84, -1286, 2102, 1986, -1928, -2374, 2088, 2530, -1782, -1471, 2344, 488, -3199, -974, 3431, 1596, -2493, -843, 2086, -364, -3054, 877, 3666, -645, -3210, 154, 2186, -1537, -2220, 2064, 2861, -1903, -2816, 1520, 1743, -1554, -588, 2867, 645, -3948, -1474, 3075, 1529, -2526, 88, 2687, -822, -3678, 348]
5575C48L499l542l207L823J425m109m30N004N95n107o40L935K4l811J456M346
5591C609k316m948K024L985j775l244L348K630m508l139M312L300l623j993L704
5606A366R51m935n15N559N26m827r6L732j202m054K315M862k023m719J659L682
5622B281k472k570L684L040m770l045L719K766l535q71M204K1n065n30N100O81
5638B638m122K39M048j742m740K442M937j946m185K264K837l342k533M390K841
5653D026m286k873L270J720l841p44N374L81n538l79M276J03l839J521L951k076
5669A046m985K080M781j916l376K582K625l585l439M470K902l398k266L436J149
5684B106m462j78M881P54m389q21L831m93m005K000M355j785m725J788L528j986
$$ y = [348, 3847, 305, -2902, 921, 2346, -1763, -2193, 2811, 3406, -1701, -2341, 1594, 1618, -2193, -737, 3609, 1293, -3655, -1631, 2354, 579, -2665, 683, 3313, -1195, -4334, -22, 3278, -345, -2338, 1366, 2317, -2618, -3133, 2426, 2952, -1875, -1971, 1761, 559, -3495, -1180, 3682, 1659, -3060, -1401, 2281, -191, -2761, 923, 3963, -807, -3852, -133, 2633, -902, -1773, 2431, 2452, -2613, -3143, 1957, 2638, -1484, -1245, 2803, 1061, -3679, -1237, 3700, 1754, -2431, -167, 2670, -672, -3205, 1185, 4026, -260, -3133, 137, 1857, -1984, -2728, 2646, 3027, -2511, -2890, 1386, 1489, -2350, -829, 3122, 1046, -3939, -1859, 2922, 1006, -2370, 212, 2837, -748, -4187, 283, 3185, -213, -2479, 957, 2106, -2356, -2534, 2347, 3101, -1288, -2109, 1722, 1229, -2776, -776, 3579, 1794, -2931, -1143, 2385, 399]
5700C99k347K989K761m596k785L899K626l646j319M134K53m671r17N125M73l894
5716a516M2L157j012l813J991M158j923l601J826K369k335k127L299L099l633
5731a9k892K988J654k862n54L771J00l877q88L986M81l484M35L685j422m153J689
5748a362L988j305l034J573K434k657k328K966K588k795k041K628R99l260m22
5763b028L922N34l906o69L144L16l108P77L181j449l247J345K844j612j965J917
5779dK238k906k183K732K494k251k035K459O87k461o00L051N01k821K4K408p57
5796E76k480J280L008r63l302J121K581j458k181K101J896k288j586J550J842
5811A697k050j094K663M50k625p96K843N30k630q7K390n65k140O25K155o52k372
$$ y = [399, -1948, 1041, 3802, -794, -3579, 320, 2946, -700, -2019, 2115, 2368, -2303, -3220, 1905, 2378, -1516, -1474, 1683, 671, -3142, -1151, 3007, 1084, -2517, -691, 1678, -657, -2784, 515, 3614, -19, -2911, 77, 1731, -1131, -1685, 2086, 2186, -1691, -2579, 1407, 1888, -1596, -1161, 2524, 1102, -3051, -1362, 2626, 1321, -1713, -140, 2294, -363, -2691, 275, 2863, 68, -1973, 655, 1654, -1606, -2028, 1894, 2428, -1478, -2147, 997, 1313, -1795, -1018, 2163, 714, -2533, -1188, 1656, 44, -1921, -4, 2234, -672, -2855, -123, 2371, 120, -1915, 544, 1231, -1230, -1830, 1221, 1722, -1099, -1075, 1333, 576, -1904, -624, 2384, 1421, -1881, -760, 1821, 363, -1818, 283, 2179, -109, -1695, -145, 1697, -353, -1447, 1216, 1666, -959, -1755, 1088, 1618, -1012, -1099, 1291, 726, -1414, -789, 1366, 714, -1658]
5828a658J168J621j328j752J959J788j893j503J411J393j669q99K036O86j957
5843e97r05J855J57j427K91J804n65k101Q33J668l98j526O79J373r06j575J374
5860C4Q89o64q64Q11O45j515j81J527M36j725j6R40N51j377j98J922l44j648J53
5879f24J017j38j011O93Q72j006q98J247Q28j400m45J023K32j096l58J042Q48
5896H26j213j95P97l79o79N38J077p19o42Q8P76j77p66N48R34m72o80P5P96o69
5916a36q9M40L34r49k7P01J04o70l4Q03j17o84j16R14K18p52L2L03j50o37M95
5937a7L17l46m39J56R20p17m82P20K87r39K11K16L55m69j86O26k84j83j49P18
5957C15o8p18L12M76j29m03J00M03j90k23J2K22kj68L60L1k70o8N2K52m23k69
$$ y = [-1658, -490, 1131, -197, -1949, 10, 1798, -95, -1598, -187, 1206, -463, -1362, 674, 1360, -597, -1502, 353, 510, -917, -626, 1178, 613, -1488, -655, 1013, 615, -911, -232, 1141, 235, -1340, 34, 923, 259, -605, 206, 851, -664, -845, 682, 1118, -607, -623, 317, 868, -509, -707, 1215, 871, -777, -624, 393, 255, -756, -63, 809, -197, -1095, 152, 980, -420, -865, 158, 390, -706, -1064, -22, 826, -387, -582, 215, -164, -843, -305, 772, 53, -589, -501, 275, 98, -668, -120, 814, 342, -338, -263, 533, -136, -225, 215, 549, -400, -427, 274, 378, -292, -326, 477, 360, -324, -440, 474, 692, -60, -28, 275, 125, -512, -17, 300, -46, -485, -329, 591, -126, -608, 112, 399, -540, -329, -113, 242, -227, -413, 213, -71, -254, -403, 315, 247, -471, -159, 317, 188, -215, -115, 288, 98, -125, -113, 109, 107, -61, 299, 330, 60, -8, 44, 296, -127, -396]
5979c96M14K16j82m06M29J88m32O3L99k70K41j27m5P1n46N58L49m39j72K38j38
6000A3n20J42M01J04m37L6J91n8Kj21L84q4k09j95M91J81n67N4Q64m79m33K39
6022am7j37j83O26P0k98j82L47K14p48J67N53l91o4Q2L04l7l99K84P4k67m73Q49
6045C43L18n19l82J57M86n81k55N75J44n22k36M68K39p84O23j46q6n09K94P38
6065C65n13l29M32L58o79l25P47M08o60l30Q37P5p55j10P84J3p05J27J036n83
6085A93p16O9J315n94r16L50R40j024j89Q85P08j204m87Q19M44q02l58R12J62
6104E07q75l05J153l97m57K86Q15p69p07O07J176j043q63R78L97o02r47J052J233
6123A239j589n14J047L48j028k20J575k05j184J06J296j50j725P37J543r39j797
$$ y = [-396, 18, 234, 52, -354, 75, 263, -169, -106, 293, 23, 264, 137, 92, 163, -383, 175, 524, 85, -87, 151, 13, -507, -365, 36, 140, -297, -261, -70, -128, -126, -247, 137, 53, -156, -351, 140, 321, -246, -192, 672, 193, -240, -1, -48, -185, -368, 258, 328, 30, -152, 195, 409, -339, -172, 381, -10, -74, 8, 312, 275, -124, 160, 234, -33, -506, 343, 661, 142, -240, -83, 403, -178, -433, 142, 286, -236, -472, -4, 235, -549, 74, -72, -158, -667, -373, 365, -148, -477, -45, 313, -366, -691, 56, 464, -196, -526, 311, 386, -369, -479, 305, 318, -387, -260, 776, 193, -523, -454, 861, 267, -649, -299, 641, -383, -572, 313, 1021, -183, -670, 149, 593, -209, -567, 345, 507, -368, -673, 480, 83, -374, -88, 727, -42, -749, -142, 1034, -9, -872, 106, 503, -99, -1046, 6, 1239, -350, -864, 183, 531, -497, -717, 858, 653, -531, -425, 871, 721, -1004, -267, 1276, 337, -1460]
6140a460J102J608j103j132J382Q22j690p24J701J048j842o41J664j54j272K20
6156d71J545l7j865L29J410k88j798P55J726j244j631J256J214j302n65J587Q03
6173A424k050j077J982P42j683o8J740j14k077M6J935N9j760M62J783j190j869
6190a715J458J925j427j669J353J377j840n78K094N67j954j105K307K77k046j68
6206a144K587o6k766l1K702l74k072P49K026j061k711J422K397j306j744J735
6222C43J056k213j308K528J500k568j060K380K68k526J60L196l54k924K62K570
6238A310j084k220J701K136j586k467J639K253j974j392K444J513l101j396K475
6253B51J512k272o62K550l92k769K84L352k92k886P68K366j586k535J785K903
$$ y = [-1460, -358, 1250, 147, -985, 397, 1219, -471, -1195, 506, 1554, -288, -929, 735, 581, -691, -471, 1074, 1037, -828, -499, 911, 623, -1175, -420, 1306, 62, -1569, -313, 901, -401, -966, 621, 1424, -626, -1703, 279, 1021, -662, -730, 1010, 896, -1181, -1135, 800, 859, -901, -439, 1344, 154, -1715, -257, 1668, 241, -1428, -75, 1302, -538, -1116, 978, 1545, -409, -1514, 793, 1070, -976, -1144, 1443, 1377, -1389, -1420, 1282, 908, -1164, -415, 1611, 550, -2161, -739, 1658, 352, -1392, 343, 1399, -814, -2122, 406, 1906, -662, -1722, 658, 926, -1600, -1440, 1756, 1402, -1522, -1260, 1310, 226, -1994, -293, 1843, 257, -2210, -571, 1682, -292, -1684, 760, 2273, -828, -2224, 251, 1763, -509, -1171, 1379, 987, -1782, -1498, 1854, 1562, -1324, -556, 1810, 224, -2311, -526, 2377]
6269B377j557k592J788J889k508j377K790J602l344j376K801P59k094n67K820
6284A411J3l560L08L308J11l258J062K594j789k957K166K988j683k677J905J838
6300A780k495j543K883J846k935j144K888J91l051k72L996j11l712K70L090j101
6316E80k252J568K616j794l215J854K632j920j848K521J604l337j428L049J701
6331B331l280o53K316P28l058p7L477k06k896Q5K924j402k754K434K495k070k825
6348b431K002K065j943j593K606J794l213j583K450J324k186m90L067l47l367
6363a845j1L720k99k715O16K341j371k873J937K720j537k339J933J499k369j468
6379b061K968J602l342j320K953N43k736M0L234L4l376j98K902j05k547J047K457
$$ y = [2377, 820, -1772, 16, 1905, -603, -1980, 810, 2412, -932, -2308, 493, 1252, -842, -1409, 1411, 1424, -2136, -1828, 1480, 1591, -1667, -605, 1989, 200, -2757, -591, 2397, 714, -1963, -58, 1780, -715, -2258, 625, 2471, -464, -1608, 1280, 1471, -1580, -1852, 2144, 2033, -1679, -1409, 1681, 580, -1672, -104, 2512, 718, -2497, -643, 1989, 69, -1779, 742, 2346, -991, -2419, 630, 2331, -949, -1602, 714, 1442, -1616, -1693, 1784, 1578, -1318, -1233, 1691, 289, -2465, -31, 2464, 394, -2431, -429, 1636, -307, -1900, 706, 2500, -713, -2296, 154, 1478, -708, -1198, 1869, 1522, -1845, -1856, 1864, 1565, -1150, -534, 1807, 436, -2437, -500, 2220, 683, -1656, 277, 1776, -593, -2061, 907, 2509, -833, -2153, 800, 1343, -1393, -1353, 1881, 1915, -1461, -1659, 1243, 1138, -1409, -362, 2095]
6396B095j685l081J835K787j785k050K203J751k871j379K643J776k733j057K439
6411H88L02l135P02K860K9l053L06K352p94k066J416K526j678k642J797J852j572
6428I0j510J987J291k392j539K722R47k333n87K303O9k406n5K903j55k513N81
6445e97K050j366j815J556K029j324k342J508J586j663j407K386J505k509j367
6460a770J874J092k146Q4K109l01k228p4K258r9j614N76J700j339j836J350K006
6477A642j346j782J566J428j747j323K025J204k204p42K217J10k040J17K430m20
6493A135k059k54J878oj933Q21J779q62j823R58J374n90j401J225O08j197j112
6510a459J803P96j526n78J294M68j657k96J833P3j796K64J320P3j348K68J641
$$ y = [2095, 410, -2671, -836, 1951, 166, -1884, 319, 2070, -801, -2180, 463, 2239, -494, -1551, 888, 1190, -1945, -1243, 1617, 1646, -1407, -1101, 1251, 457, -1609, -193, 2333, 655, -1987, -190, 1662, 90, -1420, 567, 1858, -534, -2073, 649, 1596, -737, -1324, 979, 1048, -1358, -1413, 1490, 1335, -1178, -597, 1453, 87, -1728, -172, 1857, 533, -1809, -301, 1285, -378, -1785, 601, 2106, -403, -1770, 104, 1196, -950, -866, 1243, 942, -1286, -1360, 898, 799, -815, -239, 1461, 122, -1714, -364, 1642, 296, -1486, 80, 1508, -239, -1562, 463, 1667, -537, -1279, 938, 1048, -992, -875, 1555, 1135, -924, -1178, 700, 694, -1239, -418, 1361, 499, -1324, -366, 1008, 418, -983, 242, 850, -347, -1459, 344, 1140, -386, -964, 330, 798, -859, -1155, 678, 751, -1045, -781, 539, 612, -736, -468, 1173]
6527A173o97j505Q77J003o98j185J162R82j455q50J347O27j082k08J406P6j532
6544e59K8J322j96j220K44J227n09j294J90J543l88j236M84J190p56j029J136
6561A77N43j031p30R66L03p59j98R29O09j360J01J030m39o00J36O36l28p54M50
6580c19Q68m43p29O36P14o83p56O93P09p25l52K30O42o52j40P49l9n84J44J05
6600F8L57r36L21R53n03m67K31L14m15k47K4N96l14o46O85L38n14j90L00M49m64
6621f0n1L48l5k43m98O86N5k67j38N05R0j129P68j6p4k81L97L58m70n9J66J41
6643A93m73J63L5N08o66LL95J08k34R1J03j83J89j76J43pl44K63M20m21l71K86
6665B5R9j35q0k07O16k74n14K31L66l66J48J02J03K4m20M47l01k98j07P00K33
$$ y = [1173, 476, -1029, -152, 851, 153, -1032, 130, 1112, -343, -1193, 154, 781, -301, -509, 897, 973, -559, -531, 791, 595, -625, -381, 846, 337, -957, -767, 776, 388, -848, -364, 826, 70, -959, 177, 720, -311, -1041, -75, 228, -531, -729, 200, 809, -551, -450, 580, 141, -459, -323, 313, -15, -769, -319, 549, 106, -623, 13, 727, 44, -712, -19, 690, -35, -387, -157, 485, -167, -307, 442, 403, -181, -37, 68, 425, -511, -190, 763, 260, -207, 24, 338, -77, -324, -300, 296, -18, -664, 21, 359, -155, -345, -45, 404, -60, -111, 237, 202, -41, -539, 147, 202, -65, -203, 302, 392, -737, 31, 15, -59, -340, 57, 415, -55, -114, 52, 193, -280, -117, -82, 426, -240, -237, 158, 266, 32, 123, 226, 43, 232, 56, 199, 192, -152, 111, 531, 110, -261, 25, 124, -11, -91, -298, 318, 44, -470, -239, 127, -239, -91, 11, 114, 138, -282, 165, -136, -434, -541, 159, 392]
6686C92l11n15O58j68k84J44K6Lq4p9J85q1oK26O2m99K06M17q5j38j49J01K36
6709B57m39L97J89j81k43p5N38m92K6N4K12k55k51O38l46k56l55P40J25m41N0
6730a08J62L32q22L14M17o07J6K53L73l57o14M14O35m22l12L96J34j97m78O29
6750A58J15m15k88N37j6l86o8P93k1m94K1L22k63k28J56K87m65J63L54J85m70
6771b3m64O42L81m30l52M59Q1o87KP37%r81M61N1M63o74j3N30oq94O45O17p32
6794a87m26N09K39n65k14Q17K57q21j07J228l35q01pR53k82p44L66M91j00r67
6814f96O34M69l11p41L32O75k26p47Q87M74j068l50R10L06j067K75Q91j30j134
6833f17L23R61j53j012l0J607r39j285R75Q62q02q79J044N22r65l60J057O67r21
$$ y = [392, 81, -434, 224, 56, -228, -84, -58, -55, -139, -218, -33, -114, -120, 106, 168, -331, -125, 292, 207, 69, -80, 21, 257, -182, 215, 404, 223, -20, -95, 443, -49, -23, 31, 243, -12, -263, 375, 29, -227, -582, 158, 283, -158, -108, 54, 386, -436, -122, 295, -312, -296, -43, 330, -27, -641, -227, 408, -14, -326, 70, 204, 7, -471, 158, 273, -142, -430, 107, 91, -295, -363, 430, 409, -85, -64, 258, -5, -233, -77, 210, -255, -92, 262, 447, -23, -487, 155, 536, 106, -246, 213, 294, -393, -391, 346, 346, -635, -174, -123, 340, -334, -347, 183, 177, -717, -72, 545, -187, -613, -104, 135, -430, -644, 173, 430, -391, -498, 730, 395, -406, -413, 540, 258, -486, -120, 371, 271, -696, -62, 407, 96, -645, -313, 362, 136, -611, 276, 750, -318, -668, 242, 548, -519, -244, 647, 517, -617, -294, 667, 514, -498, -528, 1079, 140, -1145, -170, 692, -110, -989, 55, 577, -388, -748, 309, 976, 55]
6852E5j061J406J37j364L54J096j19j263N41R17l41j115P69R14p40j084R93R04
6870I99j110p74J224M59j162n65J369M40j285k30J049J39j178K69J219k85j372
6887g94M22J093m97j292J280J099j016j650J363J019j568l25J051J048j774n97
6903a138J614L30j638K09J226j12j820P66J954q18j698M15J737q75j666J528J425
6920A439j217j358J331N32j301m00J840O40j971n87J631M48j828K54J539J12k119
6937a015J01K118p77j513R46J350j258j534J517J292j307r11J395Q35k014k32
6953a007J600O18j666n49J902j33k262L43K246j47k293M94J992r38j634J329K086
6970A981k216j867K033J238j493q94J748Q41k266n27K107P30j892k09J880o31
$$ y = [55, -1006, 400, 537, -827, -473, 623, 504, -759, -218, 699, 358, -757, 12, 926, 186, -898, 95, 999, -111, -885, 339, 798, -364, -929, 440, 880, -405, -635, 414, 553, -625, -356, 863, 578, -794, -372, 721, 224, -1068, 212, 1311, 295, -1355, 8, 1027, -541, -866, 185, 1233, -541, -1138, 476, 806, -832, -623, 603, 491, -1329, -563, 1391, 573, -1125, -710, 1027, 152, -1514, 14, 1439, 222, -1136, 195, 727, -574, -974, 866, 1506, -465, -1052, 579, 1027, -801, -547, 992, 1104, -1015, -914, 1204, 427, -1086, -140, 1210, -48, -1582, -65, 1227, -80, -991, 404, 1239, -775, -1007, 593, 1211, -455, -1004, 898, 765, -1497, -1154, 1092, 945, -1348, -854, 1138, 200, -1434, -105, 1981, -235, -2102, -69, 1169, -324, -1218, 530, 1371, -895, -1422, 685, 1415, -477, -686, 1194, 563]
6986E63k211Q59K236n38j634L58J594j128j870K147J353j551j697J907J102k214
7002g24n04K154J191k979p12K245N40j979o6J998n2k298L6K410p41j451P38J603
7020A409j505j759J623J770j378j461J767O13j920n58K075O43j836n90K038r0
7036H41k077N95K212m32k556N28J955o85j331R70J371j273j851J288J661j438
7052b22o00J208Q49k091o92K286N30k154o7K132m67k272O04K468j39k349N04J489
7070A017o82j875J280K059j573j776J211J325j317q05J722O59k079o34J831P17
7086A080j830J45J766l90k087L78K308o37k023Q94J875j435j560J508J446j278
7102A60j573J485J207j846p97K181P01k163m71K044k82j402N36J397k55j615L10
$$ y = [563, -1648, -789, 1447, 909, -725, -367, 1227, 99, -1771, 376, 1729, 178, -1519, 388, 1490, -724, -1228, 926, 2117, -862, -1574, 671, 1211, -768, -834, 1164, 1112, -1186, -1150, 1260, 519, -932, -194, 1409, -96, -1855, -232, 1538, 160, -1301, 466, 1079, -841, -1399, 676, 1319, -517, -1107, 931, 841, -1236, -641, 1571, 1139, -1417, -889, 1066, 381, -950, 20, 1391, 118, -1733, -445, 1216, -222, -822, 386, 1235, -856, -1548, 738, 1268, -886, -953, 1179, 712, -1560, -956, 1512, 1373, -976, -472, 1017, 335, -1540, -260, 1799, 226, -1550, -339, 986, -331, -1136, 586, 1245, -834, -1468, 363, 1080, -750, -605, 1161, 771, -1316, -938, 1370, 733, -1290, -396, 1479, 44, -1516, -8, 1438, 160, -1413, 72, 1279, -567, -1364, 817, 1518, -645, -1116, 928, 646, -756, -220, 1177, 922, -693, -383]
7119c83J357o49j184P39J510j234j569J148J694j215j543J774O35j714n94J678
7135D50O09j503n67J444Q2j477L08J734l71j406j56J908r51j233J178J259q88
7152D20j582J213J148j348k19P25N20j519l08J444M14j332j63J526k37j693K65
7169g26J629n1j435K39Q60m38j404J280R81q48j294J230J051j614k71J032Q18
7186A039j504o10J297M11j385L38J118l95j240L72J219k57j300N93J091o82j044
7203i39R13Q51n81j056R00N52r83j30J025J7r41k62R54K22j070Q7J248k13j005
7222d11K31P68m04p35K01J201j079l26N58M11l05o34N76P83q36o66Q67P10j155
7241b45m54J036k63n49J66R90j51j335L85N98j04p33L33Q07m30p05N19M73m75
$$ y = [-383, 974, 325, -859, -120, 1390, 156, -1413, -265, 1429, 214, -1329, 445, 1080, -634, -1228, 450, 1059, -444, -1011, 433, 515, -962, -654, 1080, 709, -697, -853, 1055, 104, -1129, 49, 1308, 420, -1162, 51, 1199, -149, -368, 357, 877, -642, -950, 494, 908, -424, -587, 939, 702, -991, -726, 903, 852, -583, -344, 516, 78, -1326, -46, 935, 87, -1207, 23, 1074, -540, -811, 221, 1039, -465, -1075, 222, 633, -752, -414, 704, 309, -931, -559, 660, 403, -897, -304, 787, 105, -939, -26, 825, 244, -812, 88, 640, -343, -473, 552, 569, -372, -634, 320, 542, -528, -441, 807, 594, -411, -180, 588, 184, -551, -350, 851, -228, -554, 4, 415, 110, -524, 52, 835, -1, -667, 200, 910, -245, -699, 337, 74, -475, -309, 681, 530, -805, -420, 178, 74, -659, -326, 481, 51, -654, -135, 338, -137]
7260a37m86O35N58j034j41R92Qp52p5J029k22r01K08P43M4r08K63N52q7p53N07
7281D3L70l66n63L85M61k96j97J80N66p12k17L47M24p61l5M88K19p02J09O09j09
7302B43p18j18Q65k48l04K67M78m01m45O28M0m60m6K63L09l54k94K11K94o51J16
7323c25L49R2k21k9K25K5l13L84J23L8o38K5N15Q8l89j41N85k70m33L52J41k70
7345h7j83M12o5k27k17M30o7k21K3N51l14l28j66L73N1k75N7K96K82l23J69k17
7367d6Pm4KL34n55RL43J36j48m56P97j12J7n90L26J55l70J12L9J51k03L50n3j26
7391G5l28M16j38j89n6K87n6J89l41N08j83j75J1J50r7k13K3j17K01j71K20J5
7413C1k30MNM31r8l67K32m1l9j31J94nr1%J44N2q5k45M18j41j71K11J81k19l76
$$ y = [-137, -623, 12, 570, -464, -605, 387, 395, -357, -432, 597, 375, -526, -318, 425, 469, -439, -176, 376, 289, -464, 43, 413, 47, -516, -131, 330, 34, -163, 17, 583, -129, -346, 1, 425, -336, -371, 117, 336, -366, -257, 352, 243, -475, -593, 272, 24, -280, -13, 465, 64, -381, 247, 287, -173, -219, 44, 353, -1, -295, -84, 210, -441, -325, 24, 116, -105, -134, 91, 116, -197, 187, 310, 348, -290, -265, 250, 338, -51, -192, 393, 123, -310, 42, 183, -87, -270, 142, 77, -150, -367, 63, -4, -225, -202, 349, 35, -293, -459, -86, -35, -310, -253, 43, 325, 2, 171, -46, -39, -83, -81, 253, -302, -293, 50, 186, 38, -418, 379, 267, 284, -306, 20, 175, -195, -83, -44, 107, -96, 254, 201, 75, -253, 163, 25, -164, -220, 67, 11, 200, -141, 367, 184, 9, 20, 170, 73, -140, -117, -234, -33, -204, 16, 31, -199, -195, -190, 241, 143, -224, 8, -33, -72, -203, -9, -14, -105, -105, 39, 91, 6, -239, 179, 38, -133, 78, 259, 40, -336]
7438c36M23L96k09k58k35M35m01r7M97n4l66QK14J25k54k65O25m9o03M68p4N2
7460D2m15K15J89m1j02L37j00lj42mM0j20O9j59J74m9j88R7J08l2m4ML66p89L46
7485b01L03j0n49M79M96m97l03K81L23k72k01j05Q49q66k6O29j82k20l8N65j3
7506D42p01j25Q19m57k85O6N74k88p36O80K77l51l60N78J56m53r6M96J35q15O9
7527c75L57K59n49K43K82k72m14L19M44j93o40K87R12p50k29O00L52p06m53P93
7547B67K99q42k69Q71K05q90j14Q48j87l81R1Q32n27o76N86M28q58j85O90J63
7567C51k44n13L46Q35r63m07P85J58q09k07Q88L59r79k14R99p3j146M06Q70J35
7587E77j282N88O50n26m95K86Q18p41p26J113L82q22m97J114K41j279k12J286
$$ y = [-336, 87, 483, 274, 16, -219, 216, -185, -282, 215, 161, -205, -197, 17, 142, -112, -377, 248, 199, -404, 64, -10, 42, -373, -158, 31, -10, -112, 225, 125, 122, -20, -24, 16, -104, -35, -194, -20, -69, -257, -160, -52, -84, -128, -124, 242, -547, -201, 102, 92, -457, 22, 518, 21, -282, -1, 322, 50, -151, -256, 593, -273, -299, 330, 148, -72, -110, 455, 442, -259, -384, 435, -22, -307, -241, 333, 45, -691, -11, 266, -85, -445, 133, 289, -164, -260, 236, 371, -444, -375, -18, 241, -308, -65, 217, -55, -469, -150, 294, 101, -539, -252, 660, -90, -319, 281, 633, -73, -526, 267, 566, -276, -545, 326, 531, -359, -473, 375, 188, -193, -102, 730, 203, -473, 113, 541, -317, -502, 188, 351, 107, -406, -60, 775, -188, -595, 190, 348, -461, -668, 220, 579, -400, -614, 385, 312, -834, -428, 442, 577, -705, -117, 533, 7, -488, -202, 616, -125, -851, 262, 644, -178, -675, 439, 680, -599, -811, 475]
7605D75K7p17k54J074m42r21N81J219o53r47K78R03l87j163J193P07j040p59J073
7624B47K07q66k27J073M48j412l25J129J96r48L32P59l84j205N48R87j65j028
7642f34O40R25j085q57J000R32r61q60J235J06p76l17J289Nj363P9J194O0j230
7661f18N35R44m07j619Q78J006m32j015O76R05r31r26J043O28p35n95J104L12
7679G53j576r8J635n2j395M16R09q3j617O22J626q98j120L24J488j117o51J013
7697A79P79j373m81J053P06j058n26J435J15j489k5J583l80j273M28J082l74j196
7715h15K91J676o47j227N65R38q97o78J155Q19j574l23J172L37j251n09J600K76
7733I08j527j70J491j51j037L78Q74p40r19M65J257r28m73Q14Q77j343r77J273
$$ y = [475, 502, -215, -469, 605, 163, -758, -177, 1042, 389, -558, -280, 623, 236, -927, 266, 973, -67, -826, 247, 454, -412, -639, 434, 882, -530, -855, 274, 470, -478, -146, 613, 229, -976, -428, 559, 394, -634, 6, 931, -154, -1011, -11, 921, -40, -900, 335, 441, -335, -652, 637, 642, -721, -642, 552, 612, -618, -83, 861, 454, -1165, -287, 719, 287, -728, -52, 853, -78, -1004, 39, 667, -68, -663, 441, 753, -823, -921, 714, 662, -733, -317, 592, 509, -1108, -486, 1140, 242, -878, -554, 934, -183, -834, 179, 958, -415, -896, 157, 863, -195, -721, 714, 829, -660, -685, 898, 518, -755, -327, 755, 381, -815, -524, 1152, 505, -722, -157, 781, -116, -794, 361, 1180, -394, -717, 455, 792, -459, -968, 632, 908, -619, -789, 702, 551, -486, -108, 766, 26, -893, -428, 829, -99, -572, 242, 1119, -224, -1201, 72]
7751G2Q80j329j53Q87J30j017k54J305J68j236l92J654l31j040K59J328o42j253
7769i64N87R54n10q37P12R46j174n83J432J75r58m76J211J28j380M9J606k62j329
7788f73K57J166l62j389N17J325l14j448O39J093r34r55J156R72j238o15Q29M26
7806D52q11j82R04M59j632r3J492n8r61QR41m8j317K13J313o29p55O09R06j216
7826d05o70J113P34q60n14N61O16j087J79P73M14j140p6Q80P4j395O71P66l11
7845C23j089N24J223j078m08N03R71j036o00P85M18p83k70O90J17p90n90J333
7863B43J00p80J0P15j47n04j95J202l61j114M88R64p12m50R50L42r28l00M57Q18
7883G98p66l72Q09J24j041r2J052j77n60j91P44j09o64L07N81j95o81L29O56m55
$$ y = [72, 952, -377, -530, 357, 487, -530, -784, 521, 689, -547, -939, 715, 384, -656, -397, 931, 289, -964, -377, 577, 67, -770, -58, 888, -286, -869, 563, 738, -220, -696, 515, 643, -737, -688, 918, 656, -673, -416, 750, 388, -1001, -484, 841, 527, -921, -282, 811, -123, -1078, 78, 1050, -188, -803, 26, 452, -359, -541, 363, 822, -810, -903, 589, 531, -430, -422, 519, 471, -846, -633, 680, 51, -704, -95, 811, -405, -1075, 38, 772, -88, -602, -41, 575, -512, -333, 440, 854, -286, -362, 518, 592, -803, -132, 634, 323, -766, -242, 981, -97, -505, -2, 969, -67, -667, 118, 536, -247, -517, 173, 290, -500, -1090, 243, 343, -437, -427, 288, 141, -363, -558, 644, 283, -831, -343, 621, -91, -541, 409, 751, -177, -477, -20, 798, 32, -340, 469, 593, -448, -540, 512, 335, -225, -416, 328, 219, -445, -138, 443, 248, -433, -104, 552, 97]
7903I7o41N62O37r67k74P33O54r61p7L78L41n88l78J058k44m23l45N92N2o66K60
7924b00O54k82n11n2O26k41m14Q07M0n88k42J57N06k88o4K46mk52j46O47k60m31
7946b92J18M01k06m65L05M31j34m60J87L92k6n82M39k7j02l62O15k79k76K64J09
7967E0M6k37j70L88J24m88K48JK43k77j29L57n8n13L67N1P7k72Q6L94k97l34L48
7990Ej06m4j11K67J49l49OO55m61j07j85O05om67KJ83j58K1J80J42q1m40k2M42
8014A20J2m32L96J07k12n7lL35l67j46N24k18k44K12N0k31j69J73K68k25j78J33
8036a52K22j49J6j08K95L4j03l4K74m98M1M96n32L01k72N59l66R2k1K35k0k47
8058F3j56Q0N6K5n9R7J0l07K28q2j85J15L55j60n4m31J84M84n6k64K74l39j95
$$ y = [97, -544, 18, 655, -312, -586, 147, 801, -160, -237, 141, 482, -106, -484, 574, 330, -93, -438, 154, 206, -460, -200, 454, 172, -339, -391, 235, -6, -420, 387, 427, -161, -403, -246, 260, -28, -92, 154, 150, -102, -248, 399, 139, -292, -174, 227, 21, -444, -139, 292, 158, -302, -115, 277, 251, -331, 108, 81, -21, -383, 232, -47, -323, -59, 50, 96, -141, -311, 77, 201, -287, -39, -38, 205, -72, -201, 156, 98, -415, -48, 3, 80, -192, -106, 288, -9, -343, 5, -101, -145, -256, 11, 160, -189, -183, 472, 11, -96, -281, 324, 318, -149, -147, 36, -122, -101, 79, 221, 140, -300, -322, 120, 132, -300, 96, 203, -9, -66, -69, 266, -101, -247, 277, 59, -185, 27, 77, -154, -323, -150, 118, -107, -285, -152, 70, -79, -63, -171, 124, 158, 55, 21, 295, -203, -162, 334, -198, 103, -169, 390, 24, 116, 95, 330, 310, 63, -93, -13, 43, 68, 9, 106, 116, -191, 37, -45, -230, -115, 240, 80, 26, -405, -221, 263, 207, -57, 217, -122, -317]
8081c17K96J76j01k58K41J27j10J7K8O1P5m73J66M15n52k00O50k1J12l01J18j00
8103D9r0j39J51L9J69m00M40m0j11k01J31Q6l91J55L72k37l42P56l52j65q6N51
8125C45j85k69m52L69J21J04N8K96r8k79j34L47r7k57Q1L47o7l31J46k7n1p9J15
8148CK3K9l44J49J43j18j30N27l28J3j62K43O0k20k0J83J54n55K84M68j01m26
8170a25L22k2j6lj25J17j06j57P5K64k74jK82J49l44K2J60j18l30mM62
$$ y = [-317, -21, 155, 54, -204, 37, 164, 54, 71, 99, 160, 235, -238, -72, 343, -209, -409, 241, 220, 332, 31, 149, 49, -41, -180, -29, 10, 179, -221, 219, 179, 68, -133, -2, 84, -307, -152, 220, -17, -359, 397, 45, -120, -206, 345, 160, -109, -561, -192, -71, 33, 91, 387, 289, 10, -124, 223, 126, -131, -50, 297, 230, -101, 45, 18, -33, -112, 3, 26, 55, -289, -140, 3, -115, -245, 282, -46, -33, -195, 48, 108, -112, -132, 51, 205, -350, -66, 402, 301, -125, 197, 175, 159, 156, 31, 148, 42, -115, -40, 224, -50, -51, 231, 380, 36, 58, 218, 100, -230, -234, 228]
8191B28
$$ Imaginary data points
##PAGE= N=2
##DATA TABLE= (X++(I..I)), XYDATA
0@%%%Qj6QqK4l2L2m0N6o4P2r1J14j35J60j89K20k62L08l54M08m70N38o14O94p87
29d20Q92j001J124j263J414j577J754j950K172k407K661k951L270l618M004m438
45b334M926n472O096o818P651q636R823j1276J3117j5529J8824k3643L1377m5752
59b7646Q1186l18016n08628Q15324M95341m74150m47443M04651L52003k76114
69I6508l09149J64331J86842J8756M3457p3618m13613j84877M48344M33146k21232
80A88895l40318P5024P3241k20091N7485M30478J8696n11569j41061L79448O3974
91G4202k94300J88869N13287j73266o71748J7527O53996J06343n40082j43870
101b69042M16755J23721l49117j78766J78184J96090J23143L0190k98048m12039
$$ y = [0, 0, 0, 0, 8, -8, 0, -8, 16, -16, 16, -24, 32, -32, 40, -51, 63, -72, 88, -101, 119, -143, 165, -189, 219, -251, 287, -327, 367, -420, 472, -529, 595, -668, 746, -831, 923, -1027, 1145, -1262, 1399, -1552, 1718, -1900, 2104, -2334, 2592, -2880, 3216, -3602, 4049, -4587, 5236, -6040, 7077, -8452, 10372, -13271, 18106, -27646, 53540, -264476, -773104, 42220, 537561, 63411, -384032, 20619, 372622, 96508, -212641, -48310, 138532, 157288, 200745, 127127, -286486, -471363, -23019, 410127, 188895, -151423, -76399, -3158, -223249, -165764, 264714, 283410, -228159, -369220, 10228, 74202, -220098, -31229, 482058, 308792, -362956, -345429, 308567, 414910, -125172, -269042, 147713, 271434, -77683, -256449, -78265, 117825, 240968, 271158, -26890, -438929]
111d38929J20704N30002P2712m35967r8936L18370l7530l45570J70135N49886
121D04877k6307n48722j28923L39380O1672j93551J25582K25108k22384l02245
131b65513K13626L26144j64676k71483J68800K28780k03653k92968M5921J63894
141e1128N9569J08631N8718k73502k71799K58592M25419j03138l59436O0056K26397
152A38379j97963k53768L07441M22534j84371m30831M4574L01991q563j52073
162a2650O1695M5908j79302p1844J72891K6989j87410L9717K74613Q49k90525
173a19069q0149J77521M2887o3719J04376O7455k42773j84348K56726L07958r7551
184A69314k02049O7337N7911j87687n1959K74346J16577k81413j94178J77226
$$ y = [-438929, -318225, 211777, 284489, -151478, -250414, 67956, 30426, -315144, -145009, 404877, 378570, -170152, -299075, 40305, 101977, -91574, 34008, 259116, 36732, -265513, -51887, 274257, 109581, -161902, 6898, 235678, 32025, -260943, -215022, -51128, 8441, 117072, 175790, -97712, -369511, -110919, 314500, 211362, -148074, -88018, 138379, -59584, -313352, -5911, 416623, 232252, -198579, -154005, 147986, 139423, -12650, 49045, 94953, -84349, -156193, 16698, 43687, -143723, -104006, 170607, 171456, -119069, -199218, -21697, 21190, -42529, 61847, 129302, -113471, -297819, -41093, 266865, 169314, -32735, 34602, 92513, -95174, -147133, 127213, 243790, -37623, -231801, -54575]
194e4575J54747r8183m6996J13486j2948j42215K3375J09660r7977j38145J45125
205d4646K06861r9990k00669N9773J54599k3208k4439J25185q072k53277j01162
216b09045K29339J67304j19540j12179N4428m332q5501P9567J63592p9115k22842
227a38324J595J59452j5789j23474M9988J20759m8649p8272R3806P8045j19993
238b0856q5895J36593J14738j12501j30997L7618O7403N964O1269P7960r8564
249E2732j75805L3810J80664J7080j41832m9436M3468k7576k5537J07558Q4079
260I9205r9942j01178Q5961J02410o5074q5658M6439M8489n0097p433Q7417Q466
272F9005j01627n146J31996N2931j03205r4683n73J8760K6582N7276p604j18991
$$ y = [-54575, 100172, 1989, -45007, 68479, 55531, -86684, -63309, 46351, -51626, -189771, -44646, 162215, 62225, -138444, -78671, 75928, 52720, 28281, 153466, 145394, -107883, -209045, 20294, 187598, 68058, -44121, 10307, 5975, -79526, 41, 163633, 84518, -138324, -136729, 22723, 6934, -116540, -66552, 54207, 5558, -72714, 21092, 99137, -20856, -106751, 29842, 144580, 32079, -98918, -61300, 6103, 12067, 73336, 151296, 52732, -123073, -89263, 91401, 108481, -33351, -82787, -39319, -66895, -92432, 15126, 99205, -737, -101915, -15954, 86456, 21382, -64276, -17837, 30652, -19445, -26878, 60539, 69005, -32622, -37768, 94228, 147159, 43954, -50729, -51302, -32542, -5960, 51316, 43712, -75279]
284g5279o0382J16608J17688m9705r6282P643K9683l9331o839P4850J8173q7408
296e0581k8250J00580P4986m2197n3105Q669J0726n778K0455N165p0282o1586
308i1198N6769R9817Q78p4479l5983J5597J9889K6595J9904m8586q8833l187R7676
321e141O1156l7732m1814J8815K6824O114J9989J6314m4367o5961Q064O9896K7281
334E9438m1204m0317L277L1040L6044J1933m6386p4565j7381N7180M2313l0017
346h645n1258o645L2487M0930L4100M199m2981m5984J4332N5807K0515l7365m3092
359c3600k188L7388M6860K1944k6964n1328j6955L4317L2401k0465n4411l4845
371f7846J0776M1051L7313J864l5523l0115J8364M8993K0726l3200n0536j6351
$$ y = [-75279, -135661, -19053, 98635, 48930, -47352, -39709, -10026, -49357, -56196, 18654, 36827, -50581, -78831, 21749, 96735, 54538, 1433, 10102, 20828, 15050, 35505, 40670, -29612, -91198, -34429, 65388, 66266, -8213, -44196, -28599, -8710, 17885, 37789, -10797, -99630, -102817, -5141, 56015, 18283, -23531, -4716, 22108, 28222, 48211, 64525, 20158, -45803, -37739, 32157, 59438, 18234, -22083, -18806, 12234, 48278, 60211, 13825, -60740, -78121, -20941, 21372, -8645, -59903, -66548, -34061, 6869, 40969, 45168, 2187, -43797, -29465, 26342, 46857, 9492, -33600, -35788, 1600, 48460, 70404, 43440, -7888, -24843, 9474, 41875, 21410, -33001, -67846, -57070, -16019, 21294, 23158, -12365, -42480, -24116, 24877, 45603, 12403, -38133, -54484]
383e4484L1553M8382K2059j9871l2663k269L8473L8978n479m8761m9006o797L3105
396f780L0911r681m1270k5524K1793M8131K3041k4997m7489k4256J7438L5661
408c022J4632k2064l3104j287M2483N0548J4257l2073m0267m031L2345K7534j4384
421C1567m5753l1130J6418M6335K7634j6274l8553j9940J5138K8738P299k8055
433f576m3254j6131L0086M7666J8968k1786k9369K358L6926L6576l216m5890m3057
446c6699Q169M8245K6983k2825l5880l510K5674K4174N264j8775l9184l0802J1150
459c8016L6345J0370l0447l0271N602L5339L7701J2377k9304m4661m696M6133
471F472L4107k1982m2046q393K5138L1937K4917r86l8833l5543K1114M6763p354
$$ y = [-54484, -22931, 25451, 47510, 27639, -5024, -7293, 31180, 70158, 64679, 15918, -33088, -39885, -6780, 24131, 14450, -26820, -52344, -30551, 17580, 40621, 15624, -31865, -56121, -38683, -3022, 11610, -10454, -43558, -44845, -2362, 48186, 62443, 30370, -9897, -13928, 18417, 45951, 31567, -14186, -45316, -28898, 17437, 45071, 28797, -9756, -29696, -14558, 14180, 21479, -6576, -49830, -65961, -35875, 11791, 30759, 8973, -20396, -18038, 18888, 55464, 52248, 6358, -36699, -28530, 19715, 46698, 23873, -12007, -15517, 10157, 34331, 39595, 20820, -18364, -49166, -38016, -1671, 8699, -21748, -52019, -46417, -11078, 26623, 39000, 9696, -34965, -39661, 6472, 40579, 18597, -23449, -31842, -6704, 25233, 50150, 49164, 10331, -25212, -4098, 42665, 35311]
484C5311n8582k9019K4083K4109K599P658J682k5822j7265L4077M2070j6251n0979
497b6329k0789J8379K9324L1593J3337l7443m5555K7920P5586J0404o7098m0137
509c0808K0798J3703j1271R199J3927l1608l0874L9974N2661k6797n9181K502
521c7775L5014l593j2544J5171o782m1138J2315Q2694L2279o2871m7153K7452
533f931K8086n987J2845J1304n3872n6016M9190Q6968j2539p0915l453L6462j5431
546b89k3409L1302J1489o0585k2938P2175L7320o3939l6081O3638M4709l4907
558A8485j6709K3727l0547n5417M7224R5988k3054j05190p969P4798J2762k9614
570D484K8303J9151q0622o6239O5847P8722l6650n8228K2548K1179k9806J6441
$$ y = [35311, -23271, -52290, -28207, -4098, -1499, 6159, 7841, -17981, -35246, -1169, 40901, 24650, -26329, -47118, -28739, 585, 32178, 45515, 8072, -37483, -9563, 66023, 76427, 9329, -30808, -10010, 3693, -7578, 1621, 15548, -16060, -46934, -6960, 45701, 18904, -40277, -37775, -2761, -6354, -18898, -3727, -10509, -51647, -39332, 43362, 75641, 12770, -34383, -6931, 21155, 15168, 28013, 39317, -14555, -70571, -21381, 65587, 53048, -17867, -21320, 15142, -289, -23698, 7604, 19093, -41492, -64430, 7745, 45065, -18874, -54955, 8683, 53392, 18485, 1776, 25503, -5044, -60461, -13237, 82751, 59697, -45493, -53462, 21336, 34098, 4484, 32787, 51938, -28684, -94923, -29076, 49646, 12996, -45232, -22684, -1505, -31311, -14870]
582a4870O3278k4267q2784L1079R9493l7723j26100K0147J37457J7954r4174r884
594b0394N5849l1327n2583O9347P8497p1750j05477K2666N9709j6103N404P1690
606F5528j4690j23187k1912J23144N0055q3592l5022M9363j3282n1619N0807P1161
618F6754n9817o0881R8759P6885j34247j27806J17563J57060p1513j42854L0234
629d9863Q0395m7755m4751Q9859O6122p9571p9207J6017J3382Q27P7475N5131
641I8061j17696j27596R3652J61449m0211j21419M3879R2212p0808r5082O8374
652a5185P7998o4582l3848J01006R788j60125m0471J82884R1861j40425r8574
663h9673P8575L2451q9576K293J28413L2173r9387n3567J6145J300N0972J18219
$$ y = [-14870, 48408, 24141, -58643, -27564, 71929, 34206, -91894, -71747, 65710, 83664, -10510, -20394, 35455, 4128, -48455, 20892, 99389, 27639, -77838, -55172, 4537, -11566, -6162, 65528, 50838, -72349, -94261, 28883, 78938, -4654, -39676, 9687, -3595, -55214, -4407, 66754, 6937, -53944, 44815, 121700, -12547, -140353, -22790, 134270, 62757, -80097, -49863, 30532, -17223, -61974, 27885, 94007, 14436, -64771, -48754, -35372, -34545, 42930, 98061, -19635, -147231, -53579, 107870, 67659, -53760, -9881, 82331, 11523, -83559, -15185, 62813, -1769, -35617, 65389, 75177, -84948, -125419, 57465, 149326, 8901, -89673, -11098, 21353, -68223, -65930, 62483, 94656, -4731, -58298, -42153, -40853, 10119, 128338]
675A28338k3526k03344o1775J95294J04431j58626q9374J61666Q8866j66272j12110
686a36432J24991R9519p5367l9913O2883l7251j17737M3402J55788N68j11945
697c1494R315O2068p6196p8332J15931J34122p2569j32263O386M2918j0125O3591
709C3352J10274p5507j93032K4893J98041o617j89397J6034K03666r358k22537
720a10188l9987J83314P2327r2784k4427M1960n6890o8474P4137Q6233m4322l0648
732i749O1797l1571j42935K6610K16964N5215j88884j03815R1407L9361n5711
743d1311N3049J00618q5230j46952O5895J39280o9219j17605J06420J36291j23348
754A7888j79614P1407J62968j7647p7721M4528K7426r5612l6083J01804M5374
$$ y = [128338, 104812, -98532, -160307, 34987, 139418, -19208, -108582, 53084, 141950, -24322, -136432, -11441, 88078, 12711, -27202, 35681, -1570, -119307, -75905, 79883, 80451, -31494, -22179, 39889, -36307, -114639, 1292, 135414, 62845, -69418, -63032, -20114, -30239, 33352, 143626, 68119, -124913, -100020, 98021, 91404, -97993, -81959, 121707, 112349, -110188, -150175, 33139, 105466, 12682, -11745, 30215, -26675, -95149, -21012, 65221, 20899, -9749, 52048, 20477, -122458, -95848, 121116, 176331, -12553, -116368, -24961, 14400, -41311, 11738, 112356, 27126, -119826, -53931, 85349, 16130, -101475, 4945, 141236, 17888, -161726, -90319, 72649, 55002, -22719, 21809, 49235, -46377, -82460, 19344, 64718]
765F4718n5795J3824M4523j09190j21317J33509K12276o2417k11192q93J33341
776D1387k1338q5157P6740R3325r8898j11914P5173Q0212p3189k7890J25065L2692
788A06208j54350o9567J20730O1900p7497j657R0019l9742j34624J9227J33869
799E4516J5520o5010K2008J1254j20938n2495J64796J24443j27436j38915P1954
810d0303Q6117p1003l6699J14263M3393j23317n8697Q8632K7057p2825K6112J06189
822H8919l2789j26184J2968J00946j7862o0351O8894O5821j11729j15910Q2746
833d4531J21693l2102n9236L9819n332j04489K911J48437M1519j28342n6258Q0493
845D582J3136p2902L3267J05232l0268j11145J8226Q5240l5092o9151O5953Q1396
$$ y = [64718, 8923, 22747, 67270, -41920, -163237, -29728, 182548, 120131, -91061, -91954, 41387, 20049, -65108, 11632, 104957, 6059, -105855, -30682, 49530, -23659, -51549, 73516, 106208, -48142, -117709, 3021, 64921, -12576, -14233, 75786, 36044, -98580, -79353, 54516, 70036, 5026, 27034, 38288, -82650, -135145, 29651, 154094, 26658, -112257, -40303, 45814, -25189, -61888, 52375, 95768, -27549, -86246, 2386, 29443, -43382, -17270, 88919, 56130, -70054, -57086, 43860, 25998, -34353, 34541, 100362, -11367, -127277, -44531, 77162, 45060, -14176, 25643, 20311, -84178, -81267, 67170, 108689, -19653, -75911, 4582, 17718, -55184, -21917, 83315, 53047, -58098, -39872, 45368, 10276, -58875, 7078, 88474]
857H8474p1064r4246M4196O2894m0220j3352Q3486O766j24010m6293J05224O0615
869F2470n7257j9761M2229l6457p7782N1599J17224j5943j01154n39N9441k5833
881a763m1536N9341N2243o6083n6224O1128M0609o9871k9369Q8955M0708q5519
893g381n4357N1199K5723l6870J7725O0673l0896q9232J0100Q0979P392l9839
905d784J7524J6251o4300l7721Q2128O7916n9380o5900L8337M0278l9637j9260
917b8548N2568J1868n8099q864N2992p377o1811J5792P6130k587o8721p515M1689
930G517p381k3152L8220L3493n1590n3294L4737N1085j2033j5250K2715j1172
942A3895n3625P900P2204J0874o7934k2200M8932J3649l8289j077L6453o880l1853
$$ y = [88474, 17410, -76836, -32640, 30254, -9966, -23318, 60168, 66934, -57076, -103369, 1855, 62470, 5213, -14548, 27681, -8776, -86558, -34959, 82265, 66322, -34832, -35371, 24070, -1763, -43299, 16042, 68285, 2202, -54022, 7106, 47715, -22156, -51525, 37430, 78138, -7381, -61738, -10539, 15184, -21686, -3961, 56712, 25816, -63416, -53316, 27663, 35055, -4784, 12740, 28991, -35309, -73030, 9098, 77014, 17634, -48266, -9929, 30349, -9288, -28548, 24020, 35888, -22211, -31075, 21917, 14540, -47271, -31479, 44651, 42064, -26657, -34172, 7517, 136, -23016, 15204, 48697, -2893, -56187, -21450, 29635, 17602, 2352, 25067, 13895, -39730, -31830, 40374, 51248, -16686, -38886, 10046, 23695, -14594, -15671, 20782, 13902, -17951]
955a7951J4370K7192k8047l3599L0515L9907k1072l2568J3382J3361k0166L222
967a1454M3051L603n4896k3297L9898K6262j7779p263J0612j6275k2218K6398
979c358L8458j9668m2600Q137L3181o331k3648R737J4932j4607p206K5366Q881
992B1274l1002j4397K9013K0087j7510j4210N750l968q769K0556K6010j8203l7820
1005b3189L324L2565P334j7761n062K023j0418k437K2084J1213k2036j7297J4774
1018d883J7141o498r463K588l220q403J0817J8995q150k6268j454K5127J2491
1031A8820j2164j2137l198j315N832J4719K807j9418j4012J1838J8165L32q804
1044A465l922l109l255P916J3958l091j8355o639J4567J3475r18r312p161l034
$$ y = [-17951, -3581, 23611, -4436, -38035, -7520, 32387, 11315, -21253, -7871, 5490, -14676, -11454, 31597, 35200, -19696, -42993, -3095, 23167, 5388, -1875, 8737, -7538, -29756, -3358, 35100, 15432, -27168, -19031, 14150, 7819, -15829, -6092, 8840, -5767, -12973, 12393, 21274, -9728, -24125, 4888, 24975, 7465, -6745, -995, -4963, -13732, 6824, 32834, 14631, -23189, -19865, 12700, 20034, 2273, -2789, -766, -11184, -13621, 8463, 19676, -2360, -19657, -4883, 12258, 5760, -3703, -1115, -4335, -12738, -1921, 17074, 8924, -17344, -18798, 6329, 18820, 6656, -5481, -8679, -9994, -4162, 10557, 13364, -6054, -20066, -8228, 9937, 10269, 1465, -2457, -5566, -8821, -905, 13053, 9962, -8393, -15032, -465, 13010, 12092, 2780, -4381, -7415]
1058g415O718J3162K295j5890j4450O854J7375N526r241j0481l228M458R624N651
1072A0958o814j3441l831R133J1044R28p023p918k776O195J1536L581j1225j3687
1086a3340O84J4278J0369n031j3303o586O592J2387N359p433j1644l651P874R158
1100E713K218o263q723k670P126J1736L287r715j1737L1J1884J0170l583j2051
1114b577p535N063J1779O346n484j1815n103O803J0403K344p934r532k781O801
1128c222J0329K197r172r948P85R354P882j780q663p278K47Q642J0339j033j3957
1143e278r285Q366J5345K297j0860r609n24O855Q879L229r452j0757J250J2112
1157B568O527l854o409l093k330L743J1424L889j3782j2148Q152J5566R95j0097
$$ y = [-7415, -697, 12465, 14760, -1130, -15580, -8726, 8649, 14175, 4934, -5547, -8775, -4317, 5307, 10958, 4144, -9297, -13128, -3995, 7049, 7977, 954, -6964, -9740, -3545, 7991, 11572, 347, -13340, -12656, 1622, 11991, 6960, -6343, -12929, -6337, 6050, 11409, 3976, -7668, -11319, -3445, 5713, 7931, 1668, -7055, -9725, -2599, 9137, 12424, 2709, -9028, -8997, 2887, 13057, 9474, -2577, -10112, -5049, 6730, 13076, 7592, -4223, -9326, -2523, 7880, 10224, 2290, -7242, -10023, -3222, 7107, 9304, 132, -9816, -9031, 323, 8205, 6425, -2238, -9516, -9269, -627, 9712, 8679, -5278, -14563, -6197, 9148, 11445, 585, -9024, -9548, -2693, 6186, 9415, -37, -10794, -9544, 2568, 9095, 5241, -1168, -4261, -6591, -2848, 8576, 12465, -1317, -13465, -5313, 10253, 11248, 1151]
1171A151m156M25K12O313Q236n547j6722k025J6789R096r093r434n67k95K180
1186c437J1612N984j7308j6602J0338K0235q24j3587j991L460m200J669J4103
1199I452M76j8973n727J7901Q175j3555o322J0006O92r291P280J3807j1309k2050
1213a9438Q736K5998O5j9224m284M691l673M920K1700Pl3274j3257L0875K1493
1227B5335k0453j6485J3625O761j5934p04K0310j523k0239M061J8367r355j9176
1240a5410J3068J8533j7295j6663K3852J6954l2692k5617L2914L5426j8968l2214
1252a8112L442J0456l708J2384K2577j9403m1161J0248M5330j858l7736N959L3490
1265B1908j1773l7572J1149L7151o392k6429R634J4699j9583j0327K7924Q483
$$ y = [1151, -3005, -2580, -2368, 3945, 12181, 6634, -10088, -12113, 4676, 13772, 4679, -4755, -5322, -5617, -3437, 8175, 14159, -3149, -19751, -9413, 10822, 9998, -3589, -5580, -2120, -6320, -4651, 9452, 9928, -9045, -14772, 3129, 11304, -2251, -8573, 1433, 2125, -7166, 114, 13921, 2612, -19438, -10702, 15296, 15361, -3863, -8147, -3456, -7129, -2209, 19491, 19498, -13776, -27033, 3842, 25335, 4882, -11603, 2022, 8783, -7151, -7855, 12455, 10932, -9307, -5246, 13121, 3766, -15410, -2342, 16191, -1104, -17767, 6085, 23039, -9653, -35270, -2356, 33070, 14102, -18112, -14670, -4214, -7922, 4462, 27039, 7636, -33525, -23277, 22053, 20195, -17541, -11582, 21908, 10135, -27437, -16288, 20863, 14471, -11958, -2324, 12375, -7208, -17535, 10389, 18872]
1277A8872l1288o13M0482o765n8249j968O9097K3518n4249l3174K4716J5674q613
1290b560J5523J6248l3619l1766L1696L3414l1687k4587M3226K6110n4940l9598
1302e2540M9206M4267l3501l2201K6495J3617l1354m488L2642k521k5479K2935
1314G078K9411m8707n4412N1768Q2175k6579p9992J223M9240m093k1557K8708
1326A4263J9075m2102k4970L7224J2330l6097J0658N6571j6092q0322J09Q1131
1338C1778J4739o2581q432N0766n238n1295N543M2467m346j4771K6328l585o8592
1351d7219j3401R2741M8309p7550o0946M7254L8364m1856j4530N8121J4284o0873
1363a7302k1577L8718M197k2259L3035L6477n5322o3155M7245O9681l4957n5324
$$ y = [18872, -12416, -13029, 27453, 20688, -37561, -39529, 29568, 53086, -1163, -34337, -9621, 6053, -2560, 12963, 29211, -4408, -36174, -4478, 28936, -2751, -27338, 15888, 41998, -12942, -52540, -3334, 40933, 7432, -24769, 1726, 15343, -16011, -20499, 12143, 9622, -15857, 7078, 36489, -12218, -66630, -14862, 67313, 40734, -39258, -38035, 11205, 7112, -14445, 14263, 33338, -8764, -33734, 3490, 15820, -20277, -9619, 46952, 30860, -49462, -49353, 31778, 46517, -16064, -24496, 26270, 21032, -30263, -24720, 17747, 13401, -1370, 24958, 21373, -47219, -60620, 32121, 80430, 2880, -58066, -10812, 27552, -14304, -28834, 29287, 43571, -17302, -38879, -161, 4036, -18223, 14812, 51289, -4033, -67188, -19943, 49738, 14781, -40543]
1375d0543M3159M8861n2172n8615M0693N2578j8202j4940K3697k5127o2947K8592
1387c4966R6530r54q9654j2454O3477p899n8693K9663P7017k2338p8822J825M7855
1400A0587p678j4165M3126J1604o9939k8594O6707K8056o0355q605P4418M028
1412D9190r2740k4878Q0040L5112m2302p000K5269l8611m9779N3477P6754l3223
1424C1309o8110K1974L8657m4985l0896P2892N2145o6444o2885L8582L6929l0362
1436a1194j307N3185p244p0381j240O0985o954m9370L4893O4707m7621q9629K6392
1449d4778Q4214m907m6148K1971J9966n9764l3252P3745N3998n2132m2625L5689
1461E977N672n3997J1444Q4122M304q4479j7827N7590k93m5505K9420N8696l5463
$$ y = [-40543, 2616, 51477, -695, -59310, -18617, 33961, 15759, 819, 24516, -611, -63558, -34966, 61564, 60610, -29044, -41498, 21979, 14080, -44613, -14950, 62067, 39729, -39093, -37268, 10587, 2909, -11256, 31870, 43474, -26465, -55059, 11648, 39704, -20651, -29256, 45162, 49190, -43550, -68428, 11612, 46724, 4422, -2578, 22691, -15920, -65699, -12222, 64532, 31309, -36801, -14827, 23830, -21155, -52051, 20841, 72986, 6542, -56343, -17761, 19168, -11194, -12501, 40684, 33440, -36941, -38181, 22804, 15850, -33520, 1373, 66080, 18459, -71170, -44778, 39436, 34529, -11619, 10352, 30318, -29446, -62698, 11047, 65045, 12913, -29712, 5977, 11649, -42348, -30904, 53218, 57522, -26957, -44784, 12806, 12513, -32992, -3572, 55124, 19661]
1474A9661o9072K2987N0755k7241k8049N6995L2783p5849n5838N9739N4534l4786
1486F619j9845M2170q974p3716K164Q7250K0366o3993j5014L9207j8498m5577
1498d7841M0428O6425l0919o6135J9608M2382l2192k8495N6318L8585n9700m6859
1510d8395M3346K8137m0176k324O2629J262p8570j9059O3235J9582l5591J0410
1522D486L4026m1816o0354M0162P4642j8746n7697J6581L1610l9059k8758N5145
1534A0222M0948m8475l8935L5000J5922m1126J198O0464L675o2559r929M7368
1546A3773m019m0543K7183N5451k9907o8529J2534N5666m790k5687K6039J4610
1558C1781n4091k9190N6664M1303m1353l0228L4117R771m5834l627N7449J1914
$$ y = [19661, -49411, -26424, 24331, -2910, -30959, 26036, 58819, -17030, -72868, -13129, 41405, 6619, -13226, 28944, 19970, -53746, -51582, 35668, 56034, -7959, -22973, 16234, -2264, -47841, -7413, 59012, 28093, -38042, -18434, 23948, -8244, -36739, 19579, 58164, -1536, -48395, -5049, 23088, -17088, -19412, 43217, 44479, -34091, -53150, 10085, 29667, -5924, 4486, 38512, -3304, -63658, -23496, 51146, 32400, -25297, -8716, 22894, -16165, -44923, 10222, 51170, 2695, -36240, -1240, 14682, -26444, -25246, 35218, 38893, -23666, -33595, 13773, 9754, -30789, -3606, 51845, 21938, -46591, -34057, 21609, 16819, -8868, 17171, 31781, -22310, -51500, 5164, 46467, 5114, -25114, 9003, 18774, -27060, -30687, 26762, 38676]
1570C8676m9641j0997L4719o398l4778K0234M4753j8407m3489J5057K8754k5736
1582g253k1048M4692L1399m9020m5204L1512L6384j9107j1964K7747k398m5537
1594b9797k950M9606J1243l7934m248K8484j1608l4017J9121M1439j3113l5908
1606a9682J3255K6027k2070k2593K9138K6456k6584k2894K0150R231k7308K044
1618a4830M2089M022m7147j4682L4606J1841k1656L280K1687j5774l1361J4731
1630a3194L5233p833k5384J0022J6202j9651j5029K4154J6337k3587j3322K2849
1642F797Q228k7613o519K9508R878k4565p804J6029m592j7972J3156K6139j1065
1655I605k9135M611K2306k579j1020J2003P785k1436j3102K2227J7334j6867j2584
$$ y = [38676, -10965, -21962, 12757, 6359, -28419, -8185, 36568, 18161, -25328, -10271, 18483, -7253, -28301, 16391, 47790, -1230, -46434, -14922, 21462, 2355, -9609, 18138, 15740, -29797, -32747, 16859, 28102, -9832, -14080, 14404, 2796, -31221, -12100, 29339, 16226, -19682, -6427, 19600, -2470, -25063, 4075, 30531, 3947, -18947, 1203, 10434, -16874, -14830, 27259, 31281, -15866, -30548, 4058, 15899, -5757, -2477, 19210, 3436, -27925, -13194, 22039, 14206, -11178, -1156, 15046, -4605, -19634, 4520, 20857, -2730, -16052, 6797, 15025, -12588, -19107, 10401, 20279, -4286, -12090, 3939, -653, -18625, -5469, 20670, 9605, -19530, -14919, 7387, 4808, -6212, 5791, 13576, -7860, -20962, 1265, 18599, 1732, -10852]
1668a0852J4448P436j4901l190J6187L72j6939K171J6563o181j9513N212K0202
1681A1015j666j4604L156Q466r951p527J5171J1466j4734j4592R117J0018m755
1694E80n74Q889l460j5379K656J7424P4j7080k489J2220J098r921J750Q109m569
1709f72o326P308P075r134r300O606Q335l661l590M368K70p498K766J2994J593
1724A1134j2851n265P260M442l118j72K086m899m118P555P509n574r358K455N955
1739C041j254m375J287R05l768N39P247K772o869m065L681M572r02j248j357l841
1755c635j419N710O071l072p480j15N588J733k148k458k187k583J344M860J485
1770A694m006k723K429L804J187q02j300l062j252M197M270m65n428j524L891
$$ y = [-10852, 3596, 11032, -3869, -7059, 9128, 9500, -7439, -5268, 11295, 5114, -14399, -9187, 11015, 9349, -5255, -2099, 6367, -3584, -11111, 4060, 15526, 792, -13800, -4683, 5335, 580, 6, 8895, 5435, -9944, -7288, 10136, 10210, -6870, -9359, 2861, 3959, -5962, -4212, 3897, -672, -6998, 310, 7385, -1749, -11049, -4443, 3892, 231, -3359, 1009, 1279, -6219, -3453, 9541, 11134, -1717, -6982, 278, 4720, 1602, 1430, 3516, -1383, -5501, 2054, 9563, 3989, -5369, -2914, 3041, 1787, -2588, -1301, -396, -4164, -3625, 3622, 6394, -475, -4540, -859, 3713, 2811, 1563, 206, -3635, -5054, 656, 6727, 3655, -3825, -3940, 1648, 3381, 1233, -1225, -3412, -5995, -4651, 209, 1694, -2312, -5035, -2606, 1198, 2385, 1583, 283, -2779, -4031, 166, 4436, 3971, -1457, -2981, 910]
1785I10N540j93l093l633j169J623L230l97l893l097J171L461K538n62k042k196
1801a802q15K530K538j140m288j928K752M397J462j303k132j827J419L324J764
1816D951m505n536lM029K882p41k747j979Q80L073K169j784m655k054K626L236
1832a58M77j219m72k94J797M170K032l139m448K91L120K69j79p65j220k694J948
1849d84O420P40o522m884L189L652j215k291j694j556L12N640M685m395o591K549
1865b445P296K28n924j822J385l42P19L821Q92m784j026L874k28l556K292L674
1881D054o585r976N799J3822j982j3051j477J2298M435p285l513K589k87M26M661
1896C928M8q574j271J1406O175q114n296N150J003p130M08Q062k143r552J162
$$ y = [910, 6450, 6257, 3164, -469, -1638, -15, 3215, 2818, -1075, -4172, -3001, 460, 2998, 2436, 394, -1802, -2617, -87, 2451, 1311, -2977, -4905, -2153, 2244, 3706, 2403, 271, -1556, -137, 3187, 4951, 446, -5090, -5093, -1064, 1818, 1077, -1670, -3649, -2769, 304, 2473, 689, -3966, -6020, -3394, -158, 319, -900, -1372, -1666, 131, 4301, 6333, 3194, -1254, -963, 2157, 2426, 2247, 1482, 262, -2432, -484, 5936, 6676, 154, -4730, -1541, 2111, 896, -1395, -3089, -4645, -4333, 1307, 5992, 1597, -4994, -2445, 4851, 5079, -845, -2667, -1282, -1624, -905, 2916, 3808, -976, -2002, 1872, 1644, -1912, 380, 4054, -2531, -12507, -6708, 7114, 5132, -7919, -9396, 2902, 7337, 52, -3461, -872, -1159, -733, 3928, 3976, -4598, -5869, 5537, 11712, 3598, -1698, 3452, 4455, -2675, -2267, 5795, 3652, -5900, -4738]
1911d738P211l561l420R867N770j6440j2261J6591J7313j4109k0081R393K0304
1924A1839l500j5164Q00J0004K400j015o81q182p951R409J3037q500j4111Q621
1938b994J3507j1643j4615J4348J8869j3017k0961O271J3657n651l937J4198K591
1951A0623k1299l109K5875Q448k5081j0714K3459J0373k1207j3351J3942J2243
1963A0202k830r30k463j2585k194J9771O901k3702j0090K4557P279l1958r802
1976b7844L9463K1696l3311k6912K1043K0961j3465q643J4479n95k0021L872K1955
1989A2678n360j9378J1474K2865j4581k8951P564K3066l911j1086Q341K96k0411
2002a7394J231L0535L451k9051M98K9462j0019m0843J0931N3447K210n1582j2213
$$ y = [-4738, 2473, -1088, -4508, 5359, 11129, -5311, -17572, -981, 16332, 2223, -17858, -8465, 11839, 8339, -6825, -6025, 3979, 6379, 5364, 4683, -3499, -11450, -2041, 10996, 2496, -11615, -2994, 10513, -1130, -15745, -1397, 17472, 4455, -16506, -10235, 3422, -2229, -6166, 8032, 10623, -10676, -13785, 12090, 20538, -4543, -15257, 8202, 18575, -2632, -15983, -2041, 10202, 7372, 6442, 3979, -8606, -10800, 8971, 15872, -7830, -17920, 6637, 13916, -18042, -27844, 11619, 33315, 4, -26908, -5865, 15096, 1631, -7012, 7467, 6872, -13149, -9277, 12678, 7318, -12060, -586, 22279, 7698, -21253, -13689, 9377, 5466, -5620, 2721, 3017, -17394, -16163, 14372, 17823, -11228, -10730, 18732, 8713, -32130, -21199, 32248, 34458, -17124, -29337]
2015b9337L8566J2287k3493p78J9050q956k0083Q259J1589j5285k971K8850M575
2028B2273l8594j3707L5779J5864k7492n634K5727o824l6872P354M1728P0l0924
2041a1252P420K4047k3377k9956L2725M3846k6411m8581J1546L5123j0723k0241
2053a5834K0652J7894k3778j7259J7692M130j9271J1692L1850j7405m5749R944
2065b5442M6194k854l2891J5269L2055k7801m2094K4466M5427j3430l1971J3652
2077E80J3923k9962j1161M5635K2853m2048k7944K7783J1727k9218O78L8498r84
2090B0360m0263j835L0327n589k0980K5841K8912l5356m1983K6229L8468j9830
2102D301k1655L2136J6307m6155k5335M5279L2052l0681k1027K2634l436l6626
$$ y = [-29337, 9229, 21516, -1977, -2755, 16295, 7339, -12744, -4485, 7104, -8181, -11152, 17698, 22273, -16321, -30028, 5751, 21615, -5877, -11511, 14216, 7392, -29480, -22126, 19602, 19672, -11252, -3832, 20215, -3162, -33118, -393, 43453, 17042, -31539, -19993, 15130, 4407, -15834, 4818, 22712, -1066, -18325, -633, 3497, -15774, -4082, 27768, 10363, -35386, -25442, 20752, 17898, -14993, 276, 32331, 4530, -37564, -13098, 32329, 18899, -13072, 580, 14503, -15459, -26620, 19015, 41868, -180, -28124, -341, 11386, -17832, -17154, 21344, 20360, -19903, -21738, 8589, 3000, -17980, 7861, 36773, 1417, -40566, -14337, 24131, 4301, -17354, 14782, 31089, -15066, -40401, 4878, 36930, 6249, -14778, 7856, 4420, -32206]
2114c2206R126N0149R99m4203k564L0940j0474k8402K5665L7790k5706m0491J6986
2127a2391K7521k0712j2067L9735J8564m6609k8481L5453K1900k5900m166L1883
2139B4730r746m9673K818N1472O938l4612K637K3858k4289l4431L1019M5406k1792
2152A4335m0624J5668K4319k4331j4047M0543K2077l8215k3884K6607P631k9176
2164a9097P609M3802o466n1798l601M0699K981k5508J6069K5666l2579m0439K5349
2177a7313M1838j5869k4175K3303J2604l9292j5612M8634K7445l8338k4449K6894
2189E670O886l2321J892M2524L656l7460l531K3740j1445k1717K8104L1177l1956
2202E219m2062J8723L2525j6947j4557L2245J4031m3323k3841L8236K4950k5240
$$ y = [-32206, -23080, 27069, 28068, -16135, -18699, 12241, 1767, -26635, -970, 36820, 11114, -29377, -12391, 15130, -5582, -17649, 22086, 40650, -5959, -34440, 1013, 22913, -2987, -7153, 24730, 14984, -34689, -31871, 19601, 26539, -8073, -5436, 18422, -5867, -40298, -9279, 36127, 14335, -26289, -10621, 13698, -10633, -24680, 15863, 37940, -275, -24159, 2448, 10079, -19097, -11488, 32314, 25848, -25950, -29551, 11148, 14129, -11379, 4690, 30356, -2223, -42662, -17313, 24525, 8656, -15519, 7784, 20388, -18904, -34516, 14118, 41563, 3225, -21224, 5670, 12556, -19765, -17873, 24651, 28307, -9153, -12684, 11056, -389, -22106, 5998, 37175, 5219, -36843, -18120, 14405, -2542, -17099, 15146, 29177, -14146, -37987, 249, 25199, -41]
2214d1j0807K5021n525l8179P243M7219L528l7135j168K6263j2833k9080J8771
2227f723L3200j5637k9425J1134J4690k0409n503L7711J3261m1160k0886L0670
2239I23J2568k6176J745L5746m290m4052k410M0983P722k5141L349J8733j9530
2252A70k7405K0335L0169j5641k3155J6947J4122k6629j3347L1741J8542k7436
2264a587j6985J9399J981k4124P114L6214k359l5221j503K7304k290k0204J4875
2277B614K3955k1364l2656J3858K9814q026j7008J4225J0375k3045j2834K4425
2289D333J2985k1946q262J9092K9k5700L080L1312K923k4628K55J8148q911j9481
2303a6771J5191K4553j3133k5147P968J6923q766p987J9412Q368k5551j4632J9853
$$ y = [-41, -10848, 14173, 8648, -29531, -22288, 24931, 28459, -8676, -9844, 16419, 3586, -25494, -6723, 26477, 10840, -18585, -7451, 7239, -13170, -18673, 19038, 32299, -8861, -29747, 923, 13491, -12685, -10940, 24806, 20516, -23536, -25946, 15037, 22759, -2382, 967, 19700, 170, -27235, -6900, 23269, 7628, -15527, 1420, 15542, -11087, -24434, 7307, 25849, -1587, -18572, 827, 2808, -21316, -14202, 22012, 19653, -15568, -17071, 10233, 7943, -12261, 2614, 26569, 5205, -27451, -13593, 16221, 8195, -8813, 5412, 15787, -7258, -20092, 4333, 17318, -4628, -12890, 6202, 6231, -19469, -16389, 14923, 17846, -6782, -6527, 11621, 2710, -16771, -1580, 22973, 9840, -15307, -7339, 9584, 818, -7169, 12243, 20611, -4940, -19572, 281]
2316B81J1401j6981n418J7031p40k1116J438K3090J044j7874L130J5329r988j7839
2330a7212J0612J9035p502j3519R585R223j3205p526J8821J0839j8120j3203J0935
2343a237N413j1087Q15J5581k262j7597N96J6955k6j3413L378J1055q260j3043
2357a3132Q268J4202n804r422R168Q608j0133q522J0046O780r047n391P310m79
2371B452j1156K054J5082N60j3586k097R130j768q602M377Q285o691r960N973
2385e947J0775l310n620N955N270p158m223O907K746p570k347Q252J778q111j328
2400c931Q384J058n516j76L579m908o855M858P335l305o712L381N283j807j888
2415a220M954K021o653l207N552K718l987j980L918J601k568M63L207k037n125
$$ y = [281, 11682, -5299, -10717, 6314, 5574, -15542, -14104, 8986, 10030, -7844, -4714, 10615, 627, -17212, -6600, 12435, 4933, -8586, 999, 10222, -2983, -10509, 8312, 19151, 1031, -12172, -1237, 4176, -6911, -6096, 9485, 7223, -10374, -9778, 7177, 7151, -6262, -2884, 8171, -89, -13132, -4864, 9338, 3534, -5888, 3280, 11888, 1755, -6767, 3279, 10059, 1012, -4379, 2931, 2452, -8704, -6650, 8432, 8992, -4594, -6691, 2439, 671, -7931, -3554, 4731, -1960, -11920, -5947, 4828, 1518, -4102, 1853, 7123, -35, -4258, 2649, 5395, -2175, -4522, 3730, 5508, -2603, -3931, 4453, 5511, -5, -181, 3398, -1510, -8365, -3507, 3828, 523, -6189, -2808, 2475, 668, -1220, 3734, 5755, -898, -4105, 1447, 4165, 178, -1802, 2116, 3717, 1149, 1612, 4819, 2782, -2343]
2430b343J482L462l047n862J217M240n41j721K889J236l142j745L903K191l366
2445a147l230J572K534K48R76K457m26k319J111K552n74l311j583M18K04r74J397
2462i5O30j678l38K851J627k653k667N2J438o24k21J744n1p66J243L467R56k013
2480B902j888L70o7n44j68j006o18n27J579J640J4k083j359j07L62O9j060j626
2498d117q41J732L248Q32j837M15J985J009r76q93L38j192o28K31K513N72p61
2515A630o98J170J63l83n16j061k781j268J569J788N6j733m52K117K898R61k279
2532A181l561O4M080J506l998k483L273M566j260l301J295L412j780m618j205
2547b829K855k37k942j164J588J730J330K68k409j743K246K957j372l998o9K340
$$ y = [-2343, -861, 2601, -446, -6308, -5091, -851, -1392, -3113, -224, 1012, -2130, -3875, 28, 2219, -1147, -4377, -2805, -271, -23, 953, 3410, 2984, 665, 1776, 4328, 3754, 443, -1140, -722, -518, -1492, -95, 535, -1143, -1481, 1370, 2997, 344, -2323, -2271, -833, -1457, -1678, 66, 15, -751, 492, 3959, 4915, 2902, 1014, 1384, 1317, 773, 605, -401, -1019, -1546, 33, 1673, 1687, -396, -1755, -1862, -1500, -1431, -2491, -4117, -4958, -3226, 22, 854, -983, -568, 1417, 2426, 1450, 557, 895, -297, -925, -694, 1819, 2391, 1630, 932, 2102, 2265, 1882, 1366, 305, -2476, -3744, -2175, -387, -331, -2064, -2516, -399, 2499, 3460, 1181, -2380, -2316, 1764, 3270, -728, -3211, 62, 4628, 3368, 67, 1362, 4774, 2994, -1624, -2829, 26, -211, -3153, -4317, -2729, -999, 331, 599, -1810, -3553, -1307, 1650, 278, -3720, -3789, -1449]
2563a449J197J056K537m72l488R42N991k81p624k893O990K651p825m079P090O395
2579F738n288n333K462M962j542m743j692J220L472K234k460n729K127J0175L266
2594I869r356n591O668M514o292m000N581K246o512j108P709J59p184N40Q100
2609E343k744j0668n79J0095J259q693n08P555K322l944r75J530J269K511J900
2624E673p197r049P317J5467l296j6318L48J6378J133j5245j208J3201L4j3888
2638f650k535R814J461n987L936N644o076o345P027O428p156n265P900L820r949
2653c933l467R758M037n187J838N030r761j0719J2117J5342j1854j8589P623J7215
2667I450p931j5575J0239J7753p984j7674L826J1143k890m859O801K078j0373
$$ y = [-1449, -252, 804, 3341, 2869, -619, 323, 6314, 6033, -1591, -4484, 2506, 5157, -2668, -6747, 343, 6738, 1450, -3883, -1421, 3541, 1999, -2744, -4436, -3216, 256, 2490, 30, -5699, -3572, 6603, 9869, 513, -5078, 1590, 6104, -188, -4188, 1393, 3639, -2873, -3981, 3728, 3887, -3297, -2757, 5343, 2599, -8069, -8648, 1447, 2706, -5987, -6495, 1060, 3382, -562, -1537, -7, 1262, 3773, 5673, -1524, -10573, -3256, 12211, 8915, -7403, -7055, 9323, 10456, -4789, -5997, 7204, 7238, -6650, -9185, 629, 2090, -3897, 39, 5683, -393, -6738, 289, 6717, -439, -5704, 2196, 6016, -3933, -7400, 2358, 6395, 1208, 3046, 8076, -1685, -12404, -287, 15055, 3201, -15388, -7765, 9450, 1519, -14056, -3817, 13936, 5952, -11722, -7896, 3247, 357, -4502, 2299, 4377, -5996]
2680e996L96J1938kj0819N950J3350q913j9411N363J8375k799j3246N810Q475
2694H471j3223r131J8115J3803j7256j4631J2746R590j6636o636K1261R628j8593
2707b492j0657J4305O206r818K329J1675o722j6794N872J3629q117q529J6136
2720G023J0840k1958j7489J9049J8376j4158j2393J2975L700k0284l141K5867
2732H407Q585k0957n748J6261j875j8043P934K3611o382k3850K942J7331o426
2745A790j0678J5756J3849j9793j7308J5280J1290j5122l867K1082J341k9235
2757a5615o464K8212J0249j9322j970J6449q830k3849J0032K8553m626k2942N073
2770e050J5417j2955j3794K1251J9627k0132k0847J3250J0622j6956k808K6101
$$ y = [-5996, -5600, 6338, 6336, -4483, 1467, 14817, 5904, -13507, -8144, 10231, 7432, -5814, -4, 8471, -4752, -13883, 4232, 18035, 779, -13852, -1106, 8484, -8152, -14788, 6473, 16101, -2492, -13149, 1156, 7362, -2456, -127, 11548, 4826, -11968, -6096, 7533, -584, -9113, 7023, 17863, -4095, -21584, -2535, 15841, 1683, -10710, 2265, 5965, -14319, -17460, 8407, 16992, -3965, -9713, 6548, 4673, -13370, -5436, 18175, 11793, -12057, -9115, 8216, 1790, -8888, 6868, 20717, 924, -16384, -1104, 10186, -4936, -8803, 12279, 13620, -15615, -22079, 6133, 16382, -2940, -4910, 11539, 2709, -21140, -11108, 17445, 12819, -10123, -5050, 10367, -2588, -16382, 4869, 24496, 4364, -16483, -3233, 7389, -9567, -12375, 13726]
2782A3726M395k9202q535K3279M798j8230O105K2941j2338l0962O922K8927k002
2795I824j6686J0681J2706k2566j6488K5232K2507j9609j7884J5946O516k4185
2807a4006l578L1936R650k8199j0395J8872P7j9342J0175K5910j0846k9663N150
2820a4259K2665p167j3276J9929J6902k6676k4015K0189K2306j3540j0787J7890
2832A0161J281k8842l610L2652R976k5613n344J8996o271k5900J0118L2095m876
2845A4823k8054J757J8453r824j2937K1193J9370k1498k2357J5024J3047j5329
2857f332k680K7373K909l3331j0475K8094J0994j8974M4J8473j1271k8464Q895
2870a4745L0573l711k1344P487J4091j8188j7002K3604K2632j8151k0252J2915
$$ y = [13726, 18121, -11081, -19616, 3663, 8461, -9769, -3664, 19277, 6939, -24023, -17101, 11826, 9824, -6862, 3819, 16525, -6041, -22529, 2703, 25210, 5601, -12283, 3663, 10179, -14006, -17584, 14352, 24002, -4197, -14592, 4280, 4357, -14985, -4810, 21100, 10254, -19409, -14259, 8406, 1239, -12037, 7892, 24794, -1882, -25897, -5708, 16598, 3058, -7729, 10161, 11442, -17400, -21010, 11642, 21618, -3995, -9339, 9657, 3386, -22514, -12396, 19699, 14823, -13231, -11474, 6979, -2845, -15782, 5411, 24781, 3283, -19074, -4050, 8997, -6332, -9012, 18361, 21270, -12061, -22536, 5558, 16552, -2422, -2378, 16095, 4824, -23640, -14745, 15828, 12117, -9227, -1740, 12351, -5837, -22839, 765, 23397, 5246, -15006, -2091]
2882b091Q588j8002k198K8189P258k7288r321J8848J496j6955R638K3700j2391
2895I471l1124M878K6786k862j5406J1659J3035k0935j9451J9880K0967j4161
2907B737j2816J4678M416k2479l705K8281R732k2779o681J6120l231j9468Q925
2920f270K5825n813k5410K224J6576p271j1275J7669J4828k0968k1011J4114J6039
2933I257j1038o325J7714K171k4371n692K4718Q042j7770j818J5477o501k1696
2946a7832P420K4608l154j8507M098J2222j1789j2310J7307J6329j5668j6454
2958a3730J0296Q038j2626j455K0641L874k2608o941J7592M646j2843L043J5668
2971A3595q329k0564O368K0662l785j3720P807J1052j3774j4477J3889J5091j0524
$$ y = [-2091, 6497, -11505, -13703, 14486, 21744, -5544, -14865, 3983, 5479, -11476, -1838, 21862, 9471, -21653, -16775, 10011, 7149, -8257, 3402, 16437, -4498, -23949, -4069, 16898, 2737, -10079, 4599, 9015, -13464, -17169, 11112, 20844, -1935, -8616, 7504, 4273, -15195, -6270, 19555, 13742, -11668, -9444, 7132, -139, -11414, 6255, 21083, 115, -20896, -6782, 9257, -1781, -8106, 9608, 11779, -12592, -18284, 6434, 14476, -3294, -5112, 10365, 3864, -17832, -10412, 14196, 11042, -7465, -3367, 8855, -2934, -15244, 2063, 18392, 2724, -13730, -3434, 4604, -8022, -9477, 11164, 15038, -7570, -14511, 3081, 7727, -5116, -2073, 13595, 5266, -15298, -8930, 11732, 7947, -5773, 2034, 13086, -688, -15165, -1276, 13815, 3291]
2984C291j1078Q635M598j4096k387J8325N540j6099n094J1216j541j2125O709
2997d106J7212o072j8948L565J5073l307r229Q612R408j2940j2642J1196J1184
3010I006r607o801J1113M171j4006m798J4872N825j1525l231Q845j936j2159M435
3024e796J4296k114j1583K699Q418o430o627J0649R085j1564j0866Q238Q477p423
3038e41m389J0075L034j1617m207J0277L105q902q02Q364k346j0300K435J0331
3052D517j386p278L771N745o335o977P326P940o054o543M875L720o755r69R024
3067D621K615r509l491P333K062p003k57P228j282p343R94P689j458m950K453
3082b98M999m289n075M029M678l615k754M471K199o050j597O430K818n639k659
$$ y = [3291, -7787, 848, 5446, -8650, -11037, 7288, 12828, -3271, -8365, 2851, 1310, -10815, -4106, 13106, 7034, -11914, -8349, 6724, 3417, -5812, 2800, 12208, -732, -13374, -2178, 9006, -601, -7402, 3711, 7882, -6124, -10922, 3950, 9775, -1750, -4981, 3864, 1928, -10231, -5796, 8500, 6386, -5197, -2498, 5920, -510, -7137, 3512, 12597, 1033, -9833, -1595, 6882, -541, -4930, 5145, 8179, -3438, -7645, 2632, 5737, -3165, -3967, 4397, 2051, -8249, -5814, 4517, 3131, -4147, -376, 5369, -966, -7943, -617, 7323, 1269, -5274, -399, 3321, -3434, -4403, 4621, 7236, -2273, -5764, 1569, 3631, -3372, -3629, 3599, 2317, -5026, -4032, 3657, 2199, -2751, -298, 4701, 412, -4663, -634, 4044, 429, -2325, 2146, 4345, -1705, -3302, 3128, 5946, 307, -2352]
3097b352L910nm781J233N283r26n870P89M706q59l613J513K966k857l146K616
3113a393L347l185j738L384K522l236j697L064R61k457p27K632p94l437N62L934
3129A742m25k773P88J985j693j614J886J988j980k782J676K875q73j572J700Q82
3145A810j197m60J275O6j922j77J842J0j746L20J614n46j238O83P10j339j881
3162b176J051J358p42j112M11J079n11p85J906N50k087q87J759J137j109j357
3178a515O78J454Q8n71J47K01j18k63j69l35J4P31q32n53J29K205R7j447j333
3197a392J762J681j104j475k00J049L92l74M33L2l79L38Q60j22j316o36P32k18
3215F3k85j31m4K81k2l15j40r6N56P48j660j901J840K773j381l162N04M207P19
$$ y = [-2352, 1558, 1553, -3228, -1995, 3288, 2362, -3508, -2719, 1987, 1128, -2485, -972, 1994, -863, -4009, -1393, 1954, -1231, -2969, 415, 2937, -299, -1996, 1068, 2029, -428, -1155, 1477, 683, -2754, -2192, 1742, 1317, -1456, -668, 1317, -376, -1990, -104, 1884, -96, -2878, -1202, 1673, 800, -772, 928, 1810, 613, 153, 1428, 1494, -428, -605, 1237, 1247, -499, -179, 1435, 889, -349, 334, 1044, -295, -2176, -1125, 233, -509, -1621, -1210, -131, -642, -1427, 479, 1029, -1058, -1945, -186, 951, -158, -1515, -837, 617, 705, 134, 281, 482, 364, 101, -68, -403, -389, 342, -490, -1043, -914, 1291, 1388, -59, -1392, 370, 2051, 947, -528, -728, 321, 713, 339, 772, 804, 425, 763, 1623, 1501, 185, -451, 281, 63, -222, -353, -397, -116, -138, -453, -593, -689, -133, 615, -1045, -2946, -1106, 1667, 286, -2876, -2372, 1835, 2554]
3234B554k857j900K051J936r03j601m35R70M62K19k82q68M32J802o41k182L55
3251h88K240m02k388k24K143M84r18M32Q25r44j645K424J989k859k960K816L423
3268C548k430l577J051L605k34k107m66J64o11J050N73j610j445K241K149l228
3284a327k897L647M835l381n609K255M985j469l472J521K839k067j536K740J318
3299B382l448l91M335R1n445j444N250J612l707k79K763r50l116K236L039k272
3315F56k724L048K046n282k354P722M008p864n140O228M801n565l127N242J969
3330C664n816j333M565q7l857K459M791m083o808L609P070l135n222M087L639
3345C543n835m019P244M935o002l173N463M93p807J323J0061p1j0649j013R097
$$ y = [2554, -303, -2203, -152, 1784, 881, -720, -1155, -185, 277, 496, 214, -654, -222, 1580, 939, -1243, -888, 1352, 950, -1438, -1662, 481, 965, 47, 479, 1304, 360, -1285, 1139, 3128, 269, -2691, 125, 3548, 1118, -2459, -1408, 2197, 1963, -144, -610, -446, -1057, -7, 566, -1044, -2489, -248, 1901, -1327, -4224, -577, 4258, 877, -4732, -2477, 2508, 1039, -2433, -912, 1927, -140, -1676, 1064, 2382, -1066, -1457, 2878, 2969, -2476, -3920, 1330, 2942, -765, -1044, 1719, 769, -2347, -111, 2928, 656, -2068, 980, 3026, -2256, -4610, 3112, 7120, -744, -5884, 344, 5145, -420, -3547, 1695, 3664, -2152, -3485, 1080, 993, -2864, -405, 4386, 303, -6505, -2896, 4174, 1039, -4183, -96, 3543, -2292, -6311, 933, 5868, -134, -3307, 2156, 2649, -5158, -3835, 6226, 6155, -4494, -5507, 3590]
3360C590j13p926K865Q501l467q783K361O459l509l529O584L699r248n460R382
3375A406N394p233k855Q108k35j1217k78J2024K121r801k86P255m069q593O734
3390a525J1029n808j1364M129Q256o668n564R567P268j0375p968Q406N101q022
3404c538j54J0987j115j4432o64J3222J357r391L053R173p298j2700P199J4140
3418I839n062j0262N699N835j0468n754J4014Q811j2498q289R726L128j0901M73
3432e709J4956M23j5672j997J1781r39r440P282J2093r697j5943O890J3797n610
3446B215q072R450N672j4864q400J4848J0580j1561n867J0123l97j5020J698J9397
3460I802J749j7341j708J2595l883j1989R128J5790p883j6713N666J0612p697
$$ y = [3590, 3477, -4449, -1584, 6917, 3450, -5333, -2972, 3487, -22, -3551, 3033, 6732, -2516, -7976, 1406, 6800, -433, -3288, 4820, 4585, -6632, -6910, 5114, 7235, -2566, -2852, 4403, 334, -8259, -1525, 9504, 3696, -7668, -3539, 4717, -1951, -7515, 2052, 9320, -1055, -9023, -617, 4484, -3538, -3692, 7295, 6180, -8252, -8916, 4306, 5663, -3728, -675, 8498, 1200, -11500, -4301, 9839, 4777, -5485, 214, 6049, -4419, -10173, 3841, 12652, 154, -8135, 1591, 4719, -6182, -5709, 9247, 9670, -6002, -7999, 3782, 2843, -6597, 685, 12778, 3081, -12862, -5972, 7825, 2215, -5857, 3593, 9265, -5599, -13999, 849, 11429, -132, -5999, 4124, 3727, -11293, -9595, 9802, 11551, -5790, -7498, 5097, 1214, -10775, -1647, 14143, 6260, -10453, -4787, 5825, -1872]
3473a872n960J4591P972j7796j1399J3989R620j0803k668J3803j705j9855n50
3486a2633J9780L112j3873J525J1137r345j4981J1442J9031p989j6040O468R080
3499F714j1517p533J7436J1001j6436j1295J1436M863j2360J859J8517j726k1926
3512a0967k386J8203J016j2658O562J3718j1491j8995Q922J9214n428j1954Q956
3525B712O542j6145q825J8887J3039j4660r273J1164K050j6223J093K1698K204
3538A4263j9994l708J3970k952j2091J0515J7544j1575k0338O124J6093o394q465
3551g008J2863Q098j8439j2615J5911J2884j1323n571J2441r32j9455K00K1849
3564H903L206j6476j335J2347o464j4761J0508J9021p209j8069N070J0663r242
$$ y = [-1872, -7832, 6759, 14731, -3065, -14464, -475, 9145, -1658, -4326, 9477, 7772, -12083, -12633, 7147, 10259, -3614, -2089, 9048, -297, -15278, -3836, 15195, 7206, -8834, -2366, 6714, -4803, -12336, 5100, 16101, -335, -11630, -194, 4669, -7691, -5832, 12685, 10959, -10967, -13353, 4850, 5866, -6792, -230, 13488, 1997, -16998, -8076, 11138, 5710, -6244, 2712, 9254, -6891, -15716, 3171, 16210, 1550, -7723, 3441, 5491, -10732, -9639, 12059, 14263, -5731, -9439, 4531, 1579, -10512, 3, 17547, 5972, -14366, -8242, 7851, 1457, -7008, 5855, 13953, -4486, -17101, -1190, 11694, 371, -5200, 7241, 6309, -13146, -12946, 8903, 12109, -4367, -5702, 6645, 181, -14580, -4072, 14949, 7740, -10329, -5259, 5404, -3838]
3577c838o722J6810J0334j7835j3229J2773R149j0708j336J5406n04k0744k709
3590a3153J8340L452j2062K655J1440r279j6585R399J8148n329j3587O682P634
3603G755j2872q553J6613J2217j3467j0614R450L469j2205Q47J8274J114j9029
3616g001m297J4191R84j0656O256J3025q479j7341N537J4484l315q670Q360O103
3630I181j4085q972J4317J0769j0903o456J0254J309j4657n33J7770L354j4397
3643c049k635R972l246r980P917J3973o860j5330M209J0322n757n777J0918O900
3657A1577j3141r607J0311P708q198k096R869m72j4585l63J4084K137j0735J157
3671b354R082n707j2133O870J3644m371j0497L638N949p443n104J1648O741j0505
$$ y = [-3838, -10560, 6250, 16584, -1251, -14480, -1707, 7442, -3266, -4602, 10804, 10300, -10444, -13153, 5187, 8639, -3423, -768, 10672, 1393, -15192, -5793, 12355, 7026, -6561, 121, 7755, -5117, -13670, 2943, 15160, 1693, -8921, 529, 3998, -8207, -7360, 10914, 12028, -7001, -11298, 2893, 3877, -6779, -523, 12502, 4023, -13318, -7781, 6703, 3388, -5282, 3078, 9181, -4904, -13876, 441, 11210, 307, -6149, 4105, 5414, -9243, -9776, 7994, 11348, -3049, -5684, 4288, 1042, -8938, -1021, 12952, 6092, -9238, -5029, 5293, -464, -6241, 4677, 11577, -1564, -11171, -860, 6848, -1350, -3446, 6423, 5951, -8634, -8997, 5087, 7224, -3511, -2354, 6728, 1021, -11112, -4242, 9402, 5031, -5466, -1828, 4121, -3322, -8426, 3222, 9963, -542]
3685e42p497P480M325q116lJ1261pj2940j385J0735P83p871L216Q259o073j0271
3701h646N131J0106l659p158N683M714q506n590R211O533p035n125O094J364q197
3716e080L99J0300P46r601j757P392q04o059L944P438m890q463L357P112l601
3731D33m749O011M112p882n087O966N002n728k660O380K87p666n19Q060J678o695
3747b057J1M574k096n415L833O682l166n927K504M212l605k959M875L599n368
3762c03l900M722K589m208r65M957M04o143j77N548L63m656P60L982j735n259
3778d021K273M689j552l523J649K220k513k485M096K677m352k321L653J446l668
3793a732m36L838J157m714j058L875L67k906J61L592j622l035J605K747j324k319
$$ y = [-542, -8039, -559, 3766, -4350, -4353, 6908, 6901, -6039, -7424, 3311, 4094, -3777, -561, 7698, 1625, -8646, -3515, 6591, 2932, -4226, 1457, 6171, -2335, -7925, 1286, 7819, 784, -4341, 1753, 3117, -5080, -4681, 5619, 6365, -3236, -4993, 2399, 1595, -4464, -520, 6918, 2028, -6435, -3078, 4034, 433, -4316, 1695, 5807, -2075, -7162, -196, 4806, -922, -3582, 2798, 3085, -4581, -5100, 2960, 4638, -2057, -2046, 2528, 432, -4983, -1150, 5532, 2366, -3561, -1057, 3155, -450, -3409, 1466, 5065, -303, -4203, 519, 3108, -1100, -2065, 2892, 3296, -2847, -3024, 2524, 2887, -1769, -1009, 2973, 1238, -4021, -1748, 2941, 1389, -2134, -485, 1735, -778, -3263, 833, 3510, -842, -3163, 490, 1936, -1732, -2168, 1670, 2827, -1887, -2945, 930, 1297, -1609, -1448, 2144, 522, -2513, -908, 1839, 515, -1804]
3809a804K310K269l095k254K928K083j897j741J866P77k137j00K375P4k547M99
3825c94J446j77k181Q77K330j193k005N00K010o25j893Q18J483m96j327O83K87
3842A43q31p5J379l80j676R2J952O41j757n24J169J79j363K23J114Nm61j29L33
3861C4k16l14J007O70j457j082J892J068j578r33P88J340m59r79L92N39k45J25
3879E92R6n72p65P01R58p92o73O78J064o81j076J07J174k23j099l52M63N47J50
3898B97k71j77q66O00J077j96j656o6J452N91j338l89O56N76J36n51r7j66M46
3917E8K71m43p87N39J111j52r14j70Q25J004j223q39Q75O53k64o10M52n31K56
3936A11P30L06q08j318J288Q68n38j481K09J213l24j070L06M78l19L99L55p12
$$ y = [-1804, 506, 2775, -320, -2574, 354, 2437, 540, -1201, 665, 1442, -695, -795, 1580, 1654, -893, -394, 1052, 875, -1306, -429, 1901, 708, -1297, -797, 1213, 588, -1305, -487, 996, 500, -827, -144, 143, -688, -763, 616, 236, -1440, -1348, 604, 1245, -512, -1036, 133, 312, -1051, -828, 286, 291, -170, -299, 34, -182, -496, 511, 1181, -276, -1358, 534, 1602, 24, -909, -121, 1219, 760, -219, 173, 712, 467, 592, 688, 116, -649, 52, 1010, 218, -455, 223, 1287, 606, -470, -363, 811, 588, -511, -863, -400, 147, 297, 26, -151, -1017, -417, 660, 464, -1192, -1258, 194, 785, -553, -942, -286, 290, 426, -125, -222, -388, 58, 329, -114, -901, -362, 749, 597, -317, -487, 338, 1342, 119, -720, 155, 808, 544, -66, 386, -145, 111, 841, 1147, 339, -979, 309, 1177, 639, -842, -633, 580, 256, -814, -508, -30, -349, 50, 405, -307]
3954c07p11N80J813j509j768J028K273j070k104Q64J990kk034N15P92r88p21K044
3972F85J20j891O1J741J67j874p6K510j42k458M76J916o64j356J166J772k001
3989A52j770K145J768k373j376L061R58l523j416L160J945k593j588K536j45k563
4005a622N36K776q32k871P21K566j762k313L021K502k553l175K572K311k332j539
4021a994L070J127l973j177M044J057m012O87L913r27n335N24N717m83m216P80
4037a198L480k431l243L739L799l488l398L356J852l928j107N562J399n864k097
4052c567N161J194n063J135N181j195o869J148N515j275m528L163M350m943n062
4067e655M575N515l737m003L899J994n793j725P589K125o502j587N394j0o407
$$ y = [-307, -1018, -438, 1375, -134, -1902, -874, 1399, 329, -1775, -911, 1079, 1077, -957, -442, 350, -638, -1359, 685, 805, -1086, -1025, 716, 883, -991, -1067, 1443, 1301, -1157, -681, 1235, 571, -785, 381, 2153, 152, -1618, 527, 2295, -78, -1454, 1607, 2565, -958, -2374, 786, 2731, 138, -1450, 1086, 941, -1622, -1086, 1690, 858, -2013, -1292, 1274, -488, -2801, 220, 2722, 169, -3006, -434, 1877, -455, -1994, 1076, 2203, -1770, -2947, 1097, 2154, -1858, -1171, 2742, 1815, -3520, -2996, 2721, 2238, -1978, -1198, 2282, -149, -3392, 347, 4146, 658, -2740, 616, 2468, -1460, -2567, 2995, 4394, -1470, -3567, 1594, 2788, -2275, -1140, 4041, 2846, -4023, -2875, 2640, 1365, -3163, 0, 4350, -593, -5655, -1080, 4435, 698, -3305, 594, 2588, -3205, -4930, 2659, 4784, -1718, -3305, 2089, 2079, -4328]
4082d328J998P742j792q354J553O286k585m961N136N761n758o725M589N534m193
4097i7l144O450J825q378l307Q652L707o580j306O372k066q162K759R452j586
$$ y = [-4328, -2330, 5412, 3620, -4734, -3181, 3105, 520, -4441, 695, 6456, 698, -6027, -1438, 4096, -97, -3241, 3209, 5034, -3344, -6651, 2001, 5708, -872, -2178, 4194, 2128, -6034, -3275, 6177, 4591]
$$ [...]
8191A84
##END NTUPLES=NMR FID
##END=
