##TITLE=1H_LR-675-C1-C
 CDcl3, 8 sc, 
 30.5.2019
##JCAMPDX= 6.0         $$ Bruker NMR JCAMP-DX V2.0
##DATA TYPE= NMR FID
##DATA CLASS= NTUPLES
##ORIGIN= UXNMR, Bruker Analytische Messtechnik GmbH
##OWNER= root
$$ XWIN-NMR		Version 3.5
$$ Thu May 30 13:41:25 2019 Russian Standard Time (UT+4h)  she@DPX200
##.OBSERVE FREQUENCY= 200.13155
##.OBSERVE NUCLEUS= ^1H
##.DELAY= (6, 6)
##.ACQUISITION MODE= SIMULTANEOUS
##.ACQUISITION SCHEME= undefined
##.AVERAGES= 8
##.DIGITISER RES= 18
##SPECTROMETER/DATA SYSTEM= spect
##.PULSE SEQUENCE= zg30
##.SOLVENT NAME= CDCl3
##.SHIFT REFERENCE= (INTERNAL, CDCl3, 0, 15.7039)
##AUDIT TRAIL= $$ (NUMBER, WHEN, WHO, WHERE, WHAT)
$$ ##TITLE= Audit trail, XWIN-NMR		Version 3.5
$$ ##JCAMPDX= 5.01
$$ ##ORIGIN= Bruker BioSpin GmbH
$$ ##OWNER= she
$$ F:/spectra/data/she/nmr/H-F/1/audita.txt
$$ ##AUDIT TRAIL=  $$ (NUMBER, WHEN, WHO, WHERE, WHAT)
(   1,<2019-05-30 13:40:19.04 +0400>,<she>,<DPX200>,
      <created by zg, POWCHK disabled, PULCHK disabled
       configuration hash MD5:
       00 E9 B6 7A A2 85 ED C7 34 08 36 98 17 FE 4E 26
       data hash MD5: 16K
       7B A5 73 50 4F E3 E4 D3 63 A8 A3 75 BE 32 F0 25>)
$$ ##END=
$$ 
$$ hash MD5
$$ F4 90 1E 56 C4 13 01 CC 42 A9 F9 7C F5 C2 FA 48
##$RELAX= 
##$RELAX= 
##$RELAX= 
##$RELAX= 
##$RELAX= 
##$RELAX= 
$$ Bruker specific parameters
$$ --------------------------
##$DU= <F:/spectra>
##$EXPNO= 1
##$NAME= <H-F>
##$PROCNO= 1
##$TYPE= <nmr>
##$USER= <she>
##$AMP= (0..31)
100 100 100 100 100 100 100 100 100 100 100 100 100 100 100 100 100 100 
100 100 100 100 100 100 100 100 100 100 100 100 100 100 
##$AQSEQ= 0
##$AQ_mod= 1
##$AUNM= <au_zg>
##$AUTOPOS= <>
##$BF1= 200.13
##$BF2= 200.13
##$BF3= 200.13
##$BF4= 200.13
##$BF5= 200.13
##$BF6= 200.13
##$BF7= 200.13
##$BF8= 200.13
##$BYTORDA= 1
##$CFDGTYP= 0
##$CFRGTYP= 5
##$CHEMSTR= <none>
##$CNST= (0..31)
1 1 145 1 1 1 1 1 1 1 1 1 1 1 1 1 1 1 1 1 1 1 1 1 1 1 1 1 1 1 1 1 
##$CPDPRG= <>
##$CPDPRG1= <>
##$CPDPRG2= <>
##$CPDPRG3= <>
##$CPDPRG4= <mlev>
##$CPDPRG5= <mlev>
##$CPDPRG6= <mlev>
##$CPDPRG7= <mlev>
##$CPDPRG8= <mlev>
##$CPDPRGB= <>
##$CPDPRGT= <>
##$D= (0..31)
0 1.2 0 0 0 0 0 0 0 0 0 0.03 0 0 0 0 0 0 0 0 0 0 0 0 0 0 0 0 0 0 0 0 
##$DATE= 1559209218
##$DBL= (0..7)
120 120 120 120 120 120 120 120 
##$DBP= (0..7)
150 150 150 150 150 150 150 150 
##$DBP07= 0
##$DBPNAM0= <>
##$DBPNAM1= <>
##$DBPNAM2= <>
##$DBPNAM3= <>
##$DBPNAM4= <>
##$DBPNAM5= <>
##$DBPNAM6= <>
##$DBPNAM7= <>
##$DBPOAL= (0..7)
0.5 0.5 0.5 0.5 0.5 0.5 0.5 0.5 
##$DBPOFFS= (0..7)
0 0 0 0 0 0 0 0 
##$DE= 6
##$DECBNUC= <off>
##$DECIM= 24
##$DECNUC= <off>
##$DECSTAT= 4
##$DIGMOD= 1
##$DIGTYP= 9
##$DL= (0..7)
0 120 120 120 120 120 120 120 
##$DP= (0..7)
150 150 150 150 150 150 150 150 
##$DP07= 0
##$DPNAME0= <>
##$DPNAME1= <>
##$DPNAME2= <>
##$DPNAME3= <>
##$DPNAME4= <>
##$DPNAME5= <>
##$DPNAME6= <>
##$DPNAME7= <>
##$DPOAL= (0..7)
0.5 0.5 0.5 0.5 0.5 0.5 0.5 0.5 
##$DPOFFS= (0..7)
0 0 0 0 0 0 0 0 
##$DQDMODE= 0
##$DR= 18
##$DS= 0
##$DSLIST= <SSSSSSSSSSSSSSS>
##$DSPFIRM= 0
$$ [...]
##$SUBNAM2= <"">
##$SUBNAM3= <"">
##$SUBNAM4= <"">
##$SUBNAM5= <"">
##$SUBNAM6= <"">
##$SUBNAM7= <"">
##$SUBNAM8= <"">
##$SUBNAM9= <"">
##$SW= 24.9336996594482
##$SWIBOX= (0..15)
0 0 2 0 0 0 0 0 0 0 0 0 0 0 0 0 
##$SW_h= 4990.01996007984
##$TD= 16384
##$TD0= 1
##$TE= 0
##$TE2= 300
##$TE3= 300
##$TEG= 300
##$TL= (0..7)
0 120 120 120 120 120 120 120 
##$TP= (0..7)
150 150 150 150 150 150 150 150 
##$TP07= 0
##$TPNAME0= <>
##$TPNAME1= <>
##$TPNAME2= <>
##$TPNAME3= <>
##$TPNAME4= <>
##$TPNAME5= <>
##$TPNAME6= <>
##$TPNAME7= <>
##$TPOAL= (0..7)
0.5 0.5 0.5 0.5 0.5 0.5 0.5 0.5 
##$TPOFFS= (0..7)
0 0 0 0 0 0 0 0 
##$TUNHIN= 0
##$TUNHOUT= 0
##$TUNXOUT= 0
##$USERA1= <user>
##$USERA2= <user>
##$USERA3= <user>
##$USERA4= <user>
##$USERA5= <user>
##$V9= 5
##$VALIST= <valist>
##$VCLIST= <CCCCCCCCCCCCCCC>
##$VD= 0
##$VDLIST= <DDDDDDDDDDDDDDD>
##$VPLIST= <PPPPPPPPPPPPPPP>
##$VTLIST= <TTTTTTTTTTTTTTT>
##$WBST= 1024
##$WBSW= 4
##$XGAIN= (0..3)
0 0 0 0 
##$XL= 0
##$YL= 0
##$YMAX_a= 611428
##$YMIN_a= -738456
##$ZGOPTNS= <>
##$ZL1= 120
##$ZL2= 120
##$ZL3= 120
##$ZL4= 120
##$ABSF1= 10
##$ABSF2= 0
##$ABSG= 5
##$ABSL= 3
##$ALPHA= 0
##$AQORDER= 0
##$ASSFAC= 0
##$ASSFACI= 0
##$ASSFACX= 0
##$ASSWID= 0
##$AUNMP= <proc_1d>
##$AZFE= 0.1
##$AZFW= 0.1
##$BCFW= 1
##$BC_mod= 2
##$BYTORDP= 1
##$COROFFS= 0
##$CY= 11.3945322036743
##$DATMOD= 1
##$DC= 2
##$DFILT= <>
##$DTYPP= 0
##$F1P= 18.9103706918063
##$F2P= -1.10871071338519
##$FCOR= 0.5
##$FTSIZE= 0
##$FT_mod= 4
##$GAMMA= 1
##$GB= 0.15
##$INTBC= 1
##$INTSCL= 1
##$ISEN= 128
##$LB= 0.24
##$LEV0= 0
##$LPBIN= 0
##$MAXI= 10000
##$MC2= 0
##$MEAN= 0
##$ME_mod= 0
##$MI= 1.114404
##$NCOEF= 0
##$NC_proc= 0
##$NLEV= 6
##$NOISF1= 3.799351
##$NOISF2= 2.8
##$NSP= 1
##$NTH_PI= 0
##$NZP= 0
##$OFFSET= 15.70392
##$PC= 1
##$PHC0= -8497.151
##$PHC1= 12.60023
##$PH_mod= 1
##$PKNL= yes
##$PPARMOD= 0
##$PSCAL= 0
##$PSIGN= 0
##$REVERSE= no
##$SF= 200.130013532006
##$SI= 16384
##$SIGF1= 3
##$SIGF2= 2
##$SINO= 400
##$SIOLD= 16384
##$SREGLST= <1H.CDCl3>
##$SSB= 0
##$STSI= 0
##$STSR= 0
##$SW_p= 3612.71676300578
##$SYMM= 0
##$S_DEV= 0
##$TDeff= 0
##$TDoff= 0
##$TI= <>
##$TILT= no
##$TM1= 0
##$TM2= 0
##$TOPLEV= 0
##$USERP1= <user>
##$USERP2= <user>
##$USERP3= <user>
##$USERP4= <user>
##$USERP5= <user>
##$WDW= 1
##$XDIM= 8192
##$YMAX_p= 0
##$YMIN_p= 0
$$ End of Bruker specific parameters
$$ ---------------------------------
##NTUPLES= NMR FID
##VAR_NAME=  TIME,          FID/REAL,        FID/IMAG
##SYMBOL=    X,             R,               I
##VAR_TYPE=  INDEPENDENT,   DEPENDENT,       DEPENDENT
##VAR_FORM=  AFFN,          ASDF,            ASDF
##VAR_DIM=   8192,          8192,            8192
##UNITS=     SECONDS,       ARBITRARY UNITS, ARBITRARY UNITS
##FACTOR=    0.0002004,     1,               1
##FIRST=     0,             0,               0
##LAST=      1.6414764,     0,               0
##MIN=       0,             -738456,         0
##MAX=       1.6414764,     611428,          0
$$ Real data points
##PAGE= N=1
##DATA TABLE= (X++(R..R)), XYDATA
$$ plain form
0 0 0 0 0 -8 8 -8 8 -17 24 -32 40 -53 65 -80 97 -120 144 -170 202 -237 280 -328 376 -437 502 -576 656
27 656 -744 842 -957 1078 -1209 1356 -1518 1696 -1888 2097 -2336 2592 -2868 3179 -3521 3898
43 3898 -4314 4781 -5303 5892 -6559 7326 -8220 9266 -10524 12063 -13992 16507 -19932
56 -19932 24880 -32719 47082 -81993 340272 147843 -660008 -141010 340998 180104 -166381
67 -166381 38033 150796 -44271 -162633 25529 38288 -24137 111249 201244 -173408 -479608
78 -479608 -234716 130446 55734 -66682 62394 40988 -251080 -162660 307134 344437 -120042
89 -120042 -185699 187037 116697 -353415 -221012 429726 481057 -128658 -314215 97193 221643
100 221643 -89069 -120297 156697 109590 -237457 -317414 -113316 27720 121645 206757 26339
$$ packed form
0@%%%qJ6j6J6k5M1n6P2r3J18j45J77k17K64l14L72m39N17o08P04q13R39j078J232
27F56j400J586j799K035k287K565k874L214l584L985m433M928n460O047o700P419
43C898q212R095j0084J1195j2451J3885j5546J7486j9790K2587k6055L0499l6439
56a9932M4812n7599P9801j29075M22265j92429q07851N18998M82008j60894l46485
67a66381K04414J12763j95067j18362J88162J2759o2425J35386Q9995l74652l06200
78d79608K44892L65162p4712j22416J29076k1406k92068Q8420M69794L7303m64479
89a20042o5657L72736p0340m70112J32403O50738N1331o09715j85557M11408J24450
100B21643l10712l1228K76994m7107l47047p9957K04098J41036R3925Q5112j80418
$$ plain form
111 26339 -283549 -178068 210470 165697 -209295 -122214 300237 176861 -355235 -296528 315381
122 315381 471879 53847 -125258 47541 1716 -175824 3525 252264 35952 -278818
132 -278818 -125945 133526 -18287 -202921 31708 270061 59641 -241616 -224072 -83733
142 -83733 -7131 131299 191944 -76710 -303242 -15697 348826 153057 -199463 -7909
152 -7909 335846 93577 -359506 -227528 225364 246359 -42577 -88233 9164 -70482 -102311
163 -102311 105004 176744 -69068 -199916 -35160 19415 -141634 -104223 154394 176624 -53179
174 -53179 -101117 39179 32108 -29357 114578 205174 -42932 -249939 -42474 197237 66171
185 66171 -90978 67567 176467 -56632 -219993 -19031 149320 5297 -117832 -23379
$$ packed form
111B6339l09888J05481L88538m4773l74992Q7081M22451j23376n32096N8707O11909
122C15381J56498m18032j79105J72799m5825j77540J79349K48739k16312l14770
132b78818J52873K59471j51813j84634K34629K38353k10420l01257J7544J40339
142h3733P6602J38430O0645k68654k26532K87545L64523j95769l52520J91554
152g909L43755k42269m53083J31978M52892K0995k88936m5656R7397p9646l1829
163a02311K07315P1740k45812j30848J64756N4575j61049L7411K58617K2230k29803
174e3179m7938J40296p071o1465J43935R0596k48106k07007K07465K39711j31066
185F6171j57149J58545J08900k33099j63361K00962J68351j44023j23129R4453
$$ plain form
195 -23379 -10386 -151555 -108959 119111 142645 -40355 -69259 37603 -8377 -101799 21344
206 21344 161685 34048 -128568 -31216 96985 8721 -48858 108319 169119 -38334 -163964
217 -163964 -19913 75931 -31006 -64360 50657 31199 -124888 -100364 81265 93705 -35515
228 -35515 -18825 73591 -12518 -137865 -32711 131009 68153 -66575 -15776 76636 13056
239 13056 -42319 59167 118506 3691 -79655 -20556 -1039 -69219 -37581 74283 39337
250 39337 -98182 -80245 51486 46231 -53191 -26447 55621 -4963 -106010 -48809 55590
261 55590 28574 -19324 44980 81329 -14367 -59607 49530 110159 5271 -74845 -15912 25405
273 25405 -31493 -46818 23943 44183 -8027 -15831 10914 -20879 -53953 3235 47445 -27046
$$ packed form
195b3379J2993j41169M2596K28070K3534j83000k8904J06862m5980r3422J23143
206B1344J40341j27637j62616R7352J28201q8264n7579J57177O0800k07453j25630
217a63964J44051R5844j06937l3354J15017j9458j56087K4524J81629J2440j29220
228c5515J6690R2416q6109j25347J05154J63720o2856j34728N0799R2412o3580
239A3056n5375J01486N9339j14815q3346N9099J9517o8180L1638J11864l4946
250C9337j37519J7937J31731n255r9422K6744Q2068o0584j01047N7201J04399
261E5590k7016m7898O4304L6349r5696m5240J09137O0629j04888q0116N8933M1317
273B5405n6898j5325P0761K0240n2210p804K6745l1793l3074N7188M4210p4491
$$ plain form
285 -27046 -92123 -22159 57712 19562 -19473 44584 87450 15993 -37826 15701 53269 -2835
297 -2835 -36922 7322 24146 -23061 -28791 26532 39283 -2395 -15646 -3296 -30586 -61789
309 -61789 -32283 1931 -27657 -56206 -14106 30156 12264 -5942 26999 45293 8999 -13860
321 -13860 6867 9054 -19187 -7211 41167 40134 -7502 -7695 42593 51330 999 -31931 -20822
334 -20822 -13743 -28163 -35702 -32566 -26904 -5707 23462 19767 -12824 -13689 25055 34333 -8027 -36912
348 -36912 -11963 19156 17114 9190 20096 33380 35406 35712 29489 5036 -17926 -15021 -6708 -20171
362 -20171 -41851 -36630 -11793 3031 844 -6000 -11423 -12577 -7733 -7641 -23633 -38689 -26649 3443
376 3443 17086 9124 9874 31184 48543 41883 21059 6042 2208 3259 820 -8143 -14373 -8430
$$ packed form
285b7046o5077O9964P9871l8150l9035O4057M2866p1457n3819N3527L7568n6104
297b835l4087M4244J6824m7207n730N5323J2751m1678j3251J2350k7290l1203
309f1789K9506L4214k9588k8549M2100M4262j7892j8206L2941J8294l6294k2859
321a3860K0727K187k8241J1976M8378j033m7636j93N0288Q737n0331l2930J1109
334b0822P079j4420p539L136N662K1197K9169l695l2591q65L8744R278m2360k8885
348c6912K4949L1119k042p924J0906J3284K026L06o223k4453k2962K905Q313j3463
362b0171k1680N221K4837J4824k187o844n423j154M844R2j5992j5056J2040L0092
376C443J3643p962P50K1310J7359o660k0824j5017l834J051k439q963o230N943
$$ plain form
390 -8430 7319 17162 11432 -1689 -8800 -8564 -9728 -20507 -35983 -39776 -24988 -3260 5410 2870
404 2870 6195 23619 37423 30598 9820 -1010 3857 9850 4465 -4454 -2615 10742 22439 22072
418 22072 11372 1747 -2778 -7607 -17188 -31328 -39724 -36621 -25564 -15782 -10125 -5489 666 8230
432 8230 13165 9562 -1245 -8401 -4742 3025 4779 4995 11684 22668 28985 31271 28784 18285 3545
447 3545 -820 1310 -8951 -29307 -31377 -9811 4449 -5039 -13948 -3406 8955 4075 -8107
460 -8107 -14339 -15531 -12210 -4136 -204 -4626 2093 25582 38592 23063 7904 15885 20910 3972
474 3972 -10323 -5032 -5488 -18865 -14838 5516 5841 -12962 -9115 10773 -897 -34440 -33968 -4596
488 -4596 -3847 -28123 -24167 4057 10207 2021 14445 30482 20702 6430 12693 10499 -9072 -4686
$$ packed form
390h430J5749R843n730j3121p111K36j164j0779j5476l793J4788K1728Q670k540
404B870L325J7424J3804o825k0778j0830M867N993n385q919J839J3357J1697l67
418B2072j0700r625m525m829r581j4140q396L103J1057R782N657M636O155P564
432H230M935l603j0807p156L659P767J754K16O689J0984O317K286k487j0499j4740
447C545m365K130j0261k0356k070K1566J4260r488q909J0542J2361m880j2182
460h107o232j192L321Q074L932m422O719K3489J3010j5529j5159P981N025j6938
474C972j4295N291m56j3377M027K0354L25j8803L847J9888j1670l3543M72K9372
488d596P49k4276L956K8224O150q186J2424J6037r780j4272O263k194j9571M386
$$ plain form
502 -4686 24517 20212 -15539 -11665 29817 28956 -12643 -13145 23185 10534 -41350 -42552 -470 2962
516 2962 -22480 -9593 15398 -3332 -22711 11983 40642 7484 -22676 5405 20499 -17800
528 -17800 -27811 22981 43447 662 -14362 19681 16148 -22976 -8007 36715 7332 -58687
540 -58687 -44169 13395 2120 -36233 -3580 39677 -133 -47368 -9315 33987 875 -23636
552 -23636 19030 28279 -34844 -44769 35748 66012 6128 -13033 33231 22128 -39964 -19212
564 -19212 52921 30612 -47427 -33160 26964 -1976 -53176 2474 73674 21338 -62120 -37490
576 -37490 17070 -2141 -16407 28956 26427 -45863 -44102 41447 45180 -27994 -5220 81442 33418
589 33418 -95398 -70884 64656 69901 -36340 -42980 24866 -838 -59565 -4179 69335 17735
$$ packed form
502d686K9203m305l5751L874M1482q61m1599n02L6330j2651n1884j202M2082L432
516B962k5442J2887K4991j8730j9379L4694K8659l3158l0160K8081J5094l8299
528a7800j0011N0792K0466m2785j5024L4043l533l9124J4969M4722k9383o6019
540e8687J4518N7564j1275l8353L2653M3257l9810m7235L8053M3302l3112k4511
552b3636M2666R249o3123r925Q0517L0264n9884j9161M6264j1103o2092K0752
564a9212P2133k2309p8039J4267O0124k8940n1200N5650P1200n2336q3458K4630
576c7490N4560j9211j4266M5363k529p2290J761Q5549L733p3174K2774Q6662m8024
589C3418j28816K4514J35540N245j06241o640O7846k5704n8727N5386P3514n1600
$$ plain form
601 17735 -51771 -13656 15041 -51998 -60387 52106 89149 -20154 -74532 4252 40555 -7863
613 -7863 9856 74650 22429 -77847 -37060 55354 10444 -54984 37666 116578 -16691 -148339
625 -148339 -32194 128210 61369 -76704 -43648 37120 -16763 -76332 -2009 68029 27072
636 27072 -6431 10962 -29951 -79177 13491 129612 47034 -106058 -65456 59978 21215
647 21215 -67972 15252 118915 21607 -107540 -47281 45823 -6958 -38823 62416 69767 -99308
659 -99308 -148753 34972 137958 11194 -71639 19974 53056 -54616 -80147 29598 76392
670 76392 25882 9057 -5066 -81686 -66157 106063 161486 -26861 -138983 6748 97043
681 97043 -53623 -124628 61841 164765 -15541 -157509 -45544 69193 21704 2131 64985
$$ packed form
601A7735o9506L8115K8697o7039q389J12493L7043j09303n4378P8784L6303m8418
613g863J7719O4794n2221j00276M0787R2414m4910o5428R2650P8912j33269j31648
625a48339J16145J60404o6841j38073L3056Q0768n3883n9569P4323P0038m0957
636B7072l3503J7393m0913m9226R2668J16121q2578j53092M0602J25434l8763
647B1215q9187Q3224J03663r7308j29147O0259R3104n2781l1865J01239P351j69075
659i9308m9445J83725J02986j26764q2833R1613L3082j07672k5531J09745M6794
670G6392n0510j6825j4123p6620J5529J72220N5423j88347j12122J45731R0295
681I7043j50666p1005J86469J02924j80306j41968J11965J14737m7489j9573O2854
$$ plain form
692 64985 13001 -119061 -80084 71850 65174 -40255 -589 86396 -3038 -121806 -34797
703 -34797 105665 69981 -19612 -8115 -20517 -104578 -52554 123325 113217 -82110 -103177
714 -103177 66120 59591 -121414 -91520 139854 148785 -92192 -172702 -9021 81985 25561
725 25561 23559 60168 -13323 -85032 -8421 61777 -5730 -25036 85856 77721 -109359 -149528
737 -149528 52024 153028 21563 -56934 14758 -1769 -106307 -45144 115397 75630 -83347
748 -83347 -56532 59730 -11012 -120012 12237 182735 68641 -140266 -105583 44468 40308
759 40308 -15173 41208 63608 -44041 -83477 15730 42143 -29567 12149 112405 11667
770 11667 -173791 -105450 112553 108413 -54951 -48199 60550 -2860 -117243 -22097 125378
$$ packed form
692F4985n1984j32062L8977J51934o676j05429L9666Q6985q9434j18768Q7009
703c4797J40462l5684q9593J1497j2402q4061N2024J75879j0108j95327k1067
714a03177J69297o529j81005K9894K31374Q931k40977q0510J63681R1006n6424
725B5561k002L6609p3491p1709P6611P0198o7507j9306J10892q135j87080m0169
737a49528K01552J01004j31465p8497P1692j6527j04538O1163J60541l9767j58977
748h3347K6815J16262p0742j09000J32249J70498j14094k08907L4683J50051m160
759D0308n5481N6381K2400j07649l9436R9207K6413p1710M1716J00256j00738
770A1667j85458O8341K18003m140j63364O752J08749o3410j14383R5146J47475
$$ plain form
781 125378 61495 -63871 -26477 25018 -56010 -68109 90162 145622 -18785 -113869 -6612
792 -6612 54567 -23549 -18997 88990 59465 -87558 -89911 27589 33169 -23566 40019 93965
804 93965 -40468 -154692 -28973 118135 40724 -68551 1809 60432 -52558 -110133 30078
815 30078 124058 24161 -53710 -218 2639 -73733 -26919 106996 77337 -72256 -74267 32868
827 32868 15793 -57977 13192 108678 18510 -110228 -55796 45402 8825 -30240 50758 70973
839 70973 -59757 -108626 22480 93143 4429 -30726 45440 27641 -85858 -63226 75983
850 75983 83985 -24984 -30038 35156 -10571 -79599 3185 107333 36193 -77980 -42277 26232
862 26232 -17597 -44145 45632 80686 -27504 -86202 -3484 40628 -19203 -16391 63532 37523
$$ packed form
781A25378o3883j25366L7394N1495q1028j2099J58271N5460j64407r5084J07257
792f612O1179p8116M552J07987k9525j47023k353J17500N580n6735O3585N3946
804I3965j34433j14224J25719J47108p7411j09275P0360N8623j12990n7575J40211
815C0078R3980r9897p7871N3492K857p6372M6814J33915k9659j49593k011J07135
827C2868j7075p3770P1169R5486r0168j28738N4432J01198l6577l9065Q0998K0215
839G0973j30730m8869J31106P0663q8714l5155P6166j7799j13499K2632J39209
850G5983Q002j08969n054O5194m5727o9028Q2784J04148p1140j14173L5703O8509
862B6232m3829k6548Q9777L5054j08190n8698Q2718M4112n9831K812P9923k6009
$$ plain form
874 37523 -77551 -71596 40484 55479 -14667 -2671 45832 -11180 -81135 -13684 74496 26524
886 26524 -44973 -2746 34652 -36446 -68871 29357 87258 4104 -59404 -9161 20665 -25097
898 -25097 -17913 52295 42386 -39473 -39907 24024 14815 -26692 17268 69291 4077 -74356 -25105
911 -25105 51024 19760 -28760 10968 37975 -26926 -59806 11063 52968 -774 -28060 14680
923 14680 11424 -49093 -35832 44214 46200 -26374 -35303 14623 8472 -29600 -960 45725 12701
936 12701 -37470 -14875 17536 -9461 -21222 29057 42092 -24689 -51132 9226 39006 -7322
948 -7322 -23418 21221 23844 -31114 -35360 18713 29915 -6291 -6258 19261 -389 -30963 -1286
961 -1286 38690 13631 -24326 -5058 19124 -7333 -22965 14286 34272 -3262 -25215 1993
$$ packed form
874C7523j15074N955J12080J4995p0146J1996M8503n7012o9955O7451Q8180m7972
886B6524p1497M2227L7398p1098l2425R8228N7901q3154o3508N0243K9826m5762
898b5097P184P0208r909q1859m34O3931r209m1507M3960N2023o5214p8433M9251
911b5105P6129l1264m8520L9728K7007o4901l2880P0869M1905n3742k7286M2740
923A4680l256o0517J3261Q0046J986p2574q929M9926o151l8072K8640M6685l3024
936A2701n0171K2595L2411k6997j1761N0279J3035o6781k6443O0358K9780m6328
948g322j6096M4639K623n4958m246N4073J1202l6206L3K5519j9650l0574K9677
961a286L9976k5059l7957J9268K4182k6457j5632L7251J9986l7534k1953K7208
$$ plain form
973 1993 12738 -13479 -12119 21718 14970 -25997 -24060 14123 13421 -15092 -5369 21453 3794
986 3794 -28475 -12226 19374 8689 -14902 -2789 12130 -5779 -17527 5498 18687 -1504
998 -1504 -10845 6017 5359 -15756 -10481 17234 13879 -14077 -12578 11006 9365 -9582 -2990 15727
1012 15727 6470 -12193 -5231 9740 1765 -6640 6798 14009 -2954 -12075 4987 14369 308
1025 308 -8442 2915 6198 -6192 -8339 3812 5440 -3766 -3223 4595 -720 -9031 -2250 6825 -733
1040 -733 -10192 -3511 4357 -2018 -7333 1414 7688 -1307 -7399 351 5893 -1109 -6089 -424 3236
1055 3236 -1278 -3332 316 1656 68 1842 3394 -1042 -4333 487 4999 919 -4127 -1003 4515
1070 4515 3808 285 1331 2953 2242 1921 2893 1116 -2570 -791 4534 3829 -2330 -3368 2236 5184
$$ packed form
973A993J0745k6217J360L3837o748m0967J937L8183p02k8513R723K6822j7659
986C794l2269J6249L1600j0685k3591J2113J4919j7909j1748K3025J3189k0191
998a504r341J6862o58k1115N275K7715l355k7956J499K3584j641j8947O592J8717
1012A5727r257j8663O962J4971p975q405J3438P211j6963r121J7062R382j4061
1025C08q750J1357L283j2390k147J2151J628r206N43P818n315q311O781R075p558
1040g33r459O681P868o375n315Q747O274q995o092P750N542p002m980N665L660
1055C236m514k054L648J340j588J774J552m436l291M820M512m080n046L124N518
1070D515p07l523J046J622p11l21R72j777l686J779N325p05o159j038N604K948
$$ plain form
1086 5184 642 -4097 -3325 451 1477 -1792 -5120 -3524 -274 1608 -1418 -3698 -2162 1326 756
1101 756 -2486 -3421 -1220 243 -1219 -1431 8 600 -502 -575 1731 2148 -582 -2256 -540 2048 1291
1118 1291 -1575 -1475 1196 2790 1677 -453 -573 1358 3723 1476 -1205 -1022 2129 2983 1013 426
1134 426 2144 1790 632 2247 2979 138 -2930 385 4000 308 -5421 -3016 3574 2828 -3158 -4500
1150 -4500 -1109 61 -1195 -1223 -2461 -4167 -1481 2193 -830 -6032 -2079 5660 2595 -6108 -4196
1165 -4196 3740 2339 -3522 -706 4309 -142 -5657 1003 7368 679 -5168 1744 6536 -1926 -5902
1180 -5902 2586 7055 -487 -3109 3587 2824 -4845 -428 10491 4935 -7849 -4115 8221 3563
1194 3563 -7130 -287 10331 1635 -9070 -1367 6571 -1990 -5291 7109 7429 -11672 -14463 7038
$$ packed form
1086E184m542m739P72L776J026l269l328J596L250J882l026k280J536L488n70
1101G56l242r35K201J463j462k12J439N92j102p3K306M17k730j674J716K588p57
1118A291k866J00K671J594j113k130j20J931K365k247k681J83L151Q54j970n87
1134D26J718l54j158J615P32k841l068L315L615l692n729K405O590p46n986j342
1150d500L391J170j256k8j238j706K686L674l023n202L953P739l065q703J912
1165d196P936j401n861K816N015m451n515O660O365o689n847O912M792q462l976
1180e902Q488M469p542k622O696p63p669M417J0919n556j2784L734J2336m658
1194C563j0693O843J0618q696j0705P703P938q561l301J2400L20j9101k791K1501
$$ plain form
1208 7038 12694 -6953 -11882 5796 7052 -11907 -11623 7397 8450 -6680 -3954 5366 -5854 -14362
1222 -14362 6126 20580 -1900 -20076 -78 16725 -2916 -15410 7505 20498 -2901 -16829
1234 -16829 820 8609 -3564 1664 18836 2585 -24833 -8360 25203 11435 -19457 -4293
1246 -4293 24917 4738 -28779 -10441 24666 15056 -9719 -3491 3258 -13448 -10725 21360 20291
1259 20291 -18308 -21075 16091 13087 -26793 -18030 30561 27293 -23704 -31430 5492 12318 -6093
1272 -6093 4458 17475 -11223 -31421 3338 26790 -6879 -23811 18982 32957 -23045 -47808
1284 -47808 8190 45856 8068 -22087 -1471 5000 -16832 -4275 29944 13616 -22936 -3525
1296 -3525 26570 -9526 -43475 9000 62932 14428 -52877 -26242 28489 14263 -14158 10036
$$ packed form
1208G038N656j9647m929J7678J256j8959K84J9020J053j5130K726R320j1220q508
1222a4362K0488J4454k2480j8176J9998J6803j9641j2494K2915J2993k3399j3928
1234a6829J7649P789j2173N228J7172j6251k7418J6473L3563j3768l0892J5164
1246d293K9210k0179l3517J8338L5107r610k4775O228O749j6706K723L2085j069
1259B0291l8599k767L7166l004l9880Q763M8591l268n0997p726L6922O826j8411
1272f093J0551J3017k8698k0198L4759K3452l3669j6932M2793J3975n6002k4763
1284d7808N5998L7666l7788l0155K0616O471k1832J2557L4219j6328l6552J9411
1296c525L0095l6096l3949N2475N3932m8504o7305K6635N4731j4226k8421K4194
$$ plain form
1308 10036 23389 -15878 -29291 9456 16111 -18141 -2497 44800 12790 -62215 -40994 45778
1320 45778 47741 -21428 -28670 15116 3526 -33503 -6204 35236 9809 -21366 4518 11227
1332 11227 -38564 -35639 47224 65060 -25201 -67210 689 39704 -7318 -22085 28294 30982
1344 30982 -26677 -33091 10255 9213 -10717 25427 47571 -23418 -76192 -4504 70622 23512
1356 23512 -40956 -3548 37062 -14081 -52295 6966 52813 11173 -20053 3495 -6137 -45395
1368 -45395 -7147 69438 39866 -52702 -46042 28047 18185 -38258 -4805 58822 19267 -55351
1380 -55351 -34640 19619 6473 -7017 35258 31618 -51022 -66710 25256 59797 -11824 -33160
1392 -33160 31454 28485 -54240 -53259 40263 60254 -7254 -24437 6091 -15489 -42144 17470
$$ packed form
1308A0036J3353l9267j3413L8747O655l4252J5644M7297l2010p5005K1221Q6772
1320D5778J963o9169p242M3786j1590l7029K7299M1440k5427l1175K5884O709
1332A1227m9791K925Q2863J7836r0261m2009O7899L9015m7022j4767N0379K688
1344C0982n7659o414M3346j042j9930L6144K2144p0989n2774P1688P5126m7110
1356B3512o4468L7408M0610n1143l8214N9261M5847m1640l1226K3548r632l9258
1368d5395L8248P6585k9572r2568O660P4089r862n6443L3453O3627l9555p4618
1380e5351K0711N4259j3146j3490M2275l640q2640j5688R1966L4541p1621k1336
1392c3160O4614k969q2725R81R3522J9991o7508j7183L0528k1580k6655N9614
$$ plain form
1404 17470 70825 11000 -53874 -10559 32260 -18498 -41178 39001 73769 -15218 -72368 -11318
1416 -11318 34574 -765 -3149 44703 18777 -60964 -45347 38737 36625 -23452 -2427 45917
1428 45917 -7578 -77956 -22301 67297 39797 -28716 -13784 11862 -30644 -41528 34024 61646
1440 61646 -12390 -45946 7028 13274 -43219 -19396 67968 50779 -51552 -60302 17470 24982
1452 24982 -20666 8079 55993 1102 -68710 -23954 45608 17138 -20301 23370 38963 -39225
1464 -39225 -69293 17354 67656 6801 -27745 14777 9910 -51177 -29854 57816 52571 -29046
1476 -29046 -33760 17851 -3708 -45911 9213 74721 18493 -61861 -29531 27997 -1290 -25784
1488 -25784 33394 53859 -29044 -70912 -300 43987 -2139 -15683 34088 19946 -56760 -48349
$$ packed form
1404A7470N3355n9825o4874M3315M2819n0758k2680Q0179L4768q8987n7150O1050
1416a1318M5892l5339k384M7852k5926p9741J5617Q4084k112o0077K1025M8344
1428D5917n3495p0378N5655Q9598k7500o8513J4932K5646m2506j0884P5552K7622
1440F1646p4036l3556N2974O246n6493K3823Q7364j7189j02331q750P7772P512
1452B4982m5648K8745M7914n4891o9812M4756O9562k8470l7439M3671J5593p8188
1464c9225l0068Q6647N0302o0855l4546M2522m867o1087K1323Q7670n245q1617
1476b9046m714N1611k1559m2203N5124O5508n6228q0354L2330N7528k9287k4494
1488b5784N9178K0465q2903m1868P0612M4287m6126j3544M9771j4142p6706Q411
$$ plain form
1500 -48349 35855 44432 -14908 -12485 25799 -11876 -59877 -4701 66866 26521 -39049 -12920
1512 -12920 22885 -19133 -39719 29828 64141 -6226 -51183 -2626 21700 -18177 -10120 51480
1524 51480 35756 -47834 -49330 23945 30233 -18434 -1228 43765 2596 -59813 -23506 43161
1536 43161 24712 -17612 5301 20637 -31403 -48062 22201 55507 -3761 -34610 9346 15395
1548 15395 -36949 -27350 45709 44985 -28223 -40450 9381 8799 -25168 3982 48090 7754 -50128
1561 -50128 -21440 29069 6602 -22227 16458 38243 -18197 -51512 1063 39758 6256 -12825
1573 -12825 17098 12175 -34695 -25088 33468 32851 -17006 -14246 21902 197 -39829 -4841 49759
1586 49759 22346 -33633 -19667 16581 -1630 -21390 13943 35430 -7667 -36361 -1812 19103
$$ packed form
1500d8349Q4204Q577n9340K423L8284l7675m8001N5176P1567m0345o5570K6129
1512a2920L5805m2018k0586O9547L4313p0367m4957M8557K4326l9877Q057O1600
1524E1480j5724q3590j496P3275O288m8667J7206M4993m1169o2409L6307O6667
1536D3161j8449m2324K2913J5336n2040j6659P0263L3306n9268l0849M3956O049
1548A5395n2344R599P3059p24p3208j2227M9831n82l3967K9150M4108m0336n7882
1561e0128K8688N0509k2467k8829L8685K1785n6440l3315N2575L8695l3502j9081
1573a2825K9923m923m6870R607N8556o17m9857K760L6148k1705m0026L4988N4600
1586D9759k7413n5979J3966L6248j8211j9760L5333K1487m3097k8694L4549K0915
$$ plain form
1598 19103 -7966 -9907 27245 19417 -31851 -32555 17148 23854 -10520 -7191 20076 -719 -34797
1611 -34797 -9284 30583 12153 -20388 -2738 15474 -13859 -30085 10916 36031 -1245 -26889
1623 -26889 -236 14424 -10929 -12356 21255 22321 -14966 -20075 9006 9481 -10867 2622 26252
1636 26252 4420 -26502 -8496 20967 6806 -13427 5140 18354 -9750 -26233 3495 23586
1648 23586 1082 -13636 5174 8984 -15060 -14614 14007 16701 -9916 -12659 7023 2562 -14122
1661 -14122 -1787 19750 6478 -17159 -8590 9659 -224 -11097 4216 13641 -6259 -17683
1673 -17683 1094 12177 -3589 -7750 9263 8774 -13021 -13772 9077 12333 -5215 -6101 8410
1686 8410 4461 -9310 -2354 13060 6732 -7032 -746 7183 -2882 -8216 5366 12648 -2036
$$ packed form
1598A9103k7069j941L7152p828n1268p04M9703O706l4374L329K7267k0795l4078
1611c4797K5513L9867j8430l2541J7650J8212k9333j6226M1001K5115l7276k5644
1623b6889K6653J4660k5353j427L3611J066l7287n109K9081M75k0348J3489K3630
1636B6252k1832l0922J8006K9463j4161k0233J8567J3214k8104j6483K9728K0091
1648B3586k2504j4718J8810L810k4044M46K8621K694k6617k743J9682m461j6684
1661a4122J2335K1537j3272k3637Q569J8249r883j0873J5313R425j9900j1424
1673a7683J8777J1083j5766m161J7013m89k1795p51K2849L256j7548q86J4511
1686H410l949j3771O956J5414o328j3764O286P929j0065n334J3582P282j4684
$$ plain form
1699 -2036 -10074 2816 7555 -4031 -6324 6717 6809 -7806 -9471 3749 4731 -5001 -2529 6710
1713 6710 1739 -8387 -3225 6393 1663 -6163 -1031 4639 -2175 -7532 274 6550 -321 -4984 421
1728 421 2636 -3380 -3876 2700 1723 -4786 -3497 2986 1547 -3907 0 6579 2738 -4270 -1794 4822
1744 4822 2458 -2513 392 4125 1445 -978 1778 3965 1420 -153 2159 2501 -1852 -2908 1101
1759 1101 1587 -1952 -2013 739 195 -1573 -434 1321 -1061 -2770 -834 867 -1998 -3085 -123 2127
1775 2127 -183 -1884 -8 2243 79 -1724 -820 238 -1202 -2010 -1099 154 -244 -721 -232 258 466
1792 466 104 -652 -1335 -425 810 29 -1223 -593 2208 3081 899 567 2501 3325 1399 -274 689 1564
1810 1564 500 -19 908 1330 324 -49 619 737 -519 -1792 -1254 -1221 -1459 -1712 -1986 -1561 10 982
$$ packed form
1699b036q038J2890M739j1586k293J3041R2j4615j665J3220R82r732K472R239
1713F710m971j0126N162R618m730p826N132N670o814n357P806O276o871m663N405
1728D21K215o016m96O576r77o509J289O483j439n454L907O579l841p008K476O616
1744D822k364m971K905L733k680k423K756K187k545j573K312L42m353j056M009
1759A101M86l539o1K752n44j768J139J755k382j709J936J701k865j087K962K250
1775B127k310j701J876K251k164j803R04J058j440q08R11J253l98m77M89M90K08
1792D66l62p56o83R10J235p81j252O30K801Q73k182l32J934Q24j926j673R63Q75
1810A564j064n19R27M22j006l73O68J18j256j273N38L3k38k53k74M25J571R72
$$ plain form
1828 982 -214 -2191 -637 1783 1182 -2191 -3045 80 1006 -1059 -1564 1015 1287 -199 185 1162 -774
1845 -774 -3080 -545 1849 -1148 -3738 -1538 2216 1758 -966 13 1826 781 541 1903 751 -1999
1861 -1999 693 5687 2484 -3711 -890 6736 5655 -1793 -2464 2642 1917 -2046 -1969 312 -1568 -2013
1877 -2013 1815 990 -5591 -4503 5658 5912 -6332 -9561 1273 5366 -2909 -6419 1480 4507 -1182
1892 -1182 -2571 1584 812 -1886 2858 4927 -4443 -9926 754 9572 -293 -8426 322 7400 -1173
1907 -1173 -7051 1286 6102 -1523 -3384 3307 -418 -9168 136 15595 6799 -11676 -5818 13448
1921 13448 8824 -9511 -5695 11303 8373 -7222 -7387 2419 3006 2044 7090 1496 -12959 -7997
1935 -7997 11211 7590 -13865 -10682 11892 7966 -16414 -14050 11810 14127 -5670 -7593 4029
$$ packed form
1828I82j196j977J554K420o01l373q54L125R26k065n05K579K72j486L84R77j936
1845g74k306K535K394k997k590K200L754m58k724R79J813j045k40J362j152k750
1861a999K692M994l203o195K821P626j081p448o71N106p25l963P7K281j880m45
1877b013L828q25o581J088J0161K54j2244l229J0834M093q275l510P899L027n689
1892a182j389M155p72k698M744K069r370n483J0680Q818r865q133Q748P078q573
1907a173n878Q337M816p625j861O691l725q750R304J5459q796j8475N858J9266
1921A3448m624j8335L816J6998k930j5595j65R806N87r62N046n594j4455M962
1935g997J9208l621k1455L183K2574l926k4380K364K5860K317j9797j923J1622
$$ plain form
1948 4029 -2123 -10982 4416 16486 -2168 -17499 994 16021 -3117 -15721 6028 20364
1960 20364 -756 -18835 -6018 6273 836 2514 9416 -3606 -18054 -22 20530 2357
1972 2357 -19314 3073 26814 -834 -32296 -7312 30240 16161 -14859 -7808 10294 -1328
1984 -1328 -10170 8962 16081 -6689 -13199 6243 4446 -18109 -8287 24440 16528 -20691 -20829 7844
1998 7844 7961 -8559 2529 15305 -8597 -25538 1596 20985 -4719 -16550 17910 25737 -20840
2011 -20840 -37658 11019 38106 1050 -23943 54 11052 -11609 -11752 16763 16078 -9548 -6353
2024 -6353 8304 -10005 -23122 12028 37034 -772 -35138 -6304 23631 363 -15814 16904
2036 16904 27908 -13800 -31075 6434 21620 -7413 -7526 25360 12173 -35694 -26072 28109
$$ packed form
1948D029o152q859J5398J2070j8654j5331J8493J5027j9138j2604K1749J4336
1960B0364k1120j8079J2817J2291n437J678O902j3022j4448J8032K0552j8173
1972B357k1671K2387K3741k7648l1462K4984L7552j4079l1020P051J8102j1622
1984a328q842J9132P119k2770o510J9442j797k2555R822L2727p912l7219j38K8673
1998G844J17j6520J1088J2776k3902j6941K7134J9389k5704j1831L4460P827m6577
2011b0840j6818M8677K7087l7056k4993K3997J0998k2661j43K8515o85k5626L195
2024f353J4657j8309j3117L5150K5006l7806l4366K8834K9935k3268j6177L2718
2036A6904J1004m1708j7275L7509J5186k9033j13L2886j3187m7867R622N4181
$$ plain form
2048 28109 29480 -14284 -16229 11910 -985 -29157 -6220 27852 10190 -16822 -2069 6931
2060 6931 -19908 -18804 29170 35559 -19159 -36901 7808 20807 -15816 -12904 32771 25369 -29473
2073 -29473 -30817 16123 18691 -10838 1258 25940 -5974 -42426 -8788 35034 13263 -17812
2085 -17812 4695 18069 -19552 -32464 16313 38031 -2362 -21456 7731 6287 -27180 -9360
2097 -9360 42642 29149 -28186 -25835 15988 6521 -24554 3364 40825 4964 -43639 -18497
2109 -18497 23149 5483 -14204 16079 24914 -24811 -43474 6581 32431 -2699 -13857 17745
2121 17745 8544 -35604 -22192 34420 32051 -15579 -14387 14925 -5279 -34496 3109 46573
2133 46573 13709 -33456 -13029 16866 -6216 -19137 22710 36010 -15765 -40265 1196 20556
$$ packed form
2048B8109J371m3764j945K8139j2895k8172K2937L4072j7662k7012J4753R000
2060F931k6839J104M7974O389n4718j7742M4709J2999l6623K912M5675p402n4842
2073b9473j344M6940K568k9529J2096K4682l1914l6452L3638M3822k1771l1075
2085a7812K2507J3374l7621j2912M8777K1718m0393j9094K9187j444l3467J7820
2097i360N2002j3493n7335K351M1823r467l1075K7918L7461l5861m8603K5142
2109a8497M1646j7666j9687L0283Q835m9725j8663N0055K5850l5130j1158L1602
2121A7745r201m4148J3412N6612k369m7630J192K9312k0204k9217L7605M3464
2133D6573l2864m7165K0427K9895k3082j2921M1847J3300n1775k4500M1461J9360
$$ plain form
2145 20556 -9638 -6228 33424 18415 -37805 -31342 25104 28143 -10754 -3879 22450 -5513 -40462
2158 -40462 -6173 39073 15601 -18687 298 13283 -22959 -31785 21912 41448 -9235 -34605
2170 -34605 -254 10194 -20541 -9690 35943 23909 -30037 -27673 14051 8465 -18061 7677
2182 7677 37949 -1387 -45806 -12945 33225 13619 -14731 8968 22071 -18733 -35918 8839
2194 8839 32426 -377 -13638 11514 3202 -32234 -14246 37445 27961 -21928 -19777 14437 934
2207 934 -27054 2921 40913 10828 -32419 -13225 17589 -92 -13098 19843 28995 -18713
2219 -18713 -39125 3041 25070 -4125 -11388 19051 11718 -30756 -25938 19627 22110 -10231 -7011
2232 -7011 12496 -9614 -32693 1472 37604 9807 -24181 -2557 17601 -10721 -23827 17187
$$ packed form
2145B0556l0194L410L9652j5009n6220O463N6446L039l8897O875K6329k7963l4949
2158d0462L4289M5246k3472l4288J8985J2985l6242q826N3697J9536n0683k5370
2170c4605L4351J0448l0735J0851M5633j2034n3946K364M1724n586k6526K5738
2182G677L0272l9336m4419L2861M6170j9606k8350K3699J3103m0804j7185M4757
2194H839K3587l2803j3261K5152q312l5436J7988N1691r484m9889K151L4214j3503
2207I34k7988K9975L7992l0085m3247J9194L0814j7681j3006L2941R152m7708
2219a8713k0412M2166K2029k9195p263L0439p333m2474M818M5565K483l2341L220
2232g011J9507k2110k3079L4165L6132k7797l3988K1624K0158k8322j3106M1014
$$ plain form
2244 17187 36157 -5699 -29933 -751 14224 -8925 -5226 25870 16344 -24701 -21665 14049
2256 14049 11783 -13405 421 23931 -1958 -33168 -8041 27017 11004 -12178 4639 14054
2268 14054 -14902 -24652 12273 28157 -3894 -17720 6819 8787 -18956 -12145 25096 20855 -17541
2281 -17541 -20612 6487 3705 -15297 -140 22346 1852 -25299 -8587 15153 1774 -11039
2293 -11039 9190 17156 -12755 -25252 4865 20760 -985 -8958 10978 9471 -16401 -12573 17612
2306 17612 16886 -9081 -8717 8808 -720 -18111 6 22501 6529 -16589 -4738 11099 -3292
2319 -3292 -12281 8449 18377 -5822 -19000 898 11669 -3175 -4609 13097 9588 -13766 -12133
2332 -12133 10216 9250 -7709 -3522 10048 -1393 -17477 -4130 15192 4815 -11041 -1456 6833
$$ packed form
2244A7187J8970m1856k4234K9182J4975k3149L699L1096r526m1045L036L5714
2256A4049k266k5188J3826K3510k5889l1210K5127L5058j6013k3182J6817R415
2268A4054k8956r750L6925J5884l2051j3826K4539J968k7743O811L7241m241l8396
2281a7541l071K7099k782j9002J5157K2486k0494k7151J6712K3740j3379j2813
2293a1039K0229P966k9911j2497L0117J5895k1745p973J9936j507k5872L828L0185
2306A7612p26k5967L64J7525r528j7391J8117K2495j5972k3118J1851J5837j4391
2319c292q989K0730R928k4199j3178J9898J0771j4844j434J7706l509k3354J633
2332a2133K2349r66j6959M187J3570j1441j6084J3347J9322j0377j5856R585Q289
$$ plain form
2345 6833 -6870 -13193 4435 13563 -3760 -12160 2324 7618 -6039 -5109 12049 10730 -7860
2358 -7860 -8997 5863 5657 -5177 -143 9997 2224 -9627 -1912 9194 2150 -5572 2639 7003
2372 7003 -5514 -11404 2353 9373 -1706 -6403 3914 5528 -5700 -5376 7032 7503 -4562 -5543
2386 -5543 3444 1869 -5819 -660 7746 2612 -5936 -1958 4270 -1033 -5043 951 3853 -4394 -7921
2401 -7921 111 3681 -2554 -3486 3438 3244 -4895 -4430 3995 3847 -3730 -2452 3752 2226 -3558 -442
2417 -442 6103 4088 -1787 -225 3329 211 -2419 1162 3002 -1258 -2928 1562 2551 -1828 -1242 3262
2433 3262 2269 -3292 -3091 1688 1169 -2948 -1751 2649 1450 -2539 -284 2998 2048 -1547 -832 1388
2449 1388 -526 -2444 -855 846 -799 -1985 51 315 -1453 -1102 304 -776 -2389 -1657 155 -767
$$ packed form
2345F833j3703o323J7628R128j7323q400J4484N294j3657R30J7158j319j8590
2358g860j137J4860k06j0834N034J0140p773j1851P715J1106p044p722Q211M364
2372G003j2517n890J3757P020j1079m697J0317J614j1228L24J2408M71j2065r81
2386e543Q987j575p688N159Q406n134q548L978O228n303m010N994K902q247l527
2401g921Q032L570o235r32O924j94q139M65Q425j48p577J278O204j526n784L116
2417d42O545k015n875J562L554l118k630L581J840m260j670M490R89m379N86M504
2433C262r93n561K01M779n19m117J197M400j199l989K255L282r50l595P15K220
2449A388j914j918J589J701j645j186K036K64j768L51J406j080j613P32J812r22
$$ plain form
2465 -767 -2003 -238 2077 1030 -725 470 2667 1547 -471 102 1967 1167 -216 573 2050 1748
2481 1748 763 977 1266 508 -193 -28 -277 -955 -871 -629 -369 -410 149 652 -104 -168 915 589 -1438 -1185
2501 -1185 649 1101 -1280 -1946 524 2181 589 -1747 -624 1000 225 -2139 -2335 -1158 -888 -962 -926
2518 -926 -901 -369 109 656 -64 -898 -116 383 -8 61 175 221 549 1637 3277 1427 -575 1136 4018
2537 4018 1990 -2738 -1970 2727 3219 -1771 -3941 688 3620 892 -2378 -1516 545 415 -356 -1988
2553 -1988 -2603 -328 2419 271 -2858 -1534 3357 2894 -1831 -2025 1023 619 -2842 -1299 1825 70
2569 70 -3549 -185 3522 -404 -5397 -1019 5265 886 -6545 -4561 3404 3024 -1920 -1917 1272 2567
2585 2567 1786 1082 -1261 -950 3753 5474 -2020 -7089 676 9364 3232 -6201 -1523 7423 2499 -6224
$$ packed form
2465g67j236J765K315j047j755J195K197j120k018N73J865q00j383P89J477l02
2481A748r85K14K89p58p01J65k49o78Q4K42K60m1N59N03p56o4J083l26k027K53
2501a185J834M52k381o66K470J657j592k336J123J624p75k364j96J177K70p4L6
2518i26K5N32M78N47p20q34P82M99l91O9J14M6L28J088J640j850k002J711K882
2537D018k028m728P68M697M92m990k170M629K932k728l270Q62K061j30p71j632
2553a988o15K275K747k148l129J324M891m63m725j94L048m04l461J543L124j755
2569G0l619L364L707l926m993M378O284m379p431J984P965l80m944LL189J295
2585B567p81p04k343L11M703J721p494n069P765Q688o132r433M678Q946m924q723
$$ plain form
2601 -6224 -2509 5447 1599 -5128 -1700 2338 -1755 -4015 3730 6047 -2963 -6686 848 4601 -1563
2616 -1563 -3869 1737 1972 -2875 -1826 1577 -742 -2185 5792 5635 -7369 -11314 3890 11454 -3496
2631 -3496 -12283 1872 10400 -2913 -11612 1262 11207 1658 -6623 -1165 1605 -3001 -236 7599
2645 7599 3167 -6042 -1576 7536 1541 -5630 3374 10780 -475 -10139 -643 6495 -1946 -3821 7956
2660 7956 6593 -10847 -11072 8994 11379 -7361 -9389 7709 6874 -12642 -11655 9515 12259 -3993
2674 -3993 -6527 2228 -651 -5834 3458 10158 -2080 -10170 809 5948 -7311 -7988 12338 13647
2688 13647 -10131 -15724 4401 9923 -6340 -5218 11581 5173 -15870 -9497 13483 9347 -7931
2701 -7931 -1137 12437 -665 -17217 -1707 17680 6601 -8886 -919 5935 -6879 -8015 11829
$$ packed form
2601f224L715P956l848o727L428M038m093k260P745K317r010l723P534L753o164
2616a563k306N606K35m847J049L403k319j443P977j57j3004l945J5204P564j4950
2631c496q787J4155Q528j3313q699J2874R945r549q281N458K770m606K765P835
2645G599m432r209M466R112n995p171R004P406j1255r664R496P138q441j875J1777
2660G956j363j7440k25K0066K385j8740k028J7098q35j9516R87K1170K744j6252
2674c993k534Q755k879n183R292O700j2238q090J0979N139j3259o77K0326J309
2688A3647k3778n593K0125N522j6263J122J6799o408k1043O373K2980m136j7278
2701g931O794J3574j3102j6552J5510J9387j1079j5487P967O854j2814j136J9844
$$ plain form
2714 11829 14296 -7085 -10605 5946 3388 -14590 -3691 20487 9026 -19474 -13382 11225 6297
2727 6297 -10662 1590 16990 -2096 -22750 -5081 15218 2903 -8896 6543 10701 -12994
2739 -12994 -18168 9247 18994 -3612 -10095 6189 1525 -17974 -6733 20678 12235 -14522 -8583
2752 -8583 10471 -1307 -15985 5526 25155 1123 -23500 -5403 14280 -621 -8969 13951
2764 13951 18542 -12475 -22258 6483 17006 -3988 -6043 14036 5418 -22602 -13447 18314 15539
2777 15539 -9151 -3868 10844 -6745 -23321 2434 25902 3883 -19702 -2967 10194 -10763
2789 -10763 -15260 15950 24850 -9034 -23198 1737 9698 -9392 -3861 21642 10283 -23922 -16876
2802 -16876 14489 10731 -10175 2128 19500 -4875 -28891 -4794 23264 7583 -11371 3874
$$ packed form
2714A1829K467k1381l520J6551k558j7978J0899K4178j1461k8500O092K4607m928
2727F297j6959J2252J5400j9086k0654J7669K0299j2315j1799J5439M158k3695
2739a2994n174K7415R747k2606o483J6284m664j9499J1241K7411q443k6757N939
2752h583J9054j1778j4678K1511J9629k4032k4623J8097J9683j4901q348K2920
2764A3951M591l1017r783K8741J0523k0994k055K0079q618k8020R155L1761k775
2777A5539k4690N283J4712j7589j6576K5755K3468k2019k3585J6735J3161k0957
2789a0763m497L1210Q900l3884j4164K4935P961j9090N531K5503j1359l4205P046
2802a6876L1365l758k0906J2303J7372k4375k4016K4097K8058j5681j8954J5245
$$ plain form
2814 3874 10789 -14899 -19281 14985 25717 -4698 -15115 6838 5818 -18677 -7521 27003 18423
2827 18423 -18009 -16484 9356 4234 -12460 4893 24809 -857 -28016 -8284 16111 1403
2839 1403 -10356 11898 17236 -16290 -27876 6370 22158 -1516 -9558 9652 3770 -22951 -12816
2852 -12816 21744 17981 -11218 -7976 10432 -4680 -22302 3175 30065 6351 -23160 -7955
2864 -7955 11868 -4051 -11674 14901 22765 -10133 -24006 2420 13095 -5924 -3466 20193 9144
2877 9144 -23987 -16981 16764 15529 -7757 -1300 15274 -4489 -25348 -1892 24676 7744 -13513
2890 -13513 309 8901 -13570 -17806 14114 24925 -6453 -19838 1272 6248 -13137 -6052 21205
2903 21205 13363 -18664 -16697 8422 5692 -9307 4325 19716 -2921 -26257 -5828 18051
$$ packed form
2814C874O915k5688m382L4266J0732l0415j0417K1953j020k4495J1156L4524q580
2827A8423l6432J525K5840n122j6694J7353J9916k5666k7159J9732K4395j4708
2839A403j1759K2254N338l3526j1586L4246J5788k3674q042J9210n882k6721J0135
2852a2816L4560l763k9199L242J8408j5112j7622K5477K6890k3714k9511J5205
2864g955J9823j5919p623K6575P864l2898j3873K6426J0675j9019K458K3659j1049
2877I144l3131P006L3745j235k3286O457J6574j9763k0859K3456K6568j6932k1257
2890a3513J3822Q592k2471m236L1920J0811l1378j3385K1110M976j9385P085K7257
2903B1205p842l2027J967K5119k730j4999J3632J5391k2637k3336K0429K3879
$$ plain form
2915 18051 4386 -9376 7337 12694 -13580 -21710 8116 21311 -1501 -10928 6135 3839 -17042
2928 -17042 -8450 20314 15916 -11283 -9907 7791 -22 -14205 4194 22844 3278 -19360 -5809
2941 -5809 11116 -1340 -8296 11792 16463 -10811 -20969 3130 13754 -3867 -5629 11429 5038
2954 5038 -18770 -12772 13522 12342 -8045 -4618 8535 -3674 -17928 8 18930 4886 -12915
2967 -12915 -1692 7313 -7264 -10757 11499 17410 -6373 -15511 2794 7781 -7526 -4387 14635
2980 14635 9575 -14351 -12187 8700 8171 -5770 217 11718 -890 -16023 -2811 13462 4222
2993 4222 -6693 3135 8259 -7529 -12267 7022 14558 -2650 -9356 3152 3875 -9675 -5295 13008
3007 13008 9234 -10137 -8755 5707 2006 -9208 288 12341 770 -13991 -4808 8114 1227
$$ packed form
2915A8051j3665j3762J6713N357k6274q130K9826J3195k2812r427J7063k296k0881
2928a7042Q592K8764m398k7199J376J7698p813j4183J8399J8650j9566k2638J3551
2941e809J6925j2456o956K0088M671k7274j0158K4099J0624j7621j762J7058o391
2954E038k3808N998K6294j180k0387L427J3153j2209j4254J7936J8922j4044j7801
2967a2915J1223R005j4577l493K2256N911k3783r138J8305M987j5307L139J9022
2980A4635n060k3926K164K0887n29j3941N987J1501j2608j5133J3212J6273r240
2993D222j0915R828N124j5788m738J9289P536j7208o706J2508P23j3550M380J8303
3007A3008l774j9371J382J4462l701j1214R496J2053j1571j4761R183J2922o887
$$ plain form
3020 1227 -5738 4031 7927 -6210 -11116 2995 8768 -2288 -4512 5947 3448 -9508 -5441 9975
3034 9975 8044 -5821 -3965 5734 353 -8381 -246 11092 2505 -7959 -1629 6089 -760 -5350
3048 -5350 4700 8814 -3191 -8160 1480 5453 -2407 -2828 5846 4281 -6585 -5281 5020 4054
3062 4054 -3618 -1516 5049 -761 -7891 -1496 6583 1393 -5799 -111 4035 -2902 -6184 1837 6219
3077 6219 -1978 -5930 266 2675 -2757 -2627 4143 4052 -3323 -3189 2527 2330 -2582 -280 4519 609
3093 609 -4645 -685 4401 996 -2363 1496 3670 -1554 -3953 1723 4171 -886 -2883 1711 2732
3108 2732 -2102 -2175 3473 3253 -1771 -2333 1687 1202 -2423 -795 2355 547 -2686 -1018 1458 -253
3124 -253 -2144 248 1387 -1677 -2853 3 1306 -1571 -1757 907 981 -1979 -1789 1488 1625 -1607
$$ packed form
3020A227o965R769L896j4137m906J4111N773j1056k224J0459k499j2956M067J5416
3034I975j931j3865J856R699n381q734Q135J1338q587j0464O330P718o849m590
3048e350J0050M114j2005m969R640L973p860m21Q674j565j0866J304J0301r66
3062D054p672K102O565n810p130O395Q079n190p192N688M146o937l282Q021M382
3077F219q197l952O196K409n432J30O770r1p375J34N716j97m912K302M799l910
3093F09n254L960N086l405l359L859K174n224k399N676K448n057j997M594J021
3108B732m834p3N648k20n024n62M020m85l625J628L150j808l233J668K476j711
3124b53j891K392J139l064j176K856J303k877j86K664P4k960J90L277J37l232
$$ plain form
3140 -1607 -1351 1232 712 -1381 -747 2040 975 -705 -11 1070 653 -226 736 1110 -267 -374 727
3157 727 885 -546 -191 1405 1194 -411 -322 1275 869 -673 -666 779 227 -627 -413 1147 268 -1190
3175 -1190 -468 877 -37 -1189 -578 -5 82 -1098 -832 -830 -360 -281 -88 -988 -881 5 727 -771 -1761 -157
3195 -157 985 205 -1373 -400 1531 1152 -568 -663 538 1105 189 62 311 75 394 760 724 -191 23
3214 23 709 683 39 -298 579 571 -119 201 276 -260 -152 905 1188 -412 -1300 600 1642 -691 -2428 -194
3234 -194 1624 -295 -2121 -1293 611 624 -790 -1129 -994 -342 267 33 -1251 -1410 407 1441 -786
3251 -786 -2265 26 2292 456 -1807 -384 1382 -218 -806 1220 1640 -793 -701 1947 1671 -1339
3267 -1339 -1085 2784 1892 -1463 -1975 1040 1773 -176 -271 857 -237 -968 1086 1091 -1426 -1355 2623 2337
$$ packed form
3140a607K56K583n20k093O34K787j065j680O94J081m17q79R62L74j377j07J101
3157G27J58j431L55J596k11j605Q9J597m06j542PJ445n52q54K14J560q79j458
3175a190P22J345r14j152O11N73Q7j180K66KM70P9J93r00J07Q86P22j498r90J604
3195a57J142p80j578R73J931l79j720r5J201N67r16j27K49k36L19L66l6r15K14
3214B3O86k6o44l37Q77qo90L20P5n36J08J057K83j600q88J900J042k333j737K234
3234a94J818j919j826Q28J904J3j414l39J35O52O09k34j284j59J817J034k227
3251g86j479K291K266j836k263J423J766j600n88K026M20k433R2K648k76l010
3267a339K54L869q92l355n12L015P33j949r5J128j094p31K054Nk517P1L978k86
$$ plain form
3285 2337 -3193 -3493 2329 3644 -1704 -3165 1085 1986 -1926 -2541 1872 1456 -2372 -1441 1721 -420
3301 -420 -2895 605 3776 -267 -4517 -1142 3047 -101 -2254 1328 2840 -1823 -2748 1966 2570 -1750
3317 -1750 -761 4388 1644 -5386 -2267 5687 3985 -3927 -1625 4268 995 -4391 -240 5615 1532
3332 1532 -3559 28 2647 -1981 -2738 4037 4986 -3155 -5481 2205 3488 -3629 -2367 5346 2333
3347 2333 -6231 -4203 4002 2078 -3779 433 5342 -2091 -8631 -498 7421 423 -5871 794 4570
3362 4570 -4323 -6682 3692 7818 -1587 -5065 2011 2430 -5284 -1994 8443 4502 -6866 -4480
3376 -4480 5373 1805 -5040 1641 9472 -73 -9480 -1371 7261 396 -4090 4529 6787 -6433 -9413
3391 -9413 4407 9063 -1919 -4532 4558 2563 -9101 -5603 8737 6891 -5631 -4056 4485 -1159
$$ packed form
3285B337n530l00N822J315n348j461M250R01l912o15M413m16l828R31L162k141
3301d20k475L500L171m043m250L375M189l148k153L582J512m663r25M714O04m320
3317a750R89N149k744p030L119P954j702p912K302N893l273n386M151N855m083
3332A532n091L587K619m628p57O775R49q141k326P686J283p117J262P713l013
3347B333q564K028Q205j924n857M212M909p433o540Q133P919o998o294O665L776
3362D570q893k359J0374M126r405l478P076M19p714L290J0437l941j1368K386
3376d480R853l568o845O681P831r545r407Q109Q632o865m486Q619K258j3220k980
3391i413J3820M656j0982k613R090j995j1664L498J4340j846j2522J575Q541n644
$$ plain form
3405 -1159 -8738 1897 11874 1119 -10379 -2529 5392 -3232 -5941 7132 9396 -6476 -11567 2349
3419 2349 6659 -4022 -2888 9287 3908 -12575 -8214 9135 7916 -5061 -1470 7848 -1719 -12093
3433 -12093 -176 13382 3556 -7439 686 5287 -6542 -8367 9078 13682 -4432 -10177 2717
3446 2717 4575 -7439 -3069 13047 7461 -11885 -9402 6598 3921 -6633 2165 12562 -2059
3459 -2059 -17053 -3659 11826 2903 -6958 3656 7724 -9215 -13812 5462 13543 -1516 -7344
3472 -7344 3965 1554 -12426 -5491 14583 10048 -10314 -7870 6416 -41 -10856 3144 17365
3485 17365 1810 -15439 -4866 8876 -361 -6288 9197 12613 -8743 -15945 3962 12107 -1882
3498 -1882 -4318 9375 4282 -14760 -9707 12155 10774 -6233 -3132 7614 -3781 -15047 1360
$$ packed form
3405a159p579J0635R977j0755j1498P850P921q624k709J3073K264j5872n091J3916
3419B349M310j0681J134J2175n379j6483M361J7349j219j2977L591R318r567j0374
3433a2093J1917J3558r826j0995Q125M601j1829j825J7445M604j8114n745J2894
3446B717J858j2014M370J6116n586j9346K483J6000k677j0554Q798J0397j4621
3459b059j4994J3394J5485q923r861J0614M068j6939m597J9274Q081j5059n828
3472g344J1309k411j3980O935K0074m535k0362K444J4286o457j0815J4000J4221
3485A7365j5555j7249J0573J3742r237n927J5485L416k1356p202J9907Q145j3989
3498a882k436J3693n093j9042N053K1862j381j7007L101J0746j1395j1266J6407
$$ plain form
3511 1360 18315 3727 -12656 -2441 6764 -6595 -10701 10151 16549 -6123 -16009 947 6739
3524 6739 -6135 -3423 13809 7363 -15247 -12417 8217 7643 -6112 882 11826 -2929 -18687
3537 -18687 -3253 15305 5206 -7870 2142 7155 -9875 -13904 9015 17405 -2281 -10980 3172
3550 3172 4645 -10990 -5201 16035 12528 -11135 -10942 5762 3519 -7904 2527 15970 1249
3563 1249 -17082 -5465 10637 2053 -6482 6728 10726 -9636 -16699 4201 13715 -1545 -6103
3576 -6103 6739 3106 -14851 -9282 13424 11996 -7643 -6812 6104 -1222 -12914 1021 17474
3589 17474 3933 -13274 -4945 6705 -2796 -7615 8977 13620 -6389 -15004 1635 9141 -2938
3602 -2938 -3058 11238 5999 -13888 -10355 9862 9303 -4510 -1039 9050 -1761 -14986 -1739
$$ packed form
3511A360J6955j4588j6383J0215R205j3359m106K0852O398k2672r886J6956N792
3524F739j2874K712J7232o446k2610K830K0634n74j3755O994J0944j4755j5758
3537a8687J5434J8558j0099j3076J0012N013j7030m029K2919Q390j9686q699J4152
3550C172J473j5635N789K1236l507k3663J93J6704k243j1423J0431J3443j4721
3563A249j8331J1617J6102q584q535J3210L998k0362p063K0900R514j5260m558
3576f103J2842l633j7957N569K2706j428j9639Q31J2916p326j1692J3935J6453
3589A7474j3541j7207Q329J1650r501m819J6592M643k0009q615J6639P506j2079
3602b938j20J4296n239j9887L533K0217n59j3813L471J0089j0811j3225J3247
$$ plain form
3615 -1739 15201 4842 -8828 -578 6320 -6126 -10377 6969 14495 -2505 -11525 955 4020
3628 4020 -6900 -3680 12071 7702 -10683 -10089 5477 4004 -6434 1123 11445 -648 -14805
3641 -14805 -4260 10194 3091 -6051 2883 7057 -7380 -12074 4528 12573 -1159 -6802 3646
3654 3646 3328 -8663 -5392 10379 8947 -6098 -5987 4485 666 -7375 1789 12557 1737 -10900
3668 -10900 -2494 6766 -356 -5211 5760 9330 -5089 -11260 1859 8183 -1841 -3750 6277
3681 6277 3413 -9263 -7031 6982 6529 -4307 -2392 5003 -1150 -9292 -1046 9627 2793 -6852
3695 -6852 -1450 4196 -3395 -6319 4561 9010 -2886 -8416 904 4215 -3631 -2727 7168 4982 -7095
3710 -7095 -6553 4816 4766 -3362 -331 6254 392 -7751 -1584 7442 2117 -4001 760 4636 -2984
$$ packed form
3615a739J6940j0359j3670Q250O898j2446m251J7346P526j7000r020J2480L065
3628D020j0920L220J5751m369j8385N94J5566j473j0438P557J0322j2093j4157
3641a4805J0545J4454p103r142Q934M174j4437m694J6602Q045j3732n643J0448
3654C646l18j1991L271J5771j432j5045J11J0472l819q041R164J0768j0820j2637
3668a0900Q406R260p122m855J0971L570j4419o171J3119O324j0024j909J0027
3681F277k864j2676K232J4013m53j0836J915P395o153q142Q246J0673o834r645
3695f852N402N646p591k924J0880M449j1896n530R320L311p846R04R895k186j2077
3710g095N42J1369n0q128L031O585n862q143O167R026n325o118M761L876p620
$$ plain form
3725 -2984 -6400 3170 7176 -1094 -4639 2012 2895 -4944 -2906 6240 4416 -4798 -4139 3110 1563
3740 1563 -4319 -459 6116 1008 -6644 -2348 3806 307 -3716 1363 4251 -3075 -6043 1130 4408
3755 4408 -1028 -2951 2249 1802 -4174 -3188 4046 3620 -2472 -1462 2732 687 -3805 178 5022 1346
3771 1346 -4058 -682 3431 -85 -2781 1719 4221 -733 -3702 519 2996 -613 -1472 2236 1891
3786 1891 -2388 -2052 2298 2010 -2049 -927 2274 -40 -3374 -780 3185 814 -2765 -326 1871
3801 1871 -984 -2908 600 2396 -972 -2525 -99 1671 -1401 -1765 1351 1784 -1862 -2394 1087 1332
3817 1332 -1152 -429 1528 528 -1660 -219 1525 188 -1229 670 1523 -461 -1605 820 2222
3832 2222 42 -1429 749 1588 -367 -988 815 1480 -396 -821 753 836 -661 -112 1140 150 -997
$$ packed form
3725b984l416R570M006q270l545O651Q83p839K038R146j824r214O59P249j547
3740A563n882L860O575n108p652M296O154l499m023N079K888p326k968P173L278
3755D408n436j923N200m47n976R86P234m26o092J010M194k045m492L983M844l676
3771A346n404L376M113l516k696M500K502m954k969M221K477l609q59L708l45
3786A891m279L36M350k88m059J122L201k314l334K594L965k371l579K439K197
3801A871k855j924L508J796l368j553K426J770l072l64L116M33l646n32L481K45
3817A332k484P23J957j000k188J441J744j337j417J899Q53j984j144K425J402
3832B222k180j471K178Q39j955o21J803O65j876m25J574Q3j497N49J252r90j147
$$ plain form
3849 -997 -453 700 -35 -1032 -291 595 -649 -1061 -149 289 -536 -692 222 53 -1153 -738 729 723 -1124
3868 -1124 -940 717 601 -1141 -917 321 484 -13 -626 152 338 23 17 642 85 -167 465 1007 -161
3887 -161 -300 562 889 -268 -377 524 469 2 -256 698 338 -89 194 401 -57 -873 53 1073 308 -1097
3907 -1097 -561 820 194 -787 -649 -69 223 -162 -449 -436 -355 -185 535 -326 -937 -401 580 -116 -1343 -458
3927 -458 933 511 -950 -571 776 77 -443 24 684 -42 -363 849 1047 36 -497 673 1012 -35
3945 -35 -246 758 996 130 14 308 -25 -117 443 1101 -322 -1136 652 1529 -447 -1531 775 1752 -496
3964 -496 -1709 185 1283 -144 -940 339 83 -1161 -824 694 135 -972 -487 589 -586 -2006
3980 -2006 -248 1605 -195 -1323 136 1183 -1156 -1302 1573 1630 -1077 -1543 1331 1169 -1734 -1031
$$ packed form
3849i97N44J153p35r97P41Q86j244m12R12M38q25j56R14j69j206M15J467oj847
3868a124J84J657j16j742K24J238J63m97o13P78J86l15oO25n57k52O32N42j168
3887a61j39Q62L27j157j09R01n5m67k58R54l60m27K83K07m58q16R26J020p65j405
3907a097N36J381o26r81J38N80K92l85k87J3Q1J70P20q61o11N36R81o96j227Q85
3927d58J391m22j461L79J347o99n20M67O60p26l21J212J98j011n33J170L39j047
3945c5k11J004K38q66j16K94l33r2N60O58j423q14J788Q77j976j084K306R77k248
3964d96j213J894J098j427p96J279k56j244L37J518n59j107M85J076j175j420
3980b006J758J853j800j128J459J047k339j46K875N7k707m66K874j62k903P03
$$ plain form
3996 -1031 2340 1765 -1867 -1342 2059 1335 -1141 -232 2154 211 -2135 73 2388 180 -1568 964
4012 964 2126 -1717 -2574 1982 2756 -1245 -1937 1581 1257 -2765 -1447 2975 1392 -3401 -2016 1904
4028 1904 450 -3163 -3 3777 -113 -4076 -1220 2219 -408 -2301 1285 2657 -2438 -3514 1674
4043 1674 2787 -1492 -1421 3028 1126 -4119 -2078 4553 2663 -2603 -1015 3416 -269 -4132 902
4058 902 5546 855 -4030 213 3129 -1411 -3094 3211 5097 -2000 -4366 1366 2767 -2116 -1516
4073 -1516 4363 2306 -5058 -3301 3693 2265 -3218 28 4614 -1283 -6547 -575 5890 557 -4492
4088 -4492 249 3150 -3805 -5867 3354 6203 -1964 -4987 1506 2051 -4421 -2496 6322 4225 -5065
4103 -5065 -4077 3310 1603 -3725 1133 6761 -534 -7252 -957 5368 112 -3189 3802 5199 -4557
$$ packed form
3996a031L371n75l632N25L401p24k476R09K386j943k346K208K315k208j748K532
4012I64J162l843q57M556P74m001o92L518l24m022J318M422j583m793J385L920
4028A904j454l613L160L780l890l963K856L439k627j893L586J372n095j076N188
4043A674J113m279P1M449j902n245K041O631j890n266J588M431l685l863N034
4058I02M644m691m885M243K916m540j683O305J886p097k366N732J401m883O00
4073a516N879k057p364J757O994j428n483L246M586n897n264N972O465n333n049
4088d492M741K901o955k062R221K849q167l023O493N45o472J925Q818k097r290
4103e065R88P387j707n328M858N628p295o718O295O325n256l301O991J397r756
$$ plain form
4118 -4557 -7157 3393 7148 -1273 -3707 3821 2019 -6496 -3884 7289 5000 -4426 -2890 3532
4132 3532 -705 -6166 1360 8533 1053 -7620 -1664 3914 -2220 -4365 4831 6880 -4842 -7975 1838
4147 1838 4852 -3035 -1802 6490 2815 -9013 -6192 6603 4975 -3868 -1185 5392 -1354 -8989
4161 -8989 -203 9532 2362 -5554 -153 4183 -3927 -6277 5607 9502 -3132 -7164 1877 3413
4175 3413 -4573 -2150 9071 4912 -8047 -6285 4904 3144 -4567 1103 8138 -928 -10847 -1920
4189 -1920 8189 1670 -4867 2295 5486 -6411 -9344 3712 9229 -1970 -5125 2608 1324 -8239
4203 -8239 -3918 9348 6839 -6638 -5412 3852 38 -7115 1700 10783 796 -10139 -2757 6383
4217 6383 -502 -4493 5229 7869 -5669 -10308 2542 8048 -1540 -2974 5848 2949 -9391 -6009
$$ packed form
4118d557k600J0550L755q421k434P528j802q515K612J1173k289r426J536O422
4132C532m237n461P526P173p480q673N956N578o134k145R196K049j1722l133R813
4147A838L014p887J233Q292l675j1828K821J2795j628q843K683O577o746p635
4161h989Q786R735p170p916N401M336q110k350J1884L895j2634m032R041J536
4175C413p986K423J1221m159j2959J762J1189j760p711N670P035r066r919Q927
4189a920J0109o519o537P162L191j1897k933J3056N517j1199l155P733j284r563
4203h239M321J3266k509j3477J226R264l814p153Q815R083r987j0935P382R140
4217F383o885l991R722K640j3538m639J2850N506r588j434Q822k899j2340L382
$$ plain form
4231 -6009 8282 7019 -4354 -2141 5443 -1541 -9450 649 11226 2666 -7691 -1268 4719 -3258
4245 -3258 -6165 6176 9793 -3900 -9376 1357 4491 -4116 -2329 8406 4410 -9388 -7665 5530
4259 5530 4670 -4013 -218 7008 -1619 -11042 -1733 9433 2394 -5246 1062 4842 -5671 -8505 5222
4274 5222 10565 -1695 -7147 1759 3395 -5829 -3235 9569 6516 -7078 -6347 4119 2168 -4956
4288 -4956 1438 9289 622 -9954 -2848 6704 953 -4105 3344 6140 -5013 -9224 2918 8074
4302 8074 -1296 -4363 4337 2344 -8003 -5037 7961 6582 -4852 -4221 3960 -497 -7465 9
4316 9 9487 2151 -8161 -2579 4229 -1256 -4592 4602 7603 -3460 -8524 1284 5447 -1686 -2254
4331 -2254 5599 3622 -7264 -6038 5871 5456 -3396 -1086 5183 -250 -8000 -791 8545 2593 -5135
$$ packed form
4231f009J4291j263j1373K213P584o984p909J0099J0577q560j0357O423N987p977
4245c258k907J2341L617j3693n476J0733L134q607J787J0735l996j3798J723J3195
4259E530q60q683L795P226q627r423R309J1166p039p640O308L780j0513k834J3727
4274E222N343j2260n452Q906J636r224K594J2804l053j3594P31J0466j951p124
4288d956O394P851q667j0576P106R552n751n058P449K796j1153m211J2142N156
4302H074r370l067Q700j993j0347K966J2998j379j1434O31Q181m457o968P474
4316IR478p336j0312N582O808n485l336R194L001j1063n064R808M163p133n68
4331b254P853j977j0886J226J1909m15q852K310O269n433p750P209R336n952p728
$$ plain form
4346 -5135 -427 4058 -2161 -5635 3552 7692 -1443 -6096 832 3116 -3628 -2491 5936 4316 -5869
4361 -5869 -5163 3334 2387 -3667 -248 5890 -581 -7587 -1816 5647 994 -3808 1295 3560 -3776
4376 -3776 -6678 2161 6155 -980 -4077 1768 1857 -4356 -3032 5221 4345 -3457 -3232 2703 1225 -3874
4392 -3874 499 6066 1035 -5357 -1214 3977 169 -3079 2650 4625 -2438 -5376 1481 4361 -1117
4407 -1117 -2194 2961 2263 -4027 -3390 3887 3498 -2356 -1771 2402 376 -4198 -1041 4758 1102 -3594
4423 -3594 -1079 2424 -1322 -3144 1950 4104 -1783 -3972 1279 2282 -1867 -1701 3253 2247 -3813
4438 -3813 -3108 2124 2277 -1544 -675 3058 338 -3360 -809 3584 923 -2041 330 2483 -1017 -2655
4454 -2655 1614 3318 -198 -2188 1037 1510 -1724 -1267 2763 1862 -2492 -2164 2083 1257 -1947 -617
$$ packed form
4346e135M708M485o219l474R187M140r135m653O928K284o744J137Q427j620j0185
4361e869P06Q497r47o054L419O138o471p006N771P463m653m802N103K265p336
4376c776k902Q839L994p135l097N845Q9o213J324Q253q76p802K25N935j478n099
4392c874M373N567n031o392M143N191l808l248N729J975p063k938O857K880n478
4407a117j077N155o98o290O37P277l89n854N85M173k026m574L157N799l656m696
4423c594K515L503l746j822N094K154n887k189N251J003m149J66M954j006o060
4438c813P05N232J53l821Q69L733k720l698K551M393k661k964K371K153l500j638
4454b655M269J704l516j990L225M73l234M57M030r01m354L28M247q26l204J330
$$ plain form
4470 -617 2838 434 -3285 -1026 2017 203 -1832 438 1578 -981 -2402 510 1800 -865 -1555
4485 -1555 938 968 -2134 -1495 1455 1314 -1867 -1434 1253 319 -1649 -382 1952 780 -1839 -473
4501 -473 1640 167 -1295 296 2041 -103 -1563 435 1757 215 -816 707 1000 -492 -835 834
4517 834 867 -735 -166 1347 141 -1305 -145 1516 352 -1461 -443 946 -5 -1109 203 1130
4533 1130 -66 -1110 -95 703 -680 -898 385 563 -675 -469 195 340 -528 -575 283 79 -500 -292
4551 -292 487 202 -561 82 699 -368 -541 500 775 8 -366 335 1144 82 -584 151 693 191 -584
4570 -584 200 481 60 -192 703 130 -567 -192 679 -357 -388 -165 386 -214 -502 -100 445 -468 -569 -345
4590 -345 10 -308 -505 153 104 -310 -771 430 430 -145 -863 314 423 -240 -526 -21 86 -134 -18 356
$$ packed form
4470f17L455k404l719K259L043j814k035K270J140k559j421K912J290k665o90
4485a555K493L0l102O39K950j41l181M33K687r34j968J267K334j172k619J366
4501d73K113j473j462J591J745k144j460J998J322j542j031J523K93j492l43J669
4517H34L3j602N69J513j206j446J160J661j164j813J018J389r51j104J312R27
4533A130j196j044J015P98j383k18J283J78j238K06O64J45q68m7Q58k04n79K08
4551b92P79k85p63O43O17j067j73J041K75p67l74P01Q09j062o66P35N42n02p75
4570e84P84K81m21k52Q95n73o97L75Q71j036l1K23N51o00k88M02N45r13j01K24
4590c45L55l18j97O58m9m14m61J201%n75p18J177J09o63k86N05J07k20J16L74
$$ plain form
4610 356 -95 -272 340 571 -222 -523 516 716 -75 -486 532 640 -346 -237 456 314 -256 -35 789
4629 789 350 -340 -20 647 314 -275 38 615 153 -533 -203 360 -252 -178 -142 245 -411 -582 463 -36
4649 -36 -1023 -413 835 -123 -958 -326 712 -99 -817 -284 565 -40 -866 30 709 -372 -663 293 888
4668 888 -437 -835 303 754 -562 -256 780 776 -469 139 1270 250 -869 301 1467 60 -1324
4685 -1324 337 1629 -209 -973 847 1328 -902 -1397 413 1018 -622 -836 859 323 -1345 -1187 1073
4702 1073 647 -1433 -246 552 164 -1533 -77 1715 112 -1694 104 1325 -822 -1613 1055 1619
4718 1619 -1255 -1867 832 1425 -1512 -1044 2004 1446 -1826 -1240 2016 694 -1254 144 2340 207
4734 207 -2546 240 2392 408 -1612 673 1991 -1457 -2363 1402 2354 -1067 -1543 1560 879 -2263
$$ packed form
4610C56m51j77O12K31p93l01J039K00p91m11J018J08r86J09O93j42n70K21Q24
4629G89m39o90L20O67l33n89L13N77m62o86L30N63o12P4L6L87o56j71J045m99
4649c6r87O10J248r58q35O32J038q11p18N33Q49o05q26Q96O79j081k91R56N95
4668H88j325l98J138M51j316L06J036mj245O08J131j020j119J170J166j407j384
4685a324J661J292j838p64J820M81k230m95J810O05j640k14J695n36j668J58K260
4702A073m26k080J187P98l88j697J456J792j603j806J798J221k147p91K668N64
4718A619k874o12K699N93k937M68L048n58l272N86L256j322j948J398K196k133
4734B07k753K786K152j984k020K285J318l448r06L765R52l421m76L103o81l142
$$ plain form
4750 -2263 -1137 2822 1662 -2771 -1556 1714 193 -2568 -7 2956 -123 -3741 -670 2416 -406
4765 -406 -2017 1139 2463 -1914 -3140 963 2276 -1353 -1529 2283 866 -3738 -1679 3572 2114
4780 2114 -2593 -877 2696 -467 -3483 327 5012 605 -3760 -138 2859 -682 -2665 2281 4135
4795 4135 -1907 -3871 1215 2581 -1633 -1161 3657 1703 -4047 -2361 2997 1708 -2551 -89 3423
4810 3423 -1030 -5028 -278 4581 652 -3360 472 2730 -2963 -4314 2124 4759 -1833 -3666 1285
4825 1285 1744 -3303 -1744 4714 2770 -4158 -3236 2400 1077 -2896 640 4797 -422 -5526 -896
4840 -896 4485 129 -2495 2283 3674 -3279 -5116 2493 5111 -1370 -2543 2873 1809 -4540 -2900
4855 -2900 5256 3504 -3296 -2316 2901 230 -4348 524 5983 1110 -5394 -1251 3250 -903 -3492
$$ packed form
4750b263J126L959j160m433J215L270j521k761K561K963l079l618L071L086k822
4765d06j611L156J324m377j226M103J313l629j76L812j417m604K059N251j458
4780B114m707J716L573l163l016L810M685m407m365L622K997l541j983M946J854
4795D135o042j964N086J366m214M72M818j954n750J686N358j289m259K462L512
4810C423m453l998M750M859l929m012L832K258n693j351O438K635o592j833M951
4825A285M59n047J559O458j944o928R22N636j323l973L536M157n219n104M630
4840h96N381m356k624M778J391o953j837P609K618o481j173N416j064o349J640
4855b900Q156j752o800R80N217k671m578M872N459m873o504M143M501m153k589
$$ plain form
4870 -3492 3264 4724 -3219 -5582 1161 3482 -2217 -1859 4002 1687 -5886 -3905 4576 3394 -3260
4885 -3260 -1250 3944 -878 -6100 -100 6649 1570 -4336 -206 3148 -2369 -4055 3550 6066 -1844
4900 -1844 -5012 1548 2507 -2867 -1552 5497 3396 -5635 -3639 3955 2202 -3250 621 5466 -296
4915 -296 -7115 -1071 5749 1181 -3497 1482 3556 -3305 -5940 2636 5816 -1377 -3774 2039 1578
4930 1578 -4836 -2632 5588 3882 -4470 -3421 2613 318 -4589 549 6643 320 -6685 -1725 4452
4945 4452 -264 -3378 2867 4992 -3299 -6517 1491 5165 -1237 -2607 3734 2212 -5380 -3552 5217
4960 5217 4566 -3148 -1699 3367 -192 -5528 279 6801 1361 -5171 -869 3362 -1732 -3971 3499
4975 3499 5710 -2649 -6029 1074 3534 -2419 -2108 4780 2927 -5517 -4373 3394 2951 -2673 -555
$$ packed form
4870c492O756J460p943k363O743K321n699L58N861k315p573J981Q481j182o654
4885c260K010N194m822n222O000O749n079n906M130L354n517j686P605K516p910
4900a844l168O560R59n374J315P049k101r031J996P594j753n452L871M845n762
4915b96o819O044O820m568m678M979K074o861k635Q576L180p193k397N813m61
4930A578o414K204Q220j706q352J049O034k295m907N138O094o323p005M960O177
4945D452m716l114O245K125q291l218Q008L674o402j370O341j522p592J828Q769
4960E217o51p714J449N066l559n336N807O522n440o532M302M231n094k239P470
4975C499K211q359l380P103K460n953L11O888j853q444J144P767m43n624K118
$$ plain form
4990 -555 4125 -549 -6329 -904 5636 1371 -3512 520 3154 -2878 -5095 2687 5817 -1503 -4328
5005 -4328 1134 2443 -3442 -2035 5186 3803 -4221 -3404 2910 1703 -3302 253 5310 612 -5439
5020 -5439 -1407 4382 1310 -2485 1658 4145 -2782 -4908 1581 4690 -835 -2687 2009 1874 -4348
5035 -4348 -2952 4216 3618 -3109 -2708 2384 205 -4087 24 5022 1030 -4873 -1226 2561 -407
5050 -407 -3132 1925 4238 -2045 -4795 696 3616 -1174 -1739 2960 1963 -3961 -3046 2854 2763 -2098
5066 -2098 -666 3036 11 -4102 -298 4494 1313 -2862 -323 2520 -1193 -2903 1942 4014 -862
5081 -862 -3213 1046 2001 -1800 -1543 3296 2455 -3418 -2633 1809 1621 -1862 -429 2811 205 -3622
5097 -3622 -1145 2947 559 -2286 479 1993 -1415 -3374 1070 3232 -585 -2945 939 1894 -2067
$$ packed form
4990e55M680m674n780N425O540m265m883M032K634o032k217P782L130p320k825
5005d328N462J309n885J407P221j383q024Q17O314j207n005L555N057m698o051
5020e439M032N789l072l795M143K487o927k126O489L109n525j852M696j35o222
5035d348J396P168n98o727M01N092k179m292M111M998l992n903L647L787k968
5050d07k725N057K313o283k750N491K920m790n65M699r97n924R15N900r1m861
5066b098J432L702l025m113L804M792l181m175K539K843l713j710M845K072m876
5081h62k351M259R55l801K57M839q41n873P85M442j88l483J433L240k606l827
5097c622K477M092k388k845K765J514l408j959M444K162l817k360L884R55l961
$$ plain form
5112 -2067 -1758 2057 2506 -1629 -1754 1599 586 -2174 78 3114 622 -2788 -638 2175 300 -1472
5128 -1472 681 2651 -756 -2487 779 2382 -102 -1342 1057 1126 -1842 -1620 1991 1562 -1176 -1179 1285
5145 1285 345 -2235 -627 2253 665 -1861 -394 1329 -194 -1307 433 1428 -765 -1988 581
5160 581 1181 -925 -1097 1034 1407 -1498 -1741 1138 1076 -1001 -418 1183 157 -1455 -350 1435 708
5177 708 -1311 -53 1402 -326 -1348 548 1567 -125 -1350 576 796 -224 -731 744 1113 -928
5193 -928 -550 873 484 -848 65 1196 159 -1229 -586 969 212 -1067 -108 774 -105 -731 -217 617
5211 617 -596 -537 231 365 -647 -579 734 332 -926 -727 222 448 -670 -364 518 483 -772 -173 650
5230 650 82 -582 189 1203 -547 -711 261 535 -22 -760 703 610 -396 -402 331 533 -134 -151 410 468
$$ packed form
5112b067L09L815M49m135j25L353j013k760K252L036k492l410K150K813j875j772
5128a472K153J970l407j731L266J603k484j240K399O9k968K22L611m29k738lK464
5145A285r40k580J608K880j588k526J467J723j523j113J740R95k193j223K569
5160E81O00k106j72K131L73k905k43K879o2k077N83J601j026j612J105J785p27
5177G08k019J258J455j728j022J896J019j692j225J926K20j020n07J475L69k041
5193i28L78J423l89j332R13J131j037j388O43J555p57j279R59Q82q79o26N14Q34
5211F17j213N9P68J34j012O8J313m02j258J99R49K26j118L06Q82l5j255N99Q23
5230F50n68o64P71J014j750j64R72K74n57p38J463r3j006oP33K02o67j7N61N8
$$ plain form
5250 468 -159 6 696 534 -599 -257 661 44 -524 -102 414 19 -290 35 -1 -387 -385 11 213 -346 -708
5271 -708 132 324 -254 -758 39 128 -438 -794 -39 -42 -352 44 -2 -81 -586 120 710 16 -508 49 533 -145
5293 -145 -313 382 515 -127 -272 290 95 -28 -140 476 358 -119 -393 205 517 -476 -201 207 62 -226
5313 -226 -288 196 166 31 -65 142 -319 -343 136 100 -484 -424 244 96 -264 -430 15 45 -390 -310 389 -84 -669
5336 -669 -643 67 298 -513 214 383 -145 -327 549 507 -383 -292 514 121 -75 -109 414 363 -199 150 614 323
5358 323 -720 50 1071 170 -473 56 603 -315 -660 413 587 -529 -701 367 263 -282 -253 434 284
5377 284 -1028 -575 413 199 -556 -19 762 -184 -1197 0 897 -1 -921 237 1124 -558 -966 441
5395 441 866 -184 -960 489 548 -651 -616 1077 603 -859 -35 915 359 -865 395 1835 161 -1195
$$ packed form
5250D68o27J65O90j62j133L42R18o17n68M22N16l95l09L25l6l86KL96K02n59l62
5271g08Q40J92n78n04P97Q9n66l56P55ll10L96m6p9n05P06N90o94n24N57M84o78
5293a45j68O95J33o42j45N62j95j23j12O16j18m77k74N98L12r93K75M08j45k88
5313b26o2M84l0j35r6K07m61k4M79l6n84O0O68j48l60j66M45L0m35Q0O99m73n85
5336f69K6P10K31q11P27J69n28j82Q76m2q90R1Q06l93j96l4N23n1n62L49M64k91
5358C23j043P70J021r01o43N29N47r18l45J073J74j116j72J068j04n45K9O87j50
5377B84j312M53R88k14p55N37P81r46j013J197Q97q98r20J158Q87j682m08J407
5395D41M25j050p76J449N9j199L5J693m74j462Q24R50n56j224J260J440j674j356
$$ plain form
5413 -1195 -176 1126 -60 -494 966 1270 -304 -1521 785 1109 -546 -966 1275 628 -1323 -1083
5429 -1083 1161 885 -991 -491 1014 17 -1837 93 1581 -271 -1583 -124 1044 -922 -1653 1170
5445 1170 1722 -899 -1664 622 995 -1174 -918 1446 932 -1895 -1082 1506 684 -1277 -103 1987 -327
5462 -327 -2388 103 2186 404 -1460 601 1719 -1100 -1671 1417 2129 -910 -1469 1140 825 -1971
5478 -1971 -739 2379 1380 -2215 -1143 1973 439 -1784 10 2680 -163 -3011 -296 2064 -520
5493 -520 -1744 1088 1985 -1659 -2612 1019 2329 -1032 -1367 1778 1085 -2614 -1401 2607 1598 -2092
5509 -2092 -647 2026 -245 -3055 227 3382 -50 -2771 -178 2169 -800 -1841 1634 3274 -1075
5524 -1075 -2931 1142 1997 -1289 -992 2656 1482 -3112 -1618 2589 1267 -1933 125 2576 -463
$$ packed form
5413a195J019J302j186m34J460L04j574j217K306L24j655m20K241o47j951K40
5429a083K244k76j876N00J505r97j854J930J488j852j312J459J168j966p31K823
5445A170N52k621p65K286L73k169K56K364n14k827Q13K588q22j961J174K090k314
5462c27k061K491K083j782j864K061J118k819n71L088P12l039n59K609l15k796
5478a971J232L118r99l595J072L116j534k223J794K670k843k848K715K360k584
5493e20j224K832Q97l644r53L631J310l361l35L145o93l699J213M008j009l690
5509b092J445K673k271k810L282L155l432k721K593K347k969j041L475J640m349
5524a075j856M073Q55l286K97L648j174m594J494M207j322l200K058K451l039
$$ plain form
5539 -463 -3767 0 3623 247 -2625 67 1923 -2108 -3049 2105 3179 -1518 -2743 1344 1563 -2459
5555 -2459 -1201 2992 1703 -2976 -2220 2204 987 -2745 192 3324 -383 -3899 0 3408 100
5570 100 -1923 1428 2564 -2233 -3710 1957 3544 -1356 -2177 2123 1488 -3050 -1844 3830 2434 -2848
5586 -2848 -1791 1838 298 -2889 341 4074 243 -3489 -303 2544 -824 -2048 2216 3090 -2194
5601 -2194 -3824 1847 2833 -1603 -1447 2457 1512 -4000 -2579 3503 2210 -2389 -1127 2759 -555 -4165
5617 -4165 36 4187 428 -3606 -290 2274 -1451 -2659 2199 3599 -1561 -3118 1429 1863 -1871
5632 -1871 -991 3685 1872 -3669 -2131 2742 1830 -2209 351 3377 -476 -4314 -263 3850 540
5647 540 -2438 919 2450 -2194 -3551 2230 3688 -1415 -2748 1548 1238 -3127 -1712 3860 2099
$$ packed form
5539d63l304L767L623l376k872K692J856m031r41N154J074m697j225M087K19m022
5555b459J258M193j289m679P56M424j217l732K937L132l707l516L899L408l308
5570A00k023L351J136m797j477N667J587m900q21M300o35m538J206N674j396n282
5586b848J057L629j540l187L230L733l831l732L186K847l368j224M264Q74n284
5601b194j630N671R86m436J56L904r45n512J421O082j293m599J262L886l314l610
5617d165M201M151l759m034L316K564l725j208M858J400n160j557M547M34l734
5632a871Q80M676j813n541J538M873r12m039K560L026l853l838M051M113l310
5647E40k978L357J531m644j357N781J458n103j333M296l10m365J415N572j761
$$ plain form
5662 2099 -2739 -1939 2324 410 -2882 692 4195 -202 -4807 -591 2953 -281 -2636 1644 3225
5677 3225 -2013 -3754 1355 3332 -867 -1469 2145 1427 -3308 -2024 3417 2452 -2206 -962 2368 46
5693 46 -3085 457 4240 588 -2936 -111 2259 -726 -2257 2357 3256 -2280 -3742 1533 2297 -1629
5709 -1629 -1447 2712 1820 -3507 -2218 2823 1569 -2165 -850 2304 -262 -3531 -160 3200 491
5724 491 -2579 419 2238 -1548 -2922 2061 3319 -1456 -2763 1172 1571 -2177 -1140 3059 1756
5739 1756 -2548 -1948 2052 999 -2257 154 3142 349 -3238 -584 2864 581 -1938 631 2196
5754 2196 -1331 -2447 1329 2754 -580 -1672 1501 1061 -2273 -1360 2395 1753 -2396 -1431 1761 549
5770 549 -2516 -78 2597 302 -2420 -752 1942 -518 -1774 676 2162 -1106 -2877 372 1691
$$ packed form
5662B099m838Q00M263j914l292L574L503m397m605M216L544l234k355M280J581
5677C225n238j741N109J977m199o02L614p18m735J284N441r65m658J244L330k322
5693D6l131L542L783l652l524K825K370k985j531M614Q99n536j462N275P64l926
5709a629J82M159q92n327J289N041j254l734J315L154k566l269L371L360k709
5724D91l070K998J819l786j374M983J258m775j307L935L99l748J037M199j303
5739A756m304O00M000j053l256K411K988k793l587K654L448k283k519K569J565
5754B196l527j116L776J425l334j092L173m40l334R13L755o42m149R65L192j212
5770E49l065K438K675k295k722J668K694k460j256K450J486l268j771L249J319
$$ plain form
5785 1691 -999 -1080 1478 1272 -2102 -1464 1742 1285 -1508 -610 1703 -84 -2078 -4 2492 205
5801 205 -2037 -215 1840 -411 -1528 862 2167 -746 -1779 444 1197 -952 -904 1625 1076 -1368
5817 -1368 -1126 1430 1034 -950 -295 1493 28 -2037 56 1591 -145 -1339 254 1118 -796 -1554
5833 -1554 692 1786 -664 -1635 653 956 -1093 -916 1013 1205 -1180 -1508 787 683 -1120 -27
5849 -27 1326 -368 -1531 -101 980 145 -741 691 1119 -622 -1008 670 1333 -456 -536 998 595
5866 595 -679 -539 1071 946 -886 -665 812 536 -1147 -305 832 192 -586 124 974 -125 -714 159
5884 159 577 -829 -1082 312 554 -236 -382 570 314 -987 -929 466 307 -667 -267 571 238 -472 -347
5903 -347 736 167 -360 -40 247 -143 -280 349 838 -204 -811 110 383 34 -265 559 371 -378 -7
$$ packed form
5785A691k690q1K558k06l374O38L206m57k793Q98K313j787j994K074K496k287
5801B05k242J822K055k251j117K390J305k913j033K223P53k149M8K529n49k444
5817a368K42K556l96j984O55J788j465k065K093J535j736j194J593Q64j914p58
5833a554K246J094k450r71K288L03k049J77J929J92k385l28K295j04j803J093
5849b7J353j694j163J430J081q35q86J432M28j741l86J678O63j789q0J534m03
5866E95j274J40J610j25j832K21J477k76j683Q42J137o40p78P10Q50j099n89Q73
5884A59M18j406k53J394K42p90j46R52k56j301N8J395j59r74M00Q38l33p10J25
5903c47J083n69n27L20K87l90j37O29M89j042o07R21K73l49k99Q24j88p49L71
$$ plain form
5922 -7 244 115 -107 -82 410 341 -553 112 671 33 -779 -505 134 77 -260 -279 160 -210 -165 108 298 -311
5944 -311 -652 476 83 -452 -278 -43 -38 -403 -234 264 -169 -493 -99 332 67 -311 -46 236 -46 -473
5964 -473 116 524 210 -340 368 103 -2 -141 160 385 174 -138 571 273 50 -257 391 -139 6 97
5984 97 530 47 -125 -16 308 99 -426 256 135 -101 -622 -59 478 -293 -349 -7 243 -304 -92 -33 182
6005 182 -128 -403 185 -212 -241 -265 290 12 -243 7 173 -50 -155 541 269 -84 -196 8 393 -46 -145
6026 -145 429 172 -175 -228 96 347 10 69 398 280 -286 -107 392 75 -303 14 282 -116 -386 387 439
6047 439 -137 -382 371 153 -343 -384 553 320 -690 -110 73 -269 -528 -284 543 -40 -735 -266 191 -17
6067 -17 -344 350 202 -519 -735 8 516 -126 -242 501 265 -530 -126 508 206 -604 222 465 441 -679
$$ packed form
5922gK51j29k22K5M92o9q94O65N59o38q12K74O39n7l37j9M39l70M5K73J90o09
5944c11l41J128l93n35J74K35Nl65J69M98m33l24L94M31k65l78K65K82k82m27
5964d73N89M08l14n50P08k65j05j39L01K25k11l12P09k98k23l07O48n30J45R1
5984I7M33m83j72J09L24k09n25O82j21k36n21N63N37p71n6L42K50n47K12N9K15
6005A82l10k75N88l97k9k4N55k78k55K50J66k23j05O96k72l53j12K04L85m39r9
6026a45N74k57l47n3L24K51l37N9L29j18n66J79M99l17l78L17K68l98k70P73N2
6047D39n76k45P53k18m96m1R37k33j010N80J83l42k59K44Q27n83o95M69M57k08
6067a7l27O94j48p21k16P43N08o42j16P43k36p95M04O34l02q10Q26K43k4j120
$$ plain form
6087 -679 -30 890 -221 -597 -34 463 -112 -377 370 921 -343 -508 357 317 -630 -727 642 286 -893
6106 -893 -465 672 35 -610 -249 750 -272 -1193 -128 984 83 -649 605 892 -413 -836 676 1066
6124 1066 -505 -1009 202 613 -823 -318 1246 572 -977 -407 912 348 -817 187 1326 -313
6140 -313 -1181 176 884 -392 -784 991 1202 -801 -1300 807 770 -918 -870 959 594 -1288 -636 1269
6158 1269 279 -1073 -411 840 -269 -1533 30 1314 74 -1364 -187 571 -979 -1098 932 1262
6174 1262 -1024 -1518 759 992 -1175 -653 1453 848 -1660 -908 1466 603 -1012 51 1796 -123
6190 -123 -1819 -66 1758 48 -1343 414 1035 -751 -1380 1097 1431 -887 -827 877 871 -1409 -566
6207 -566 1992 674 -1559 -832 1438 414 -1507 295 1958 -201 -2438 -178 1955 -252 -1455
$$ packed form
6087f79O49R20j111l76N63M97n75k65P47N51j264j65Q65m0r47r7J369l56j179
6106h93M28J137o37o45L61R99j022r21J065J112r01p32J254K87j305m23J512L90
6124A066j571n04J211M11j436N05J564o74j549N70J319n64j165J004J139j639
6140c13q68J357P08j276l92J775K11k003m99K107l7j688M8J829l65j882O52J905
6158A269r90j352O62J251j109j264J563J284j240j438J177P58j550j19K030L30
6174A262k286m94K277K33k167N22K106o05k508P52K374q63j615J063J745j919
6190a23j696J753J824j710j391J757O21j786o29K477L34k318O0J704ok280Q43
6207e66K558j318k233P27K270j024j921J802J663k159k237K260K133k207j203
$$ plain form
6222 -1455 748 1245 -1393 -1912 782 1575 -1077 -1109 1067 580 -2278 -1124 1857 895 -2151 -880 1469
6239 1469 -292 -1888 418 2457 -265 -2282 345 1700 -388 -1174 1386 2249 -1249 -1807 1128 1785
6255 1785 -851 -1089 1822 1136 -2122 -1024 1926 1204 -1559 -492 1604 -327 -2330 273 2468 56
6271 56 -2091 381 1850 -1121 -1876 1733 2330 -1288 -1977 890 1174 -1818 -834 2128 1165 -2498 -1306
6288 -1306 1585 424 -1565 22 2165 -188 -2952 32 2760 -301 -1461 1007 1786 -1343 -2021
6303 -2021 1688 1989 -979 -1474 1414 948 -2087 -924 2694 1816 -1972 -1344 1917 578 -1982 83
6319 83 2690 -48 -2735 -227 1850 -295 -1450 1275 1834 -1545 -2478 950 1910 -1224 -763 1150
6335 1150 944 -2451 -1830 2247 1376 -1830 -824 1584 -204 -2802 351 2564 -38 -2383 428 1729
$$ packed form
6222a455K203M97k638n19K694P93k652l2K176m87k858J154K981r62l046J271K349
6239A469j761j596K306K039k722k017K627J355k088p86K560Q63l498n58K935O57
6255A785k636k38K911o86l258J098K950p22k763J067K096j931k003K603K195k412
6271E6k147K472J469k971p55L609N97l618o89K867K84k992R84K962r63l663J192
6288a306K891j161j989J587K143k353k764K984K728l061j160K468P79l129o78
6303b021L709L01k968m95K888m66l035J163L618q78l788O28L261j339k560K065
6319H3K607k738k687K508K077k145j155K725N59l379r33L428R60l134M61J913
6335A150k06l395O21M077q71l206J006K408j788k598L153K213k602k345K811J301
$$ plain form
6351 1729 -947 -1791 1429 2354 -1216 -2034 703 1473 -1327 -694 2075 1203 -2383 -1493 2044 1293 -1626
6368 -1626 -32 2259 -119 -2601 -9 2548 187 -1769 687 1788 -1343 -1934 1505 2342 -648
6383 -648 -1887 1109 1078 -1867 -862 2404 1122 -1754 -1553 1506 588 -1329 118 2168 -116 -2544
6399 -2544 -100 1640 -292 -1625 934 1476 -1345 -2069 921 1957 -909 -1195 1483 900 -2088 -1238
6415 -1238 2051 1291 -1366 -635 1696 81 -1864 82 2425 329 -1885 -246 1767 -537 -1413 1303
6431 1303 1862 -1129 -1870 943 1504 -847 -1176 1748 1250 -1920 -1423 1734 907 -1546 -512 1484 108
6448 108 -1967 -236 2017 -12 -1736 243 1423 -1061 -1625 724 1685 -889 -1434 844 830 -918
6464 -918 -958 1525 906 -1545 -890 1268 554 -1337 -279 1812 5 -1969 -134 1603 392 -1079
$$ packed form
6351A729k676q44L220R25l570q18K737P70k800O33K769q72l586Q90L537p51k919
6368a626J594K291k378k482K592K557k361j956K456J101l131n91L439Q37k990
6383f48j239K996l1k945J005L266j282k876K01L059r18j917J447K050k284k428
6399b544K444J740j932j333K559N42k821p24K990J036k866k86K678n83k988Q50
6415a238L289p60k657P31K331j615j945J946K343k096k214J639K013k304q76K716
6431A303N59k991p41K813N61k351l29K924m98l170M97L157q27k453J034J996j376
6448A08k075J731K253k029j724J979J180k484n64K349R61k574n45K278j4j748
6464i18m0K483o19k451O55K158p14j891J058K091j807j974J835J737j211j471
$$ plain form
6480 -1079 383 1234 -668 -1466 520 1887 -681 -633 916 1038 -1025 -812 1840 982 -1376 -552 1257
6497 1257 418 -1453 -44 1649 97 -1771 -514 1295 -178 -1112 356 1145 -587 -1485 488 768
6513 768 -594 -856 699 377 -1092 -585 912 638 -826 -233 902 -29 -1077 406 1478 -40 -1319
6530 -1319 -70 1235 -179 -1016 522 904 -253 -962 273 671 -251 -581 502 974 -696 -751 439
6547 439 387 -357 -250 987 191 -651 -123 908 241 -601 92 783 -379 -891 478 833 -451 -946 114
6566 114 511 -490 -752 529 719 -809 -492 350 327 -723 89 279 -9 -818 -8 688 202 -579 9
6585 9 458 -405 -581 239 644 -211 -636 639 653 -331 -527 298 646 -708 -217 385 246 -658 -245 656
6605 656 319 -582 -389 413 -32 -390 256 588 -217 -312 38 305 -331 -460 131 176 -359 -124 213 213 -418
$$ packed form
6480a079J462Q51j902p98J986J367k568M8J549J22k063K13K652q58k358Q24J809
6497A257q39j871J409J693j552j868J257J809j473r34J468P89j732q98J973K80
6513G68j362k62J555l22j469N07J497k74j464N93J135r31j048J483J072j518j279
6530a319J249J305j414q37J538L82j157p09J235L98r22l30J083M72j670n5J190
6547D39n2p44J07J237p96q42N28J031o67q42O93O91j162n12J369L55j284m95J060
6566A14L97j001k62J281J90j528L17Q42k3j050Q12J90k88q09Q10O96m86p81N88
6585IM49q63j76Q20M05q55m25J275J4r84j96Q25L48j354M91O02j39r04M13R01
6605F56l37r01J93Q02m45l58O46L32q05r5L50K67o36j29N91M5n35K35L37%o31
$$ plain form
6626 -418 13 -2 2 -433 -39 467 148 -471 -63 58 115 -404 -119 11 139 -325 -76 25 133 -432 606
6647 606 488 -274 -352 305 -166 -537 -177 135 108 -514 90 160 -47 -189 200 317 6 79 51 141 -139 -216
6669 -216 41 257 -40 -24 -44 189 -261 -91 151 95 -216 -220 252 31 -267 -93 43 -276 -183 120 288 -283
6691 -283 -481 -122 498 -87 -142 393 470 -16 -53 245 471 -207 -107 453 366 82 -320 358 -22 107 60 343
6713 343 8 66 -144 109 67 -208 130 272 276 -352 129 408 -297 -666 247 91 -226 -44 184 212 4 -69
6735 -69 150 90 -298 -225 513 -166 -357 88 111 42 -431 -60 238 -6 -373 264 425 -46 -261 329 192 -476
6757 -476 -181 246 -202 -428 -253 674 -33 -597 -228 540 332 -484 178 490 -151 -215 260 379 -517 -251
6777 -251 186 478 -204 -137 512 85 -532 -401 385 46 -428 -388 303 -326 -551 -69 473 -52 -747 97 518
$$ packed form
6626d18M31j5Mm35L94N06l19o19M08J21N7n19K85J30J28m64K49J01J08n65J038
6647F06j18p62p8O57m71l71L60L12k7o22O04P0k07j42L89J17l11P3k8R0k80p7
6669b16K57K16k97J6k0K33m50J70K42n6l11mM72k21k98J74J36l19R3L03J68n71
6691b83j98L59O20n85n5N35P7m86l7K98K26o78J00N60q7k84m02O78l80J29m7K83
6713C43l35N8k10K53m2k75L38J42Mo28M81K79p05l69R13j56l17J82K28K8k08p3
6735f9K19o0l88P3P38o79j91M45K3o9m73L71K98k44l67O37J61m71k15N90j37o68
6757d76K95M27m48k26J75R27p07n64L69P68k08q16O62L12o41o4M75J19q96K66
6777b51M37K92o82O7O49m27o17J31P86l39m74M0O91o29k25M82N42n25o95Q44M21
$$ plain form
6798 518 -377 -448 35 460 -471 -310 424 215 -297 -132 589 325 -349 -36 498 -138 -730 46 603 71
6818 71 -708 38 366 48 -523 514 956 -451 -253 314 427 -515 -360 315 335 -669 -367 781 302
6837 302 -688 -154 610 -207 -975 58 961 -45 -732 385 664 -819 -928 518 508 -299 -721 280
6855 280 668 -424 -556 594 427 -696 -365 473 34 -576 -123 761 21 -910 75 787 -245 -697 645
6874 645 915 -619 -645 814 948 -702 -412 710 362 -1318 -516 1116 540 -723 -87 715 -52 -1310
6892 -1310 18 1168 -17 -1124 319 751 -576 -885 385 917 -1053 -1182 438 660 -801 -394
6908 -394 960 562 -1293 -649 789 674 -1121 301 1150 -117 -1465 -64 1252 -41 -1147 453
6924 453 937 -793 -1163 606 936 -622 -947 688 537 -1063 -653 1435 658 -1424 -600 1262 265
$$ packed form
6798E18q95p1M83M25r31J61P34k09n12J65P21k64o74L13N34o36n92P76N57n32
6818G1p79P46L28l18n71J037M42j407J98N67J13r42J55O75K0j004L02J148m79
6837C02r90N34P64q17p68J033R03j006o87J117K79j483j09J446j0q07m22J001
6855B80L88j092j32J150j67j123L31Q38m39o10M53Q84p40r31R85P12j032m52J342
6874F45K70j534k6J459J34j650K90J122l48j680Q02J632n76j263O36Q02p67j258
6892a310J328J150j185j107J443M32j327l09J270N32j970j29J620K22j461M07
6908c94J354l98j855O44J438j15j795J422Q49j267j348J401J316j293j106J600
6924D53M84j730l70J769L30j558l25J635j51j600M10K088p77k082Q24J862r97
$$ plain form
6941 265 -1225 445 1426 -62 -1629 -28 1241 64 -1253 715 1152 -822 -1371 400 1268 -622
6957 -622 -952 974 305 -1321 -602 1194 533 -1014 -320 1272 65 -1571 -47 1879 88 -1663
6973 -1663 249 926 -570 -1375 1070 1670 -834 -1601 660 897 -853 -751 1386 665 -1495 -734 1523
6990 1523 701 -1167 -405 1393 -199 -1960 199 1474 53 -1408 257 1049 -920 -1442 1256 1700
7006 1700 -777 -1519 730 999 -1269 -732 1516 753 -1917 -795 1395 117 -1187 -170 1603 -215
7022 -215 -1808 132 1480 -228 -1300 403 1234 -1052 -1542 1173 1421 -854 -827 1085 654 -1441 -672
7039 -672 1702 1012 -1481 -528 1510 514 -1270 364 1854 197 -1463 -10 1479 -292 -819 1065
7055 1065 1261 -1094 -1558 891 1591 -784 -887 1190 501 -1903 -661 1512 735 -1245 -619 1226 -120
$$ packed form
6941B65j490J670R81j488j567J601J269j177j317J968M37j974n49J771Q68j890
6957f22l30J926o69j626P19J796o61j547O94J592j207j636J524J926j791j751
6973a663J912O77j496q05K445O00k504p67K261K37j750J02K137p21k160P61K257
6990A523q22j868P62J798j592j761K159J275j421j461J665P92j969n22K698M44
7006A700k477p42K249K69k268N37K248p63k670J122K190j278j304J017J773j818
7022b15j593J940J348j708j072J703Q31k286m90K715K48k275K7J912m31k095P69
7039f72K374o90k493R53K038r96j784J634J490j657j660J453J489j771n27J884
7055A065J96k355m64K449P00k375j03K077o89k404J242K173p77j980O26J845j346
$$ plain form
7072 -120 -1660 -106 1882 52 -1754 35 1098 -447 -1153 763 1455 -879 -1503 838 596 -743
7088 -743 -474 1748 504 -1458 -925 1341 372 -1347 333 1581 -102 -1707 63 1640 -33 -1355
7104 -1355 479 838 -1041 -1360 922 1524 -529 -1277 414 581 -1234 -591 1538 506 -1084 -773 1110
7121 1110 -101 -1329 189 1134 -469 -1645 -71 1459 -126 -996 471 1175 -994 -1376 969 1037
7137 1037 -799 -605 836 803 -1103 -742 1551 549 -1073 -549 1050 207 -1223 345 1319 -223 -1564
7154 -1564 295 958 -262 -896 690 962 -667 -1257 608 922 -578 -448 772 671 -937 -786 933
7171 933 557 -715 -541 1047 183 -1275 -56 1344 324 -1124 104 616 -802 -894 694 659 -780
7188 -780 -959 568 567 -606 -286 932 553 -1025 -693 911 440 -628 -6 494 -67 -893 -419 863
$$ packed form
7072a20j540J554J988j830j806J789J063j545p06J916O92k334o24K341k42j339
7088g43K69K222j244j962N33K266r69j719J680J248j683j605J770J577j673j322
7104a355J834L59j879l19K282O02k053p48J691J67j815O43K129j032j590L11J883
7121A110j211j228J518R45j603j176J574J530j585q70J467P04k169l82K345O8
7137A037j836J94J441l3j906L61K293j002j622N24J599q43j430J568R74j542j341
7154a564J859O63j220o34J586K72j629n90J865L14j500J30J220j01j608J51J719
7171I33l76j272J74J588q64j458J219J400j020j448J228N12j418r2J588l5j439
7188g80j79J527jj173L20J218l79j578L32J604m71j068O22N00n61q26M74J282
$$ plain form
7206 863 173 -642 326 744 -537 -666 353 841 -115 -510 550 437 -404 -377 610 724 -796 -115 995
7225 995 338 -620 -166 737 -185 -874 -244 518 132 -1040 492 577 -439 -382 275 769 -249 -607 481
7244 481 296 -700 -395 389 157 -457 -321 712 -115 -641 -39 677 61 -501 295 710 127 -648 126 245
7264 245 -216 -594 159 355 -123 -512 427 643 -652 -100 409 119 -336 68 757 42 -498 -93 461 60
7284 60 -374 24 455 -239 -521 -58 277 -315 -662 209 365 -352 -108 51 564 -566 -460 288 -52 -486
7304 -486 -94 469 36 -660 -229 720 -146 -254 307 406 -16 63 188 147 -180 -349 236 236 -26 -558 295 405
7326 405 -139 -326 120 139 -398 52 356 318 -107 206 165 11 -154 27 269 36 -218 -3 74 -170 -149 18
7348 18 190 -81 250 306 419 -202 -163 289 48 -430 -120 126 164 -227 -55 5 221 122 106 99 210 -417 8
$$ packed form
7206H63o90q15R68M18j281j29J019M88r56l95J060j13q41K7R87J14j520O81J110
7225I95o57r58M54R03r22o89O30P62l86j172J532Q5j016N7O57M94j018l58J088
7244D81j85r96L05P84k32o14J36J033q27n26O02P16o16n62P96M15n83p75P74J19
7264B45m61l78P53J96m78l89R39K16j295N52N09k90m55M04O89p15n40M05N54m01
7284F0m34L98M31o94k82M63L35n92l47Q71J56p17K44J59N13j130J06P48l40m34
7304d86L92N63m33o96M31R49q66j08N61R9m22P9J25m1l27j69N85%k62n32Q53J10
7326D05n44j87M46J9n37M50L04l8m25L13m1j54j65J81K42k33k54K15P7k44K1J67
7348A8J72k71L31N6J13o21L9M52k41m78L10K46L8l91J72O0K16r9j6pJ11o27M25
$$ plain form
7371 8 3 -45 -70 120 -53 124 147 -106 370 -178 -217 36 108 -278 -145 25 206 -160 -239 201 114 -300 -109 374
7395 374 -26 -365 10 21 -8 -222 -303 207 -229 114 54 89 -375 -271 165 -333 -248 -174 -93 66 -144 98 -18
7418 -18 -25 -196 -205 334 -226 -264 -63 249 -172 -191 3 220 -283 137 127 29 136 -161 33 -232 -88 126 88
7441 88 13 -220 165 -182 194 -275 524 316 -460 -158 67 250 -260 -49 188 426 -249 161 34 301 -204
7462 -204 -25 -146 -222 -158 -20 251 271 -46 54 98 -227 -235 41 160 -414 -130 159 85 -264 -317 405 350 -217
7485 -217 -174 645 47 -442 -216 412 108 -340 -112 393 -129 -329 -34 804 48 -463 266 399 -632 -210
7505 -210 -20 124 -540 -178 432 125 -463 -239 501 234 -489 -68 586 -203 -482 66 441 -362 -551 221
7525 221 468 -636 -710 380 304 -153 -261 358 -51 -704 -144 471 261 -240 114 634 -111 -513 97 649
$$ packed form
7371Hnm8k5J90j73J77K3k53M76n48l9K53P2l86J33J70J81l66p9M40q7m14J91M83
7395C74m00l39L75J1k9k14q1N10m36L43o0L5m64J04M36m98Q5P4Q1J59k10K42j16
7418a8pj71rN39n60l8K01L12m21j9J94K17n03M20j0r8J07k97J94k65J44K14l8
7441H8p5k33L85l47L76m69P99k08p76L02K25J83n10K11K37K38o75M10j27K67n05
7462b04J79j21p6O4J38K71K0l17J00M4l25qK76J19n74K84K89p4l49n3P22n5n67
7485b17M3Q19n98m89K26O28l04m48K28N05n22k00K95Q38p56n11P29J33j031M22
7505b10J90J44o64L62O10l07n88K24P40k67p23M21O54p89k79N48L75q03j89P72
7525B21K47j104p4J090p6m57j08O19m09o53N60O15k10n01L54N20p45m02O10N52
$$ plain form
7545 649 -176 -538 85 475 -494 -357 581 398 -108 -520 372 431 -442 -363 579 466 -717 -116 554 163
7565 163 -669 97 683 -179 -893 55 730 -151 -617 305 473 -654 -646 236 673 -367 -745 284 492 -797
7585 -797 -602 830 243 -737 -212 818 253 -618 98 887 17 -1090 234 726 -116 -527 499 928
7603 928 -627 -475 572 620 -382 -265 847 430 -898 -341 1070 286 -565 -36 746 -210 -1075 188
7621 188 994 -50 -732 490 655 -478 -605 362 791 -587 -726 359 578 -998 -307 862 86 -874
7639 -874 -464 908 392 -890 -193 1026 -419 -1031 255 1101 163 -952 320 614 -670 -1129 700
7656 700 777 -580 -751 492 646 -550 -388 1105 472 -1068 -194 1148 248 -978 41 1139 -376
7673 -376 -893 -232 989 -520 -875 584 652 -502 -970 656 1053 -632 -638 901 210 -1224 -374 1114
$$ packed form
7545F49q25l62O23L90r69J37R38j83n06m12Q92N9q73P9R42j13j183O01O70l91
7565A63q32P66N86q62p14R48O75q81m66R22J68j127QQ82M37j040l78J029K08j289
7585g97J95J432n87r80N25J030n65q71P16P89q70j107J324M92q42m11J026M29
7603I28j555J52J047M8j002J17J112m17j328N57J411p84q51N29P82r56q65J263
7621A88Q06j044o82J222J65j133j27R67M29j378j39J085K19j576O91J169p76r60
7639h74M10J372n16j282O97J219j445o12J286Q46r38j115J272K94j284m59J829
7656G00P7j357j71J243J54j196J62J493o33j540Q74J342r00j226J019J098j515
7673c76n17O61J221j509l55J459O8j154m68J626L97j685oJ539o91j434Q50J488
$$ plain form
7691 1114 699 -963 -202 793 -28 -1135 -126 1006 -177 -1124 -24 792 -352 -737 834 886 -901
7708 -901 -875 724 777 -670 -696 1184 527 -1164 -477 1271 750 -1057 -30 1024 -294 -1160 581 1313
7726 1313 -175 -973 602 831 -420 -768 1007 1253 -845 -719 840 644 -691 -550 1132 452 -1602
7743 -1602 -363 1131 342 -976 -123 774 -185 -1090 -134 1061 -137 -915 51 746 -672 -1084 816
7760 816 911 -678 -1166 790 323 -1072 -550 1055 570 -1118 -495 857 24 -1047 205 1202 151
7777 151 -1253 -55 927 -292 -670 789 890 -375 -893 796 981 -613 -487 639 471 -788 -487
7794 -487 1030 230 -804 -347 604 -136 -889 203 1215 -34 -1199 44 538 -563 -552 477 683
7811 683 -815 -852 556 626 -566 -527 586 136 -1137 -357 539 235 -929 -83 873 -178 -1037 -90 1011
$$ packed form
7691A114m15j662P61R95q21j107J009J132j183r47J100Q16j144l85J571N2j787
7708i01K6J599N3j447k6J880o57j691O87J748n21j807J027J054j318q66J741P32
7726A313j488p98J575K29j251l48J775K46k098J26J559j96j335J41J682o80k054
7743a602J239J494p89j318Q53Q97r59r05R56J195j198p78R66O95j418m12J900
7760H16R5j589m88J956m67j395N22J605m85j688O23J352q33j071J252R97j051
7777A51j404J198R82j219l78J459J01j265n18J689J85j594J26J126j68j259L01
7794d87J517q00j034M57R51p40p53J092J012j249j165J243M94j101J1J029K06
7811F83j498l7J408P0j192L9J113m50j273P80Q96l04j164Q46R56j051q59R47J101
$$ plain form
7830 1011 75 -804 283 700 -620 -704 739 965 -616 -549 580 374 -461 -186 867 402 -819 -205
7848 -205 608 306 -763 -234 949 -234 -1075 -276 686 -106 -1068 244 598 -277 -804 467 627 -314
7866 -314 -343 558 366 -858 -419 516 399 -817 -678 565 -182 -758 -8 925 -20 -618 -33 560 -500
7885 -500 -848 135 804 -482 -813 599 331 -456 -302 459 539 -555 -531 564 307 -278 -658 603 -88
7904 -88 -700 -358 482 -2 -414 -38 30 -145 -308 275 303 -435 -447 22 204 -140 -513 457 619 -568 -540
7925 -540 388 289 -407 26 328 54 -604 -222 537 276 -536 64 253 -79 -135 89 316 -126 -512 110 274
7946 274 -354 -592 678 387 -527 -319 269 140 -159 57 374 221 -772 -43 200 -119 -318 -136 215 -48
7966 -48 -430 67 402 -145 -198 193 111 -465 -323 456 -145 -297 -350 214 191 -267 -202 178 136 -291 132 393
$$ packed form
7830A011r36q79J087M17j320q4J443K26j581O7J129k06q35K75J053m65j221O14
7848b05Q13l02j069N29J183j183q41P99R62p92r62J312L54q75n27J271J60r41
7866c14k9R01j92j224M39R35j17j216J39J243p47n76P50R33r45n98N85N93j060
7885e00l48R83O69j286l31J412k68p87J54P61Q0j094K4J095k57n85l80J261o91
7904h8o12L42Q40m84m12L76O8j75j63N83K8p38j2M69J82l44l73R70J62j187K8
7925e40R28r9o96M33L02k74o58L82P59k61q12O00J89l32n6K24K27m42l86O22J64
7946B74o28k38J270k91r14K08N88j29k99K16L17j53r93P29K43l19j99J82L51k63
7966d8l82M97L35n47n3L91q2n76J42P79o01j52n3N64k3m58O5L80m2m27M23K61
$$ plain form
7988 393 -101 -407 152 338 18 -279 419 267 -334 -304 116 237 -477 -143 223 230 -246 -167 -2 280 0
8009 0 75 166 63 6 -67 362 -15 -218 167 268 -239 -18 136 421 -238 -458 328 -45 -144 -263 221 38
8031 38 1 -183 265 -58 -453 242 296 93 -197 -327 -61 180 -113 87 98 -88 76 10 424 -320 -99 1
8053 1 245 62 -100 215 -231 -53 -62 45 319 -419 -327 235 6 -174 71 159 -56 -38 50 235 13 -241 -150
8076 -150 90 -11 -314 307 330 123 3 -52 -45 -74 -129 133 14 -193 -34 -3 300 -396 -200 193 -9 -347
8098 -347 -161 -108 38 -240 -297 106 117 -200 103 84 132 -77 -299 100 -242 -495 72 330 -116 -315 -14 27
8120 27 -218 -246 194 4 -57 22 344 -51 167 130 310 149 -99 382 -37 -235 -152 208 7 -229 3 224
8142 224 -259 -194 90 35 -342 -180 -107 196 -88 -270 -61 304 -6 -261 246 117 -105 -315 292 103 -293
$$ packed form
7988C93m94l06N59J86l20k97O98j52o01L0M20J21p14L34L66Pm76P9J65K82k80
8009@P5R1j03n7p3M29l77k03L85J01n07K21J54K85o59k20P86l73r9j19M84j83
8031C8l7j84M48l23l95O95N4k03k90j30K66K41k93K00J1j86J64o6M14p44K21J00
8053AK44j83j62L15m46J78rJ07K74p38R2N62k29j80K45Q8k15J8Q8J85k22k54R1
8076a50K40j01l03O21K3k07j20n5Pk9n5K62j19k07J59L1L03o96J96L93k02l38
8098c47J86N3J46k78n7M03J1l17L03j9M8k09k22L99l42k53N67K58m46j99L01M1
8120B7k45k8M40j90o1P9L22l95K18l7J80j61k48M81m19j98Q3L60k01k36K32K21
8142B24m83O5K84n5l77J62P3L03k84j82K09L65l10k55N07j29k22k10O07j89l96
$$ plain form
8163 -293 -92 108 -13 -103 27 -105 196 -103 126 258 -113 -311 291 251 60 39 -8 80 -50 -49 280 351 -140
8186 -140 -83 492 -146 -162 -255
$$ packed form
8163b93K01K00j21r0J30j32L01k99K29J32l71j98O02m0j91k1m7Q8j30JL29P1m91
8186a40N7N75o38j6r3
8191b55
$$ Imaginary data points
##PAGE= N=2
##DATA TABLE= (X++(I..I)), XYDATA
$$ plain form
0 0 0 0 0 8 -8 0 -8 16 -16 16 -24 32 -32 40 -52 64 -72 88 -102 118 -143 166 -188 220 -254 288 -326 371 -420
29 -420 474 -531 596 -670 750 -836 926 -1034 1150 -1270 1406 -1562 1729 -1910 2116 -2347
45 -2347 2605 -2896 3233 -3619 4068 -4607 5259 -6063 7098 -8472 10387 -13269 18067 -27498
59 -27498 52980 -261077 -738456 28928 456519 10174 -347699 99575 406053 50817
69 50817 -282110 -36292 261668 264489 140052 -49835 -354808 -333182 152134 408375 21269
80 21269 -283148 -18830 186501 -108169 -265245 50160 195712 -101906 -214669 -16664
90 -16664 -92492 -318184 35762 611428 360577 -419747 -431830 290825 484132 -56291 -286146
101 -286146 77840 251922 -24614 -202147 -63207 126363 261587 269972 -61241 -460814
$$ packed form
0@%%%Qj6QqK4l2L2m0N6o4P2r2J16j36J60j90K20k61L09l54M08m74N42o14O97p91
29d20Q94j005J127j266J420j586J762j960K184k420K676k968L291l639M026m463
45b347M952n501O129o852P687q675R866j1322J3161j5570J8859k3656L1336m5565
59b7498Q0478l14057m77379P67384M27591m46345l57873M47274L06478l55236
69E0817l32927K45818K97960K821j24437j89887l04973K1626M85316K56241l87106
80B1269l04417K64318K05331k94670j57076L15405J45552k97618j12763J98005
90a6664p5828k25692L53946N75666k50851p80324j2083P22655J93307n40423k29855
101b86146L63986J74082k76536j77533J38940J89570J35224Q385l31213l99573
$$ plain form
111 -460814 -293746 253436 283447 -219470 -335023 58105 127885 -214114 -179183 253754
121 253754 286537 -94933 -163351 56459 -29104 -222396 47152 401907 154919 -297139
131 -297139 -182457 222787 219413 -16082 15240 110859 -64519 -221652 -99633 12000 -31321
142 -31321 35550 147187 -44964 -300784 -106967 250836 144303 -175046 -84978 149301
152 149301 -45581 -309716 -33201 375240 225838 -152359 -99929 150083 80075 -77684
162 -77684 51184 175766 -5053 -167770 -65702 9859 -61910 14852 197630 85625 -214312
173 -214312 -198203 65760 88743 -79892 -45978 70010 -58455 -196456 -12688 191545
183 191545 73066 -58254 84897 146244 -104872 -214770 71462 258717 32539 -174571
$$ packed form
111d60814J67068N47182L0011n02917j15553L93128O9780l41999L4931M32937
121B53754L2783l81470o8418K19810q5563j93292K69548L54755k46988m52058
131b97139J14682M05244l374k35495L1322R5619j75378j57133J22019J11633m3321
142c1321O6871J11637j92151k55820J93817L57803j06533l19349R0068K34279
152A49301j94882k64135K76515M08441j49402l78197N2430K50012p0008j57759
162g7684J28868J24582j80819j62717J02068P5561p1769P6762J82778j12005k99937
173b14312J6109K63963K2983j68635L3914J15988j28465j38001J83768K04233
183A91545j18479j31320J43151O1347k51116j09898K86232J87255k26178k07110
$$ plain form
193 -174571 -53422 65712 -23097 -34322 108411 94037 -85278 -105134 5760 -37226 -124659
204 -124659 8260 152470 5590 -180370 -63239 128503 74017 -24069 65694 106855 -62897
215 -62897 -139101 34453 131495 3972 -46373 72361 65352 -92033 -74876 108261 110736
226 110736 -59884 -87363 6826 -38628 -131071 -26539 118370 34718 -109285 -46202 69284
237 69284 14417 -51689 39556 95681 -24126 -103595 -11110 55715 1197 5249 89669 55351
249 55351 -70070 -51606 70822 52974 -60031 -44053 33906 -26822 -120382 -41768 82674
260 82674 43462 -46739 -8529 44235 -19482 -59165 29949 77088 -17166 -69595 13572 61016
272 61016 -424 -9525 76875 90129 -2260 -41216 2545 8049 -22293 -3431 11037 -48256
$$ packed form
193a74571J21149J19134q8809j1225J42733j4374j79315j9856J10894m2986q7433
204a24659J32919J44210j46880j85960J17131J91742n4486r8086Q9763M1161j69752
215f2897p6204J73554R7042j27523n0345J18734p009j57385J7157J83137K475
226A10736j70620k7479R4189m5454r2443J04532J44909q3652j44003O3083J15486
237F9284n4867o6106R1245N6125j19807p9469R2485O6825n4518M052Q4420l4318
249E5351j25421J8464J22428j7848j13005J5978P7959o0728r3560P8614J24442
260H2674l9212r0201L8210N2764o3717l9683Q9114M7139r4254n2429Q3167M7444
272F1016o1440r101Q6400J3254r2389l8956M3761N504l0342J8862J4468n9293
$$ plain form
284 -48256 -76875 6473 61584 -11029 -62465 13667 61531 -30522 -103229 -31598 48887 15209
296 15209 -33927 -5274 27185 16291 27777 63328 39875 -19055 -13317 27762 2089 -52578
308 -52578 -31981 26827 21898 -19711 -16537 7309 8 -6734 9445 -8759 -61906 -60626 3483
321 3483 23356 -22075 -27002 36538 67277 25934 -1493 23389 38354 15341 -1725 -1286 -9057
334 -9057 -12281 13417 35123 17499 -5120 5297 16657 -5888 -32002 -31828 -30233 -42934 -39698
347 -39698 -16224 -9263 -18112 -2661 32431 34217 503 -14901 4751 16889 1654 -12759 -6681
360 -6681 10036 25227 34479 29033 15063 12943 21635 11981 -20407 -42006 -33058 -17121 -18273 -24789
374 -24789 -18436 -3935 8021 13707 9128 -5069 -14931 -8319 1829 -3214 -13434 -5658 20410
$$ packed form
284d8256k8619Q3348N5111p2613n1436P6132M7864r2053p2707P1631Q0485l3678
296A5209m9136K8653L2459j0894J1486L5551k3453n8930N738M1079k5673n4667
308e2578K0597N8808m929m1609L174K3846p301o742J6179j8204n3147J280O4109
321C483J9873m5431m927O3540L0739m1343k7427K4882J4965k3013j7066M39p771
334i057l224K5698K1706j7624k2619J0417J1360k2545k6114J74J595j2701L236
347c9698K3474O961q849J5451L5092J786l3714j5404J9652J2138j5235j4413O078
360f681J6717J5191R252n446j3970k120Q692r654l2388k1599Q948J5937j152o516
374b4789O353J4501J1956N686m579j4197r862O612J0148n043j0220P776K6068
$$ plain form
387 20410 40703 39182 27856 24261 29999 28903 10381 -14333 -24730 -16962 -7310 -10365 -16821 -12985
401 -12985 -127 6849 -218 -13692 -23714 -26320 -24394 -22646 -23834 -22626 -10788 9756 25873
414 25873 27685 21228 19424 24472 23551 9412 -7444 -11486 -1277 8380 7421 1541 3318 13127 17375
429 17375 5544 -14023 -23753 -21693 -20101 -25967 -29528 -22064 -6868 8781 16408 14392 10156 14116
443 14116 21037 15355 -2196 -8027 5018 14663 8561 6170 19263 28587 19822 7647 4895 0
457 0 -14862 -24940 -23603 -24161 -27215 -22095 -11343 -6904 -3607 5645 6572 -8283 -15243 -2324 3520
472 3520 -11431 -14588 6910 20624 10970 10282 29979 32831 13656 7056 14903 433 -26289 -18661
486 -18661 10102 3716 -26184 -20281 11897 14570 -8396 -10122 2585 -4455 -17958 -13492 -9781
$$ packed form
387B0410K0293j521j1326l595N738j096j8522k4714j0397P768R652l055o456L836
401a2985J2858O976p067j3474j0022k606J926J748j188J208J1838K0544J6117
414B5873J812o457j804N048r21j4139j6856m042J0209R657r59n880J777R809M248
429A7375j1831j9567r730K060J592n866l561P464J5196J5649P627k016m236L960
443A4116O921n682j7551n831J3045R645o102k391J3093R324q765j2175k752m895
457@j4862j0078J337n58l054N120J0752M439L297R252R27j4855o960J2919N844
472C520j4951l157K1498J3714r654o88J9697K852j9175o600P847j4470k6722P628
486a8661K8763o386k9900N903L2178K673k2966j726J2707p040j3503M466L711
$$ plain form
499 -9781 -16777 -2819 29738 26498 -8655 -3409 40757 42456 -2524 -11926 19375 12843 -27905
512 -27905 -23084 18496 17172 -14985 -7043 17367 -5767 -35168 -8627 20104 -13004 -48013 -22971
525 -22971 2345 -18930 -20619 26653 38084 -9968 -21421 23282 28337 -14311 -8014 36885 19464
538 19464 -37941 -22596 36993 30318 -10333 9590 38479 -9108 -54975 -9261 38873 -2919
550 -2919 -45270 -6948 18117 -28226 -37428 32983 56353 -7206 -29760 16932 13578 -38652 -12209
563 -12209 62258 37088 -47870 -33657 42672 30415 -25426 8173 60041 3119 -73322 -36837
575 -36837 26558 3252 -26166 11572 15948 -50195 -50526 36002 48493 -27006 -25723 44040 7620
588 7620 -91092 -44313 90511 77609 -44895 -47959 41361 29912 -36540 4734 75360 19768
$$ packed form
499i781o996J3958L2557l240l5153N246M4166J699m4980r402L1301o532m0748
512b7905M821M1580j324l2157P942K4410k3134k9401K6541K8731l3108l5009K5042
525b2971K5316k1275j689M7272J1431m8052j1453M4703N055m2648O297M4899j7421
538A9464n7405J5345N9589o675m0651J9923K8889m7587m5867M5714M8134m1792
550b919m2351L8322K5065m6343r202P0411K3370o3559k2554M6692l354n2230K6443
563a2209P4467k5170q4958J4213P6329j2257n5841L3599N1868n6922p6441L6485
575c6837O3395k3306k9418L7738M376o6143l31Q6528J2491p5499J283O9763l6420
588G620r8712M6779J34824j2902j22504l064Q9320j1449o6452M1274P0626n5592
$$ plain form
600 19768 -61977 -28118 19379 -23324 -30594 59769 72695 -47433 -92688 9785 60193 -4782
612 -4782 -18181 37208 3176 -80338 -34501 66909 34074 -36615 29608 90099 -31993 -134913
624 -134913 635 152312 54055 -107969 -64142 48103 9939 -57478 7336 72599 13931
635 13931 -44028 -23455 -29827 -55225 22971 108394 12570 -130821 -68733 82189 54848 -48088
647 -48088 9414 99397 4732 -114682 -35031 80383 30035 -29872 41970 51377 -89376 -112804
$$ packed form
600A9768q1745L3859M7497m2703p270R0363J2926j20128m5255J02473N0408o4975
612d782j3399N5389l4032q3514M5837J01410l2835p0689O6223O0491j22092j02920
624a34913J35548J51677r8257j62024M3827J12245l8164o7417O4814O5263n8668
635A3931n7959K0573o372k5398P8196Q5423r5824j43391O2088J50922k7341j02936
647d8088N7502Q9983r4665j19414P9651J15414n0348n9907P1842R407j40753k3428
$$ [...]
8191B30
##END NTUPLES=NMR FID
##END=
