##TITLE=1H_LR-675-C-2-3-C2
 CDcl3, 8 sc, 
 31.5.2019
##JCAMPDX= 6.0         $$ Bruker NMR JCAMP-DX V2.0
##DATA TYPE= NMR FID
##DATA CLASS= NTUPLES
##ORIGIN= UXNMR, Bruker Analytische Messtechnik GmbH
##OWNER= root
$$ XWIN-NMR		Version 3.5
$$ Fri May 31 16:25:17 2019 Russian Standard Time (UT+4h)  she@DPX200
##.OBSERVE FREQUENCY= 200.13155
##.OBSERVE NUCLEUS= ^1H
##.DELAY= (6, 6)
##.ACQUISITION MODE= SIMULTANEOUS
##.ACQUISITION SCHEME= undefined
##.AVERAGES= 8
##.DIGITISER RES= 18
##SPECTROMETER/DATA SYSTEM= spect
##.PULSE SEQUENCE= zg30
##.SOLVENT NAME= CDCl3
##.SHIFT REFERENCE= (INTERNAL, CDCl3, 0, 15.7039)
##AUDIT TRAIL= $$ (NUMBER, WHEN, WHO, WHERE, WHAT)
$$ ##TITLE= Audit trail, XWIN-NMR		Version 3.5
$$ ##JCAMPDX= 5.01
$$ ##ORIGIN= Bruker BioSpin GmbH
$$ ##OWNER= she
$$ F:/spectra/data/she/nmr/H-F/1/audita.txt
$$ ##AUDIT TRAIL=  $$ (NUMBER, WHEN, WHO, WHERE, WHAT)
(   1,<2019-05-31 16:24:07.10 +0400>,<she>,<DPX200>,
      <created by zg, POWCHK disabled, PULCHK disabled
       configuration hash MD5:
       00 E9 B6 7A A2 85 ED C7 34 08 36 98 17 FE 4E 26
       data hash MD5: 16K
       24 A6 18 E9 71 3F 98 AE EE 7F AB DA CC 90 9D 20>)
$$ ##END=
$$ 
$$ hash MD5
$$ C5 D6 15 CD B6 80 2B 99 73 41 61 5D 21 11 ED 9F
##$RELAX= 
##$RELAX= 
##$RELAX= 
##$RELAX= 
##$RELAX= 
##$RELAX= 
$$ Bruker specific parameters
$$ --------------------------
##$DU= <F:/spectra>
##$EXPNO= 1
##$NAME= <H-F>
##$PROCNO= 1
##$TYPE= <nmr>
##$USER= <she>
##$AMP= (0..31)
100 100 100 100 100 100 100 100 100 100 100 100 100 100 100 100 100 100 
100 100 100 100 100 100 100 100 100 100 100 100 100 100 
##$AQSEQ= 0
##$AQ_mod= 1
##$AUNM= <au_zg>
##$AUTOPOS= <>
##$BF1= 200.13
##$BF2= 200.13
##$BF3= 200.13
##$BF4= 200.13
##$BF5= 200.13
##$BF6= 200.13
##$BF7= 200.13
##$BF8= 200.13
##$BYTORDA= 1
##$CFDGTYP= 0
##$CFRGTYP= 5
##$CHEMSTR= <none>
##$CNST= (0..31)
1 1 145 1 1 1 1 1 1 1 1 1 1 1 1 1 1 1 1 1 1 1 1 1 1 1 1 1 1 1 1 1 
##$CPDPRG= <>
##$CPDPRG1= <>
##$CPDPRG2= <>
##$CPDPRG3= <>
##$CPDPRG4= <mlev>
##$CPDPRG5= <mlev>
##$CPDPRG6= <mlev>
##$CPDPRG7= <mlev>
##$CPDPRG8= <mlev>
##$CPDPRGB= <>
##$CPDPRGT= <>
##$D= (0..31)
0 1.2 0 0 0 0 0 0 0 0 0 0.03 0 0 0 0 0 0 0 0 0 0 0 0 0 0 0 0 0 0 0 0 
##$DATE= 1559305446
##$DBL= (0..7)
120 120 120 120 120 120 120 120 
##$DBP= (0..7)
150 150 150 150 150 150 150 150 
##$DBP07= 0
##$DBPNAM0= <>
##$DBPNAM1= <>
##$DBPNAM2= <>
##$DBPNAM3= <>
##$DBPNAM4= <>
##$DBPNAM5= <>
##$DBPNAM6= <>
##$DBPNAM7= <>
##$DBPOAL= (0..7)
0.5 0.5 0.5 0.5 0.5 0.5 0.5 0.5 
##$DBPOFFS= (0..7)
0 0 0 0 0 0 0 0 
##$DE= 6
##$DECBNUC= <off>
##$DECIM= 24
##$DECNUC= <off>
##$DECSTAT= 4
##$DIGMOD= 1
##$DIGTYP= 9
##$DL= (0..7)
0 120 120 120 120 120 120 120 
##$DP= (0..7)
150 150 150 150 150 150 150 150 
##$DP07= 0
##$DPNAME0= <>
##$DPNAME1= <>
##$DPNAME2= <>
##$DPNAME3= <>
##$DPNAME4= <>
##$DPNAME5= <>
##$DPNAME6= <>
##$DPNAME7= <>
##$DPOAL= (0..7)
0.5 0.5 0.5 0.5 0.5 0.5 0.5 0.5 
##$DPOFFS= (0..7)
0 0 0 0 0 0 0 0 
##$DQDMODE= 0
##$DR= 18
##$DS= 0
##$DSLIST= <SSSSSSSSSSSSSSS>
$$ [...]
##$SUBNAM2= <"">
##$SUBNAM3= <"">
##$SUBNAM4= <"">
##$SUBNAM5= <"">
##$SUBNAM6= <"">
##$SUBNAM7= <"">
##$SUBNAM8= <"">
##$SUBNAM9= <"">
##$SW= 24.9336996594482
##$SWIBOX= (0..15)
0 0 2 0 0 0 0 0 0 0 0 0 0 0 0 0 
##$SW_h= 4990.01996007984
##$TD= 16384
##$TD0= 1
##$TE= 0
##$TE2= 300
##$TE3= 300
##$TEG= 300
##$TL= (0..7)
0 120 120 120 120 120 120 120 
##$TP= (0..7)
150 150 150 150 150 150 150 150 
##$TP07= 0
##$TPNAME0= <>
##$TPNAME1= <>
##$TPNAME2= <>
##$TPNAME3= <>
##$TPNAME4= <>
##$TPNAME5= <>
##$TPNAME6= <>
##$TPNAME7= <>
##$TPOAL= (0..7)
0.5 0.5 0.5 0.5 0.5 0.5 0.5 0.5 
##$TPOFFS= (0..7)
0 0 0 0 0 0 0 0 
##$TUNHIN= 0
##$TUNHOUT= 0
##$TUNXOUT= 0
##$USERA1= <user>
##$USERA2= <user>
##$USERA3= <user>
##$USERA4= <user>
##$USERA5= <user>
##$V9= 5
##$VALIST= <valist>
##$VCLIST= <CCCCCCCCCCCCCCC>
##$VD= 0
##$VDLIST= <DDDDDDDDDDDDDDD>
##$VPLIST= <PPPPPPPPPPPPPPP>
##$VTLIST= <TTTTTTTTTTTTTTT>
##$WBST= 1024
##$WBSW= 4
##$XGAIN= (0..3)
0 0 0 0 
##$XL= 0
##$YL= 0
##$YMAX_a= 516501
##$YMIN_a= -682817
##$ZGOPTNS= <>
##$ZL1= 120
##$ZL2= 120
##$ZL3= 120
##$ZL4= 120
##$ABSF1= 10
##$ABSF2= 0
##$ABSG= 5
##$ABSL= 3
##$ALPHA= 0
##$AQORDER= 0
##$ASSFAC= 0
##$ASSFACI= 0
##$ASSFACX= 0
##$ASSWID= 0
##$AUNMP= <proc_1d>
##$AZFE= 0.1
##$AZFW= 0.1
##$BCFW= 1
##$BC_mod= 2
##$BYTORDP= 1
##$COROFFS= 0
##$CY= 11.3945322036743
##$DATMOD= 1
##$DC= 2
##$DFILT= <>
##$DTYPP= 0
##$F1P= 18.9103706918063
##$F2P= -1.10871071338519
##$FCOR= 0.5
##$FTSIZE= 0
##$FT_mod= 4
##$GAMMA= 1
##$GB= 0.15
##$INTBC= 1
##$INTSCL= 1
##$ISEN= 128
##$LB= 0.24
##$LEV0= 0
##$LPBIN= 0
##$MAXI= 10000
##$MC2= 0
##$MEAN= 0
##$ME_mod= 0
##$MI= 1.114404
##$NCOEF= 0
##$NC_proc= 0
##$NLEV= 6
##$NOISF1= 3.799351
##$NOISF2= 2.8
##$NSP= 1
##$NTH_PI= 0
##$NZP= 0
##$OFFSET= 15.70392
##$PC= 1
##$PHC0= -8497.275
##$PHC1= 13.00022
##$PH_mod= 1
##$PKNL= yes
##$PPARMOD= 0
##$PSCAL= 0
##$PSIGN= 0
##$REVERSE= no
##$SF= 200.130013532006
##$SI= 16384
##$SIGF1= 3
##$SIGF2= 2
##$SINO= 400
##$SIOLD= 16384
##$SREGLST= <1H.CDCl3>
##$SSB= 0
##$STSI= 0
##$STSR= 0
##$SW_p= 3612.71676300578
##$SYMM= 0
##$S_DEV= 0
##$TDeff= 0
##$TDoff= 0
##$TI= <>
##$TILT= no
##$TM1= 0
##$TM2= 0
##$TOPLEV= 0
##$USERP1= <user>
##$USERP2= <user>
##$USERP3= <user>
##$USERP4= <user>
##$USERP5= <user>
##$WDW= 1
##$XDIM= 8192
##$YMAX_p= 0
##$YMIN_p= 0
$$ End of Bruker specific parameters
$$ ---------------------------------
##NTUPLES= NMR FID
##VAR_NAME=  TIME,          FID/REAL,        FID/IMAG
##SYMBOL=    X,             R,               I
##VAR_TYPE=  INDEPENDENT,   DEPENDENT,       DEPENDENT
##VAR_FORM=  AFFN,          ASDF,            ASDF
##VAR_DIM=   8192,          8192,            8192
##UNITS=     SECONDS,       ARBITRARY UNITS, ARBITRARY UNITS
##FACTOR=    0.0002004,     1,               1
##FIRST=     0,             0,               0
##LAST=      1.6414764,     0,               0
##MIN=       0,             -682817,         0
##MAX=       1.6414764,     516501,          0
$$ Real data points
##PAGE= N=1
##DATA TABLE= (X++(R..R)), XYDATA
$$ plain form
0 0 0 0 0 -8 8 -8 8 -16 24 -32 40 -48 58 -72 88 -105 128 -152 183 -211 249 -292 337 -389 447 -513 584
27 584 -664 752 -853 960 -1078 1211 -1354 1512 -1684 1871 -2083 2311 -2558 2834 -3141 3476
43 3476 -3847 4262 -4729 5254 -5848 6533 -7327 8262 -9382 10752 -12470 14710 -17751
56 -17751 22151 -29112 41842 -72692 300680 107085 -605088 -124883 280345 110238 -150614
67 -150614 112441 196455 -94426 -263097 -15104 117493 80236 106587 93392 -223895 -373319
78 -373319 -56173 204345 -34338 -200800 61347 197873 -118012 -234373 106268 267435
88 267435 19946 -21832 172655 -29919 -445875 -182308 516501 497699 -220854 -444759
98 -444759 52865 302195 4488 -139862 59669 78075 -155268 -217621 -96880 -35009 60488
$$ packed form
0@%%%qJ6j6J6k4M0n6P2q8J06j30J60j93K33k80L35l94M60n41O29p26Q36r60J097
27E84j248J416j605J813k038K289k565K866l196L555l954M394m869N392n975O617
43C476p323Q109q991R983j1102J2381j3860J5589j7644K0134k3222K7180l2461
56a7751L9902n1263P0954j14534L73372j93595p12173M80205M05228j70107k60852
67a50614K63055Q4014k90881j68671K47993J32597l7257K6351j3195l17287j49424
78c73319L17146K60518k38683j66462K62147J36526l15885j16361L40641J61167
88B67435k47489m1778J94487k02574m15956K63567O98809j8802p18553k23905
98d44759M97624K49330k97707j44350J99531J8406k33343o2353J20741O1871R5497
$$ plain form
109 60488 215278 94402 -233559 -191115 190146 203822 -153721 -128147 267394 206448 -292765
120 -292765 -319765 203293 400652 92436 -58605 44839 -65938 -236995 7772 320386
130 320386 89608 -327744 -243570 89494 67279 -115120 -7325 158701 32810 -132823
140 -132823 -82007 -41557 -93436 27048 212215 60393 -225498 -106540 212844 147940 -94797
151 -94797 51113 301394 45603 -370818 -223530 226956 238067 -82005 -147530 -12170
161 -12170 -40295 -82276 83341 163479 -43338 -169753 -19870 41585 -118448 -115700 121415
172 121415 171883 -22674 -64586 70258 49812 -50096 78484 227836 38401 -220086 -121542
183 -121542 101623 53125 -52583 75861 145197 -91433 -240507 -12252 188125 29438
$$ packed form
109F0488J54790j20876l27961M2444L81261J3676l57543K5574L95541o0946m99213
120b92765k7000N23058J97359l08216j51041J03444j10777j71057K44767L12614
130C20386k30778m17352Q4174L33064k2215j82399J07795J66026j25891j65633
140a32823N0816M0450n1879J20484J85167j51822k85891J18958L19384o4904k42737
151i4797J45910K50281k55791m16421J47288M50486J1111l20072o5525J35360
161a2170k8125m1981J65617Q0138k06817j26415J49883O1455j60033K748K37115
172A21415N0468j94557m1912J34844k0446r9908J28580J49352j89435k58487R8544
183a21542K23165m8498j05708J28444O9336k36630j49074K28255K00377j58687
$$ plain form
193 29438 -156548 -83635 -6671 -92733 -85091 78219 100221 -31386 -16301 104283 31754
204 31754 -122002 -30193 158865 94058 -89111 -65869 41836 -8052 -42526 111083 179899
215 179899 -24061 -180762 -56837 69510 -10175 -70007 11447 6021 -120349 -90507 91095
226 91095 109477 -32781 -31903 87071 44281 -95627 -53437 88055 62358 -38884 10602
237 10602 90939 9006 -71009 35489 140624 47575 -78094 -65116 -35392 -71943 -38503
248 -38503 62533 30950 -107398 -98948 48009 73377 -30956 -41326 34426 6395 -78552
259 -78552 -38007 51666 19917 -34805 40077 113588 31595 -58072 7261 87128 29451 -44716
271 -44716 -16015 2821 -60955 -70227 25633 70160 2123 -44516 -16235 -5711 -19996 11443
$$ packed form
193B9438j85986P2913P6964q6062P642J63310K2002j31607J5085J20584p2529
204C1754j53756R1809J89058o4807j83169K3242J07705m9888l4474J53609O8816
215A79899k03960j56701J23925J26347p9685n9832Q1454n426j26370K9842J81602
226I1095J8382j42258Q78J18974m2790j39908M2190J41492k5697j01242M9486
237A0602Q0337q1933q0015J06498J05135r3049j25669J2978K9724l6551L3440
248c8503J01036l1583j38348Q450J46957K5368j04333j0370P5752k8031q4947
259g8552M0545Q9673l1749n4722P4882P3511q1993q9667O5333P9867n7677p4167
271d4716K8701J8836o3776r272R5860M4527o8037m6639K8281J0524j4285L1439
$$ plain form
283 11443 31353 -38498 -91168 -9426 80216 32058 -38413 18563 101783 61367 -17723 -4713
295 -4713 31099 -921 -27470 10381 22409 -33512 -52036 8318 42755 6425 -18381 -9414
307 -9414 -29236 -62858 -38396 7809 -9866 -53701 -34965 17916 28869 17491 31817 34873
319 34873 1797 -6252 30449 31996 -26036 -45157 14470 55553 20563 -17098 -201 22915
331 22915 12640 -943 -4966 -25977 -52884 -42635 -9693 -1729 -12165 -5588 9608 10931 15563
344 15563 34366 31337 -5471 -23090 3902 27740 11740 -7814 3886 25704 31186 28606 21987
357 21987 1691 -20743 -20022 -7501 -16261 -40649 -47065 -29181 -9338 905 5214 423 -10799
370 -10799 -10935 4025 9515 -7170 -23575 -16558 4091 20139 25837 25341 20922 19740 26564 29915
$$ packed form
283A1443J9910o9851n2670Q1742Q9642m8158p0471N6976Q3220m0416p9090J3010
295d713L5812l2020k6549L7851J2028n5921j8524O0354L4437l6330k4806Q967
307i414j9822l3622K4462M6205j7675m3835J8736N2881J0953j1378J4326L056
319C4873l3076q049L6701J547n8032j9121N9627M1083l4990l7661J6897K3116
331B2915j0275j3583m023k1011k6907J0249L2942P964j0436O577J5196J323M632
344A5563J8803l029l6808j7619K6992K3838j6000j9554J1700K1818N482k580o619
357B1987k0296k2434P21J2521q760k4388o416J7884J9843J0243M309m791j1222
370a0799j36J4960N490j6685j6405P017K0649J6048N698m96m419j182O824L351
$$ plain form
384 29915 15025 -10651 -25518 -20751 -8928 -4570 -9279 -14865 -10756 2522 14195 9886 -6888
397 -6888 -20161 -18992 -10116 -3953 -2916 -4277 -890 12542 31131 40572 32430 15123 6004 8786
411 8786 10673 2095 -13315 -22401 -16689 -1548 8000 3810 -6957 -12690 -9830 -7312 -13456 -24651
425 -24651 -32627 -31355 -20766 -4908 6958 8404 5469 10906 24812 30329 19883 1904 -7329
438 -7329 -2667 7157 11622 5175 -3570 658 17394 24190 9161 -9280 -11778 -9431 -17460 -24646
452 -24646 -18531 -11724 -14566 -12326 7449 23599 17620 4875 5507 11580 11340 7374 1831 -7749 -8110
467 -8110 11936 30394 20903 -138 1196 13683 9159 -7068 -13440 -19189 -34120 -33389 -9939 -1262
481 -1262 -19709 -21797 7298 19698 -4893 -17961 2114 10483 -10644 -16209 7025 15430 -748
$$ packed form
384B9915j4890k5676j4867M767J1823M358m709n586M109J3278J1673m309j6774
397f888j3273J169Q876O163J037j361L387J3432J8589R441q142j7307r119K782
411H786J887q578j5410r086N712J5141R548m190j0767n733K860K518o144j1195
425b4651p976J272J0589J5858J1866J446k935N437J3906N517j0446j7979r233
438g329M662R824M465o447q745M228J6736O796j5029j8441k498K347q029p186
452b4646O115O807k842K240J9775J6150n979j2745O32O073k40l966n543r580l61
467h110K0046J8458r491k1041J334J2487m524j6227o372n749j4931P31K3450Q677
481a262j8447k088K9095J2400k4591j3068K0075Q369k1127n565K3234Q405j6178
$$ plain form
494 -748 1480 27225 34926 20398 13917 9503 -9896 -14868 10905 16154 -23914 -42760 -4853 24465
508 24465 -277 -17926 9178 20413 -12915 -26704 2118 7741 -21354 -15618 24926 22668 -14115
521 -14115 -4550 39783 36868 1871 6108 23692 -9134 -42267 -8543 30910 2594 -32655 -9027
534 -9027 12089 -16757 -23677 19982 24203 -35545 -53339 -4187 7834 -31721 -21957 34832 29662
547 29662 -22483 -11889 39498 25331 -16231 12150 49927 -1111 -59638 -15691 48619 24069
559 24069 -15110 15242 29303 -28157 -45770 24755 48975 -24396 -56512 395 14058 -41059
571 -41059 -30872 49663 55290 -16645 -27871 19422 10681 -21818 16143 53120 -6076 -57479
583 -57479 -63 46389 -10735 -33195 55601 78389 -46353 -111131 -6589 70972 -819 -58374
$$ packed form
494g48K228K5745P701j4528o481m414j9399m972K5773N249m0068j8846L7907K9318
508B4465k4742j7649K7104J1235l3328j3789K8822N623k9095N736M0544k258l6783
521a4115R565M4333k915l4997M237J7584l2826l3133L3724L9453k8316l5249K3628
534i027K1116k8846o920M3659M221n9748j7794M9152J2021l9555R764N6789n170
547B9662n2145J0594N1387j4167m1562K8381L7777n1038n8527M3947O4310k4550
559B4069l9179L0352J4061n7460j7613P0525K4220p3371l2116N6907J3663n5117
571d1059J0187Q0535N627p1935j1226M7293q741l2499L7961L6977n9196n1403
583e7479N7416M6452n7124k2460Q8796K2788j24742o4778J04542P7561p1791n7555
$$ plain form
595 -58374 -6136 12923 -48268 -43028 41835 48994 -19504 -14719 32053 -13974 -74611 -3527 90819
608 90819 40397 -51568 -22200 35495 212 -17883 56963 71986 -33186 -70392 13570 25224
620 25224 -60141 -29696 100515 68208 -107108 -116720 57611 111093 -12332 -60173 17995
631 17995 25105 -51053 -42732 32309 37668 13179 37730 19138 -74477 -64865 80628 115713 -30000
644 -30000 -97623 3409 38467 -59710 -56969 75994 85323 -51310 -82535 10046 9844 -54165
656 -54165 12926 108022 4705 -148531 -74938 98009 80609 -38525 -14517 68896 16500
667 16500 -72248 -32436 42266 37797 31626 40062 -42541 -128539 -18847 153180 90560 -97360
679 -97360 -74718 77143 29790 -126496 -59599 131603 100050 -84151 -101183 14223 27356
$$ packed form
595e8374N2238J9059o1191N240Q4863P159o8498M785M6772m6027o0637P1084R4346
608I0819n0422r1965K9368N7695l5283j8095P4846J5023j05172l7206Q3962J1654
620B5224q5365L0445J30211l2307j75316r612J74331N3482j23425m7841P8168
631A7995P110p6158Q321P5041N359k4489K4551j8592r3615R612J45493L5085j45713
644c0000o7623J01032L5058r8177K741J32963R329j36633l1225R2581k02o4009
656e4165O7091R5096j03317j53236P3593J72947j7400j19134K4008Q3413n2396
667A6500q8748L9812P4702m469o171Q436q2603q5998J09692J72027o2620j87920
679i7360K2642J51861m7353j56286O6897J91202l1553j84201j7032J15406J3133
$$ plain form
690 27356 -6493 58168 86740 -38988 -114216 -4216 74214 -6865 -39702 61358 70655 -68150
702 -68150 -106005 16132 73561 18818 13270 23259 -77155 -137186 11304 144075 24804
713 24804 -114600 -13164 101135 -26763 -146516 8974 181089 67964 -120662 -91243
723 -91243 25083 25886 10029 65470 51418 -51471 -54887 32398 17068 -51111 23834 123533
735 123533 10242 -158533 -89887 87638 80235 -20474 6666 44244 -59463 -111236 31108
746 31108 121037 1609 -75038 29291 56057 -89319 -105780 92954 168010 -5210 -118981
757 -118981 -32454 28289 -18510 -1783 69275 21977 -73928 -40399 24034 -28163 -47434 82413
769 82413 123447 -62372 -176899 -22319 118507 28617 -57153 28444 62244 -63946 -96680
$$ packed form
690B7356l3849O4661K8572j25728p5228J10000P8430q1079l2837J01060R297j38805
702f8150l7855J22137N7429n4743n548R989j00414o0031J48490J32771j19271
713B4804j39404J01436J14299j27898j19753J55490J72115j13125j88626K9419
723i1243J16326Q03j5857N5441j4052j02889l416Q7285j5330o8179P4945R9699
735A23533j13291j68775O8646J77525p403j00709K7140L7578j03707n1773J42344
746C1108Q9929j19428p6647J04329K6766j45376j6461J98734P5056j73220j13771
757a18981Q6527O0743m6799J6727P1058m7298r5905L3529O4433n2197j9271J29847
769H2413M1034j85819j14527J54580J40826q9890q5770Q5597L3800j26190l2734
$$ plain form
780 -96680 47957 107110 4203 -29135 37976 -4035 -108242 -35722 124545 92652 -61004
791 -61004 -66336 23456 -751 -53384 28442 101034 4625 -90211 -31183 22533 -32152 -18760
803 -18760 100403 83550 -89223 -122069 36726 93865 -14333 -33460 60885 31663 -98445
814 -98445 -77071 63601 75365 -15174 -9707 31512 -41030 -98001 10493 107446 21726 -74385
826 -74385 -20239 25501 -47339 -56682 67578 101356 -26034 -83334 1732 28855 -34145 -3008
838 -3008 92506 43920 -87641 -66477 51925 47064 -25306 15332 73948 -11677 -103262 -26117
850 -26117 75348 29665 -34235 13204 33492 -55425 -76268 40448 91538 -1439 -50297 7232
862 7232 8354 -58284 -25132 78413 58833 -49179 -50321 24800 9715 -40361 15813 79665
$$ packed form
780i6680J44637N9153j02907l3338O7111m2011j04207P2520J60267l1893j53656
791f1004n332Q9792k4207n2633Q1826P2592r6409r4836N9028N3716n4685J3392
803a8760J19163j6853j72773l2846J58795N7139j08198j9127R4345k9222j30108
814i8445K1374J40672J1764r0539N467M1219p2542n6971J08494R6953q5720r6111
826g4385N4146M5740p2840r343J24260L3778j27390n7300Q5066K7123o3000L1137
838c008R5514m8586j31561K1164J18402m861p2370M0638N8616q5625r1585P7145
850b6117J01465m5683o3900M7439K0288q8917k0843J16716N1090r2977m8858N7529
862G232J122o6638L3152J03545j9580j08012j142P5121j5085n0076N6174O3852
$$ plain form
874 79665 6936 -83617 -37835 36324 5755 -25757 31301 46369 -43466 -76348 12818 56593
886 56593 -6349 -25426 32752 18794 -65975 -50539 53183 65020 -13742 -25504 20545 1189
898 1189 -40537 5204 63791 19090 -41653 -10931 23603 -18880 -33693 39654 65266 -18123
910 -18123 -62913 -1846 33489 -11528 -18789 35022 26055 -45274 -43584 25338 31160 -14655 -1019
923 -1019 36908 -2859 -57964 -16590 48678 24253 -29038 -10258 17856 -14540 -33825 13969
935 13969 40282 -4121 -28824 3470 5751 -32938 -18475 39748 31108 -33484 -35607 18402 20701
948 20701 -17045 -3575 35400 12623 -34142 -17613 22720 12987 -8819 12081 24199 -12588
960 -12588 -29507 11152 33433 -307 -17978 9434 12699 -21931 -21771 18810 23907 -10434 -13938
$$ packed form
874G9665p2729r0553M5782P4159l0569l1512N7058J5068q9835l2882Q9166M3775
886E6593o2942j9077N8178j3958q4769J5436J03722J1837p8762j1762M6049j9356
898A189m1726M5741N8587m4701o0743L0722L4534m2483j4813P3347K5612q3389
910a8123m4790O1067L5335m5017p261N3811q967p1329J690O8922N822m5815J3636
923a019L7927l9767n5105M1374O5268k4425n3291J8780K8114l2396j9285M7794
935A3969K6313m4403k4703L2294K281l8689J4463N8223q640o4592k123N4009K299
948B0701l7746J3470L8975k2777m6765J6529M0333r733k1806K0900J2118l6787
960a2588j6919M0659K2281l3740j7671K7412L265l4630J60M0581N097l4341l504
$$ plain form
973 -13938 10219 1908 -21074 -1833 27430 6805 -25898 -11972 14772 264 -16059 6205
985 6205 22741 -3506 -23888 -1724 14427 -3376 -12008 6856 7627 -16581 -16750 9442 11512
998 11512 -8721 -5813 12006 2503 -18323 -6785 16744 8575 -12083 -3825 11695 1669 -9222
1011 -9222 5702 18619 3563 -8533 1500 8192 -2708 -4517 9168 8894 -7299 -7692 8339
1024 8339 8190 -6534 -4113 8988 4890 -10219 -8082 4624 3496 -4750 -2017 3990 -1617 -6372
1038 -6372 1432 6547 -2182 -7085 98 3194 -5451 -8006 1671 4924 -3071 -6446 -96 2183 -2473
1053 -2473 -3022 1035 -972 -5040 -1848 2885 -427 -3968 1262 6595 2335 -3133 406 5452 3872
1068 3872 -652 303 2774 2353 1638 2809 3047 1258 2303 3483 1777 -1671 -285 2548 751 -2265
$$ packed form
973a3938K4157q311k2982J9241K9263k0625l2703J3926K6744j4508j6323K2264
985F205J6536k6247k0382K2164J6151j7803q632J8864P71k4208j69K6192K070
998A1512k0233K908J7819r503k0826J1538K3529q169k0658Q258J5520j0026j0891
1011i222J4924J2917j5056j2096J0033O692j0900j809J3685k74j6193l93J6031
1024H339j49j4724K421J3101m098j5109K137J2706j128q246K733O007n607m755
1038f372P804N115q729m903P183L096q645k555R677L253p995l375O350K279m656
1053b473n49M057k007m068L192M733l312l541N230N333m260n468L539N046j580
1068C872m524R55K471m21p15J171K38j789J045J180j706l448J386K833j797l016
$$ plain form
1084 -2265 -2039 943 1717 -1171 -1825 -520 1148 -299 -1535 -1726 -2214 -1303 -479 -1165 -2314 -1467 -108
1101 -108 -112 -2244 -2058 -700 -487 -2013 -2878 -1620 -1004 -1221 -2048 -663 633 772 -101 -584 -1 617 1132
1120 1132 1228 408 391 2644 2818 1755 925 2492 3050 2264 1645 1809 1345 701 1392 1984 243 -1106 940
1139 940 2765 108 -2267 -180 3013 -235 -4156 -2334 1415 99 -2412 -1766 -588 -1651 -1455 857
1155 857 -684 -4160 -1951 1922 -894 -6150 -3006 3652 785 -5884 -3131 2906 161 -4550 -138
1170 -138 4149 -1468 -5509 706 4885 -653 -2714 4342 5682 -2664 -3916 5991 6629 -1160 -905 6842
1186 6842 3211 -6028 -1239 10418 5323 -5795 -1434 7356 842 -7585 958 9669 84 -8201
1200 -8201 -291 4525 -5617 -6248 8914 8256 -10791 -12946 5694 8209 -7862 -7456 8315 4866
$$ packed form
1084b265K26K982P74k888o54J305J668j447j236j91m88R11Q24o86j149Q47J359
1101a08mk132J86J358K13j526q65J258O16k17q27J385J296J39q73m83N83O18N15
1120A132R6q20j7K253J74j063q30J567N58p86o19J64m64o44O91N92j741j349K046
1139I40J825k657k375K087L193l248l921J822L749j316k511O46J178j063J96K312
1155H57j541l476K209L873k816n256L144O658k867o669K753O037k745m711M412
1170a38M287n617m041O215M179n538k061P056J340q346j252R907O38p789K55P747
1186F842l631r239M789J1657n095j1118M361Q790o514q427Q543Q711r585q285
1200h201P910M816j0142o31J5162o58j9047k155J8640K515j6071M06J5771l449
$$ plain form
1214 4866 -12628 -9380 6811 3965 -7045 1469 8501 -8561 -18223 3891 18951 -1472 -16460
1227 -16460 1805 13113 -6688 -15392 7575 17880 -1527 -9923 3241 1483 -9960 4038
1239 4038 24392 5566 -23232 -7209 22129 8033 -18222 -344 26754 5999 -25167 -11004
1251 -11004 15712 8510 -3951 7497 5538 -20241 -16363 19474 20136 -16275 -16632 17895 11178
1264 11178 -28982 -22212 24218 26577 -12979 -20141 1180 -2623 -11958 11339 24734 -10150 -31268
1277 -31268 3852 23203 -13520 -27205 21474 39927 -14081 -46139 -3546 29994 8166 -6224
1289 -6224 9494 549 -25347 -6967 28815 11010 -21300 4996 35001 -8293 -51257 -3761
1301 -3761 56215 25606 -32233 -19603 13553 -1956 -13326 18940 26875 -14686 -23310 13758
$$ packed form
1214D866j7494L248J6191k846j1010Q514P032j7062r662K2114J5060k0423j4988
1227a6460J8265J1308j9801q704K2967J0305j9407q396J3164j758j1443J3998
1239D038K0354j8826k8798J6023K9338j4096k6255J7878K7098k0755l1166J4163
1251a1004K6716p202j2461J1448j959k5779L878L5837O62l6411l57L4527o717
1264A1178m0160O770M6430K359l9556p162K1321l803r335K3297J3395l4884k1118
1277c1268L5120J9351l6723j3685M8679J8453n4008l2058M2593L3540k1828j4390
1289f224J5718q945k5896J8380L5782j7805l2310K6296L0005m3294m2964M7496
1301c761N9976l0609n7839J2630L3156j5509j1370L2266P935m1561q624L7068
$$ plain form
1313 13758 8174 -33836 -9800 53467 30799 -50792 -49975 22385 35384 -10366 -11018 19648 -1920
1326 -1920 -36415 -8426 25227 897 -14612 23379 23395 -44709 -55478 30069 67717 -3748 -47973
1339 -47973 -2361 21808 -18192 -21058 29832 32369 -15858 -19069 9349 -10505 -30401 25271
1351 25271 68381 366 -71697 -23388 48548 20153 -27478 7858 41005 -9721 -49179 -4643
1363 -4643 31685 6122 498 29174 -538 -63110 -31124 58105 49554 -32681 -33542 25169 7998
1376 7998 -48255 -15233 53048 30873 -30777 -22350 3984 -21739 -21121 45785 55707 -32820 -68046
1389 -68046 6186 42323 -15431 -27119 40036 41815 -41914 -59162 12660 38044 1952 6297
1401 6297 27790 -19848 -63482 -2232 65622 21600 -37162 949 35280 -25081 -59336 20146
$$ packed form
1313A3758n584m2010K4036O3267k2668q1591Q17P2360J2999m5750o52L0666k1568
1326a920l4495K7989L3653k4330j5509L7991J6o8104j0769Q5547L7648p1465m4225
1339d7973M5612K4169m0000k866N0890K537m8227l211K8418j9854j9896N5672
1351B5271M3110o8015p2063M8309P1936k8395m7631L5336L3147n0726l9458M4536
1363d643L6328k5563n624K8676k9712o2572L1986Q9229q551q2235q61N8711j7171
1376G998n6253L3022O8281k2175o1650Q427K6334k5723O18O6906R922q8527l5226
1389f8046P4232L6137n7754j1688O7155J779q3729j7248P1822K5384l6092M345
1401F297K1493m7638m3634O1250O7854m4022n8762L8111L4331o0361l4255P9482
$$ plain form
1413 20146 75450 13117 -43738 -11825 8844 -25119 -8692 57095 40021 -44347 -46331 21418
1425 21418 17866 -31047 1711 62048 15105 -69386 -42742 33586 26514 -10858 13741 26652
1437 26652 -35569 -59979 13186 54244 -985 -26629 21128 16017 -56357 -45858 50250 64007
1449 64007 -18072 -40750 8001 2007 -38027 2335 64150 23019 -50223 -27135 23270 -3444
1461 -3444 -26382 33485 61744 -18013 -70070 -7478 42657 3743 -11138 35726 25205 -51740
1473 -51740 -49238 33604 47511 -11406 -10558 30553 -5478 -63305 -15790 63757 35541 -34131
1485 -34131 -18551 17785 -19498 -43291 23715 64592 -2028 -53354 -10521 18459 -20435 -18122
1497 -18122 46032 41668 -39785 -53824 12654 25804 -15236 1331 45557 4681 -63712 -30007
$$ packed form
1413B0146N5304o2333n6855L1913K0669l3963J6427O5787j7074q4368j984O7749
1425B1418l552m8913L2758O0337m6943q4491K6644P6328p072l7372K4599J2911
1437B6652o2221k4410P3165M1058n5229k5644M7757n111p2374J0499R6108J3757
1449F4007q2079k2678M8751n994m0034M0362O1815m1131p3242K3088N0405k6714
1461c444k2938N9867K8259p9757n2057O2592N0135l8914j4881M6864j0521p6945
1473e1740K502Q2842J3907n8917Q48M1111l6031n7827M7515P9547k8216o9672
1485c4131J5580L6336l7283k3793O7006M0877o6620n1326M2833K8980l8894K313
1497a8122O4154m364q1453j4039O6478J3150m1040J6567M4226m0876o8393L3705
$$ plain form
1509 -30007 43298 28199 -19988 3450 30532 -20970 -55786 6684 57848 12462 -28079 4094
1521 4094 12981 -34619 -28413 45397 53317 -20230 -39545 11332 13485 -28089 -3944 53105 25120
1534 25120 -44623 -32899 20311 9843 -16594 18388 40989 -17638 -58270 -4651 40897 3156
1546 3156 -22036 17762 22900 -36849 -45750 21879 44177 -5609 -20351 12079 -324 -40597
1558 -40597 -11500 47113 26830 -31425 -20100 18803 -2939 -31621 10868 49493 5015 -42832
1570 -42832 -13741 19839 -2025 -11458 26338 27832 -25977 -36635 14212 27880 -9691 -7433
1582 -7433 29218 11351 -40041 -24644 31920 29048 -12677 -7839 16627 -6618 -31115 3787
1594 3787 37178 6821 -25654 -3124 12597 -17101 -22489 22306 33419 -13567 -32573 1575
$$ packed form
1509c0007P3305j5099m8187K3438K7082n1502l4816O2470N1164m5386m0541L2173
1521D094Q887m7600O206P3810P920p3547j9315N0877K153m1574K4145N7049k7985
1534B5120o9743J1724N3210j0468k6437L4982K2601n8627m0632N3619M5548l7741
1546C156k5192L9798N138n9749q901O7629K2298m9786j4742L2430j2403m0273
1558d0597K9097N8613k0283n8255J1325L8903k1742k8682M2489L8625m4478m7847
1570d2832K9091L3580k1864r433L7796J494n3809j0658N0847J3668l7571K258
1582g433L6651j7867n1392J5397N6564k872m1725M838K4466k3245k4497L4902
1594C787L3391l0357l2475K2530J5721k9698n388M4795J1113m6986j9006L4148
$$ plain form
1606 1575 13243 -12734 -7413 24606 11834 -29100 -20824 16483 10862 -13353 3692 24519 -5014
1619 -5014 -34198 -5281 28071 8227 -15714 2668 13704 -13606 -21570 13056 26166 -3303
1631 -3303 -14361 7018 5950 -17979 -6980 24922 16873 -17006 -13368 12777 5924 -12656 3694
1644 3694 23802 3280 -21935 -6262 14508 1679 -9571 8036 14097 -11142 -19647 5463
1656 5463 15088 -4394 -9370 7810 4130 -18152 -12537 12901 11356 -9956 -7595 7522 -46
1669 -46 -13900 -303 15843 3003 -13413 -3361 7959 -2839 -8823 7640 13985 -4322 -12815
1682 -12815 3002 9287 -3503 -4993 8202 6183 -9211 -7511 7596 6893 -4272 163 9575
1695 9575 774 -10635 -98 12399 3480 -7747 203 7908 -1043 -7243 3466 9826 -111 -6502
$$ packed form
1606A575J1668k5977N321L2019j2772m0934Q276L7307n621k4215J7045K0827k9533
1619e014k9184K8917L3352j9844k3941J8382J1036k7310p964L4626J3110k9469
1631c303j1058K1379j068k3929J0999L1902q049l3879L638K6145o853j8580J6350
1644C694K0108k0522k5215J5673K0770j2829j1250J7607O061k5239q505K5110
1656E463R625j9482m976J7180l680k2282N615K5438j545k1312K361J5117p568
1669d6j3854J3597J6146j2840j6416J0052J1320j0798n984J6463O345j8307q493
1682a2815J5817O285j2790j490J3195k019j5394J700J5107p03j1165M435R412
1695I575q801j1409J0537J2497q919j1227P950P705q951o200J0709O360r937o391
$$ plain form
1709 -6502 1147 2857 -5341 -4325 4845 2673 -7458 -5948 3266 1583 -6156 -2115 5222 -229 -7978
1724 -7978 -3474 3597 138 -4652 269 3913 -1610 -4547 2337 5512 -882 -3745 2377 3364 -2818
1739 -2818 -3306 3105 4100 -1281 -1268 2534 2092 -1052 18 3129 896 -2748 -243 2843 418 -1139
1755 -1139 2345 4410 935 -987 1944 3600 181 -1825 676 1453 -1391 -2338 279 1170 -1316 -1287
1771 -1287 59 -438 -2502 -2417 -1054 -1830 -3557 -2795 -243 -839 -2050 -511 869 342 -1119 -411 576
1788 576 -35 -484 165 183 -69 497 1473 1671 375 484 1887 1107 -674 -854 240 443 -515 128 1207
1807 1207 1131 1017 1692 2390 977 601 841 1339 161 -593 439 1520 459 677 1257 1071 3 -361
1825 -361 103 -1256 -2677 -2490 -775 -1897 -2825 -2065 -314 -363 -1745 -1213 -557 -1504 -1675 -430 -605 -1979
$$ packed form
1709f502P649J710q198J016R170k172j0131J510R214j683p739M041P337n451p749
1724g978M504P071l459m790M921L644n523k937O884L175o394k863O122R87o182
1739b818m88O411R95n381J3L802m42l144J070L111k233l644K505L086k425j557
1755a139L484K065l475j922K931J656l419k006K501P77k844r47K617Q91k486K9
1771a287J346m97k064Q5J363p76j727P62K552n96j211J539J380n27j461P08R87
1788E76o11m49O49J8k52N66R76J98j296J09J403p80j781j80J094K03r58O43J079
1807A207p6j14O75O98j413l76K40M98j178p54J032J081j061K18N80j86j068l64
1825c61M64j359j421J87J715j122r28P60J751m9j382N32O56r47j71J245j75j374
$$ plain form
1843 -1979 -763 1778 1607 -1283 -309 3677 3651 -675 -1062 1483 1159 -1634 -488 1620 464 -1196
1859 -1196 1607 3389 -218 -2186 2264 4628 -1028 -4202 -71 3462 964 -565 1711 2112 213
1874 213 1504 3681 -265 -3527 1766 5510 -2307 -9337 -1950 7767 2028 -7660 -4116 4343 991
1889 991 -5670 -3621 1124 -1190 -3859 -831 -1209 -5558 -1510 7825 4590 -6661 -4915 5633 5041
1904 5041 -4249 -2273 5366 2004 -4356 -33 5200 -616 -2658 7819 8789 -8207 -13001 5732
1918 5732 15135 -2382 -13369 1173 11141 -277 -8727 1914 9362 3361 -1088 -402 -4620 -5405
1932 -5405 7070 13358 -3491 -14760 1619 14372 -1608 -13574 2877 14793 -3080 -17346
1944 -17346 -4253 6649 -2735 -5636 7333 3725 -15602 -11369 13055 12621 -10797 -11272 9440
$$ packed form
1843a979J216K541j71k890R74L986k6m326l87K545l24k793J146K108j156j660
1859a196K803J782l607j968M450K364n656l174M131L533k498j529K276M01j899
1874B13J291K177l946l262N293L744p817p030P387R717n739r688L544Q459l352
1889I91o661K049M745k314k669L028l78m349M048R335l235j1251J746J0548n92
1904E041r290J976P639l362o360M323N233n816k042J0477R70j6996m794J8733
1918E732R403j7517j0987J4542R968j1418q450J0641P448o001m449O86m218p85
1932e405J2475O288j6849j1269J6379J2753j5980j1966J6451J1916j7873j4266
1944a7346J3093J0902r384k901J2969l608j9327M233K4424m34k3418m75K0712
$$ plain form
1957 9440 7139 -13144 -10471 10883 12699 -749 -2439 53 -7166 -2860 16556 13768 -13608 -15802
1971 -15802 11794 14633 -15243 -15741 19997 24910 -12234 -25527 3370 16479 -941 -4365 9091
1984 9091 1468 -16052 -4682 16094 6147 -9625 4750 16403 -7093 -24213 914 22252
1996 22252 4151 -12495 -1832 1044 -14477 -6558 20946 12554 -20295 -14203 15268 3346 -27886
2009 -27886 -8327 33747 17178 -29953 -24792 15443 17070 -5883 -97 14327 -2925 -19342
2021 -19342 -422 14027 -1912 -3850 18823 10791 -26708 -22304 22882 28531 -9692 -15894 10523
2034 10523 3354 -24604 -6722 29588 15178 -19891 -8425 16385 -4589 -24234 11281 39280
2046 39280 1373 -37290 -11825 20386 4021 -10930 11824 18692 -14558 -24401 4758 11779
$$ packed form
1957I440k301k0283K673K1354J816j3448j690K492p219M306J9416k788k7376k194
1971a5802K7596K839k9876m98L5738M913l7144j3293K8897J3109j7420l424J3456
1984I091p623j7520J1370K0776r947j5772J4375J1653k3496j7120K5127K1338
1996B2252j8101j6646J0663K876j5521P919K7504q392l2849O092K9471j1922l1232
2009b7886J9559M2074j6569m7131N161M0235J627k2953N786J4424j7252j6417
2021a9342J8920J4449j5939j938K2673q032l7499M404M5186N649l8223o202K6417
2034A0523p169k7958J7882L6310j4410l5069J1466K4810k0974j9645L5515K7999
2046C9280l7907l8663K5465L2211j6365j4951K2754O868l3250r843K9159P021
$$ plain form
2058 11779 -8417 304 22299 -4099 -41427 -15473 33461 19214 -20947 -7659 19667 -5972
2070 -5972 -34015 702 37438 10075 -23478 -4538 12145 -13074 -15833 27129 35322 -13449
2082 -13449 -31670 4320 15460 -11436 -4848 28923 13693 -30724 -22443 17317 12543 -10686
2094 -10686 9740 26530 -13395 -43131 -1475 36878 7641 -20056 7276 18687 -21156 -31221
2106 -31221 19149 38906 -3473 -23293 3535 3532 -26316 -9619 35132 22446 -26731 -23734 11419
2119 11419 2120 -20360 8137 34956 -2425 -41255 -12820 21449 1944 -11916 19884 25132
2131 25132 -23489 -37115 11535 33112 -1066 -11060 16311 5788 -33486 -18049 33036 28869
2143 28869 -14124 -11614 14017 -6157 -31116 4189 42134 9760 -32369 -12535 13795 -6343
$$ packed form
2058A1779k0196Q721K1995k6398l7328K5954M8934j4247m0161J3288K7326k5639
2070e972k8043L4717L6736k7363l3553J8940J6683k5219k759M2962Q193m8771
2082a3449j8221L5990J1140k6896O588L3771j5230m4417Q281L9760m774k3229
2094a0686K0426J6790l9925k9736M1656L8353k9237k7697K7332J1411l9843j0065
2106c1221N0370J9757m2379j9820K6828lk9848J6697M4751j2686m9177K997L5153
2119A1419r299k2480K8497K6819l7381l8830K8435L4269j9505j3860L1800N248
2131B5132m8621j3626M8650K1577l4178r994K7371j0523l9274J5437N1085m167
2143B8869m2993K510K5631k0174k4959L5305L7945l2374m2129J9834K6330k0138
$$ plain form
2155 -6343 -14870 23434 33310 -14452 -34572 2345 17297 -8795 -4620 29313 12455 -36737 -27506
2168 -27506 22656 22456 -11264 -1867 19933 -9387 -40113 -6230 33564 10134 -20619 -238
2180 -238 13097 -20644 -28739 20886 40337 -4605 -29424 -85 10138 -15875 -8396 31154 23037
2193 23037 -21335 -21227 11942 7962 -12183 10220 33362 -3131 -41041 -11402 27084 8706
2205 8706 -14383 9709 21807 -17364 -34363 8158 31556 813 -14747 7892 5073 -27125
2217 -27125 -16010 29776 27733 -14352 -17621 9744 1260 -21378 1331 31518 7229 -28138
2229 -28138 -12950 11123 -4247 -12816 18172 26097 -17032 -35051 2856 21702 -5979 -12447
2241 -12447 17957 13811 -25913 -24114 18166 24224 -4860 -4650 14268 -2526 -25995 -2380 30108
$$ packed form
2155f343q527L8304R876m7762k0120L6917J4952k6092M175L3933j6858m9192R231
2168b7506N0162k00l3720R397K1800k9320l0726L3883L9794k3430l0753K0381
2180b38J3335l3741q095M9625J9451m4942k4819K9339J0223k6013P479L9550q117
2193B3037m4372J08L3169l980k0145K2403K3142l6493l7910K9639L8486j8378
2205H706k3089K4092J2098l9171j6999M2521K3398l0743j5560K2639k819l2198
2217b7125J1115M5786k043m2085l269K7365q484k2638K2709L0187k4289l5367
2229b8138J5188K4073j5370q569L0988P925m3129j8019L7907J8846k7681o468
2241a2447L0404m146l9724J799M2280O058k9084K10J8918j6794k3469K3615L2488
$$ plain form
2254 30108 11396 -17271 -3365 13025 -8870 -19157 14463 30355 -4096 -24830 -1434 9999
2266 9999 -10676 -8355 21577 16611 -20303 -20847 12132 13524 -9484 -1379 20702 2482 -27791
2279 -27791 -12193 19202 10553 -10282 914 12082 -9862 -21642 5523 21587 -1708 -15863
2291 -15863 1990 5287 -16968 -13687 17665 19361 -11656 -15940 7280 6622 -11688 -1820 20406
2304 20406 7549 -18072 -9690 12466 5428 -7244 7731 18102 -4561 -19511 1435 16192
2316 16192 -89 -9288 6673 8442 -13466 -14214 11001 15402 -4875 -7796 7154 1809 -14570
2329 -14570 -4388 15662 7164 -12792 -6296 8718 -348 -10217 4815 15717 -936 -14870 -2356
2342 -2356 7226 -3734 -7178 6948 7812 -10035 -12378 5718 8601 -5605 -4499 8208 2104 -13691
$$ packed form
2254C0108j8712k8667J3906J6390k1895j0287L3620J5892l4451k0734K3396J1433
2266I999k0675K321K9932m966l6914n44L2979J392k3008Q105K2081j8220l0273
2279b7791J5598L1395q649k0835J1196J1168k1944j1780K7165J6064k3295j4155
2291a5863J7853L297k2255L281L1352J696l1017m284K3220o58j8310R868K2226
2304B0406j2857k5621Q382K2156p038j2672J4975J0371k2663j4950K0946J4757
2316A6192j6281r199J5961J769k1908p48K5215M401k0277k921J4950n345j6379
2329a4570J0182K0050q498j9956O496J5014r066r869J5032J0902j6653j3934J2514
2342b356R582j0960l444J4126Q64j7847k343J8096K883j4206J106J2707o104j5795
$$ plain form
2356 -13691 -6696 10037 7038 -5940 -1560 7941 415 -7497 3135 12452 1922 -6987 745 5717
2370 5717 -3631 -5440 7468 9522 -3999 -7290 3746 5002 -4511 -3274 6447 2497 -8683 -5434
2384 -5434 4840 3011 -4250 585 6723 -543 -7330 -159 6535 -80 -5368 326 3356 -3412 -5284
2399 -5284 3100 5292 -2092 -4357 1584 1025 -5413 -3809 3324 1326 -5664 -3459 3053 1219 -2618
2414 -2618 761 5442 930 -3768 -2 4035 381 -1743 2400 4134 -532 -1184 3479 4455 204
2429 204 -1080 2262 1496 -3219 -2031 2199 1358 -2576 -1600 1980 699 -1917 -657 2223 -107 -2668
2445 -2668 -1060 870 -745 -1783 655 1790 -398 -1421 1145 1183 -1189 -1440 61 -370 -2519 -2190
2461 -2190 -26 -14 -1542 -812 927 -31 -1495 -876 1099 -758 -1767 -365 1166 845 339 1434 2446
$$ packed form
2356a3691O995J6733k999j2978M380R501p526p912J0632R317j0530q909P732M972
2370E717r348j809J2908K054j3521l291J1036J256r513J237R721l950j1180L249
2384e434J0274j829p261M835O138p266o787P171O694o615n288N694L030o768j872
2399e284Q384K192p384k265N941n59o438J604P133j998o990K205O512j834l837
2414b618L379M681m512m698L766M037l654k124M143J734m666o52M663R76m251
2429B04j284L342p66m715J188M230q41l934R76L580j281k616J260K880k330k561
2445b668J608J930j615j038K438J135k188j023K566L8k372k51J501m31k149L29
2461b190K164J2j528P30J739r58j464O19J975j857j009J402J531l21n06J095J012
$$ plain form
2478 2446 1777 878 1981 2249 511 352 1126 1027 -122 -20 810 1240 282 202 576 71 -469 -547 -949 -1779
2498 -1779 -1466 -241 375 -760 -1052 525 1759 18 -1282 -461 583 -430 -1393 -1179 -259 -225 -253 306
2516 306 -102 -826 -274 95 -886 -2361 -1625 -458 -262 -1364 -725 31 933 1629 1747 618 -684 1102
2534 1102 2779 1076 -1872 -520 3531 3352 -520 -1177 2682 4223 1040 -1653 -755 507 199 -892
2550 -892 -1039 -1731 -510 1412 549 -2316 -1859 1795 1830 -2127 -3383 -245 1192 -1110 -1009 1159 285
2567 285 -1963 778 3202 -547 -4476 -336 3783 -397 -6512 -3044 3792 2685 -3178 -3228 1129 1457
2583 1457 354 -491 -1344 -1329 1526 3125 -1374 -4953 1734 9103 3786 -4756 -1656 6770 4250 -3685
2599 -3685 -1511 4574 1534 -3736 -528 3503 -327 -2638 3176 4490 -4195 -7488 1047 5513 -1353
$$ packed form
2478B446o69q99J103K68j738j59P74r9j149J02Q30M30r58q0L74n05n40p8m02q30
2498a779L13J225O16j135k92J577J234j741j300Q21J044j013r63K14R20L4k8N59
2516C06m08p24N52L69r81j475P36J167J96j102O39P56R02O96J18j129j302J786
2534A102J677j703k948J352M051j79l872o57L859J541l183k693Q98J262l08j091
2550h92j47o92J221J922q63k865M57L654L5l957j256L138J437k302J01K168q74
2567B85k248K741K424l749l929M140M119m180o115L468O836j107n863n0M357L28
2583A457j103q45q53J5K855J599m499l579O687P369n317q542L100Q426k520p935
2599c685K174O085l040n270L208M031l830k311N814J314q685l293Q535M466o866
$$ plain form
2614 -1353 -5815 -505 1768 -2026 -1771 2426 922 -1795 2440 3279 -5907 -8320 4203 10645 -2658
2629 -2658 -11789 -813 9639 -23 -8487 1008 8892 -679 -8918 -2062 3064 -1284 -804 5349 1699
2644 1699 -7404 -2711 8682 5263 -4843 -249 7639 152 -8472 -90 9100 2765 -3293 3513
2658 3513 4994 -7187 -6951 9780 11783 -7181 -12270 3927 7837 -7297 -8737 8407 10521 -6373
2672 -6373 -10458 1226 3330 -2528 1400 6396 -4040 -12549 24 10044 -914 -7139 5960
2685 5960 9766 -8746 -14681 4635 13189 -2204 -8498 3651 3025 -11327 -6021 14050 10535 -9682
2699 -9682 -8045 8027 2479 -11715 -972 16852 5859 -12614 -6025 8136 1888 -3311 9206
2712 9206 11756 -8275 -13934 4889 10241 -5558 -4818 12901 6900 -17727 -12842 13183 13330 -7236
$$ packed form
2614a353m462N310K273l794K55M197j504k717M235Q39r186k413J2523O442j3303
2629b658r131J0976J0452r662q464R495P884r571q239O856N126m348M80O153l650
2644A699r103M693J1393l419j0106M594P888p487q624Q382R190o335o058O806
2658C513J481j2181K36J6731K003j8964n089J6197L910j5134j440J7144K114j6894
2672f373m085J1684K104n858L928M996j0436q509J2573J0020j0958o225J3099
2685E960L806j8512n935J9316Q554j5393o294J2149o26j4352N306K0071l515k0217
2699i682J637J6072n548j4194J0743J7824j0993j8473O589J4161o248n199J2517
2712I206K550k0031n659J8823N352j5799P40J7719o001k4627M885K6025J47k0566
$$ plain form
2726 -7236 -6233 7975 -2465 -18045 -2660 18218 5529 -13048 -2606 7976 -6496 -12730
2738 -12730 9518 19019 -4507 -17835 -572 7485 -6821 -4593 16111 10219 -16546 -14427 9572
2751 9572 8462 -8770 140 16310 -998 -23442 -6662 18803 8630 -8590 2587 11655 -9253
2764 -9253 -18460 8470 22779 183 -12874 3331 6685 -13216 -8879 19793 18311 -11762 -15182
2777 -15182 5644 3182 -12248 979 21318 3211 -23732 -10307 12901 2767 -10032 7857
2789 7857 17230 -10392 -25574 859 18453 -35 -8528 9357 6781 -19949 -16290 17437 19693
2802 19693 -8444 -10737 9160 76 -20995 -3733 25045 11279 -16960 -9089 8681 -2846
2814 -2846 -11998 11529 23625 -5183 -23103 -443 13914 -4117 -6337 18088 15278 -18131 -20529
$$ packed form
2726g236J003J4208j0440j5580J5385K0878j2689j8577J0442J0582j4472o234
2738a2730K2248R501k3526j3328J7263Q057j4306K228K0704n892k6765K119K3999
2751I572j110j7232Q910J6170j7308k2444J6780K5465j0173j7220J1177R068k0908
2764i253r207K6930J4309k2596j3057J6205L354j9901M337K8672j482l0073l420
2777a5182K0826k462j5430J3227K0339j8107k6943J3425K3208j0134j2799J7889
2789G857R373k7622j5182K6433J7594j8488q493J7885k576k6730L659L3727K256
2802A9693k8137k293J9897r084k1071J7262K8778j3766k8239P871J7770j1527
2814b846r152K3527J2096k8808j7920K2660J4357j8031k220K4425k810l3409k398
$$ plain form
2827 -20529 10997 17196 -4806 -3323 14005 -254 -25214 -8371 22336 12428 -12627 -3518 10717
2840 10717 -8472 -22156 5697 25667 2135 -19158 -3640 6373 -10616 -8920 18159 18427
2852 18427 -13457 -19184 5858 7382 -10582 -617 22154 5596 -25621 -14325 15620 9943 -8595
2865 -8595 3563 15307 -7795 -24956 872 21685 3941 -10548 5595 8616 -15621 -15578 16608
2878 16608 22891 -5432 -13314 5195 3213 -14122 -1889 23494 11011 -17215 -10701 9476 889
2891 889 -11045 7826 21411 -4723 -25771 -4386 14815 83 -8454 9440 11284 -15416 -20276
2904 -20276 8037 16642 -3621 -6535 8806 921 -20236 -8358 19274 13396 -10869 -6717 8033
2917 8033 -3827 -15497 5021 22249 1943 -17501 -4054 8419 -5083 -7955 14291 17004
$$ packed form
2827b0529L1526O199k2002J483J7328j4259k4960J6843L0707r908k5055R109J4235
2840A0717j9189j3684K7853J9970k3532k1293J5518J0013j6989J696K7079K68
2852A8427l1884n727K5042J524j7964R965K2771j6558l1217J1296K9945n677j8538
2865h595J2158J1744k3102j7161K5828K0813j7744j4489J6143L021k4237M3L2186
2878A6608O283k8323p882J8509j982j7335J2233K5383j2483k8226O514K0177q587
2891H89j1934J8871J3585k6134k1048K1385J9201j4732q537J7894J844k6700m860
2904b0276K8313Q605k0263k914J5341p885k1157J1878K7632n878k4265M152J4750
2917H033j1860j1670K0518J7228k0306j9444J3447J2473j3502k872K2246K713
$$ plain form
2929 17004 -10106 -18190 4372 10984 -4868 -2214 14924 5707 -17870 -11047 13986 10974 -6115
2942 -6115 366 11378 -4245 -18344 339 18030 4080 -11060 39 6411 -9980 -11786 11074
2955 11074 16167 -6211 -13692 2033 4044 -9917 -3720 15030 7836 -14485 -10483 7705 3755
2968 3755 -7665 3130 13845 -2745 -17937 -3108 12748 2221 -7260 4697 8766 -8730
2980 -8730 -13979 6426 13882 -1908 -6862 4776 2627 -11334 -4986 13692 9650 -8050 -5559
2993 -5559 6889 679 -9265 2660 15071 1642 -12854 -3385 7586 -640 -5795 6451 10321
3006 10321 -6447 -12233 2669 8319 -3209 -5025 6417 3321 -11304 -8283 7997 6729 -5256
3019 -5256 -3289 5460 -1556 -10296 -164 10200 1543 -8152 -906 5327 -3723 -7114 5906 10080
$$ packed form
2929A7004k7110q084K2562O612j5852K654J7138r217k3577O823K5033l012j7089
2942f115O481J1012j5623j4099J8683J7691j3950j5140J1099O372j6391j806K2860
2955A1074N093k2378p481J5725K011j3961O197J8750p194k2321M002J8188l950
2968C755j1420J0795J0715j6590j5192J4829J5856j0527r481J1957M069j7496
2980h730n249K0405P456j5790m954J1638k149j3961O348J8678m042j7700K491
2993e559J2448o210r944J1925J2411j3429j4496R469J0971q226n155J2246L870
3006A0321j6768n786J4902N650j1528j816J1442l096j4625L021J6280j268j1985
3019e256J967Q749p016q740J0132J0364q657r695P246O233r050l391J3020M174
$$ plain form
3033 10080 -3248 -9115 1660 5384 -3803 -3145 7275 5379 -6710 -5640 5427 4456 -3553 34
3047 34 7026 308 -8288 -1086 7944 2395 -4433 1426 5092 -2605 -6048 3124 7691 -1372 -5264
3062 -5264 1440 2703 -4922 -3835 5176 4615 -4576 -4970 2601 1316 -4346 -1582 4840 343 -6556
3077 -6556 -2536 3480 441 -3411 1091 4111 -2217 -5221 1299 4483 -881 -2967 1548 2421 -3348
3092 -3348 -3112 3815 3581 -2038 -2259 2702 1549 -2926 -637 4089 1489 -2806 -846 2856 814 -1504
3108 -1504 1679 4126 -375 -3023 913 2784 -592 -1887 1668 1860 -2129 -2243 1491 1863 -1424 -1276
3124 -1276 1304 -22 -2980 -1483 1523 40 -2429 -1177 1339 -527 -2597 -161 1640 -546 -2151
3139 -2151 -310 1305 -741 -1254 722 1292 -838 -584 1120 1116 -482 -30 1299 755 -1076 -624 1257
$$ packed form
3033A0080j3328n867J0775L724r187O58J0420j896j2089J070J1067r71q009L587
3047C4O992o718q596P202R030n549o828N859L666p697l443R172M567r063l892
3062e264O704J263p625J087R011n61r191l94P571j285n662K764O422m497o899
3077f556M020O016l039l852M502L020o328l004O520L184n364k086M515Q73n769
3092c348K36O927k34n619k21M961j153m475K289M726k600m295J960L702k042k318
3108a504L183K447m501k648L936J871l376j295L555J92l989j14L734L72l287J48
3124a276K580j326k958J497L006j483k469J252K516j866k070K436J801k186j605
3139b151J841J615k046n13J976N70k130K54J704mj598M52J329n44j831M52J881
$$ plain form
3156 1257 799 -464 359 1554 853 -789 581 860 775 -273 280 940 -15 -289 1107 1223 -197 -600
3174 -600 637 585 -599 -1275 -246 -57 -912 -898 -360 -271 -689 -324 -425 -1127 -953 -235 472 -1246 -1542 129
3194 129 845 -375 -1321 -342 1141 623 -523 -315 455 171 -3 152 -104 -226 720 1127 452 -512 398
3213 398 948 344 -364 187 561 417 322 389 297 186 304 1268 820 -956 -772 1351 1167 -1294 -1389 552
3233 552 1198 -440 -1683 -255 457 111 -418 -814 -1252 -510 28 -404 -2076 -1463 809 672 -1573 -1555
3251 -1555 703 1608 -871 -1637 187 848 -598 -262 1089 199 -1301 286 2015 325 -1464 480
3267 480 2168 537 -1621 -105 1902 1396 58 728 433 -529 629 2371 744 -2023 -112 2972
3283 2972 789 -3292 -702 3548 1793 -3019 -1970 1745 821 -1579 -564 1316 -997 -2613 177
$$ packed form
3156A257m58j263Q23J195p01j642J370K79q5j048N53O60r55k74J396J16j420m03
3174f00J237n2j184o76J029J89q55J4N38Q9m18L65j01p02J74P18P07j718k96J671
3194A29P16j220r46R79J483n18j146K08P70k84j74J55k56j22R46M07o75r64R10
3213C98N50o04p08N51L74j44r5O7r2j11J18R64m48j776J84K123j84k461r5J941
3233E52O46j638j243J428P12l46n29l96m38P42N38m32j672O13K272j37k245J8
3251a555K258R05k479p66J824O61j446L36J351q90j500J587J729j690j789J944
3267D80J688j631k158J516K007n06j338O70k95r62J158J742j627k767J911L084
3283B972k183m081K590M250j755m812J049L715r24k400J015J880k313j616K790
$$ plain form
3298 177 897 -2068 -1928 2107 1684 -3341 -3500 1590 2342 -1736 -1745 1575 190 -3179 -619 3476 626
3315 626 -2727 817 3219 -1450 -4621 1936 6231 13 -4397 221 4028 -487 -2127 2702 3688
3330 3688 -1833 -2541 1865 1416 -2569 160 5375 1142 -5703 -1761 5081 1886 -3801 -6 4034
3345 4034 -1969 -6268 528 5177 -649 -3932 1574 2606 -4757 -4855 4685 5400 -3887 -5203 2068 1707
3361 1707 -4924 -1892 6085 2265 -5569 -3239 3596 -140 -4255 2737 7097 -2235 -8595 414 6536
3376 6536 -231 -3756 4035 5098 -5276 -6623 4939 7101 -2101 -2521 4882 1446 -7748 -2128 9096
3391 9096 5024 -5649 -2575 4732 -1020 -7117 2502 9822 -256 -8471 -865 4782 -3223 -4733
3405 -4733 6794 7068 -6752 -9561 3008 5512 -4264 -2473 7363 1760 -10944 -5718 7464 4235
$$ packed form
3298A77P20k965J40M035m23n025j59N090P52m078rL320j385l369K560M095k850
3315F26l353L544K402m669l171O557M295o218m410M618L807m515j640M829R86
3330C688n521p08M406m49l985K729N215m233o845L942O842l195n687L795M040
3345D034o003m299O796M649n826l283N506J032p363r8R540P15r287j316P271l61
3361A707o631L032P977l820p834K330O835l736m115O992M360r332o360R009O122
3376F536o767l525P791J063j0374j347J1562K162r202m20P403l436r194N620J1224
3391I096m072j0673L074P307n752o097R619P320j0078q215P606N647q005j510
3405d733J1527K74j3820k809J2569K504r776J791R836n603j2704N226J3182l229
$$ plain form
3419 4235 -5375 -562 6266 -3513 -11164 1413 11456 1303 -7482 827 4728 -6024 -6928 8492
3433 8492 10553 -4260 -7826 3358 3535 -6355 -1058 12455 5439 -10934 -6661 6890 3709 -4884
3447 -4884 2721 10190 -2302 -13051 -1044 10273 1154 -5365 4550 6200 -9153 -11318 6873
3460 6873 11981 -3279 -7094 3837 1695 -10805 -4497 12144 7705 -9152 -6557 4736 -1327
3473 -1327 -9301 3225 14333 -67 -14053 -3289 7816 -1173 -5741 7696 9879 -8296 -13335
3486 -13335 3748 9770 -2535 -2682 8999 3072 -13887 -7012 12470 9716 -5902 -2630 7389
3499 7389 -2779 -12745 1824 16055 3657 -10074 -1488 5731 -5649 -8040 10357 13887 -6358
3512 -6358 -13650 2346 6670 -5967 -2688 12596 6123 -13964 -10477 7627 6082 -6167 839
$$ packed form
3419D235r610M813O828r779p651J2577J0043j0153q785Q309L901j0752r04J5420
3433H492K061j4813l566J1184J77r890N297J3513p016j6373M273J3551l181q593
3447d884P605P469j2492j0749J2007J1317r119o519R915J650j5353k165J8191
3460F873N108j5260l815J0931k142j2500O308J6641m439j6857K595J1293o063
3473a327p974J2526J1108j4400j3986J0764J1105q989m568J3437K183j8175n039
3486a3335J7083O022j2305j47J1681n927j6959O875J9482k754j5618L272J0019
3499G389j0168r966J4569J4231j2398j3731Q586P219j1380k391J8397L530k0245
3512f358p292J5996M324j2637L279J5284o473k0087L487J8104j545j2249P006
$$ plain form
3525 839 10606 -3334 -16833 -2444 13795 3562 -7467 1986 6521 -8774 -12868 7265 14988
3538 14988 -2435 -9825 2929 3356 -9749 -4044 15029 10214 -10086 -9060 5836 2761 -7518
3551 -7518 2598 15274 1196 -15626 -4532 10161 2228 -5835 6632 10043 -8243 -14835 4135
3564 4135 12850 -1228 -5367 6315 3553 -12543 -8144 11946 10603 -6636 -6137 5467 -1373 -11984
3578 -11984 567 15110 3496 -12772 -4606 5957 -2994 -7689 7439 12570 -6065 -14070 762
3591 762 7681 -3350 -3324 10032 5984 -12420 -10220 8238 8737 -4359 -1665 8395 -956 -13470
3605 -13470 -2045 13606 5722 -7186 -104 6169 -5231 -9756 6524 14203 -1450 -10085 1139
3618 1139 4984 -6012 -4301 10763 8876 -9133 -9739 4557 4121 -5708 393 10782 740 -13725
$$ packed form
3525H39R767j3940j3499J4389J6239j0233j1029R453M535j5295m094K0133P723
3538A4988j7423p390J2754M27j3105N705J9073m815k0300J026J4896l075j0279
3551g518J0116J2676j4078j6822J1094J4693p933q063J2467L411j8286o592J8970
3564D135Q715j4078m139J1682k762j6096M399K0090j343j7239M99J1604o840j0611
3578a1984J2551J4543j1614j6268Q166J0563q951m695J5128N131j8635q005J4832
3591G62O919j1031K6J3356m048j8404K200J8458M99j3096K694J0060r351j2514
3605a3470J1425J5651p884j2908P082O273j1400m525J6280P679j5653q635J1224
3618A139L845j0996J711J5064j887j8009o06J4296m36r829O101J0389j0042j4465
$$ plain form
3632 -13725 -5121 9055 3232 -5809 1689 7132 -5681 -12081 1880 10702 -579 -6643 2455 3176
3646 3176 -8628 -6665 9242 8973 -5752 -6724 3932 1421 -7397 -121 11489 3574 -9668 -4227
3660 -4227 5840 799 -5044 4641 9306 -3277 -10342 962 7959 -440 -3108 5996 4811 -7548
3674 -7548 -7197 6049 7523 -3176 -2663 4772 -51 -8527 -1799 9164 3833 -6470 -2422 4292
3688 4292 -2372 -6745 2955 8730 -1926 -8299 -400 3777 -3328 -3948 5851 5254 -5992 -6837 3524
3703 3524 3737 -3522 -1529 5492 936 -7654 -2923 6154 3214 -3747 178 4715 -2157 -6313 1754
3718 1754 7701 -168 -4622 1137 3660 -3487 -3685 5119 5987 -3167 -4493 2919 1894 -3720 -203
3733 -203 5930 2130 -5469 -2881 3855 995 -3102 581 4393 -1820 -5838 -82 4250 -661 -3432
$$ packed form
3632a3725Q604J4176n823r041P498N443j2813o400J3961Q822j1281o064R098P21
3646C176j1804J963J5907k69j4725r72J0656k511q818P276J1610p915j3242N441
3660d227J0067n041n843R685M665j2583p065J1304O997q399k668R104j185j2359
3674g548L51J3246J474j0699N13P435m823q476O728J0963n331j0303M048O714
3688D292o664m373R700N775j0656o373P899M177p105o20R799n97j1246q45J0361
3703C524K13p259J993P021m556q590M731R077k940o961L925M537o872m156Q067
3718A754N947p869m454N759K523p147j98Q804Q68r154j326P412j025n614L517
3733b03O133l800p599K588O736k860m097L683L812o213m018N756M332m911k771
$$ plain form
3748 -3432 1840 2224 -3811 -4479 2988 3869 -2438 -2785 2067 876 -4185 -1956 4204 2189 -3578 -1869
3764 -1869 2475 242 -3051 1336 4476 -272 -4132 247 3217 -302 -2319 2262 3239 -1858 -2606
3779 -2606 2083 3087 -870 -1136 2617 1546 -3068 -1090 3287 1567 -2020 -771 2502 165 -2632
3794 -2632 -50 3005 367 -2436 -384 989 -805 -1774 1018 1756 -1362 -2562 671 1086 -1747 -1620
3810 -1620 1495 1094 -2519 -1809 1016 984 -1516 -490 1419 -247 -1960 -303 1691 150 -1318 439
3826 439 1661 -561 -1210 1098 1790 132 -1193 799 1279 -247 -325 1302 1066 -812 196 1180 455
3843 455 -1179 392 1522 297 -1217 -112 1304 392 -1103 -256 553 26 -1070 -217 583 -746 -820
3860 -820 -1 76 -979 -734 362 363 -936 -1377 339 341 -813 -671 320 61 -627 -77 209 -291 -263 166
$$ packed form
3748c432N272L84o035o68P467Q81o307l47M852j191n061K229O160k015n767J709
3764a869M344k233l293M387L140m748l860M379K970l519k017M581R77n097p48
3779b606M689J004l957k66L753j071m614J978M377j720l587J249L273k337k797
3794b632K582L055k638k803K052J373j794r69K792P38l118j200L233M15k833J27
3810a620L115m01l613P10K825l2k500J026J909j666j713J657J994j541j468J757
3826D39J222k222o49K308O92j658j325J992M80j526p8J627k36j878J008R84p25
3843D55j634J571J130j225j514J105J416r12j495Q47Q09n27j096Q53Q00j329p4
3860h20Q19P7j055K45J096Jj299m41J716Kj154J42R91k59o88N50K86n00K8M29
$$ plain form
3880 166 325 -172 -131 454 1028 -10 -703 563 878 395 -541 620 924 409 329 360 346 212 936 730
3900 730 220 -934 251 609 22 -639 -146 654 57 -474 -604 -154 -268 -462 -159 -322 -569 -280 274
3919 274 -31 -1033 -337 555 -187 -1288 -1066 303 232 -568 -676 415 -181 -175 104 273 -314 -256 649 919
3939 919 -64 -456 944 942 146 -386 819 1058 179 -164 707 268 -115 529 1386 259 -1011 486 1278
3958 1278 21 -1039 372 1191 -220 -1224 144 584 -290 -664 470 79 -1223 -475 1117 89
3974 89 -1721 -759 961 -201 -2281 -170 1487 -133 -1597 -469 1023 -673 -916 1141 1263 -1187
3990 -1187 -1818 1015 1154 -901 -858 1860 1680 -1743 -1249 1811 1697 -1192 159 1811 25 -1984 943
4007 943 2673 -1 -1433 978 2031 -992 -2200 1743 2714 -1238 -2256 900 1436 -2024 -1016 2661
$$ packed form
3880A66J59m97M1N85N74j038o93J266L15m83r36J161L04n15q0L1j4j34P24k06
3900G30n10j154J185L58n87o61M93Q00n97n31j30M50j14j94L03j63k47K89N54
3919B74l05j002O96Q92p42j101K22J369p1q00j08J091n96OK79J69n87N8R05K70
3939I19r83l92J400kp96n32J205K39q79l43Q71m39l83O44Q57j127j270J497P92
3958A278j257j060J411Q19j411j004J368M40q74l74J134l91j302P48J592j028
3974H9j810R62J720j162k080K111J657j620j464J128J492j696k43K057J22k450
3990a187o31K833J39k055M3K718j80l423M94L060j14k889J351J652j786k009K927
4007I43J730k674j432K411J053l023j208L943R71l952j018L156N36l460J008L677
$$ plain form
4023 2661 1319 -3031 -1870 2016 101 -2550 107 3083 -334 -3552 -582 2475 -388 -2553 1075
4038 1075 1966 -2187 -3440 1466 3058 -1989 -2050 2204 1039 -3302 -2090 3912 2702 -2662 -1681 2712
4054 2712 230 -3127 736 4933 491 -4069 335 3253 -669 -2491 2855 4351 -2203 -4647 1490
4069 1490 3473 -1692 -1755 3913 2017 -4821 -3055 3904 2875 -2876 -961 3259 -975 -6106 -569
4084 -569 5572 888 -4390 -278 2809 -2904 -4801 2779 5633 -2460 -5370 1370 2519 -3652 -2475
4099 -2475 5358 3524 -5296 -4633 3159 2440 -3424 82 5778 35 -6830 -875 6173 1302 -3698
4114 -3698 2066 4911 -3236 -6278 3197 6991 -737 -3852 2617 2383 -5188 -3530 6670 5128 -4462
4129 -4462 -3943 3516 857 -5519 415 7824 1232 -7485 -2445 4514 -528 -4009 2915 5986 -4042
$$ packed form
4023B661j342m350J161L886j915k651K657K976l417l218K970L057k863k165L628
4038A075Q91m153j253M906J592n047o1M254j165m341J212O002j210n364R81M393
4054B712k482l357L863M197m442m560M404K918l922j822N346J496o554k444O137
4069A490J983n165o3N668j896o838J766O959j029n751J915M220m234n131N537
4084e69O141m684n278M112L087n713j897P580K854q093k910O740J149o171J177
4099b475P833j834q820O63P792p19n864L506N696n743o865N955P048m871n000
4114c698N764K845q147l042R475L794p728l115O469k34p571J658J0200j542r590
4129d462N19P459k659o376N934P409o592q717N040O959n042l481O924L071j0028
$$ plain form
4144 -4042 -8238 1148 5402 -1956 -3283 4619 3130 -7336 -5741 5911 5594 -3455 -2470 4190 -385
4159 -385 -7696 -844 8782 2786 -5994 -988 4459 -2302 -5584 4381 9220 -1780 -8057 854 4780
4174 4780 -2645 -2413 7251 5481 -6824 -6492 4406 4637 -3345 -322 6933 413 -9751 -2784 8046
4189 8046 3099 -4815 361 4765 -4270 -8589 3147 9182 -823 -6420 1403 2760 -6206 -4755
4203 -4755 7772 7065 -5597 -6773 3200 1875 -5452 -35 8838 1561 -9715 -3657 5780 1325
4217 1325 -4302 3428 7372 -4294 -9811 1758 8596 -298 -3947 4526 4183 -7520 -6105 7322
4231 7322 8080 -3774 -3946 4337 725 -8112 -678 10461 3978 -7565 -3266 4913 -1043 -5801 3956
4246 3956 9281 -2307 -9561 -384 5664 -2223 -3764 6386 5191 -8053 -8473 4351 6059 -3730
$$ packed form
4144d042m196R386M254p358j327P902j489j0466J595J1652l17r049R85O660m575
4159c85p311O852R626n996q780N006N447o761l282R965M839j1000o277Q911L926
4174D780p425K32R664j770j2305L32J0898K31p982L023P255o520j0164O967J0830
4189H046m947p914N176M404r035m319J1736O035j0005n597P823J357q966J451
4203d755J2527p07j2662j176R973j325p327N417Q873p277j1276O058R437m455
4217A325n627P730L944j1666n517J1569O838q894l649Q473l43j1703J415J3427
4231G322P58j1854j72Q283l612q837P434J1139o483j1543M299Q179n956m758R757
4246C956N325j1588p254R177O048p887j541J0150j195j3244m20J2824J708r789
$$ plain form
4260 -3730 -2359 5889 617 -10107 -3520 9097 4223 -5688 -1287 4723 -2670 -8235 2597 10141
4274 10141 159 -7256 174 4206 -4120 -3882 7064 7603 -5432 -6853 3247 4059 -4208 -182 8353
4289 8353 2474 -8874 -4521 6882 3456 -4180 1353 6456 -2969 -9166 916 8805 629 -5133
4303 -5133 1980 3513 -5808 -6090 5551 7273 -3963 -5759 2467 1296 -6391 -1538 8242 3074 -7461
4318 -7461 -4307 4300 643 -5260 1739 7811 -1430 -8812 -654 6155 -214 -3787 3842 4773 -5352
4333 -5352 -6710 4015 6452 -2207 -2875 4052 1653 -6286 -2566 7555 4662 -4471 -2272 4117 -545
4348 -545 -5367 1898 8174 619 -6412 -399 4323 -1686 -3530 4361 5471 -4080 -6442 2142 3893
4363 3893 -2839 -1911 4477 1912 -6491 -3877 4763 3117 -3639 -818 3934 -1683 -6273 5 6384
$$ packed form
4260c730J371Q248n272j0724O587J2617m874r911M401O010p393n565J0832P544
4274A0141r982p415P430M032q326K38J0946N39j3035j421J0100Q12q267M026Q535
4289H353n879j1348M353J1403l426p636N533N103r425o197J0082P889q176n762
4303e133P113J533r321k82J1641J722j1236j796Q226j171p687M853R780n168j0535
4318g461L154Q607l657n903O999O072r241p382Q158O809o369l573P629R31j0125
4333e352j358J0725K437q659o68O927k399p939L720J0121k893r133K199O389m662
4348e45m822P265O276p555p031O013M722o009j844P891J110r551k362Q584J751
4363C893o732R28O388k565q403K614Q640j646o756K821M752n617m590O278O379
$$ plain form
4378 6384 457 -4447 369 2968 -2577 -4070 3434 5445 -2299 -4657 1554 2719 -3180 -1650 5159
4393 5159 2856 -4425 -3040 3397 1999 -2917 742 4667 -24 -5091 -324 4818 684 -2702 1488
4408 1488 2994 -2582 -4056 2366 4278 -1207 -2668 1819 1444 -3411 -2061 3664 2651 -3140 -2305
4423 -2305 2190 21 -3621 35 4057 -9 -4570 -770 2589 -686 -2287 1225 2987 -2122 -3599
4438 -3599 1054 2691 -666 -1485 2267 1382 -3007 -1650 2991 2249 -1825 -748 2494 155 -2519 -396
4454 -396 3503 766 -2300 265 1986 -566 -1787 1606 3238 -916 -2478 846 1898 -1115 -1335
4469 -1335 1933 1656 -1953 -1356 1530 947 -1194 -599 1765 -255 -2744 -830 2077 -225 -2208 78
4485 78 1294 -1058 -2275 571 1605 -692 -1709 468 1075 -1329 -939 1459 932 -1396 -1178 1185
$$ packed form
4378F384n927m904M816K599n545j493P504K011p744k358O211J165n899J530O809
4393E159k303p281J385O437j398m916L659L925m691n067M767N142m134l386M190
4408A488J506n576j474O422J912n485j461M487l75m855J350N725j013n791Q35
4423b305M495k169l642L656M022m066m561L800L359l275j601L512J762n109j477
4438c599M653J637l357q19L752q85m389J357M641p42m074J077L242k339k674K123
4454c96L899k737l066K565J721k552j221L393J632m154j562L324J052l013k20
4469a335L268k77l609N97K886n83k141N95K364k020k489J914K907k302j983K286
4485G8J216k352j217K846J034k297j017K177O07k404L90K398n27k328K18K363
$$ plain form
4501 1185 805 -1142 -440 1505 807 -1485 -359 1565 379 -465 719 1572 -148 -912 883 1438 -469
4518 -469 -872 838 986 -534 -1161 1065 1085 -337 -916 640 374 -877 -478 568 -13 -918 -449 424
4536 424 -105 -840 141 680 -421 -908 -299 768 -278 -800 306 365 -635 -884 313 691 -498 -534
4554 -534 632 721 -497 -521 780 627 -583 -172 573 602 -79 26 648 284 -74 -18 482 -305 45 685
4574 685 617 -112 -266 488 740 -313 -465 517 632 -509 -514 359 74 -431 -320 94 -82 -583 -428 104
4594 104 -142 -730 -357 132 -104 -358 113 143 -196 -665 10 -25 -452 -46 327 67 -664 -51 821 347 -366
4615 -366 -172 788 383 -445 -52 696 528 134 419 845 270 -245 496 734 -181 -64 611 715 -461 -317
4635 -317 433 157 -389 -93 604 68 -1008 -96 330 -203 -793 -339 769 -634 -1145 -31 527 -334 -1113
$$ packed form
4501A185l80j947P02J945o98k292J126J924j186q44J184Q53j720p64J795N55j907
4518d69m03J710J48j520o27K226K0j422n79J556k66j251L99J046n81r05M69Q73
4536D24n29p35R81N39j101m87O09J067j046n22J106N9j000k49J197L78j189l6
4554e34J166Q9j218k4J301j53j210M11P45K9o81J05O22l64l58N6N00p87L50O40
4574F85o8p29j54P54K52j053j52R82J15j141nQ73k85n05J11M14j76n01J55N32
4594A04k46n88L73M89k36k54M71L0l39m69O75l5m27M06L73k60p31O13Q72m74p13
4615c66J94R60m05q28L93P48j68l94K85M26n75n15P41K38r15J17O75J04j176J44
4635c17P50k76n46K96O97n36j076R12M26n33n90M54J108j403n11J114N58q61p79
$$ plain form
4654 -1113 94 506 -864 -832 119 408 -481 6 365 61 -977 -84 1006 -163 -599 191 875 -42
4672 -42 -739 157 1228 -228 -478 674 810 -315 -554 1228 1076 -695 -734 1225 826 -577 -207 1316
4690 1316 594 -847 -305 906 290 -875 174 803 -787 -1748 487 1182 -583 -1403 457 755 -1631
4707 -1631 -1332 1219 661 -1368 -1104 771 -25 -1951 -656 1915 365 -2036 -599 1611 27 -1695
4723 -1695 899 2022 -395 -1731 596 1909 -352 -669 1722 1404 -1705 -1667 1823 1894 -1230 -337 1895
4740 1895 645 -2387 -476 2997 759 -1949 -136 1838 -508 -2311 1173 2565 -438 -2474 642
4755 642 1778 -1198 -1502 1812 1796 -2549 -2513 1485 1482 -2249 -520 2994 241 -3464 -1386 2388 629
4772 629 -2309 263 2548 -1440 -3432 721 3636 -540 -2256 1293 1710 -2469 -2111 2758 3102 -2010
$$ packed form
4654a113J207M12j370L2R51K89q89M87L59l04j038Q93J090j169m36P90O84r17
4672d2o97Q96J071j456k50J152J36j125k39J782j52j771l9J959l99j403L70J523
4690A316p22j441N42J211o16j165J049O29j590r61K235O95j765q20J860K98k386
4707a631K99K551n58k029K64J875p96j926J295K571j550k401J437K210j584j722
4723a695K594J123k417j336K327J313k261l17K391l18l109L8L490P1l124Q93K232
4740A895j250l032J911L473k238k708J813J974k346j803L484J392l003k036L116
4755F42J136k976l04L314j6m345L6L998ll731J729L514k753l705K078L774j759
4772F29k938K572K285l988j992M153K915m176j716L549M17m179L58M869L44n112
$$ plain form
4788 -2010 -2384 2349 1226 -2548 -55 4445 1314 -3736 -1575 2619 564 -2526 1509 3801 -1029
4803 -1029 -4371 568 3607 -333 -2159 2160 2582 -3444 -3799 2583 3432 -2284 -1998 2397 366 -4673
4819 -4673 -1633 4476 1836 -3775 -1606 2779 -713 -4141 1033 4829 -460 -4689 -218 2888 -1425
4834 -1425 -2232 3531 3618 -3656 -4178 2214 2896 -2191 -981 4144 1199 -5166 -2080 4801 2564 -2469
4850 -2469 63 3420 -1322 -5143 980 5807 307 -4072 971 2758 -2534 -3444 3837 4677 -2755
4865 -2755 -4288 1557 2214 -3415 -1036 5179 2119 -5496 -2993 3403 984 -3414 575 4587 -1061
4880 -1061 -6239 -318 5202 84 -3037 1766 2972 -3988 -4754 3414 5185 -2152 -3536 2355 1614
4895 1614 -4766 -1837 6007 3523 -4034 -2537 3109 136 -3807 1198 5933 -209 -5578 -411 4062
$$ packed form
4788b010l74M733j123l774K493M500l131n050K161M194k055l090M035K292m830
4803a029l342M939L039l940j826M319M22o026l55O382Q49n716K86M395k031n039
4819d673L040O109k640n611K169M385l492l428N174L796n289m229M471L106m313
4834a425q07N763Q7p274n22O392O82n087J210N125k945o365L086O881k237n033
4850b469K532L357m742l821O123M827n500m379N043J787n292r10P281Q40p432
4865b755j533N845O57n629K379O215l060p615K503O396k419m398L989M012n648
4880a061n178N921N520n118l121M803J206o960p66Q168J771p337j384N891p41
4895A614o380K929P844k484p557J497N646k973l943N005M735o142n369N167M473
$$ plain form
4910 4062 -748 -2862 3372 4628 -3453 -5516 2322 4507 -1675 -1865 3986 1489 -5256 -3158 4661
4925 4661 3225 -3604 -1327 3407 -1013 -5620 241 6031 541 -4829 -753 2868 -2367 -3736 3559
4940 3559 5084 -3126 -5535 1422 3114 -2969 -1559 5107 2531 -5447 -3825 3929 2968 -3012 95
4955 95 4508 -711 -6330 -383 5873 1072 -3124 1199 3544 -2838 -4724 3260 5770 -1571 -4093
4970 -4093 1721 1977 -3807 -1905 5579 3449 -4191 -3538 2787 1080 -3464 496 5401 -61 -6303
4985 -6303 -1567 4197 226 -3375 1822 4008 -3179 -5871 1572 4579 -1438 -2906 2419 1649 -4844
5000 -4844 -3068 4350 3790 -2980 -2028 2709 114 -4331 112 5904 1114 -4738 -924 3620 -630
5015 -630 -2997 2684 4987 -1607 -4966 1129 3640 -1277 -1573 3565 2583 -4088 -3736 3382 3574 -2420
$$ packed form
4910D062m810k114O234J256q081k063P838K185o182j90N851k497o745K098P819
4925D661j436o829K277M734m420m607N861N790n490n370M076L621n235j369P295
4940C559J525q210k409O957J692o083J410O666k576p978J622P754r61n980L107
4955I5M413n219n619N947O256m801m196M323K345o382j886P984K510p341k522
4970d093N814K56n784J902P484k130p640O53O325j707m544L960M905n462o242
4985f303M736N764l971l601N197K186p187k692P443L007o017j468N325p70o493
5000d844J776P418n60o770R52M737k595m445M443N792m790n852L814M544m250
5015f30k367N681K303o594l359O095K511m917k96N138r82o671L52P118J92n994
$$ plain form
5031 -2420 -1153 3525 -77 -4758 -1136 4454 1505 -3536 -641 2453 -1640 -3956 1819 4630 -1331
5046 -1331 -4404 700 2383 -2705 -2207 3548 2841 -3480 -3668 2317 1846 -2490 -702 3885 641 -4618
5062 -4618 -1366 3567 1016 -2712 566 3107 -1340 -3919 1117 3843 -218 -2189 1511 2321 -2438
5077 -2438 -2024 3583 3145 -2324 -2004 2023 729 -2562 -541 3774 1373 -3593 -1386 2661 313 -2458
5093 -2458 703 2634 -630 -3442 506 2989 -541 -1903 1357 1540 -2653 -2709 1746 1923 -1872 -1521
5109 -1521 1501 374 -2910 -941 2646 812 -2451 -734 2037 -124 -2466 625 2949 41 -2605
5124 -2605 208 2159 -194 -1552 1369 2094 -1338 -1662 1453 1500 -1007 -456 1860 591 -2225 -822
5140 -822 2275 1007 -1808 -72 1773 -439 -2309 107 2259 -376 -1595 -234 1239 -818 -1478
$$ packed form
5031b420J267M678l602m681L622N590k949n041K895L094m093k316N775K811n961
5046a331l073N104J683n088M98N755p07o321j88N985m71m336J788M587l244n259
5062d618L252M933k551l728L278K541m447k579N036K726m061j971L700Q10m759
5077b438M14N607m38n469L20M027j294l291K021M315k401m966K207M047k348k771
5093b458L161J931l264k812L948K483l530j362L260J83m193n6M455J77l795L51
5109a521L022j127l284J969L587j834l263J717K771k161k342L091K324k908k646
5124b605K813J951k353j358K921P25l432l24L115M7k507N51K316j269k816J403
5140h22L097j268k815J736J845k212j870K416K152k635j219J361J473k057o60
$$ plain form
5155 -1478 1112 1632 -1400 -1997 492 767 -1242 -530 1451 434 -1635 -766 861 361 -1223 156
5171 156 1160 -538 -1541 263 1404 -312 -1293 740 1006 -686 -991 840 1518 -239 -673 925
5187 925 763 -830 -96 1225 1045 -746 -157 1122 620 -698 -122 1212 177 -1260 101 888 -208
5204 -208 -885 521 903 -612 -1039 462 862 -654 -762 365 167 -902 -789 606 519 -895 -611 22
5222 22 -166 -437 -67 437 -305 -780 -72 489 -380 -588 341 773 -73 -491 207 662 -154 -149 653 651 -155 -57
5244 -57 786 880 -27 -54 740 507 -204 -109 627 134 -230 19 389 72 -671 182 260 -94 -429 -300 175 -496
5266 -496 -513 254 479 -787 -551 167 233 -514 -657 103 -196 -620 -468 135 -37 -618 -233 369 -99 -292
5286 -292 -4 128 223 -380 158 448 -231 -233 539 523 -290 -214 550 653 -26 -58 757 268 -102 -45 499 435 -276
$$ packed form
5155a478K590N20l032n97K489K75k009P12J981j017k069Q69J627n00j584J379
5171A56J004j698j003J804J141j716r81K033K66j692l05J831O78j757m34J598
5187I25j62j593P34J321j80j791N89J279n02j318N76J334j035j437J361P87j096
5204b08o77J406L82j515m27J501M00j516j08J127j98j069J13J395q7j414K84O33
5222B2j88k71L70N04p42m75P08N61q69k08R29M32q46m18O98M55q16NQ02kq06R8
5244e7Q43R4r07k7P94k33p11R5P36m93l64K49L70l17p43Q53P8l54l35J29M75o71
5266d96j7P67K25j266K36P18O6p47j43P60k99m24J52O03j72n81L85O02m68j93
5286b92K88J32R5o03N38K90o79kP72j6q13P6P64J03o79l2Q15m89l70N7N44o4p11
$$ plain form
5309 -276 114 452 -65 -209 400 83 -97 -331 -262 279 -10 -285 -152 -43 -268 -395 391 -136 -523 -566 198
5330 198 -74 -200 113 345 -169 -761 -275 171 -206 -604 -150 377 -132 -285 139 480 98 -159 283 367
5350 367 -773 -410 422 220 -333 -50 510 390 -315 -131 877 -1 -321 272 836 -309 -327 503 896
5369 896 -139 -644 403 464 -208 -483 596 268 -649 -468 214 -156 -806 -134 812 -138 -1265 -12 632
5388 632 -305 -733 52 368 -748 -1230 255 658 -621 -710 704 552 -1242 -802 930 720 -875 -476
5406 -476 1319 462 -1170 103 1316 78 -890 95 1120 -208 -625 1055 1017 -684 -838 702 1153
5423 1153 -764 -567 1115 904 -1385 -603 1312 502 -1239 -89 1219 -130 -1658 -167 1454 -88
5439 -88 -1431 224 1175 -1067 -1580 852 1214 -940 -1595 339 762 -1042 -949 1464 982 -1911 -816
$$ packed form
5309b76L90L38n17j44O09l17j80k34O9N41k89k75J33J09k25j27P86n27l87m3P64
5330A98k72j26L13K32n14n92M86M46l77l98M54N27n09j53M24L41l82k57M42Q4
5350C67j140L63Q32k02n53K83N60j20p05J84J008q78l20N93N64j145j8Q30L93
5369H96j035n05J047O1o72k75J079l28r17J81O82l70o50O72R46r50j127J253O44
5388F32r37m28P85L16j116m82J485M03j279q9J414j52j794M40J732k10j595L99
5406d76J795q57j632J273J213j238r68R85J025j328m17J680l8j701j54J540M51
5423A153j917J97J682k11k289P82J915q10j741J150J308j349j528J491J621j542
5439h8j343J655R51k242n13K432L62k154o55J934M23j804R3K413m82k893J095
$$ plain form
5456 -816 1328 402 -1305 -66 1791 96 -1959 17 1935 258 -1145 837 1696 -773 -1781 1116
5472 1116 2183 -615 -1455 1388 1131 -2053 -1083 2420 1579 -1686 -826 1153 413 -1766 58 2294
5488 2294 623 -2194 -595 1340 -864 -2103 1087 2190 -1241 -2873 707 1958 -1160 -1195 1617
5503 1617 1289 -2385 -1815 1863 1442 -1566 -794 1961 46 -2636 -116 2925 538 -2214 214 1895
5519 1895 -809 -2150 1463 3202 -976 -2435 982 1712 -1392 -1188 2803 2009 -2199 -1953 2203 1694
5535 1694 -1735 -335 2807 249 -3564 -929 2822 598 -2240 409 2177 -1673 -3192 993 3013
5550 3013 -817 -2054 1206 1415 -2817 -2027 2957 2401 -2105 -1992 1909 736 -2720 -70 3450 543
5566 543 -3641 -959 2421 165 -2239 1016 3269 -1647 -3481 801 3226 -642 -1575 2276 1867 -2833
$$ packed form
5456h16K144r26j707J239J857j695k055J976J918j677j403J982Q59k469j008K897
5472A116J067k798q40K843k57l184R70L503q41l265Q60J979p40k179J824K236
5488B294j671k817J599J935k204j239L190J103l431j632L580J251l118l5K812
5503A617l28l674N70L678m21l008P72K755j915k682K520L041k387k752K428J681
5519A895k704j341L613J739m178j459L417P30l104K04L991p94m208K46M156n09
5535A694l429J400L142k558l813K635L751k224k838K649J768l850j519M185K020
5550C013l830j237L260K09m232P90M984n56m506J13L901j173l456K650L520k907
5566E43m184K682L380k256k404L255K253m916j834M282K425l868r33L851m09m700
$$ plain form
5582 -2833 -2249 2677 2529 -1909 -1633 2443 422 -3262 -527 4100 1110 -2845 -683 2440 -886 -2891
5598 -2891 1641 3789 -993 -3829 299 2309 -1849 -1885 2888 2421 -3135 -3207 2032 1934 -2087 -1071 2785
5615 2785 229 -3740 -1396 3201 1112 -2674 -103 2416 -1046 -3554 1147 3793 -337 -2432 599
5630 599 1938 -1683 -2143 3254 3122 -2206 -2692 1644 1671 -2292 -394 3731 1260 -3458 -1648 2864
5646 2864 779 -2285 618 3176 -1154 -4142 509 3556 -400 -2407 1116 1945 -2652 -2750 2307 2734
5662 2734 -2005 -2407 1810 504 -2907 -1039 3769 1584 -2986 -1533 2091 -84 -2850 790 3691
5677 3691 -834 -3909 159 2416 -604 -2210 1919 2233 -2372 -3174 2045 2844 -1593 -1229 2547 908
5693 908 -3170 -1416 3083 1511 -1982 -578 2267 -565 -2774 771 3682 -84 -2883 238 2092
$$ packed form
5582b833N84M926j48m438K76M076k021l684K735M627k990l955K162L123l326k005
5598b891M532K148m782k836M128K010m158l6M773m67n556p2N239r8m021J016L856
5615B785k556l969K344M597k089l786K571K519l462k508M701K646m130k095L031
5630E99J339l621m60N397j32n328m86M336K7l963J898M125k471m718J810M512
5646B864k085l064K903K558m330k988M651L047l956k007L523Q29m597r8N057M27
5662B734m739m02M217j306l411J868M808k185m570J453L624k175k766L640K901
5677C691m525l075M068K257l020j606M129L14m605q02N219P99m437L64L776j639
5693I08m078J754M499j572l493J404K845k832k209L545K911l766k799L121J854
$$ plain form
5708 2092 -1215 -2295 2264 2760 -2295 -2667 1236 1497 -1988 -1086 2269 690 -3393 -1640 2301 863
5724 863 -1857 -284 2467 -876 -3356 -49 2803 199 -2214 492 1811 -1911 -2434 1731 2524 -1518
5740 -1518 -2132 1480 1423 -2086 -913 2721 1831 -2022 -1304 1937 606 -1683 229 2658 -246 -2878
5756 -2878 -32 2411 -23 -2022 1123 1923 -1398 -2604 1457 2279 -1131 -1549 1442 980 -2404 -1034
5772 -1034 2182 1415 -1994 -1240 1772 213 -2337 -185 2539 80 -2533 -625 1587 -386 -1559
5787 -1559 814 1666 -1236 -2061 1081 1474 -1138 -1015 1645 926 -2043 -1286 1657 1497 -1197 -313 1650
5804 1650 25 -1968 24 2648 310 -1446 32 1664 -368 -1683 904 2086 -660 -1534 689
5819 689 1237 -686 -936 1455 959 -1470 -1180 1147 840 -1124 -425 1288 49 -1766 -344 1382 40
$$ packed form
5708B092l307j080M559M96n055l72L903K61l485R02L355j579m083J753L941j438
5724H63k720J573K751l343k480L307K852k604k413K706J319l722n23M165P93m042
5740a518o14L612n7l509J173L634q90l853P18L241j331k289J912K429k904k632
5756b878K846K443k434j999L145Q00l321j206M061Q22l410m18K991m62l384J370
5772a034L216p67l409P54L012j559k550K152K724k459k613J908K212j973j173
5787a559K373Q52k902q25L142L93k612J23K660p19k969P57K943j60k694Q84J963
5804A650j625j993J992K624k338j756J478J632k032j315K587J182k746q74K223
5819F89N48j923k50K391m96k429K90K327l07j964O99J713j239j815J422J726j342
$$ plain form
5836 40 -1594 -41 1275 -307 -1464 265 1333 -521 -1127 477 796 -1097 -697 1146 976 -923
5852 -923 -695 943 398 -902 -70 1279 428 -1174 -238 849 163 -550 307 1110 -256 -1005 411 979
5870 979 130 -541 633 902 -611 -762 905 852 -796 -482 905 235 -571 -3 803 191 -853 -284
5888 -284 636 34 -828 -162 750 -212 -835 -295 355 -378 -525 460 580 -648 -884 338 281 -305 -419 336
5908 336 345 -653 -239 485 394 -617 222 302 272 -500 81 572 -166 -122 36 573 -181 -426 416 757 -93 -499
5930 -499 230 289 -274 12 123 125 -290 -336 481 29 -485 -5 154 162 -400 -266 324 -176 -553 13 105 -110
5952 -110 -508 344 224 -306 -157 -60 171 -379 -411 396 113 -334 -152 -60 206 -199 56 472 152 -148 151
5973 151 692 3 83 -23 306 -40 -204 317 204 51 50 276 608 -99 -98 72 177 -207 -66 384 -72 -297
$$ packed form
5836D0j634J553J316j582j157J729J068j854o06J604L19j893M00J843j70j899
5852i23K28J638n45j300Q32J349q51j602R36J087o86p13Q57Q03j366p49J416N68
5870I79q49o71J174K69j513j51J667n3j648L14J387o70q06N68Q06o12j044N69
5888b84R20o02q62O66R12r62o23N40O50p33j47R85J20j228k36J222n7n86j14P55
5908C36Rr98M14P24r1j011Q39Q0l0p72N81M91p38M4J58N37p54k45Q42L41q50m06
5930d99P29N9n63K86J11Km15m6Q17m52n14M80J59Qn62J34N90n00l77N66R2k15
5952a10l98Q52j20n30J49R7K31n50l2Q07k83m47J82R2K66m05K55M16l20l00K99
5973A51N41o89Q0j06L29l46j64N21j13j53jK26L32p07JJ70J05l84J41M50m56k25
$$ plain form
5995 -297 -494 431 -38 -235 107 141 41 -456 -83 339 -317 -349 11 31 -271 -271 291 372 -266 -271 56 15 -179
6018 -179 -59 215 27 -405 -109 399 39 -251 44 630 291 -301 95 379 39 -288 230 508 -41 -35 331
6039 331 486 -184 82 272 119 -200 -390 437 3 -713 75 392 1 -591 5 274 -37 -499 -146 43
6059 43 -471 -466 128 223 -614 -345 328 271 -373 -583 271 23 -713 13 84 9 -425 514 494 -137 -473 389 380
6082 380 -74 -519 315 348 -233 -312 599 554 -237 71 414 264 -569 104 665 100 -242 211 442 -278 -709
6103 -709 91 927 -182 -643 387 558 -319 -794 482 481 -818 -606 573 130 -739 -461 893 324 -1098
6122 -1098 -256 857 24 -966 37 696 -206 -1158 176 870 -44 -935 389 500 -943 -761 832 1001
6140 1001 -893 -732 759 319 -781 -121 1143 205 -1124 -221 1258 117 -875 -51 1267 -186 -1447
$$ packed form
5995b97j97R25m69j97L42L4j00m97L73M22o56l2L60K0l02%N62Q1o38nL27m1j94
6018a79J20K74j88m32K96N08l60k90K95N86l39n92L96K84l40l27N18K78n49OL66
6039C31J55o70K66J90j53l19j90Q27m34p16P88L17l91n92N96K69l11m62L53J89
6059D3n14NN94R5q37K69O73n7o44k10Q54k48p36P26P1p5m34R39k0o31l36Q62r
6082C80m54m45Q34L3n81p9R11m5p91L08L43j50q33O73N61n65l42M53K31p20m31
6103g09Q00Q36j109m61J030J71q77m75J276jj299K12J179m43q69K78J354n69j422
6122a098Q42J113q33r90J003O59r02r52J334O94r14q91J324J11j443J82J593J69
6140A001j894J61J491m40j100O60J264r38j329R03J479j141r92Q24J318j453j261
$$ plain form
6157 -1447 314 1242 -315 -642 836 670 -784 -1093 676 890 -812 -630 857 -58 -1144 -434 1245
6174 1245 285 -1427 -332 1106 41 -1202 181 1503 -491 -1250 314 855 -1042 -1020 978 1210
6190 1210 -1086 -1335 867 1260 -553 -529 1642 562 -1832 -413 1539 395 -1091 131 1375 -355
6206 -355 -2113 472 2088 -208 -1398 677 1237 -1046 -1423 1578 1463 -1147 -1299 1014 837 -1491
6222 -1491 -473 1905 929 -1882 -974 1240 345 -1806 278 1549 -290 -2406 -292 1675 -353 -1377
6238 -1377 672 1560 -1442 -2035 931 1672 -1122 -961 1258 1012 -1969 -690 2069 962 -1592 -403
6254 -403 1590 -65 -1870 391 2303 53 -2058 109 1824 -573 -1474 1519 2240 -1356 -1831 1139
6270 1139 1675 -972 -745 1652 815 -2346 -1381 2212 1458 -1479 -145 1933 -469 -2874 253 2157
$$ packed form
6157a447J761R28j557l27J478j66j454l09J769K14j702J82J487r15j086P10J679
6174A245r60j712J095J438j065j243J383J322j994p59J564N41j897K2J998K32
6190A210k296k49K202L93j813K4K171j080k394J419J952j144j486J222J244j730
6206c55j758K585J616k296j190K075N60k283l77L001j15k610j52K313j77k328
6222a491J018K378r76k811R08K214q95k151K084J271j839k116K114J967k028j024
6238a377K049Q88l002n93K966P41k794J61K219k46k981J279K759j107k554J189
6254d03J993j655j805K261J912k250k111K167J715k397r01K993P21l596m75K970
6270A139N36k647K27K397q37l161R65L593p54k937J334K078k402k405L127J904
$$ plain form
6286 2157 -201 -2075 43 1368 -1145 -1972 1252 2163 -1395 -2416 744 1231 -1470 -916 2359 1112
6302 1112 -2197 -1433 1831 1192 -1429 371 2377 -2 -2899 -4 2491 379 -1568 742 1759
6317 1759 -1291 -1993 1460 2569 -1007 -1743 1097 1070 -1991 -1115 2223 1551 -1832 -1116 1466 512 -2155
6334 -2155 89 2294 58 -2473 -188 1998 -612 -1848 1079 1927 -1857 -2530 982 1953 -949 -1399
6350 -1399 1168 596 -2110 -1582 2001 1185 -1631 -810 1421 -181 -2550 110 2703 460 -2208 -120
6366 -120 1602 -458 -1736 987 2521 -869 -1999 759 1588 -1068 -1223 2054 1232 -1993 -1554 1990
6382 1990 1328 -1429 -400 1850 263 -2402 -119 2515 211 -1802 246 1527 -948 -1930 1155
6397 1155 2231 -807 -1736 780 1012 -1643 -1357 1694 1047 -1764 -1423 1381 598 -1198 -169 1667
$$ packed form
6286B157k358j874K118J325k513q27L224R11l558j021L160M87k701N54L275j247
6302A112l309P64L264o39k621J800K006k379k897K895K495k112j947K310J017
6317A759l050p02L453J109l576p36K840k7l061Q76L338o72l383P16K582r54k667
6334b155K244K205k236k531K285K186k610j236K927Q48l784o73L512R71k902m50
6350a399K567n72k706N28L583q16k816Q21K231j602k369K660K593k243k668K088
6366a20J722k060j278K723J534l390j130K758Q29k656j55L277q22l225M39L544
6382A990o62k757J029K250j587k665K283K634k304k013K048J281k475r82L085
6397A155J076l038r29K516K32k655K86L051o47k811L41K804p83j796J029J836
$$ plain form
6413 1667 300 -2319 -487 1804 330 -1471 724 1695 -919 -2087 1208 2054 -662 -1220 1180 1031
6429 1031 -1631 -903 1696 1661 -1083 -859 1227 568 -1699 -208 2069 443 -1846 -459 1396 218
6445 218 -1409 510 1937 -779 -1962 389 1468 -1018 -1019 752 1255 -1376 -1391 1561 919 -1000 -785
6462 -785 1133 -93 -1909 -284 1633 440 -1598 -5 1225 -427 -1257 518 1706 -341 -1263 509
6478 509 1053 -786 -934 1186 1292 -827 -625 1102 1204 -798 -192 1360 272 -1349 -86 1229 502
6495 502 -1182 260 1093 -270 -1262 340 1243 -367 -1101 485 801 -901 -1171 1202 1260 -1193 -722
6512 -722 621 564 -1191 -503 1014 34 -1104 -392 791 207 -1003 191 1019 -242 -1558 52 1337
6529 1337 -294 -768 744 974 -633 -878 810 1247 -479 -578 705 623 -625 -423 1031 377 -866
$$ packed form
6413A667j367k619J832K291j474j801K195R71k614j168L295Q46k716n58K400j49
6429A031k662P28K599l5k744K24K086o59k267J491K277j626k289J387J855j178
6445B18j627J919J427k716j183K351J079k486jJ771N03k631j5K952o42j919K15
6462g85J918j226j816J625J917j193k038J593J230j652q30J775J188k047r22J772
6478E09N44j839j48K120J06k119K02J727J02k002O06J552j088j621J263J315p27
6495E02j684J442Q33j363r92J602R03j610p34J586L16j702k70K373N8k453M71
6512g22J343n7j755O88J517r80j138P12J183n84j210J194Q28j261j316J610J285
6529A337j631m74J512K30j607k45J688M37j726r9J283q2j248K02J454o54j243
$$ plain form
6546 -866 -199 660 153 -883 333 1041 -229 -904 81 635 -511 -477 711 796 -692 -918 694 430
6564 430 -495 -477 427 -68 -565 -609 815 182 -397 -253 402 -415 -898 -95 798 175 -601 113 572 -14
6584 -14 -442 402 346 -205 -397 468 603 -428 -509 782 409 -481 -200 800 230 -333 44 367 -61 -712
6604 -712 -134 554 6 -302 481 229 31 -329 21 189 -147 -200 307 -35 -405 -300 -41 -143 -627 -259
6624 -259 -127 83 -369 -440 330 59 -570 -256 505 -13 -291 62 135 -258 -281 95 384 56 -304 191 56
6645 56 -50 14 157 333 -113 -150 347 263 72 -27 276 174 -205 -42 380 98 -296 201 246 -160 -214 301
6667 301 412 -26 -157 149 140 33 -194 129 -230 -48 -71 289 -54 -462 -244 169 -65 -393 49 99 259
6688 259 -445 39 -21 -7 -148 136 207 -65 -175 113 396 -363 -518 251 456 -150 156 481 151 113 167 347
$$ packed form
6546h66O67Q59n07j036J216P08j270o75R85N54j146L4J188Q5j488k26J612k64
6564D30r25J8R04m95m97m4J424o33n79J44O55q17m83Q03Q93o23p76P14M59n86
6584a4m28Q44n6n51j92Q65J35j031q1J291l73q90K81J000n70n63L77L23m28o51
6604g12N78O88n48l08P83k52j98l60L50J68l36n3N07l42l70J05K59j02m84L68
6624b59J32K10m52p1P70k71o29L14P61n18k78L53P3l93k3L76K89l28l60M95j35
6645E6j06O4J43J76m46l7M97q4j91r9L03j02l79J63M22k82l94M97M5m06n4N15
6667C01J11m38j31L06rj07k27L23l59J82k3L60l43m08K18M13k34l28M42N0J60
6688B59p04M84o0J4j41K84P1k72j10K88K83p59j55P69K05o06L06L25l30l8N4J80
$$ plain form
6710 347 150 -164 -122 315 18 -151 24 327 513 211 64 223 -6 -146 331 71 86 -96 223 14 -367
6731 -367 -264 137 7 -173 93 312 180 -777 -181 289 76 -377 -194 321 -354 -162 -36 43 -99 -144 298
6752 298 -73 -320 37 247 287 -136 85 429 -144 -283 -44 492 312 -271 186 265 -234 -194 348 458 -125
6773 -125 -266 317 329 -96 5 300 296 -656 -212 250 144 -284 -221 247 -131 -514 25 276 155 -343 12
6794 12 412 -299 -541 251 334 -130 -509 12 272 -868 -247 293 190 -418 -224 415 349 -455 -373 415 -225
6815 -225 -340 478 746 -229 -588 321 556 -275 -441 125 579 -156 -544 416 427 -418 -371 610 431 -464 -293
6836 -293 434 -32 -949 430 1185 134 -410 -42 646 -473 -623 532 716 -756 -903 168 517 -666
6854 -666 -640 503 256 -987 -928 893 401 -946 -60 811 288 -838 -64 963 -216 -1032 -73 874
$$ packed form
6710C47j97l14M2M37k97j69J75L03J86l02j47J59k29j40M77k60J5j82L19k09l81
6731c67J03M01j30j80K66K19j32r57N96M70k13m53J83N15o75J92J26P9j42m5M42
6752B98l71k47L57K10M0m23K21L44n73j39K39N36j80n83M57P9m99M0N42J10n83
6773a25j41N83J2m25J01K95mr52M44M62j06m28O3M68l78l83N39K51j21m98L55
6794A2M00p11k42P92Q3m64l79N21K60j140O21N40j03o08J94O39o6q04Q2P88o40
6815b25j15Q18K68r75l59R09K35q31j66N66M54p35l88R60J1q45M7R81j79q95J71
6836b93P27m66r17J379P55j051n44L68O88j119j50J155J84j472j47J071L49j183
6854f66K6J143k47j243N9J821m92j347Q86Q71n23j126P74J027j179q16R59R47
$$ plain form
6872 874 -280 -749 751 937 -507 -782 424 735 -623 -407 1108 650 -782 -406 876 277 -633
6889 -633 144 1050 130 -972 -261 1053 174 -825 145 849 -528 -856 128 1114 -667 -920 501 466 -1061
6908 -1061 -415 867 454 -1010 -798 590 -303 -902 -115 1256 -308 -965 137 1043 -78 -856 595
6925 595 1236 -593 -1507 738 1226 -651 -389 1201 741 -1295 -640 1375 1021 -622 -106 1263 -22
6942 -22 -1079 178 1460 155 -1192 196 1247 -542 -1084 995 1316 -610 -1237 382 716 -945
6958 -945 -712 1064 785 -1404 -991 1093 626 -1182 -118 1060 -26 -1644 -329 1132 177 -1183
6974 -1183 502 891 -559 -1199 527 1120 -474 -1037 640 1198 -1074 -764 1341 1105 -1308 -829 968
6991 968 480 -1115 38 1591 -180 -1456 -79 1176 28 -951 385 1556 -614 -1382 345 1549
$$ packed form
6872H74j154m69J500J86j444k75J206L11j358K16J515m58j432L76J282n99r10
6889f33P77R06r20j102P11J314q79r99R70P04j377l28R84R86j781k53J421l5j527
6908a061O46J282m13j464K12J388q93n99P87J371j564o57J102R06j121p78J451
6925E95O41j829r14K245M88j877K62J590m60k036O55K015l54j643N16J369j285
6942b2j057J257J282j305j347J388J051j789n42K079L21j926o27J619L34j661
6958i45K33J776k79k189M13K084m67j808J064J178j086j618J315J461r55j360
6974a183J685L89j450o40J726N93j594n63J677N58k272L10K105k36k413M79J797
6991I68m88j595J153J553j771j276J377J255j148r79J336J171k170p68J727J204
$$ plain form
7007 1549 -518 -885 1404 1028 -1570 -908 1176 1066 -1450 -733 1095 153 -1575 -366 1741 261
7023 261 -1282 -226 1073 -403 -1384 618 1721 -536 -1396 389 1257 -654 -1019 1161 1047 -1049
7039 -1049 -1300 1099 940 -900 -639 1495 485 -1527 -346 1642 621 -1222 203 1427 -375 -1318
7055 -1318 522 1492 -239 -1156 529 772 -988 -774 1287 1280 -1226 -1059 1026 246 -1198 -621 1556
7072 1556 207 -1550 -651 1361 42 -1076 -89 1085 -538 -1493 252 1467 -502 -987 507 870
7088 870 -720 -1285 1046 1114 -1050 -1033 1044 577 -1048 -344 1487 309 -1297 -405 1513 37 -677
7105 -677 605 1505 -168 -1109 91 1272 -134 -724 1047 1092 -1191 -1070 749 991 -642 -571 828
7122 828 65 -1214 -444 1055 332 -1035 -420 961 -234 -1350 112 1358 -508 -1085 326 724 -527
$$ packed form
7007A549k067l67K289l76k598O62K084j10k516P17J828r42j728J209K107j480
7023B61j543J056J299j476r81K002J103k257q60J785Q68j911l65K180j14k096
7039a049k51K399j59j840K61K134j010k012J181J988j021j843J425J224j802r43
7055a318J840R70j731r17J685K43j760K14K061pk506J67K085p80j444N77K177
7072A556j349j757Q99K012j319j118R87J174j623r55J745J215j969m85J494L63
7088H70j590n65K331O8k164J7K077m67j625P04J831j178j606Q92J918j476p14
7105f77J282R00j673r41J200J181j406n90J771M5k283J21J819K42j633P1J399
7122H28p63j279P70J499p23j367O15J381j195j116J462J246j866n77J411L98j251
$$ plain form
7139 -527 -1123 494 875 -779 -825 688 682 -701 -195 1197 326 -1371 -434 1018 726 -850 83 953
7157 953 -198 -847 154 1263 75 -842 183 678 -364 -678 598 1331 -213 -693 605 514 -668
7174 -668 -232 1148 486 -864 -324 884 372 -666 -271 904 -83 -1101 -23 515 -203 -988 60
7191 60 741 -225 -965 253 497 -514 -562 367 432 -840 -515 630 249 -823 -359 601 -134 -820 29
7210 29 710 -95 -449 65 905 41 -625 578 959 -576 -820 423 832 -436 -472 504 283 -606 -506
7229 -506 580 294 -531 -81 470 389 -676 -72 559 -120 -712 19 516 -387 -246 430 909 -120 -486
7248 -486 -9 318 -405 -481 283 126 -750 -283 172 197 -186 -327 370 309 -418 135 118 231 -342 267 499
7269 499 28 -702 18 196 6 -22 362 543 -162 -181 385 44 -220 -305 466 304 -174 -114 234 128 -417
$$ packed form
7139e27n96J617L81j654m6J513oj383N06J392q71j697R37J452k92j576R33Q70
7157I53j151o49J001J109j188r17J025M95j042l14J276P33j544m80J298r1j182
7174f68M36J380o62j350N40J208n12j038L95J175r87j018J078N38p18p85J048
7191F0O81r66p40J218K44j011m8R29O5j272L25J145l81j072M64R60p35o86Q49
7210B9O81q05l54N14Q40q64o66J203L81j535k44J243M09j268l6R76k21q89J00
7229e06J086k86q25M50N51q1j065O04O31o79n92P31M97r03J41O76M79j029l66
7248d86M77L27p23p6P64j57q76M67M55K5l83j41O97o1p27N53j7J13n73O09K32
7269D99m71p30P20J78j90k8L84J81p05j9N66l41k64q5P71j62m78O0L48j06n45
$$ plain form
7290 -417 -247 276 212 21 146 288 -123 -458 54 330 4 -370 -128 -24 -346 -410 0 427 -266 -155 175
7311 175 190 -175 94 414 -24 -180 -334 415 19 -165 20 359 -37 -218 256 -105 69 -6 172 204 -350
7332 -350 -273 305 439 -172 -138 459 71 -72 -6 169 216 -296 24 219 -16 -313 -24 324 -512 -164 -198 201
7354 201 -179 -64 -148 261 -505 -43 -65 219 98 -88 240 -106 -405 -186 550 -139 -312 -178 -187 31 -88
7375 -88 -91 176 -91 -47 184 45 -174 -116 -231 351 121 -284 573 136 -121 240 247 48 -150 -293 327 343 -181
7398 -181 330 -169 -23 -192 17 -1 23 -172 -96 99 -237 -523 -89 120 -178 43 196 133 -90 -180 313 -237
7420 -237 -30 48 58 -38 -417 89 178 108 -41 55 153 -155 -118 60 186 36 -170 157 336 128 82 380 245
7443 245 -301 -57 368 -38 -299 120 285 122 30 2 510 -295 -49 -8 482 0 -33 337 81 -195 -215 87
$$ packed form
7290d17J70N23o4j91J25J42m11l35N12K76l26l74K42J04l22o4M10M27o93J11L30
7311A75J5l65K69L20m38j56j54P49l96j84J85L39l96j81M74l61J74p5J78L2n54
7332c50P7N78J34o11L4N97l88j43O6J75M7n12L20J95k35k97K89L48q36L48l4L99
7354B01l80J15q4M09p66M62k2K84j21j86L28l46k99K19P36o89j73J34rK18j19
7375h8lK67k67M4K31j39k19N8j15N82k30m05Q57m37k57L61Pj99j98j43O20J6n24
7398a81N11m99J46j69K09j8K4j95P6J95l36k86M34K09k98K21J53o3k23r0M93n50
7420b37K07P8J0r6l79N06Q9p0j49R6R8l08L7J78J26j50k06L27J79k08m6K98j35
7443B45n46K44M25m06k61M19J65j63r2k8N08q05K46M1M90m82l3L70k56k76k0L02
$$ plain form
7465 87 -17 -264 -119 32 86 -287 53 413 -284 -501 0 322 -8 -345 47 344 -123 -471 275 237 -272
7486 -272 -530 52 123 -297 -259 234 93 -191 59 235 209 -274 320 226 33 -577 -138 257 -160 -58 163
7507 163 488 -184 -241 232 231 -144 -304 420 317 -289 -357 430 106 -142 -109 138 -134 -276 -303 564 163 -708
7529 -708 -74 415 -111 -284 430 236 -209 -476 -200 508 -272 -295 205 529 -468 -464 327 106 -439 -315 728
7550 728 233 -602 -64 513 31 -472 -41 485 -9 -396 311 668 -152 -588 241 534 -143 -351 372 455
7570 455 -273 -347 358 310 -530 -35 330 -239 -604 -217 347 -91 -921 245 379 -118 -640 258 539 -266
7590 -266 -705 767 300 -817 -648 449 752 -433 -135 492 173 -665 -323 707 235 -404 43 537
7608 537 6 -729 585 1049 -105 -831 141 608 -424 -392 801 688 -368 -475 378 312 -733 -93 686
$$ packed form
7465H7j04k47J45J51N4l73L40L60o97k17N01L22l30l37L92K97m67l48P46l8n09
7486b72k58N82P1m20L8M93j41k84K50J76k6m83N94r4j93o10M39L95m17J02K21
7507A63L25o72n7M73jl75j60P24j03o06o8P87l24k48L3K47k72j42k7Q67m01q71
7529g08O34M89n26j73P14j94m45k67K76P08p80k3N00L24r97MP91k21n45J24J043
7550G28m95q35N38N77m82n03M31N26m94l87P07L57q20m36Q29K93o77k08P23Q3
7570D55p28p4P05m8q40M95L65n69l65L87N64m38q30J166J34m97n22Q98K81q05
7590b66m39J472m67j117J69J097L03j185K98O27l19q38L42J030m72o39M47M94
7608E37n31p35J314M64j154p26R72M67j032L2J193j13j056j07Q53o6j045O40P79
$$ plain form
7627 686 -13 -1099 -141 672 402 -814 54 628 -191 -863 273 912 -223 -506 128 524 -610 -896
7645 -896 830 491 -805 -554 783 285 -855 -120 1079 132 -981 -377 887 -98 -864 320 851
7662 851 -310 -819 368 690 -141 -971 635 476 -481 -343 825 1040 -441 -210 383 505 -683 -41
7680 -41 1261 676 -845 -330 492 -84 -813 29 1070 -482 -1069 -99 679 -219 -757 637 498 -741
7698 -741 -793 477 390 -652 -738 730 476 -897 -308 603 395 -907 -102 778 -216 -836 370 918 -27
7717 -27 -649 17 604 -508 -507 666 822 -782 -927 528 593 -499 -293 994 426 -875 -298 1027 257
7736 257 -888 -137 851 -249 -1454 56 1072 -102 -336 500 402 -649 -642 442 751 -612 -965 762
7754 762 -14 -777 -212 931 440 -803 -83 992 159 -807 16 867 -117 -1100 265 736 -406 -797
$$ packed form
7627F86o99j086R58Q13k70j216Q68N74q19o72J136O39j135k83O34L96j134k86
7645h96J726l39j296K51J337m98j140P35J199r47j113O04J264r85p66J184N31
7662H51j161n09J187L22q31q30J606j59r57J38J168K15j481K31N93J22j188O42
7680d1J302n85j521N15Q22n76p29Q42J041j552n87R70P78q98n38J394j39j239
7698g41n2J270q7j042q6J468k54j373N89R11k08j302Q05Q80r94o20J206N48r45
7717b7o22O66N87j112JJ173J56j604j45J455O5j092K06J287n68j301N77J325p70
7736B57j145P51R88j100j205J510J016j174k34Q36r8j051PJ084L09j363l53J727
7754G62p76p63N65J143m91j243P20J075q33r66Q23Q51r84r83J365M71j142l91
$$ plain form
7772 -797 316 711 -770 -633 332 482 -193 -367 365 388 -544 -455 813 642 -778 -85 828 144 -999
7791 -999 103 871 328 -878 113 511 -402 -586 376 628 -516 -811 289 346 -451 -406 682 275 -725
7810 -725 -596 657 552 -788 -50 885 -246 -1151 19 845 -8 -677 32 811 -568 -703 308 818
7828 818 -217 -439 349 474 -691 -405 910 639 -480 -488 533 183 -596 -206 671 272 -458 -68 844
7847 844 209 -730 -47 959 -282 -841 406 725 -403 -543 512 457 -449 -438 577 408 -666 -524
7865 -524 733 -62 -794 149 896 -33 -745 -198 522 -188 -412 47 541 -102 -490 593 500 -86 -480 689
7885 689 361 -360 -356 633 389 -684 -142 495 241 -596 282 593 334 -391 -121 544 -338 -134 197 351
7905 351 -331 -617 418 489 39 -382 520 504 -631 -214 495 84 -404 -15 454 -256 -541 -104 456 -174
$$ packed form
7772g97J113L95j481J37R65J50o75j74P32K3r32Q9J268j71j420O93R13o84j143
7791i99J102P68n43j206R91L98r13j84R62K52j144k95J100N7p97M5J088m07j000
7810g25J29J253j05j340P38R35j131r05J170Q26q53o69P09P79j379j35J011N10
7828H18j035k22P88J25j165K86J315k71j119qJ021l50p79L90Q77l99p30L90R12
7847H44o35r39O83J006j241n59J247L19j128j40J055n5r06J1J015j69j074J42
7865e24J257p95p32R43P47r29p12N47P20p10k24M59M94o43l88J083r3n86l94J169
7885F89l28p21MR89k44j073N42O37k54q37Q78L11k59p25K70O65q82K04L31J54
7905C51o82k86J035P1m50m21R02j6j135M17P09m11m88L89M69p10k85M37N60o30
$$ plain form
7925 -174 -363 -82 538 -188 -628 214 391 -307 -199 187 320 -318 -90 295 404 -352 -8 415 155 -574
7945 -574 -266 302 75 -245 -272 403 194 -255 102 502 -33 -213 131 191 31 -55 159 442 24 -194 588
7966 588 197 -148 -56 378 -31 -417 -50 252 161 -629 -377 182 -55 -521 -363 -34 -237 -358 15 561 -303
7987 -303 -286 -414 475 -224 -441 427 103 -156 -102 425 330 -153 -13 -26 190 -251 255 427 11 -56 -154 169
8009 169 -175 -149 150 400 222 266 201 476 -43 -331 146 -163 -339 -94 131 394 -154 -59 141 -81 -125 21
8031 21 65 19 -130 -155 -100 -25 -298 28 114 -395 -283 147 -108 -164 -322 132 53 -84 -90 -215 237 -329 -87 151
8055 151 92 -288 -62 147 173 -89 83 -68 -93 174 73 71 81 -98 234 263 173 -100 72 174 -148 77 -13
8078 -13 290 64 -215 -89 250 -288 -115 -43 252 -186 -289 -154 -141 -259 231 23 -183 -213 43 89 -131 78
$$ packed form
7925a74j89K81O20p26m40Q42J77o98J08L86J33o38K28L85J09p56L44M23k60p29
7945e74L08N68k27l20k7O75k09m49L57M00n35j80L44O0j60q6K14K83m18k18P82
7966E88l91l45R2M34m09l86L67L02r1p90K52N59k37m66J58L29k03j21L73N46q64
7987c03J7j28Q89o99k17Q68l24k59N4N27r5m83J40j3K16m41N06J72m16o7r8L23
8009A69l44K6K99K50j78M4o5K75n19k88M77l09j76K45K25K63n48R5K00k22m4J46
8031B1M4m6j49k5N5P5k73L26Q6n09J12M30k55n6j58M54p9j37oj25M52n66K42K38
8055A51n9l80K26K09K6k62J72j51k5K67j01kJ0j79L32K9r0k73J72J02l22K25r0
8078a3L03k26k79J26L39n38J73P2K95m38j03J35J3j18M90k08k06l0K56M6k20K09
$$ plain form
8100 78 -42 103 111 -133 40 -59 -19 -167 -101 89 -49 12 171 293 -84 161 396 -31 -247 49 426 307
8122 307 96 50 175 62 -67 180 199 -118 -183 195 -61 -88 -186 -55 -32 -150 135 163 16 -256 -299 201 81
8145 81 -222 -306 -105 93 -501 -174 221 -209 -171 -121 -99 -208 -100 6 -106 -371 -120 179 -170 77 -61 68
8167 68 -18 -398 206 348 227 107 280 -95 161 -26 172 7 -32 -199 165 61 -214 -20 191 1 -123
8188 -123 98 192 -5
$$ packed form
8100G8j20J45Qk44J73r9M0j48O6J90j38O1J59J22l77K45K35m27k16K96L77j19
8122C07k11m6J25j13j29K47J9l17o5L78k56k7r8J31K3j18K85K8j47k72m3N00j20
8145H1l03q4K01J98n94L27L95m30L8N0K2j09J08J06j12k65K51K99l49K47j38J29
8167F8q6l80O04J42j21j20J73l75K56j87J98j65l9j67L64j04k75J94K11j90j24
8188a23K21R4j97
8191e
$$ Imaginary data points
##PAGE= N=2
##DATA TABLE= (X++(I..I)), XYDATA
$$ plain form
0 0 0 0 0 8 -8 0 -8 8 -16 16 -17 24 -32 38 -48 56 -64 80 -89 106 -128 146 -166 195 -223 255 -288 328 -373
29 -373 421 -471 529 -594 662 -741 821 -915 1017 -1124 1245 -1380 1529 -1690 1873 -2076
45 -2076 2306 -2561 2858 -3203 3600 -4079 4657 -5370 6290 -7515 9219 -11793 16086 -24546
59 -24546 47512 -235519 -682817 33325 465202 49382 -334342 31429 335545 77148
69 77148 -201914 -44135 135994 154999 180540 98480 -274662 -428115 -8173 385769 168175
80 168175 -166920 -97811 9053 -158292 -130095 210895 216735 -213658 -306728 49296 88724
91 88724 -226724 -90011 414659 340874 -250590 -313031 210383 329541 -88226 -183799 168635
102 168635 228325 -126377 -273757 -52451 161778 241228 210665 -72531 -411025 -259713
$$ packed form
0@%%%Qj6QqJ6k4L2l3M1n6P0q6J04j20J44j69J95k34K74l12L61m18M78n43O16p01
29c73P94q92J000j123J256j403J562j736J932k141K369k625K909l219L563l949
45b076M382m867N419o061O803p679Q736j0027J1660j3805J6734k1012K7879m0632
59b4546P2058k83031m47298P16142M31877m15820l83724L65771L04116k58397
69G7148k79062J57779J80129J9005K5541q2060l73142j53453M19942L93942k17594
80A68175l35095O9109J06864j67345K8197L40990N840m30393r3070L56024L9428
91H8724l15448J36713N04670p3785n91464o2441N23414J19158m17767r5573L52434
102A68635N9690l54702j47380K21306K14229P9450l0563k83196l38494J51312
$$ plain form
112 -259713 240608 282797 -177822 -304038 45384 108996 -207616 -160460 271052 300827 -101957
123 -101957 -185556 82150 62154 -169856 -29988 278565 140234 -205122 -132115 144149
133 144149 86895 -75165 75106 217497 -33792 -309026 -198489 27315 66825 72982 77345
144 77345 -121606 -294085 -34550 325038 173708 -205584 -124031 193825 74782 -254351
154 -254351 -119372 265302 231444 -69121 -66565 110090 35689 -91560 57167 192480 6193
165 6193 -188300 -106800 -17934 -80406 -17246 179628 112516 -183080 -212569 45001 123363
176 123363 -20455 -30898 46499 -67139 -182217 5342 210161 76725 -91782 55792
186 55792 195511 -8678 -196770 -20035 177111 51111 -113424 -46946 4719 -99067
$$ packed form
112b59713N00321M2189m60619j26216L49422O3612l16612M7156M31512K9775m02784
123a01957q3599K67706j9996k32010J39868L08553j38331l45356P3007K76264
133A44149n7254j62060J50271J42391k51289k75234J10537K25804L9510O157M363
144G7345j98951j72479K59535L59588j51330l79292Q1553L17856j19043l29133
154b54351J34979L84674l3858l00565K556J76655p4401j27249J48727J35313j86287
165F193j94493Q1500Q8866o2472O3160J96874o7112k95596k9489K57570P8362
176A23363j43818j0443P7397j13638j15078J87559K04819j33436j68507J47574
186E5792J39719k04189j88092J76735J97146j26000j64535O6478N1665j03786
$$ plain form
196 -99067 -74087 131325 153993 -62662 -148809 -35630 -12801 -76129 10655 122503 -6280
207 -6280 -169926 -46900 156891 106037 -24628 44791 125945 -2355 -107734 5812 90176
218 90176 -13499 -53530 72615 82852 -85668 -112197 62721 116408 -19883 -73564 -17276
229 -17276 -68604 -152513 -37078 131377 60000 -113134 -75212 74375 65714 -14764 27222
240 27222 75485 -14513 -81267 1658 56888 -15263 -29686 73344 86468 -31459 -60116 29083
252 29083 31574 -54162 -38376 35338 -28400 -141851 -80024 70822 73794 -17835 -13377 31533
264 31533 -12672 -42377 45703 94080 -11311 -90091 -1866 87502 38998 -14946 34799 74378
276 74378 27736 -6518 6672 -18101 -60094 -23589 31295 -15669 -87156 -45026 33159 12599
$$ packed form
196i9067K4980K05412K2668k16655q6147J13179K2829o3328Q6784J11848j28783
207f280j63646J23026K03791n0854j30665O9419Q1154j28300j05379J13546Q4364
218I0176j03675m0031J26145J0237j68520k6529J74918N3687j36291n3681N6288
229a7276n1328q3909J15435J68455p1377j73134L7922J49587q661q0478M1986
240B7222M8263q9998o6754Q2925N5230p2151j4423J03030J3124j17927k8657Q9199
252B9083K491q5736J5786P3714o3738j13451O1827J50846K972r1629M458M4910
264C1533m4205k9705Q8080M8377j05391p8780Q8225Q9368m8504n3944M9745L9579
276G4378m6642l4254J3190k4773m1993L6505N4884m6964p1487M2130P8185k0560
$$ plain form
288 12599 -30574 14077 48070 -30954 -96280 -24437 60086 22501 -43783 -17384 35356 32308
300 32308 27493 53599 40608 -13674 -17529 25770 12405 -50804 -54594 644 18035 -8794 -11502
313 -11502 1019 -13753 -19968 14472 23389 -32194 -67340 -25266 19521 7517 -2059 31109 45455
326 45455 15892 11056 51256 57998 5822 -29429 -7985 14562 4090 -8788 -6139 -4565 1829
339 1829 21061 19877 -19021 -48295 -29052 -4541 -19568 -43473 -36243 -15531 -5081 9000 31589
352 31589 31443 5976 -3370 15935 25348 6643 -12567 -12177 -3450 7109 20633 24772 9343 -4695
366 -4695 2661 13341 -243 -27324 -40061 -35272 -24667 -13096 -3691 -3854 -7096 3094 24631
379 24631 31780 15439 -3883 -6753 1898 11074 13504 9744 6836 12861 28391 37852 29313 9092
$$ packed form
288A2599m3173M4651L3993p9024o5326P1843Q4523l7585o6284K6399N2740l048
300C2308m815K6106j2991n4282l855M3299j3365o3209l790N5238J7391k6829k708
313a1502J2521j4772o215L4440Q917n5583l5146M2074M4787j2004r576L3168J4346
326D5455k9563m836M0200O742n2176l5251K1444K2547j0472j2878K649J574O394
339A829J9232j184l8898k9274J9243K4511j5027k3905P230K0712J0450J4081K2589
352C1589j46k5467r346J9305R413j8705j9210L90Q727J0559J3524M139j5429j4038
366d695P356J0680j3584k7081j2737M789J0605J1571R405j63l242J0190K1537
379B4631P149j6341j9322k870Q651R176K430l760k908O025J5530R461q539k0221
$$ plain form
393 9092 -6936 -11911 -10555 -12439 -22397 -34484 -34637 -17890 2412 6699 -3173 -11147 -8274 -951
407 -951 415 -7160 -16995 -18619 -8305 9342 21578 22241 17152 16229 21475 24875 17456 -647 -18429
422 -18429 -23147 -13382 -3184 -5004 -13995 -13958 -1223 10802 8658 -4363 -15170 -17673 -13859 -8102
436 -8102 -4128 -4329 -2109 8869 23957 31957 31014 25308 15685 6172 5695 12390 5240 -16057 -23801
451 -23801 -2745 18030 11085 -8338 -11637 -2935 -3192 -11441 -19054 -26558 -32450 -24853 -7350 -344
465 -344 -3664 2935 16044 17049 10794 13573 14665 -435 -12037 700 13522 2460 -8237 5371
479 5371 18381 10369 4789 13000 2065 -29777 -33591 -1063 7320 -25341 -38918 -7957 17814
492 17814 10281 4681 15014 13940 1694 6832 13722 -2711 -12603 11690 29445 7161 -7528
$$ packed form
393I092j6028m975J356j884r958j2087j53J6747K0302M287r872p974K873P323
407i51J366p575r835j624J0314J7647J2236O63n089r23N246L400p419j8103j7782
422a8429m718R765J0198j820q991L7J2735J2025k144j3021j0807k503L814N757
436h102L974k01K220J0978J5088Q000r43n706r623r513m77O695p150k1297p744
451b3801K1056K0775o945j9423l299Q702k57q249p613p504n892P597J7503P006
465c44l320O599J3109J005o255K779J092j5100j1602J2737J2822j1062j0697J3608
479E371J3010q012n580Q211j0935l1842l814L2528Q383l2661j3577L0961K5771
492A7814p533n600J0333j074j2246N138O890j6433r892K4293J7755k2284j4689
$$ plain form
505 -7528 19523 34613 4876 -10845 15565 17258 -30944 -51328 -12706 9198 -16112 -24048 1567
518 1567 -381 -26317 -8472 31848 14781 -33273 -25607 12723 2314 -24808 2694 39209 17471
531 17471 -9635 16141 33935 -2555 -18477 23492 31964 -27992 -52378 -4287 17578 -13500
543 -13500 -8488 32774 13663 -45031 -29706 33016 23648 -30181 -17873 22714 -5522 -41939
555 -41939 9824 67422 30071 -19258 13630 40534 -10960 -36617 24334 49144 -18858 -50610
567 -50610 4824 20911 -31373 -22799 50851 41900 -49932 -67046 -2791 10824 -21251 -1759
579 -1759 24778 -25703 -60455 11104 67015 7105 -32903 37323 61957 -43010 -89265 21799
591 21799 92719 7561 -56083 4279 35976 -26502 -32178 47957 52452 -30439 -45103 2981
$$ packed form
505g528K7051J5090k9737j5721K6410J693m8202k0384L8622K1904k5310p936K5615
518A567j948k5936J7845M0320j7067m8054P666L8330j0409k7122K7502L6515k1738
531A7471k7106K5776J7794l6490j5922M1969Q472n9956k4386M8091K1865l1078
543a3500N012M1262j9111n8694J5325O2722r368n3829J2308M0587k8236l6417
555d1939N1763N7598l7351m9329L2888K6904n1494k5657O0951K4810o8002l1752
567e0610N5434J6087n2284Q574P3650q951r1832j7114O4255J3615l2075J9492
579a759K6537n0481l4752P1559N5911n9910m0008P0226K4634j04967m6255J11064
591B1799P0920q5158o3644O0362L1697o2478n676Q0135M495q2891j4664M8084
$$ plain form
603 2981 -19340 -59425 11637 90487 20042 -79748 -35812 51201 28096 -10823 35652 45047
615 45047 -44466 -65881 31476 54876 -29751 -17715 91348 55827 -105296 -99814 76291 113119
627 113119 -35109 -92297 -1615 18917 -54324 -41623 45935 47125 -11405 -12952 -11904 -61251
639 -61251 -34408 89190 94698 -60272 -113736 17565 78021 -17883 -35267 77790 79710 -59378
651 -59378 -85615 24338 41169 -30941 6469 81316 -14736 -145104 -51424 125582 89573
662 89573 -58549 -49106 41129 983 -76261 -17553 71267 46085 -3305 -2904 -37774 -74129
674 -74129 30726 158986 63681 -125350 -86928 83232 47973 -105198 -44110 132926 80727
685 80727 -116705 -117603 34537 60930 -3795 19699 37841 -70322 -122363 8173 100040 11417
$$ packed form
603B981k2321m0085P1062P8850p0445r9790M3936Q7013k3105l8919M6475R395
615D5047q9513k1415R7357K3400q4627J2036J09063l5521j61123N482J76105L6828
627A13119j48228n7188R0682K0532p3241J2701Q7558J190n8530j547J048m9347
639f1251K6843J23598N508j54970n3464J31301O0456r5904j7384J13057J920j39088
651e9378k6237J09953J6831p2110L7410P4847r6052j30368R3680J77006l6009
662H9573j48122R443R0235m0146p7244N8708Q8820k5182m9390M01l4870l6355
674g4129J04855J28260r5305j89031L8422J70160l5259j53171O1088J77036n2199
685H0727j97432q98J52140K6393o4725K3494J8142j08163n2041J30536R1867q8623
$$ plain form
697 11417 -47872 34590 49075 -68363 -83179 56082 105032 9926 -31453 -5154 -51103 -79193
709 -79193 51974 150554 13520 -128244 -24025 98480 -16248 -127019 23352 170988
$$ packed form
697A1417n9289Q2462J4485j17438j4816J39261M8950r5106m1379K6299m5949k8090
709g9193J31167R8580j37034j41764J04219J22505j14728j10771J50371J47636
$$ [...]
8191a81
##END NTUPLES=NMR FID
##END=
