##TITLE=1H_LR-675-C-2-3-C
 CDcl3, 8 sc, 
 30.5.2019
##JCAMPDX= 6.0         $$ Bruker NMR JCAMP-DX V2.0
##DATA TYPE= NMR FID
##DATA CLASS= NTUPLES
##ORIGIN= UXNMR, Bruker Analytische Messtechnik GmbH
##OWNER= root
$$ XWIN-NMR		Version 3.5
$$ Thu May 30 13:32:58 2019 Russian Standard Time (UT+4h)  she@DPX200
##.OBSERVE FREQUENCY= 200.13155
##.OBSERVE NUCLEUS= ^1H
##.DELAY= (6, 6)
##.ACQUISITION MODE= SIMULTANEOUS
##.ACQUISITION SCHEME= undefined
##.AVERAGES= 8
##.DIGITISER RES= 18
##SPECTROMETER/DATA SYSTEM= spect
##.PULSE SEQUENCE= zg30
##.SOLVENT NAME= CDCl3
##.SHIFT REFERENCE= (INTERNAL, CDCl3, 0, 15.7039)
##AUDIT TRAIL= $$ (NUMBER, WHEN, WHO, WHERE, WHAT)
$$ ##TITLE= Audit trail, XWIN-NMR		Version 3.5
$$ ##JCAMPDX= 5.01
$$ ##ORIGIN= Bruker BioSpin GmbH
$$ ##OWNER= she
$$ F:/spectra/data/she/nmr/H-F/1/audita.txt
$$ ##AUDIT TRAIL=  $$ (NUMBER, WHEN, WHO, WHERE, WHAT)
(   1,<2019-05-30 13:31:48.51 +0400>,<she>,<DPX200>,
      <created by zg, POWCHK disabled, PULCHK disabled
       configuration hash MD5:
       00 E9 B6 7A A2 85 ED C7 34 08 36 98 17 FE 4E 26
       data hash MD5: 16K
       EC 5F 10 35 1D 86 37 CA A3 B8 0E 2B 41 85 90 9F>)
$$ ##END=
$$ 
$$ hash MD5
$$ BC 40 D8 AF 68 75 61 C6 A1 B6 62 DB 9E 80 65 5F
##$RELAX= 
##$RELAX= 
##$RELAX= 
##$RELAX= 
##$RELAX= 
##$RELAX= 
$$ Bruker specific parameters
$$ --------------------------
##$DU= <F:/spectra>
##$EXPNO= 1
##$NAME= <H-F>
##$PROCNO= 1
##$TYPE= <nmr>
##$USER= <she>
##$AMP= (0..31)
100 100 100 100 100 100 100 100 100 100 100 100 100 100 100 100 100 100 
100 100 100 100 100 100 100 100 100 100 100 100 100 100 
##$AQSEQ= 0
##$AQ_mod= 1
##$AUNM= <au_zg>
##$AUTOPOS= <>
##$BF1= 200.13
##$BF2= 200.13
##$BF3= 200.13
##$BF4= 200.13
##$BF5= 200.13
##$BF6= 200.13
##$BF7= 200.13
##$BF8= 200.13
##$BYTORDA= 1
##$CFDGTYP= 0
##$CFRGTYP= 5
##$CHEMSTR= <none>
##$CNST= (0..31)
1 1 145 1 1 1 1 1 1 1 1 1 1 1 1 1 1 1 1 1 1 1 1 1 1 1 1 1 1 1 1 1 
##$CPDPRG= <>
##$CPDPRG1= <>
##$CPDPRG2= <>
##$CPDPRG3= <>
##$CPDPRG4= <mlev>
##$CPDPRG5= <mlev>
##$CPDPRG6= <mlev>
##$CPDPRG7= <mlev>
##$CPDPRG8= <mlev>
##$CPDPRGB= <>
##$CPDPRGT= <>
##$D= (0..31)
0 1.2 0 0 0 0 0 0 0 0 0 0.03 0 0 0 0 0 0 0 0 0 0 0 0 0 0 0 0 0 0 0 0 
##$DATE= 1559208707
##$DBL= (0..7)
120 120 120 120 120 120 120 120 
##$DBP= (0..7)
150 150 150 150 150 150 150 150 
##$DBP07= 0
##$DBPNAM0= <>
##$DBPNAM1= <>
##$DBPNAM2= <>
##$DBPNAM3= <>
##$DBPNAM4= <>
##$DBPNAM5= <>
##$DBPNAM6= <>
##$DBPNAM7= <>
##$DBPOAL= (0..7)
0.5 0.5 0.5 0.5 0.5 0.5 0.5 0.5 
##$DBPOFFS= (0..7)
0 0 0 0 0 0 0 0 
##$DE= 6
##$DECBNUC= <off>
##$DECIM= 24
##$DECNUC= <off>
##$DECSTAT= 4
##$DIGMOD= 1
##$DIGTYP= 9
##$DL= (0..7)
0 120 120 120 120 120 120 120 
##$DP= (0..7)
150 150 150 150 150 150 150 150 
##$DP07= 0
##$DPNAME0= <>
##$DPNAME1= <>
##$DPNAME2= <>
##$DPNAME3= <>
##$DPNAME4= <>
##$DPNAME5= <>
##$DPNAME6= <>
##$DPNAME7= <>
##$DPOAL= (0..7)
0.5 0.5 0.5 0.5 0.5 0.5 0.5 0.5 
##$DPOFFS= (0..7)
0 0 0 0 0 0 0 0 
##$DQDMODE= 0
##$DR= 18
##$DS= 0
##$DSLIST= <SSSSSSSSSSSSSSS>
$$ [...]
##$SUBNAM2= <"">
##$SUBNAM3= <"">
##$SUBNAM4= <"">
##$SUBNAM5= <"">
##$SUBNAM6= <"">
##$SUBNAM7= <"">
##$SUBNAM8= <"">
##$SUBNAM9= <"">
##$SW= 24.9336996594482
##$SWIBOX= (0..15)
0 0 2 0 0 0 0 0 0 0 0 0 0 0 0 0 
##$SW_h= 4990.01996007984
##$TD= 16384
##$TD0= 1
##$TE= 0
##$TE2= 300
##$TE3= 300
##$TEG= 300
##$TL= (0..7)
0 120 120 120 120 120 120 120 
##$TP= (0..7)
150 150 150 150 150 150 150 150 
##$TP07= 0
##$TPNAME0= <>
##$TPNAME1= <>
##$TPNAME2= <>
##$TPNAME3= <>
##$TPNAME4= <>
##$TPNAME5= <>
##$TPNAME6= <>
##$TPNAME7= <>
##$TPOAL= (0..7)
0.5 0.5 0.5 0.5 0.5 0.5 0.5 0.5 
##$TPOFFS= (0..7)
0 0 0 0 0 0 0 0 
##$TUNHIN= 0
##$TUNHOUT= 0
##$TUNXOUT= 0
##$USERA1= <user>
##$USERA2= <user>
##$USERA3= <user>
##$USERA4= <user>
##$USERA5= <user>
##$V9= 5
##$VALIST= <valist>
##$VCLIST= <CCCCCCCCCCCCCCC>
##$VD= 0
##$VDLIST= <DDDDDDDDDDDDDDD>
##$VPLIST= <PPPPPPPPPPPPPPP>
##$VTLIST= <TTTTTTTTTTTTTTT>
##$WBST= 1024
##$WBSW= 4
##$XGAIN= (0..3)
0 0 0 0 
##$XL= 0
##$YL= 0
##$YMAX_a= 898413
##$YMIN_a= -922475
##$ZGOPTNS= <>
##$ZL1= 120
##$ZL2= 120
##$ZL3= 120
##$ZL4= 120
##$ABSF1= 10
##$ABSF2= 0
##$ABSG= 5
##$ABSL= 3
##$ALPHA= 0
##$AQORDER= 0
##$ASSFAC= 0
##$ASSFACI= 0
##$ASSFACX= 0
##$ASSWID= 0
##$AUNMP= <proc_1d>
##$AZFE= 0.1
##$AZFW= 0.1
##$BCFW= 1
##$BC_mod= 2
##$BYTORDP= 1
##$COROFFS= 0
##$CY= 11.3945322036743
##$DATMOD= 1
##$DC= 2
##$DFILT= <>
##$DTYPP= 0
##$F1P= 18.9103706918063
##$F2P= -1.10871071338519
##$FCOR= 0.5
##$FTSIZE= 0
##$FT_mod= 4
##$GAMMA= 1
##$GB= 0.15
##$INTBC= 1
##$INTSCL= 1
##$ISEN= 128
##$LB= 0.24
##$LEV0= 0
##$LPBIN= 0
##$MAXI= 10000
##$MC2= 0
##$MEAN= 0
##$ME_mod= 0
##$MI= 1.114404
##$NCOEF= 0
##$NC_proc= 0
##$NLEV= 6
##$NOISF1= 3.799351
##$NOISF2= 2.8
##$NSP= 1
##$NTH_PI= 0
##$NZP= 0
##$OFFSET= 15.70392
##$PC= 1
##$PHC0= -8497
##$PHC1= 13.40023
##$PH_mod= 1
##$PKNL= yes
##$PPARMOD= 0
##$PSCAL= 0
##$PSIGN= 0
##$REVERSE= no
##$SF= 200.130013532006
##$SI= 16384
##$SIGF1= 3
##$SIGF2= 2
##$SINO= 400
##$SIOLD= 16384
##$SREGLST= <1H.CDCl3>
##$SSB= 0
##$STSI= 0
##$STSR= 0
##$SW_p= 3612.71676300578
##$SYMM= 0
##$S_DEV= 0
##$TDeff= 0
##$TDoff= 0
##$TI= <>
##$TILT= no
##$TM1= 0
##$TM2= 0
##$TOPLEV= 0
##$USERP1= <user>
##$USERP2= <user>
##$USERP3= <user>
##$USERP4= <user>
##$USERP5= <user>
##$WDW= 1
##$XDIM= 8192
##$YMAX_p= 0
##$YMIN_p= 0
$$ End of Bruker specific parameters
$$ ---------------------------------
##NTUPLES= NMR FID
##VAR_NAME=  TIME,          FID/REAL,        FID/IMAG
##SYMBOL=    X,             R,               I
##VAR_TYPE=  INDEPENDENT,   DEPENDENT,       DEPENDENT
##VAR_FORM=  AFFN,          ASDF,            ASDF
##VAR_DIM=   8192,          8192,            8192
##UNITS=     SECONDS,       ARBITRARY UNITS, ARBITRARY UNITS
##FACTOR=    0.0002004,     1,               1
##FIRST=     0,             0,               0
##LAST=      1.6414764,     0,               0
##MIN=       0,             -922475,         0
##MAX=       1.6414764,     898413,          0
$$ Real data points
##PAGE= N=1
##DATA TABLE= (X++(R..R)), XYDATA
$$ [...]
409 82105 61408 21090 40567 107905 132446 67316 -23836 -50472 -15598 -5760 -63948 -125358
421 -125358 -106174 -23626 22875 -14991 -69962 -57966 1944 15736 -48060 -106805 -78188 6095
433 6095 47808 21593 1956 46056 114520 126128 67058 3812 1437 42566 53866 4886
445 4886 -43981 -19341 51899 71324 7320 -55884 -44332 466 -9066 -77443 -122464 -88709
457 -88709 -14035 16216 -22060 -55851 -13542 63923 69054 -7209 -50670 1538 65476 48524
469 48524 -6372 -4096 54530 94455 78166 30991 -5735 -4152 22319 16934 -42883 -86681 -47736
482 -47736 17812 11812 -46514 -58947 -13504 11279 -19978 -65373 -79913 -51098 4727 34322
494 34322 724 -33765 16706 98423 83897 -6637 -27128 42367 68611 6464 -34239 3697
506 3697 51617 56940 42407 16038 -19628 -20476 18031 11052 -65199 -98269 -34214 16534 -20764
519 -20764 -51603 -4809 40837 20230 -13512 -24087 -42212 -45555 7907 47550 -4076 -52214
531 -52214 20536 115160 78618 -11332 249 58339 24898 -52861 -54080 -9089 5348 16998
543 16998 40297 8091 -50796 -17720 67741 34953 -90006 -108320 -14849 4148 -65713 -59522
555 -59522 34295 67372 26949 11860 11839 -20353 -15641 51378 44868 -65120 -89651 39477 114683
568 114683 37305 -8239 69652 98284 -186 -65255 -28036 -9289 -33511 -7345 20774 -45566
580 -45566 -88902 24826 130765 37629 -100501 -64050 24659 -31534 -119413 -59486 45928
591 45928 43559 2534 10452 9419 -138 68063 124603 12937 -133042 -73250 76933 48247
603 48247 -65815 -1777 138750 87194 -63237 -54432 46473 29554 -42416 -34477 -38880 -116983
615 -116983 -98717 55239 108539 -7018 -52605 39920 45768 -72099 -85346 30209 56309
626 56309 -23327 -33073 13952 3292 22111 141441 160815 -17227 -118458 12370 90612
637 90612 -51414 -124390 38740 131330 -30007 -147163 -18666 109218 46454 -39552 -38522
648 -38522 -70433 -129489 -69391 36941 15829 -37798 33299 84801 -24996 -85748 60943
659 60943 159554 22159 -103767 -27852 38108 -27753 -5245 146612 141291 -45859 -86751
670 -86751 51117 52602 -85905 -62300 79246 20333 -167949 -141583 54196 98726 3984
681 3984 -9844 12220 -58462 -94363 1374 48229 -22448 -11999 87511 34704 -108347 -19854
693 -19854 211958 179229 -69400 -110027 51069 43197 -100759 -45712 129964 88013 -91431
704 -91431 -92338 19076 5378 -41247 29292 42980 -111906 -182047 -33930 71328 2184 -16983
716 -16983 76190 48316 -91662 -68002 88524 94910 -12187 9050 66107 -41743 -116796
727 -116796 67089 232466 80386 -119195 -42609 82060 -25175 -132154 1823 124409
737 124409 106 -139953 -81866 9172 5165 30738 76619 -21011 -152660 -79309 70984
748 70984 29899 -60941 43799 150347 8268 -140890 -11318 163759 92070 -36669 1036
759 1036 26906 -82851 -85390 93288 140943 -26289 -92322 18320 16930 -114901 -81809 88028
771 88028 73203 -103617 -133957 -19903 12504 1758 76777 93868 -51161 -122104 12265
782 12265 89058 -18083 -37208 112984 120103 -79362 -122198 81038 172717 32871 -51376
793 -51376 3916 -17591 -103607 -39689 91088 50158 -64755 -32240 31087 -51732 -104972 30290
805 30290 119415 -17944 -141994 -59205 31325 -7886 1411 107069 87283 -61759 -72068
816 -72068 55327 59079 -39490 876 102045 17360 -128380 -55825 113351 94889 -21542
827 -21542 -13785 18668 -69668 -115988 1983 74989 -19413 -74599 7015 21799 -69529 -39545
839 -39545 105978 97490 -63718 -98235 5961 20441 -33561 29635 119067 41483 -71034
850 -71034 -11949 86336 35023 -31012 30554 56863 -61722 -118114 431 82573 16302 -20842
862 -20842 32425 6806 -92333 -64915 54569 40035 -73626 -65818 23156 -534 -63034 11599
874 11599 113840 57713 -49952 -33692 16859 -16154 -25913 52753 66205 -33949 -59429 39919
886 39919 72145 -4021 -12876 55952 23512 -89686 -87094 13628 30656 -20930 -3317 31490
898 31490 -22743 -64239 15139 76833 205 -71502 -18474 26271 -31507 -50994 42602 94030
910 94030 27913 -19421 13163 20445 -11070 11218 49653 -3053 -70923 -23495 53093 21279
922 21279 -32841 15355 64837 -5611 -84732 -45676 16461 -6933 -37194 -9318 -963 -38211
934 -38211 -20698 50191 48011 -20799 -24800 26050 8098 -51914 -27358 50158 49743 -3868 -3629
947 -3629 29709 19811 6360 31550 28046 -33134 -54230 -1272 18934 -26476 -28933 33418 42468
960 42468 -24450 -48239 -372 18615 -16521 -27947 -8300 -15805 -27644 9509 45872 22201
972 22201 -5535 21315 40027 -1921 -32566 4154 35395 5594 -20620 1637 19839 7253
984 7253 8599 25108 5494 -34397 -30007 -3157 -17629 -45694 -22444 17437 5323 -26105 -11867
997 -11867 19452 11055 -11190 -6557 -466 -16045 -15087 16056 29592 10780 10191 35027 34333 3849
1011 3849 -4889 13711 12346 -10706 -15670 -3673 -2728 -4650 8647 14883 -5827 -20524 -7836
1024 -7836 -1825 -22658 -35254 -15099 3074 -5719 -10797 6609 20954 16139 10113 11179 3763
1037 3763 -7143 -1777 10819 8029 -139 8289 23232 20304 5077 399 1919 -4508 -14323 -19625
1051 -19625 -21887 -21860 -11694 695 -1396 -11564 -7143 6678 4182 -13806 -19517 -6600 2866 -1297
1065 -1297 -2385 8077 20945 26133 23947 17288 10949 8541 8571 3045 -6244 -7642 1049 8969 7040
1080 7040 2075 707 1013 -2275 -10205 -19516 -24715 -21625 -12998 -7442 -8892 -6726 5248 15122 10969
1095 10969 -237 -3583 2429 5140 -1156 -5173 994 12983 19145 15939 11123 10880 11290 5649 -5838
1110 -5838 -15391 -15901 -11251 -8799 -9765 -7290 -2259 2282 1956 -2133 -8199 -13464 -12275 -8633 -7068 -7565
1126 -7565 -2141 11331 21209 18620 13061 12997 15145 11622 2335 -4148 -2633 3186 7640 6856 4007
1141 4007 5493 10631 7637 -6208 -16902 -15233 -12771 -17447 -20679 -14393 -5572 -1679 1774 5929
1155 5929 3045 -3345 -2265 829 -4535 -11915 -4647 10766 14237 8617 10611 18855 18408 10134 3772
1170 3772 -2064 -8999 -9152 -3258 -4992 -10480 -2477 11866 7021 -10349 -11113 1730 -1858 -18993
1184 -18993 -20422 -6082 -3141 -6685 3109 17048 14516 7206 12378 14028 -129 -6775 6834 12046
1198 12046 -2656 -6629 10725 18538 6747 4124 12748 3711 -17181 -17747 -6729 -13693 -22558 -6953
1212 -6953 7183 -8344 -20491 2340 19865 -2274 -22203 -6136 6507 -12310 -20818 6997
1224 6997 25788 11163 3092 16775 15956 331 6240 20174 2068 -22154 -7531 15520 -142
1237 -142 -16092 10656 31243 -103 -31153 -12303 8974 -10126 -23553 -2665 2171 -21289
1249 -21289 -15923 22168 25051 -6214 -2819 25090 7258 -33139 -16063 31969 26684 -10788 -7364
1262 -7364 18421 10505 -1717 17342 21793 -15033 -29027 -140 1064 -35098 -23425 33044 28928
1275 28928 -35396 -44364 12498 26936 -14298 -22354 5767 -3382 -30396 -7718 27588 13576
1287 13576 -1809 29235 36029 -19695 -39545 22841 56019 465 -37966 -400 23887 -6101
1299 -6101 -8634 30218 24690 -20147 -19875 4668 -21356 -46019 7313 53564 -5221 -68280 -20256
1312 -20256 48959 22138 -25505 1482 28929 -14031 -41269 1603 28278 4398 9817 40980
1324 40980 7360 -51239 -14235 65528 40500 -44644 -40629 17790 2473 -42127 -6425 46680
1336 46680 15739 -31998 -15249 113 -33050 -23439 43578 36413 -52900 -63554 26701 55321
1348 55321 -7101 -14207 45915 35008 -39136 -38714 24042 30756 570 18278 28523 -28613 -50601
1361 -50601 29570 74988 711 -53881 -3760 20665 -42507 -55135 27207 56314 -12699 -41744
1373 -41744 -1138 -1040 -30146 11556 61648 1874 -77172 -31625 48128 20532 -26129 25017
1385 25017 68346 -4243 -66162 -9563 47577 12451 -13010 18512 2169 -60328 -33629 58536
1397 58536 51334 -32164 -30410 25484 -9439 -72802 -19548 66867 29945 -49675 -27039 23195
1409 23195 -5224 -18943 48991 66420 -25259 -67742 4977 39906 -12081 -9365 61386 44227
1421 44227 -50731 -50998 34699 42873 -14419 -5249 25571 -30617 -80814 -8739 67580 19552 -39820
1434 -39820 -82 23998 -43853 -60918 32900 69121 -16669 -58585 1821 19292 -27009 887
1446 887 78500 47017 -52789 -47179 27753 17888 -27168 14126 58588 -8645 -71812 -10093 54721
1459 54721 12488 -22956 23969 22381 -65639 -74098 30066 64005 -12873 -33590 24904 13338
1471 13338 -51515 -18007 68403 44338 -39671 -30059 20639 -9522 -36329 37272 86358 5490
1483 5490 -65169 -11724 38262 -6687 -25843 33216 34168 -51366 -65619 14849 37727 -11581
1495 -11581 -2176 41045 -8395 -83259 -35743 56939 34183 -37728 -16025 29560 -10221 -44484
1507 -44484 20963 71856 15622 -35319 -3856 9084 -33495 -16350 60696 51428 -38393 -47364
1519 -47364 25010 28865 -24629 -6607 45292 6507 -64804 -38912 25797 15059 -12587 21838
1531 21838 33294 -32780 -57622 16626 56068 -2954 -32842 13182 19053 -36281 -27666 47045
1543 47045 54472 -8049 -20760 9452 -8806 -36438 9913 53717 1901 -55664 -17694 29407
1555 29407 -2607 -26584 21923 40879 -24642 -60759 -10172 23324 -3752 -6010 27155 8761
1567 8761 -40878 -18453 42811 31365 -18646 -6274 26648 -6601 -42775 1541 52959 22612
1579 22612 -20333 -1791 15432 -14945 -20031 25568 29817 -24730 -37350 6233 12324 -21433
1591 -21433 -6385 38485 18759 -37397 -30678 15172 11304 -15118 3267 23079 -9690 -32286
1603 -32286 7052 36652 6669 -12888 13877 14375 -28459 -29117 21847 32064 -9907 -19662 9730
1616 9730 5603 -21697 -5013 28154 7188 -31506 -18496 8921 -6051 -19272 13160 30686
1628 30686 -6038 -28833 2701 22706 -1961 -11229 14946 15131 -17530 -15627 20828 24327 -1718
1641 -1718 884 18992 680 -24605 -5085 22430 4664 -20416 -4370 12836 -6467 -18855
1653 -18855 7475 20751 -7542 -23976 -5049 3401 -13287 -10231 14598 12188 -12838 -9430 14278
1666 14278 11593 -7460 -541 15294 145 -19036 -4001 17240 8083 -4293 6626 11639 -6699
1679 -6699 -13524 4800 8807 -11277 -15841 1791 3424 -12514 -7180 14542 11800 -8999 -9704 5052
1693 5052 1854 -8768 -1221 10175 2861 -5169 5996 15501 6205 486 9943 9903 -6104 -10893
1707 -10893 2380 5386 -5052 -5102 5938 3683 -7334 -4512 4723 -1755 -13969 -10613 -1927 -6785
1721 -6785 -12474 -2242 8656 3675 -2934 2245 6812 1399 -2492 2203 3013 -2504 -1461 6538 7097
1736 7097 2661 5570 10410 4763 -4566 -3848 651 -3788 -9466 -5616 174 -2004 -4023 1514 5293
1751 5293 455 -4402 -1900 -279 -4465 -5550 -128 3722 3519 4132 7568 8488 6031 5191 3808 -142
1767 -142 -3089 -1649 -202 -2179 -3150 1245 3376 -10 -2992 -2431 -2481 -6795 -9341 -8012 -6133 -6301
1783 -6301 -4560 164 2387 2375 2396 3955 3313 873 -214 15 1085 2021 3466 4835 5783 6592 6876
1800 6876 4643 690 -1181 -1126 -2745 -5522 -6103 -2726 -578 -1140 -857 810 1017 -1272 -2395 -2236 -3179
1817 -3179 -3691 -2133 863 2523 2953 4228 6124 6174 4230 1929 139 -856 -331 -288 -2119 -3353 379
1834 379 3451 566 -4178 -2983 -25 -2603 -8209 -8599 -4289 -2415 -2840 -1988 377 1321 2388 3488
1850 3488 2726 -434 -315 3588 3073 -596 512 5869 7251 4384 3058 3481 1130 -992 1792 1137
1866 1137 -5091 -6403 1534 4513 -3721 -7569 1699 7081 -1381 -9808 -5024 2153 872 -2683 -1893
1881 -1893 -215 892 4403 5441 -1317 -3379 4750 7651 -3975 -10868 379 9989 2198 -6638
1895 -6638 -1008 4357 -1785 -5051 1046 1385 -7235 -6172 3312 952 -9449 -3430 11577 8121 -8273
1910 -8273 -8970 3856 5923 -904 -779 2554 -267 457 8289 6214 -4486 258 15298 7096 -16974
1925 -16974 -13315 13148 15823 -7613 -12631 6769 9916 -6086 -7227 5658 3692 -8000 -5658
1938 -5658 140 -7737 -9034 8921 15017 -5048 -14982 1620 9976 -4554 -8358 5661 4717 -11095
1952 -11095 -6921 10407 5816 -6668 6433 19791 -3167 -26592 -4744 23862 7670 -19787
1964 -19787 -7702 14772 3627 -13330 852 16356 4284 -8571 -3953 -5190 -13629 -122
1976 -122 20892 7457 -18471 -6969 19284 8671 -13703 1723 22771 817 -26288 -7682
1988 -7682 17486 5815 -7058 11980 17446 -13036 -22597 9889 22318 -7739 -20819 1696
2000 1696 4829 -18119 -13786 16246 16495 -7570 -7703 2352 -11151 -17770 11019 24092 -9638
2013 -9638 -27886 4714 23456 -4428 -11934 24418 30144 -15765 -32349 5096 20693 -3870
2025 -3870 -6653 16286 6212 -23668 -10084 23968 14943 -12840 -5205 7712 -16454 -30013 5724
2038 5724 29863 2517 -16805 5193 10133 -16164 -9460 30379 24283 -23388 -26451 12748 12820
2051 12820 -15352 1698 36787 13482 -32313 -19039 18255 8478 -15449 1412 13534 -18982
2063 -18982 -35089 3112 27554 984 -11496 10511 3880 -31920 -20563 26776 24400 -16771
2075 -16771 -13122 16736 1990 -22703 10269 47884 14231 -32553 -13541 17594 -2407 -16985
2087 -16985 18505 32322 -13754 -35429 2279 21395 -5769 -7114 20744 3660 -42245 -28100
2099 -28100 24193 23201 -12593 -2959 20675 -6462 -33881 3696 40492 9918 -23080 -960
2111 -960 12419 -19254 -20653 31633 41839 -13859 -34479 4358 13667 -19568 -11371 28554 13621
2124 13621 -36298 -28854 14148 10346 -11975 10356 27773 -14085 -44637 -2470 35795 7623
2136 7623 -15828 12229 19135 -21607 -25653 25622 39285 -2785 -15176 9371 -1802 -30599
2148 -30599 -1098 44240 17552 -34957 -20496 17398 -639 -24462 9678 36428 -6434 -43729
2160 -43729 -12043 19519 1105 -5071 22732 14730 -31894 -28013 23135 27652 -10186 -5683 23122
2173 23122 -601 -38365 -9461 38242 19870 -19986 -7667 10178 -17356 -27442 18405 37664
2185 37664 -9119 -34711 864 14806 -17968 -15254 30552 27819 -24337 -31995 8959 17730 -3714
2198 -3714 7952 26880 -3227 -34308 -4773 29024 7245 -13451 13417 21184 -22971 -35709
2210 -35709 15827 39601 -2006 -23856 2196 4274 -25628 -14018 29812 22471 -21693 -19867
2222 -19867 11217 1781 -19658 6646 34119 1171 -35381 -12806 18114 3824 -7114 17567
2234 17567 18913 -19988 -26713 12347 20546 -10394 -8489 19601 3105 -35531 -15814 32468 24278
2247 24278 -15779 -10824 13349 -3783 -24958 2482 29188 4645 -21051 -2912 10912 -8226
2259 -8226 -7244 24972 23726 -17462 -25415 6607 11131 -11306 -1929 23423 6078 -26823 -11121
2272 -11121 21299 10878 -11698 1593 14340 -13579 -30827 2009 27385 3561 -15902 2615
2284 2615 10540 -12267 -13875 14610 17179 -11522 -16827 2642 747 -12889 3408 24553 6154
2297 6154 -20150 -6711 13993 687 -12969 6066 17397 -8220 -21923 3617 20175 2870
2309 2870 -4734 11272 8649 -15883 -14816 10828 12414 -8533 -7116 8202 770 -13469 1308
2322 1308 19115 5414 -13750 -5179 4361 -7641 -11451 8952 15576 -5666 -13086 5816 11567
2335 11567 -4448 -4438 12117 6218 -16183 -12896 8031 7443 -6004 -700 10155 -304 -13067
2348 -13067 -1748 10346 -290 -10935 -2024 3011 -8430 -9199 8240 12731 -2803 -6041 6008
2361 6008 4967 -7124 -2831 11082 5901 -8412 -4056 9321 5768 -2971 4374 11391 -272 -10806
2375 -10806 -2043 6014 -2237 -7178 1366 4181 -6063 -7571 4303 6873 -3584 -5130 2261 -730
2389 -730 -8415 -3139 7219 3556 -4313 372 6796 1429 -4142 3431 7994 -1275 -8039 -739 4233
2404 4233 -2233 -4608 2903 4258 -4096 -5565 1404 1679 -4660 -3986 1470 -753 -5749 -1628 5244
2419 5244 3055 -968 1707 5351 1060 -1636 3085 5676 664 -1250 3690 4078 -685 -985 4410
2434 4410 3360 -3250 -4202 755 781 -4165 -4245 -54 -597 -4078 -3011 -37 -778 -2046 -765 405 -1141
2451 -1141 -1588 1249 2353 -20 -547 2408 2651 222 71 2523 1884 -918 -519 1522 -45 -2359
2467 -2359 -1278 643 -535 -3859 -2504 281 -225 -2077 -1561 938 1385 -191 -301 902 1285 1562
2483 1562 1595 1051 1271 2601 3974 2264 809 1709 2910 1048 -1571 -1196 377 -856 -2311 -1255
2499 -1255 -353 -1327 -1742 -931 -570 -2483 -3623 -1893 -307 -2070 -2846 -895 1593 2101 815 365 1463
2516 1463 2227 1660 -196 -1279 -109 1864 960 -1354 -766 2566 3197 -249 -2236 -251 221 -1918
2532 -1918 -3301 -1777 -182 -812 -35 1909 1919 77 1274 2942 1243 -1719 -1309 1256 1676 965 839
2549 839 1707 2355 2816 2286 -571 -2407 12 1725 -2852 -6801 -2297 3567 1338 -4249 -2320 3514
2565 3514 1657 -3878 -3733 -46 -447 -2832 -1967 -6 -361 545 3987 3430 -812 -1146 2153 1112 -2769
2582 -2769 -1822 1744 235 -1888 1547 4157 276 -1207 3948 4254 -4701 -7558 1274 6023 -1886
2597 -1886 -6184 1970 7165 695 -3484 1946 4923 402 -2920 -1136 -2179 -3201 1672 4701 -462
2612 -462 -3942 2236 5560 -2195 -5550 2397 4631 -5658 -8779 897 4636 -2496 -2533 6390 4270
2627 4270 -7232 -6027 5744 4249 -6757 -5529 3825 1516 -6454 -1547 7490 4184 -2287 292
2641 292 1483 -4739 -3728 6364 5604 -6353 -5295 7421 5590 -6125 -1285 12847 6682 -10635
2655 -10635 -7481 6767 4065 -6669 -303 8972 -240 -10320 -424 9672 1171 -6324 1048 2965
2669 2965 -8446 -9151 5248 7914 -3767 -4134 5426 242 -10269 -374 13781 2997 -13071 -4707
2683 -4707 8470 -736 -9790 5230 16083 -803 -15139 -1716 9411 -1707 -6756 6232 6568
2696 6568 -10789 -11815 6503 9644 -3453 -1775 8254 -843 -14155 -2091 14536 4564 -8838
2709 -8838 1243 9200 -6244 -11593 10440 19991 -2967 -15055 2331 8811 -7370 -7527 12943
2722 12943 11460 -12115 -13813 4925 4621 -7661 529 12956 -2806 -20712 -5290 13693 2661
2735 2661 -9099 4478 10010 -10394 -16483 7991 17495 -1643 -8079 6998 3637 -15490 -6469
2748 -6469 20446 13592 -13753 -11398 8568 2024 -12815 1892 19332 2287 -19145 -6606 9024
2761 9024 -1291 -5985 11751 12457 -14095 -18408 9350 16778 -4106 -4870 13443 5580 -19335 -10112
2775 -10112 18084 13714 -7768 -2990 8404 -6640 -17365 6549 23011 -680 -19594 -2306
2787 -2306 7739 -11400 -13033 14029 18266 -11278 -19567 2927 7321 -7346 834 18115 1629
2800 1629 -23037 -8887 16934 7827 -8110 6488 17066 -8648 -23577 2957 22208 2814
2812 2814 -10897 3267 4130 -16571 -10276 19593 17944 -11965 -12959 7891 737 -17206 -222
2825 -222 24768 7586 -21023 -9588 11812 3106 -5962 11274 17234 -10569 -21784 3421 14845
2838 14845 -4299 -5816 15201 7309 -22596 -16258 16313 16603 -9570 -8306 7630 -5546 -22146
2851 -22146 -817 22705 5938 -15423 -2212 9209 -9235 -13597 14942 22618 -8269 -21551
2863 -21551 1530 10296 -6020 -1185 20714 9752 -19225 -13301 12702 7514 -9348 3573 16233
2876 16233 -7236 -25528 -372 23776 6036 -11735 2690 8398 -13446 -17064 12077 19888
2888 19888 -5816 -12479 5367 3653 -13366 -1433 23379 10455 -18530 -12142 9031 934 -11416
2901 -11416 5845 19402 -3816 -22517 -2266 14081 -661 -8133 9602 8736 -17769 -19377 9899
2914 9899 16963 -4336 -6387 9792 1799 -17481 -5285 19140 10583 -11174 -5339 6757 -4883
2927 -4883 -11791 9703 21365 -1555 -16400 59 8772 -5972 -6363 14253 12120 -14301 -15762
2940 -15762 7235 10583 -4755 -310 12250 -348 -18755 -6420 13732 5807 -8384 1087 7699
2953 7699 -8221 -13999 6696 16254 -2026 -11338 2286 3418 -11484 -6361 14295 10665 -10482
2966 -10482 -10068 6200 2608 -8509 1985 14226 453 -15914 -5089 8938 1670 -5045 6613
2979 6613 9265 -7949 -12770 4576 10780 -2295 -4019 6752 1983 -11858 -5066 13047 9050
2992 9050 -6883 -3745 6372 -1385 -9965 2827 14062 1472 -10785 -1678 6091 -2441 -5041
3005 -5041 7401 8481 -7092 -10754 2306 5285 -4564 -1928 7503 1202 -11467 -5320 8034 3531
3019 3531 -6225 -169 6386 -3569 -10408 1370 10484 476 -6529 1582 4895 -5295 -5493 7363
3033 7363 7977 -4351 -5839 3352 2702 -4723 -93 8116 2142 -7909 -3258 5008 602 -3939 3197
3048 3197 6482 -3238 -7911 2307 6971 -1207 -3889 3728 3923 -5595 -4741 5750 6160 -2998 -3209
3063 -3209 3215 907 -5634 -841 5485 625 -5900 -1913 2866 -1570 -4065 1924 4149 -2808 -6326
3078 -6326 332 2971 -2448 -2409 3514 2412 -3866 -2434 4394 3178 -2384 -679 4491 752 -4245
3093 -4245 -629 4627 1852 -2531 379 3003 -590 -2479 1735 2683 -1818 -3223 792 1127 -2312
3108 -2312 -991 3004 1813 -2916 -1213 2314 937 -2495 -402 2498 -371 -3097 534 3055 402
3123 402 -1597 590 1788 -1778 -2938 70 1282 -1380 -2140 101 329 -1360 -630 1374 -112 -2184
3139 -2184 -823 729 -751 -1874 507 2198 355 -948 1017 2562 827 -561 1115 1687 -282
3154 -282 -891 1104 1752 -7 -49 1537 1302 -237 -723 681 -66 -1268 -1090 -206 -367 -741 316 916
3172 916 -342 -622 614 745 -768 -1359 558 1025 -618 -1422 597 1298 3 -602 573 192 -689
3189 -689 -1133 -200 -843 -1478 -394 479 38 -571 -164 722 -525 -922 99 -143 -390 -62 607 943 145
3208 145 957 2034 1566 -243 273 1548 1180 -435 -571 1076 1198 7 -314 656 615 242 67 -242
3226 -242 -1115 -919 83 -215 -1182 -853 656 340 -1042 -1051 496 -8 -1084 -657 633 -543 -1379 597
3244 597 1698 -183 -888 617 1170 -625 -1159 92 876 -732 -961 316 384 -215 241 973 -273 -1613
3262 -1613 350 1492 -234 -1354 784 2233 -87 -1035 1309 2451 72 -729 953 1086 -934 -753
3278 -753 2348 1606 -1428 -757 1634 326 -2058 -54 1796 -121 -2746 -750 1251 -783 -1596 1350
3294 1350 1313 -2585 -2731 1130 1799 -1980 -2144 2188 731 -2847 -1545 3001 1874 -2328 -687 1979
3310 1979 -429 -3200 874 3849 -31 -2945 815 2404 -1017 -1886 2910 3073 -2565 -2815 1973 1823
3326 1823 -2124 177 4366 1218 -4599 -1120 4429 1367 -3263 656 3757 -1575 -4976 1016 5133
3341 5133 -446 -2846 1677 1870 -4642 -3240 4450 3798 -3800 -3881 2600 744 -4685 -406 5503 527
3357 527 -6176 -2302 2945 -1058 -4240 3402 5602 -3556 -6790 2255 5708 -1739 -3200 4399 3539
3372 3539 -5908 -4507 5359 5451 -2456 -960 4444 -561 -6334 808 8319 1429 -6251 -669 4583
3387 4583 -2564 -5075 4994 7979 -3014 -6938 1361 3466 -4067 -1791 7636 3055 -8905 -5494
3401 -5494 6491 4219 -4650 141 6950 -1596 -10571 -2059 7932 2177 -4989 1107 3023 -6057 -6097
3416 -6097 6482 7756 -4752 -6352 3197 1525 -7989 -2242 10890 5097 -8488 -5019 5000 1035
3430 1035 -5244 3973 9721 -2454 -11046 189 8531 -500 -3630 6395 6559 -8073 -9358 5596
3444 5596 8732 -2589 -3109 4698 -624 -10310 -1064 11354 3945 -7593 -1767 5218 -4744 -10030
3458 -10030 5098 13023 -1871 -11616 -845 5661 -3603 -3849 9392 7019 -9678 -9845 4595 5039
3472 5039 -4481 544 9725 -254 -13520 -3654 10817 3784 -6004 1104 5186 -6891 -10768 5891
3486 5891 12825 -1595 -7201 3966 3567 -9309 -4624 13328 9779 -9163 -8238 5325 2485 -6366
3500 -6366 2447 13075 1003 -13090 -3384 7617 107 -4816 6510 8222 -9322 -13285 4774
3513 4774 10435 -2483 -4489 6136 1507 -13490 -6974 11890 8107 -7422 -3953 5834 -2611 -11544
3527 -11544 3402 15749 1520 -12600 -2540 6011 -4044 -6042 9212 11515 -7378 -11926 2978
3540 2978 6540 -3949 -890 10806 2225 -14151 -6503 10851 6350 -5534 916 8777 -4696
3553 -4696 -13738 2202 14291 1740 -7961 1804 5042 -7909 -7464 10597 12074 -5956 -9515 3675
3567 3675 2538 -8017 -957 13096 3734 -12818 -6403 6698 1278 -6199 4496 9878 -6402
3580 -6402 -14889 927 10341 -909 -5173 5975 4422 -11520 -8870 9533 10283 -4771 -4844 5310
3594 5310 -71 -10354 -272 13896 4437 -9552 -3204 5416 -2395 -6530 6911 11562 -4338
3607 -4338 -11310 1921 6770 -3544 -2795 9627 5481 -11516 -8385 7717 6938 -4717 -855 8214
3621 8214 -1156 -12395 -1133 11692 3218 -7022 -237 4928 -5838 -8930 6038 10804 -3385
3634 -3385 -8355 1777 3037 -7153 -2882 10273 5126 -9845 -7107 5426 2385 -5410 2033 9941
3648 9941 -1947 -11980 -1189 9149 1067 -5019 3958 6285 -6138 -8429 5792 9472 -2012
3661 -2012 -4425 3784 1693 -7771 -2283 9726 5360 -6503 -3364 4798 -763 -6508 3039 9500
3675 9500 -1086 -9378 -732 5441 -1762 -3677 6081 5724 -6524 -7985 3680 5446 -3485 -2372
3689 -2372 5505 1245 -8606 -3847 6893 3599 -4666 -1062 3875 -2775 -6749 2507 7490 -1077 -6096
3704 -6096 762 3163 -4070 -3367 6280 5786 -4857 -5758 3375 2986 -3236 -275 6438 1515 -6344 -2248
3720 -2248 5398 2009 -3116 1709 4474 -2207 -5956 1892 5745 -318 -3055 2157 1868 -4161 -2785
3735 -2785 4796 3133 -4074 -2683 2785 317 -4533 39 5756 616 -5412 -1631 3069 -641 -3337
3750 -3337 1606 3563 -1808 -4609 692 3320 -1201 -1390 2491 1306 -4083 -2301 3135 1982 -2303
3765 -2303 -538 2815 -617 -3391 892 4241 515 -3108 318 2563 -1388 -2403 2608 3723 -1508
3780 -1508 -2716 1632 2727 -1201 -1325 2437 1503 -2515 -1508 2085 799 -1552 38 2043 -1012
3795 -1012 -3148 127 2117 -939 -2574 643 946 -2238 -2029 1624 1854 -1785 -1861 1121 784 -2005
3811 -2005 -797 2375 1196 -1645 -781 1695 740 -1054 347 1886 -227 -1495 162 1546 -557
3826 -557 -930 1428 1539 -1097 -896 1580 1166 -972 -621 1776 633 -1076 60 2157 769 -1404
3842 -1404 -37 1345 421 -1157 -48 1078 -131 -1121 -163 585 -553 -1072 298 169 -1185 -1391 356
3859 356 -196 -1286 -309 657 52 -1263 -295 745 0 -1074 -269 835 16 -971 409 1162 -287 -640
3877 -640 585 1363 152 -285 484 883 -29 -207 674 736 -186 -102 553 242 -364 98 943 -147 -532 539
3897 539 851 -135 -564 375 950 72 -721 270 603 -117 -697 60 68 -572 -245 356 196 -943 -214 -91
3917 -91 -161 -1064 -491 25 -385 -715 -100 359 -312 -421 715 525 -949 -539 854 794 -710 -425 1253
3936 1253 780 -699 295 1039 720 -347 -139 402 263 -600 579 1121 -14 -413 467 531 -707 -576
3954 -576 429 570 -1109 -575 735 158 -912 193 1260 -379 -1508 -8 1095 -423 -1619 425
3970 425 819 -759 -1257 442 1177 -702 -654 551 -145 -1397 -492 1613 155 -1528 -439 1576 -153
3987 -153 -1772 684 1756 -223 -1798 83 1541 -648 -923 1661 1819 -1268 -957 1795 1597 -1436
4003 -1436 -761 2275 523 -2294 -853 2358 1005 -1310 242 1757 -1251 -2248 884 2351 -1269
4018 -1269 -2272 1062 1288 -2388 -1977 2267 2133 -2366 -2439 1374 171 -2326 -561 2835 -338 -3180
4034 -3180 -429 2529 -135 -2288 1172 2797 -1828 -3384 1099 2848 -700 -1620 2566 1149 -3149
4049 -3149 -1317 3708 2277 -2832 -925 2917 -249 -3821 556 4963 914 -3645 -173 2832 -821
4064 -821 -2132 2825 3491 -2383 -3546 2138 2331 -2446 -481 4365 1245 -4971 -2847 3669 1448 -3447
4080 -3447 -103 3477 -1827 -5225 781 5006 -351 -4012 1151 2682 -3856 -4172 3832 4976 -2951
4095 -2951 -4085 2289 1647 -3523 -177 5660 1571 -5516 -1696 4045 62 -3539 2489 5797 -2541
4110 -2541 -6575 1230 5379 -630 -3159 3352 3170 -5015 -4708 4532 5050 -2903 -2100 3835 360 -6061
4126 -6061 -390 7526 2213 -5606 -1034 3489 -2139 -4756 3741 6473 -2846 -6492 1038 3249 -3555
4141 -3555 -2400 5958 3238 -7393 -5607 4721 3663 -4088 -1020 5520 -1195 -8180 -941 7527
4155 7527 1691 -4264 872 4077 -3839 -5681 4925 7474 -1806 -5525 2099 2672 -4975 -1926 8005
4170 8005 4406 -6632 -4684 4367 1511 -4823 1939 8046 -1154 -8997 -961 6664 287 -4096 3487
4185 3487 4577 -5813 -7158 4106 7038 -2302 -3389 3681 732 -7803 -2300 8206 3914 -6038
4199 -6038 -2668 3783 -1792 -6605 2736 9042 -1114 -8457 -335 4364 -2554 -3673 6209 6011 -5949
4214 -5949 -7259 3946 5211 -3050 -629 6358 727 -8521 -2903 7871 3236 -4017 788 5099
4228 5099 -3596 -7423 3162 8973 -692 -5778 1577 2663 -5672 -3967 7961 6594 -5775 -6254
4242 -6254 3718 1805 -5120 479 8283 851 -9484 -3181 6178 945 -4128 2914 6010 -4952
4256 -4952 -8974 2126 7205 -1787 -3910 3788 1937 -7502 -4538 7688 5797 -4858 -3397 3872
4270 3872 -637 -7146 610 9651 1522 -7694 -1013 5347 -1437 -4132 5589 7767 -4468 -7880 2187
4285 2187 5399 -2590 -1695 6412 2793 -8094 -4646 6249 3957 -3833 -74 5048 -2212 -8381 595
4300 595 8609 870 -6110 635 3776 -4351 -5436 5205 7327 -3904 -7011 2182 2536 -4201 -1629
4315 -1629 7213 2904 -7261 -3900 4865 1493 -4098 1404 5965 -2005 -7828 543 6659 157 -3858
4330 -3858 2703 3708 -5083 -5437 4963 6157 -3032 -3858 3725 1465 -5389 -1148 7357 3334 -5353
4345 -5353 -2719 3553 -271 -4097 2357 6546 -1627 -6217 421 3988 -1708 -2820 4386 3074 -5705
4360 -5705 -5167 3619 3987 -2819 -1551 3889 -51 -5996 -1428 5463 1600 -4174 -700 3300 -2244
4375 -2244 -4649 2478 5578 -1234 -4660 800 2596 -2310 -1556 4450 2855 -4166 -3105 2984 2154
4390 2154 -2559 654 4789 89 -5151 -643 4743 798 -3011 1560 3492 -2040 -4139 1875 4277
4405 4277 -904 -2580 1627 988 -3601 -1879 3916 2212 -3576 -1902 2227 94 -3107 437 3793
4420 3793 -394 -4355 -631 2608 -1048 -2453 1879 2421 -3031 -3890 1721 2774 -1670 -1982 2156 740
4436 740 -3399 -1925 3348 1582 -2232 -468 2175 -322 -2531 1241 3554 10 -2464 350 2228
4451 2228 -997 -1583 2693 2718 -1781 -2169 1570 1678 -1790 -725 2494 804 -2952 -1088 1880 845
4467 845 -1801 -221 1655 -413 -2514 264 1950 -447 -1621 834 1045 -1662 -1542 1577 1575 -1740
4483 -1740 -1531 1007 593 -1767 -401 1743 437 -2542 -719 1546 142 -1683 532 1870 -519
4498 -519 -1859 312 1744 -164 -885 1146 1380 -763 -575 1322 1313 -647 -315 1137 422 -1096 69
4515 69 1759 245 -1070 30 1314 -327 -999 408 999 -459 -1491 179 905 -788 -945 543
4531 543 668 -906 -571 320 357 -693 -410 359 -239 -879 -102 846 -195 -648 28 665 -568 -786 705
4550 705 542 -445 -634 276 826 -370 -417 877 759 -211 -553 773 809 -218 16 412 424 -256 628 1083
4570 1083 488 53 304 334 -370 -573 282 165 -487 -575 633 175 -741 -685 496 60 -1059 -684 372
4589 372 258 -870 -513 548 174 -423 -86 453 164 -695 -310 107 -555 -372 -78 193 -370 -238 400
4608 400 396 -176 115 620 64 -480 -61 885 39 -491 243 1284 78 -582 387 1020 145 -641 62 868
4628 868 77 -273 554 442 -278 -164 404 108 -712 -104 492 -381 -1191 -38 325 -232 -603 57 487 -837
4648 -837 -824 278 465 -715 -732 474 512 -806 -398 564 718 -561 -664 399 147 -564 12 692 -48
4667 -48 -596 474 671 -400 -514 1194 857 -732 -835 1172 749 -719 -99 1145 711 -1299 -308 1197
4685 1197 645 -1154 23 1120 -588 -1412 156 1385 -370 -1009 319 657 -1142 -826 1087 304
4701 304 -1503 -953 1043 166 -1484 95 1764 -458 -2110 -171 1731 -50 -1676 149 1399 -903
4717 -903 -1954 803 1779 -648 -1512 1205 987 -1140 -845 1908 1017 -1455 -392 1476 280 -1499
4733 -1499 798 2706 -173 -1929 414 2025 -824 -1617 1931 2017 -1925 -2355 1369 2089 -1366 -1211
4749 -1211 1940 896 -3000 -1437 2031 724 -1972 -259 1714 -1130 -2569 536 2688 -751 -2213
4764 -2213 1071 1544 -2315 -1835 2718 2368 -2432 -2150 1867 1180 -2506 -357 3387 457 -3834 -1200
4780 -1200 2684 410 -2211 812 3219 -1022 -3187 1273 3241 -232 -1543 1768 1325 -2861 -1955
4795 -1955 3451 2617 -2433 -1371 2891 317 -3480 207 4521 337 -4074 -526 2852 -1138 -3140
4810 -3140 2057 3771 -2087 -4531 837 2815 -1549 -1700 2849 1494 -4015 -2472 3103 2135 -2479
4825 -2479 -22 3332 -1021 -4963 544 4635 162 -3737 763 2676 -2449 -3231 3419 4677 -1898
4840 -1898 -3925 1509 1785 -2925 -683 5017 2179 -3788 -2216 3549 1333 -2496 1074 4158 -1285
4855 -1285 -5094 605 4402 -486 -2766 2248 2768 -3934 -4191 3350 4291 -2646 -2831 2449 1209 -4626
4871 -4626 -1377 5069 2058 -4181 -1740 3376 -723 -3829 1478 5020 -1725 -5315 385 3695 -1446
4886 -1446 -2208 3933 2836 -4560 -3794 3523 3423 -2452 -999 4236 -96 -6052 -695 5975 1777 -4133
4902 -4133 -470 3191 -2069 -4382 2858 5715 -1154 -4253 1308 3003 -3278 -1812 5106 2978 -4630
4917 -4630 -3600 3219 1569 -3551 332 5203 -292 -6504 -898 4653 312 -3790 1516 3295 -3946
4932 -3946 -5576 2511 5254 -1815 -3107 2604 1655 -4938 -2211 5435 3338 -4295 -2371 3272 -3
4947 -3 -3974 1518 6203 -274 -5538 -132 3973 -1154 -2813 3745 4438 -3878 -4968 2881 4119 -1886
4963 -1886 -1596 3915 1233 -5809 -2368 5465 2940 -3538 -907 3289 -1442 -5308 1284 6081 -224
4978 -224 -4828 203 2583 -2911 -3162 4255 3879 -3894 -4518 2527 1778 -3292 -490 5247 1255 -5795
4994 -5795 -2279 4204 1437 -3210 795 3853 -1876 -5318 1289 5035 -320 -2904 2164 2056 -3797
5009 -3797 -2811 4478 3861 -2764 -2573 2758 926 -3791 168 5437 1442 -4852 -1169 3436 -250 -2919
5025 -2919 2140 4485 -2325 -5157 982 3641 -909 -2314 3141 1686 -4235 -3090 3146 2843 -2798
5040 -2798 -1294 2692 -304 -4184 -91 4747 368 -4215 -263 3325 -1654 -3238 2291 4023 -1696
5055 -1696 -3784 1360 2510 -2103 -1679 3888 2203 -3648 -2409 3081 1773 -2344 452 3522 -364
5070 -364 -4258 -74 4364 67 -2409 1140 2491 -2037 -2789 2671 3485 -1643 -2333 1699 1636 -3020
5086 -3020 -1366 3680 1689 -3432 -1745 2338 658 -2637 317 3143 -738 -3985 -541 2501 -699
5101 -699 -2000 1568 1935 -2177 -2723 1936 2301 -1701 -1254 2196 711 -3260 -1003 3267 1394 -2619
5117 -2619 -618 2278 -195 -2385 711 3294 -22 -2647 170 1946 -559 -1284 1929 1802 -1563
5132 -1563 -1688 1416 1565 -1149 -295 2003 516 -2559 -383 2207 602 -1783 108 1576 -1070 -2284
5148 -2284 757 2217 -1036 -2111 509 1033 -1691 -1493 1481 1129 -1542 -1407 1126 569 -1205 -234
5164 -234 1706 124 -1777 -96 1287 -182 -958 958 1518 -735 -1769 765 1480 -945 -696 1232
5180 1232 818 -1199 -1003 1516 1319 -888 -664 1211 349 -1253 95 1863 182 -909 -17 939 -270
5197 -270 -665 555 1139 -1040 -1084 652 1022 -782 -666 824 500 -1240 -1032 779 196 -1183 -587 794
5215 794 -21 -1029 -221 724 2 -1080 -214 837 -392 -597 699 1149 -281 -508 488 580 -415 -252
5233 -252 715 626 -893 -61 1039 630 -588 -137 1298 134 -604 302 1090 3 -865 -27 512 -207
5251 -207 -620 267 740 -200 -609 160 326 -506 -444 492 129 -764 -303 428 -207 -873 -113 419 -179 -1010
5271 -1010 31 667 -606 -591 -109 493 -568 -545 77 289 -263 -291 497 717 29 -333 472 154 -202 22
5291 22 318 48 -419 122 737 26 -201 249 907 -97 -304 575 545 -347 -413 643 235 -248 -41 380
5311 380 510 -770 -432 215 111 -669 -132 385 86 -562 -344 315 -739 -713 84 270 -462 -337 357 224
5331 224 -452 -180 636 194 -454 -230 693 56 -605 -223 646 -91 -763 -68 744 44 -537 476 661 -203
5351 -203 -573 426 491 -438 -30 749 6 -750 -83 998 154 -817 -180 658 -352 -595 577 765 -163
5370 -163 -775 689 765 -692 -717 607 594 -953 -579 663 165 -458 -668 306 -61 -779 -135 964 -209
5389 -209 -881 281 676 -526 -826 547 975 -720 -809 812 790 -1117 -178 1311 490 -1386 -303 1258
5407 1258 151 -745 241 1072 27 -1371 187 1045 -205 -754 1035 1134 -1022 -1045 1006 726 -792
5424 -792 -501 907 156 -1728 -438 1396 454 -1672 -141 1318 -534 -1207 486 1571 -492 -1591
5440 -1591 263 944 -1127 -1117 1529 898 -1170 -1126 1250 836 -1190 -420 1692 372 -1997 -131 2217
5457 2217 537 -1506 1099 1876 -551 -1792 923 2102 -418 -1409 1117 1307 -1658 -923 2104 1101
5473 1101 -1820 -959 1502 86 -1729 -48 2527 -220 -2311 51 1755 -483 -1828 1204 2227
5488 2227 -1711 -2605 1194 1682 -1224 -1347 1772 820 -2742 -1502 2336 1166 -2021 -444 1869 -333
5504 -333 -2786 312 3064 72 -2421 403 1676 -1082 -1983 2208 2573 -1931 -2018 1702 1591 -1734
5520 -1734 -401 3112 907 -3267 -1044 2631 1043 -2030 403 2792 -985 -3260 422 3045 -523
5535 -523 -2081 1167 1477 -2433 -1969 2489 2601 -1958 -1790 1795 288 -2848 -658 3184 306 -3454
5551 -3454 -994 2416 -445 -2588 1195 3065 -1371 -3571 701 2656 -838 -1627 2283 1673 -3096
5566 -3096 -2390 2823 2204 -1899 -667 2701 -168 -3210 -170 3916 944 -2886 -81 2556 -1297
5581 -1297 -2652 2401 3735 -1701 -3297 1340 1937 -1856 -1682 3206 1888 -3364 -2266 2537 1465
5596 1465 -1960 -93 2956 -499 -4240 152 3495 223 -2684 921 2030 -2402 -3260 2411 3598
5611 3598 -1702 -2446 1595 1378 -2905 -1215 3850 1686 -3575 -1813 2502 447 -2636 989 4116
5626 4116 -565 -3928 -326 2987 -299 -1700 2427 2405 -2684 -2901 2463 2933 -1898 -1309 2406 576
5642 576 -3884 -760 3982 1504 -2648 -711 2315 -931 -3706 1066 3902 -938 -3828 323 1990
5657 1990 -1565 -1882 2496 2235 -2913 -2923 1930 1694 -2348 -507 3469 371 -4007 -1181 3352 747
5673 747 -2501 622 2384 -1699 -3698 1586 3964 -789 -2729 1141 1963 -2272 -1736 3574 2853 -2494
5689 -2494 -2293 2202 770 -2263 208 3761 164 -3549 -485 2679 135 -1985 1991 2936 -1913
5704 -1913 -3684 1379 2707 -1249 -1892 1976 1202 -3173 -2112 3017 2176 -2696 -1193 2201 -278 -3285
5720 -3285 91 3555 301 -2948 -178 2332 -935 -1910 1983 2891 -1932 -2872 1180 1909 -1689 -846
5736 -846 2844 1438 -3045 -1400 2627 1337 -1959 -262 2511 -126 -2938 8 3102 494 -2163
5751 -2163 590 2306 -1118 -1911 1868 2281 -1397 -1849 1259 996 -2026 -612 2638 928 -2848 -1193
5767 -1193 2081 503 -1983 309 2305 -818 -3176 195 2235 -655 -1841 867 1480 -1751 -2042
5782 -2042 1364 1850 -1260 -1115 1141 417 -2064 -696 2235 733 -1578 -811 1685 -256 -1899 841
5798 841 2487 -504 -2020 558 1941 -780 -1180 1468 1502 -1722 -1522 1308 1568 -674 -563 1396 375
5815 375 -2113 -441 1865 288 -1455 -134 1242 -742 -1472 793 1695 -922 -1323 557 706 -1132
5831 -1132 -955 1620 1184 -1572 -1429 1229 458 -1334 -244 1387 303 -1933 -363 1242 122 -885
5847 -885 120 988 -386 -787 858 1229 -483 -447 1199 698 -1155 -700 1390 1085 -844 -58 1070
5864 1070 422 -882 12 1228 277 -1354 -183 1275 128 -981 236 1054 -513 -1054 275 885
5880 885 -461 -483 576 273 -999 -325 730 400 -790 -543 577 -15 -1105 -46 911 -231 -959
5897 -959 4 857 -230 -812 618 1043 -692 -632 504 503 -416 -298 789 359 -630 -282 708 549 -344
5916 -344 138 922 -42 -421 374 691 -39 -682 333 601 -323 -597 524 766 -565 -514 447 508 -538
5935 -538 -554 658 279 -533 -556 419 134 -174 -32 368 -15 -409 -46 432 -29 -799 322 557 -422 -385
5955 -385 99 466 -306 -338 297 156 -623 -180 809 402 -118 -163 655 54 -417 68 563 20 -240 142 510
5976 510 -62 -95 370 373 -170 -322 430 135 -240 -147 525 269 -441 -316 196 220 -589 -174 356 -113 -751 -156
5998 -156 241 57 -474 112 227 -459 -523 -36 156 -336 -303 239 -44 -251 -92 293 47 -542 73 345 34
6019 34 -303 276 554 -92 -303 250 455 -130 -160 636 634 -265 17 695 472 -55 -139 618 162 -334 28 465
6041 465 -252 -237 89 291 -214 -713 329 428 -325 -686 317 369 -549 -675 481 0 -316 -419 659 -313
6061 -313 -545 -155 322 -104 -379 126 462 -193 -501 358 297 -122 -525 517 262 -805 -293 879 341
6080 341 -837 -98 1046 335 -548 22 988 -109 -725 196 909 -226 -435 572 788 -333 -718 465
6098 465 599 -524 -364 301 51 -949 -243 898 156 -821 -159 619 -395 -1310 121 880 -598 -816
6116 -816 9 876 -462 -1148 623 471 -981 -648 583 873 -889 -442 837 195 -1127 -231 1130
6133 1130 475 -610 88 904 -373 -945 728 1141 -401 -926 906 1110 -868 -786 1882 960 -1083
6150 -1083 -765 1180 675 -1026 -182 1447 232 -1768 -112 1348 -134 -890 495 852 -1276 -1463
6166 -1463 823 1046 -1087 -742 983 432 -1630 -600 1622 770 -1876 -533 904 -122 -1322 290
6182 290 1790 -166 -1592 443 1044 -324 -999 1309 1366 -894 -1177 1221 1113 -813 -165 1722 390
6199 390 -2286 -402 1870 448 -1501 128 2019 -628 -1895 809 1990 -516 -1716 805 1070
6214 1070 -1101 -1368 1616 1498 -1666 -1534 1222 643 -1654 -379 1912 36 -2289 -744 1626 -23
6230 -23 -1682 834 1937 -1513 -2173 816 1900 -868 -1265 1361 1149 -1805 -1538 2129 1700 -1552 -889
6247 -889 1494 203 -1984 -70 2795 319 -1666 215 1671 -477 -1633 1584 2294 -1317 -2142 982
6263 982 1407 -1347 -911 2244 971 -2460 -1455 2018 658 -1671 -61 1986 -302 -2441 262 2664
6279 2664 46 -1980 108 1322 -1190 -2154 1438 1961 -998 -1754 1042 1215 -1863 -742 2832 1063
6295 1063 -2618 -1160 1956 468 -1883 791 2506 -396 -2767 483 2342 -351 -1591 1491 1597
6310 1597 -1908 -1835 1708 1983 -1092 -1339 1621 559 -2539 -233 2620 697 -2155 -356 1917 -511
6326 -511 -2245 1229 2505 -1016 -2753 805 1870 -1269 -1366 1935 1890 -2590 -2063 1700 1366 -1975 -676
6343 -676 2291 16 -2977 -550 2503 364 -1681 41 1570 -1210 -2271 1291 2596 -948 -2211
6358 -2211 1330 1267 -1507 -1011 2521 1457 -2084 -1699 1708 810 -1920 -100 2415 -12 -2615 -122
6374 -122 2053 98 -2012 841 1875 -1351 -2536 1225 2179 -1079 -1329 1305 905 -2536 -1224 2564
6390 2564 1558 -2171 -1412 1455 -246 -2512 552 2566 -395 -2403 -245 1624 -727 -1702 1512
6405 1512 1940 -1849 -2392 1270 1471 -1032 -776 1927 854 -2729 -795 2290 946 -1388 178 2065
6421 2065 -416 -2435 427 2306 -32 -1715 691 1949 -1338 -1270 1909 1819 -1346 -1399 1260 796 -1481
6438 -1481 -379 1976 630 -2384 -1201 1887 231 -1537 522 1844 -819 -2346 556 1730 -780
6453 -780 -1321 982 689 -1805 -1532 1578 1515 -1519 -1067 1258 501 -2057 -287 2218 406 -1832 -327
6470 -327 1676 -9 -1099 1074 1650 -577 -1562 770 1294 -623 -1106 1526 930 -1124 -917 1575 1021
6487 1021 -1320 -423 1548 134 -1672 14 1892 211 -1549 42 1106 -633 -1456 844 1186 -556
6503 -556 -1475 467 912 -1201 -749 1327 730 -1241 -966 1082 488 -1051 -432 987 -131 -1858 55
6520 55 1260 -267 -1159 740 956 -648 -821 1070 1386 -623 -950 525 822 -879 -455 1260 718
6537 718 -951 -267 1198 365 -862 259 969 -259 -1190 336 991 -264 -1041 410 957 -722 -1112
6554 -1112 478 869 -948 -640 784 320 -1117 -517 912 496 -617 -333 403 -321 -914 97 504
6571 504 -393 -648 204 681 -264 -733 461 862 -201 -676 645 647 -393 -467 807 419 -783 -275 642
6590 642 506 -662 -89 861 -124 -825 276 606 -277 -637 306 387 -458 -473 525 309 -450 -304 316 156
6610 156 -731 -315 474 104 -777 79 469 65 -562 74 306 -217 -404 -195 310 -363 -108 168 62 -449
6630 -449 -729 240 226 -369 -317 255 129 -745 149 385 -88 -166 192 681 125 -306 141 664 -218 -543 335
6651 335 450 113 -154 367 260 -28 -123 345 487 -471 -316 113 -74 -341 59 374 -297 -429 31 64 -294
6672 -294 -593 67 542 -297 -673 200 213 -465 -560 168 150 -286 -511 -52 187 -388 -111 181 106 -501 -334
6693 -334 399 65 -272 94 386 -100 -121 318 491 11 -10 498 497 -322 -90 507 159 -206 -95 431 254
6714 254 66 -184 462 67 -285 61 396 -195 -316 105 208 7 -151 180 78 -436 -254 269 184 -663
6734 -663 -135 428 -272 -680 -347 278 -23 -471 49 515 -105 -643 417 429 -147 111 613 413 -255 -164
6754 -164 235 117 -54 28 558 156 -293 98 614 -149 -433 307 782 -43 -471 106 802 -198 -430 453
6774 453 524 -1 -629 309 414 -620 -211 502 190 -339 -501 399 14 -556 210 314 -180 -664 82 577
6794 577 -590 -643 508 294 -458 -518 636 312 -459 -119 413 387 -515 199 739 233 -663 -58 665 -147
6814 -147 -399 266 698 -119 -673 313 481 -442 -199 593 574 -648 -210 1042 359 -869 41 972 74
6833 74 -1005 379 906 -21 -702 408 608 -773 -950 594 967 -635 -877 620 256 -862 -615 890
6851 890 477 -1058 -227 718 141 -902 515 1165 -174 -1117 306 1023 -203 -686 866 972 -813
6868 -813 -1066 1116 953 -520 -301 1113 472 -894 -589 1342 427 -834 307 1045 -381 -983 340
6885 340 1049 -377 -888 540 899 -993 -833 1055 600 -1102 -966 929 488 -1245 -491 1008 -4
6902 -4 -1181 -297 794 41 -901 141 1061 -569 -1351 304 869 -314 -918 718 608 -1152 -737 1544
6920 1544 788 -1031 -416 1109 257 -1276 283 1834 103 -1429 403 968 -517 -931 961 1467
6936 1467 -916 -1351 551 980 -509 -493 1247 563 -1711 -968 1285 451 -1165 -438 880 -315 -1914
6953 -1914 157 1559 -186 -1470 561 959 -1119 -1137 976 1428 -1199 -1603 787 801 -1129 -460 1470
6970 1470 462 -1482 -735 1564 205 -932 358 1399 -376 -1792 489 1492 -43 -1024 454
6985 454 922 -1064 -1134 1348 1386 -947 -966 1133 300 -1292 -222 1878 806 -1727 -241 1205 -268
7002 -268 -1198 373 1648 -580 -1677 419 1110 -512 -1141 857 1118 -1893 -1138 1231 991 -1403 -503
7019 -503 1321 53 -1990 -97 2008 413 -1701 62 1206 -619 -1611 867 1797 -534 -1503 446
7035 446 1076 -983 -411 1668 683 -1406 -776 1009 972 -1421 203 1745 -336 -1562 10 1585 -179
7052 -179 -1221 662 1127 -779 -1731 936 1324 -738 -1164 675 766 -1325 -613 1635 1045 -1478 -849
7069 -849 1114 -47 -1297 621 1785 -303 -1842 -68 1467 -497 -1214 1052 1500 -1300 -1913 976
7085 976 1350 -836 -669 1547 338 -1657 -837 1674 899 -1389 -268 1438 -407 -1436 622 1734
7101 1734 -124 -1377 337 893 -1022 -1037 1134 1409 -1395 -1075 948 1017 -1195 -250 1602 499 -1525
7118 -1525 -706 1222 203 -1215 7 1339 -660 -1770 144 1616 -548 -1306 479 513 -1155 -758
7134 -758 1211 1192 -633 -921 730 180 -1202 -93 1487 106 -1366 -328 1463 299 -956 871
7150 871 1532 -531 -1128 535 1486 -329 -578 937 986 -923 -772 855 779 -703 -599 1064 306 -1242
7168 -1242 -205 1604 1 -1149 2 811 -667 -1109 469 1440 -507 -854 539 750 -449 -536 908
7185 908 446 -977 -566 654 667 -774 -322 739 -57 -905 -12 1225 111 -703 132 731 -15 -696
7203 -696 448 1195 -592 -562 565 599 -391 -130 982 583 -744 -439 917 219 -704 -13 470 119 -792
7222 -792 -48 836 -209 -480 339 511 -561 -612 559 417 -651 -684 383 240 -813 -653 435 48
7240 48 -936 -475 522 91 -868 214 792 -18 -882 181 345 -346 -454 497 613 -685 -515 275 430
7259 430 -557 -29 801 4 -594 -70 780 400 -630 104 761 4 -458 183 820 -37 -560 264 517 -140
7279 -140 -258 351 79 -290 -122 377 234 -266 -412 219 253 -819 -69 302 51 -397 76 145 -340 -404 362
7300 362 272 -224 -304 158 383 -290 -605 322 738 -390 -634 189 306 -399 20 412 -104 -460 -66 538
7320 538 313 -235 238 514 -1 -405 286 576 -113 -244 392 515 -305 -256 235 332 -546 -254 368 272 -325
7341 -325 -563 309 304 -610 5 45 -109 -528 -207 57 -258 -309 -97 13 -257 -469 22 87 -402 -307 488 149
7363 149 -406 -306 557 656 -544 -67 209 486 -473 -118 259 -292 -223 180 191 -50 -42 359 44 -284 -328 215
7385 215 375 -222 50 436 189 -349 16 331 -143 -464 -99 167 287 -344 221 241 -223 -451 16 78 -116
7406 -116 -431 -88 89 -639 -561 196 -172 -210 -233 -65 239 -107 -196 121 58 -277 9 165 -243 -313 27 550
7428 550 -216 -284 310 369 -95 -221 511 -102 -191 -171 319 204 174 -246 681 31 -326 -35 469 -278 -36 174
7450 174 413 134 -239 322 15 -255 -226 19 -162 -333 -71 115 0 -412 110 556 12 -325 163 218 -4
7471 -4 -535 162 168 -385 -132 169 170 -446 -208 420 161 -360 -120 389 194 -732 431 628 208 -142 391 424
7493 424 -25 124 113 582 -67 -261 489 347 31 -611 411 130 -557 102 621 104 -353 192 444 -160
7513 -160 -862 -69 502 -189 -550 379 292 -281 -517 283 70 -442 -269 417 376 -655 -313 314 348 -522 -95
7534 -95 634 -72 -776 -284 760 -113 -348 134 576 -442 -484 588 456 -406 -97 413 482 -733 -88 913
7554 913 329 -789 -183 508 99 -682 19 654 -306 -368 96 523 -374 -470 488 272 -560 -644 570 215
7574 215 -760 -418 736 -118 -1427 -345 752 -271 -783 212 744 -509 -1182 170 896 -169 -902
7591 -902 180 474 -626 -453 541 780 -987 -563 582 276 -725 83 719 33 -1013 285 782 103
7609 103 -454 452 1061 -520 -932 685 683 -149 -322 602 241 -934 -460 1052 555 -997 -173 851 302
7628 302 -1138 -14 942 -127 -1101 269 700 -580 -904 475 537 -744 -554 730 516 -847 -478
7645 -478 1212 391 -1275 -427 915 401 -879 426 841 -119 -1217 357 1316 -279 -653 400 735
7662 735 -480 -625 926 1012 -1001 -577 952 293 -826 -237 1165 253 -1220 -424 1050 -80 -987
7679 -987 391 1098 -488 -1513 267 873 -183 -776 888 708 -1139 -1091 759 734 -721 -548 873
7696 873 332 -1414 -84 1437 151 -1346 -18 860 -492 -799 887 1247 -521 -1440 501 756 -587
7713 -587 -706 981 539 -1212 -466 1064 835 -972 -192 1099 45 -1341 -11 1482 105 -851 535
7730 535 1076 -601 -1187 665 1124 -585 -924 967 256 -1282 -740 1106 461 -1234 -456 974 355
7747 355 -1020 -8 1014 151 -1302 162 948 -59 -749 314 982 -1006 -1244 1117 1003 -429 -519
7764 -519 850 771 -998 -147 1383 550 -1212 -352 920 194 -1065 590 1372 -101 -1004 -13 907 -557
7782 -557 -850 1057 974 -808 -842 853 735 -556 -608 984 140 -1469 -329 1179 192 -1080 157 751
7800 751 -350 -1356 496 1103 -292 -821 338 641 -853 -815 843 566 -870 -911 554 159 -816 136
7818 136 996 5 -1080 -215 1118 86 -1057 508 1129 -668 -1065 668 948 -419 -907 634 698
7835 698 -682 -341 747 597 -706 -109 634 225 -900 356 884 7 -731 8 710 -492 -687 652
7853 652 452 -619 -1013 422 346 -682 -416 613 336 -941 -611 713 -218 -1123 -55 928 -32 -793
7871 -793 116 928 -7 -716 307 749 -233 -622 703 1097 -513 -570 657 619 -813 -149 612 292 -468
7890 -468 -55 505 267 -511 269 764 -152 -823 34 524 80 -569 222 439 -433 -620 734 661 -531 -253
7910 -253 430 187 -791 -314 580 208 -923 -394 483 -187 -420 161 530 -238 -843 177 259 -301 -285 604
7930 604 410 -124 -648 209 403 -631 -509 832 321 -328 -132 375 62 -330 69 479 -51 -505 420
7949 420 541 -125 -564 269 633 -365 -392 717 299 -227 -476 332 303 -295 -291 530 78 -353 -169 588 -259
7970 -259 -352 45 275 -175 -166 111 309 -107 -788 287 266 -718 -461 126 381 -375 -313 458 390 -391 -12 704
7992 704 67 -442 54 536 -185 -271 78 225 52 -241 549 405 149 -43 236 302 -187 124 448 242 -295
8013 -295 -3 326 364 -538 -236 376 234 -370 -126 182 -25 -359 261 386 -143 -431 -153 542 -338 -465
8033 -465 192 -131 -212 -165 378 -185 -211 59 136 47 -249 259 261 -186 51 70 140 274 -162 419 302 -59 -326
8056 -326 329 348 -76 19 227 247 -120 -50 401 33 -41 -94 495 221 -101 139 231 -495 -223 448 360 -68 -289
8079 -289 184 212 -306 -201 379 202 -372 -134 151 196 -723 -246 222 352 -351 -355 -40 -344 -134 -19 507
8100 507 160 -399 152 171 47 -100 221 139 -290 176 222 254 -359 -96 197 -232 -186 103 212 -6 -231 205
8122 205 186 -91 -135 32 -40 -203 -145 228 135 -390 -234 32 -169 1 -218 361 312 -393 256 210 -283 -310 -100
8145 -100 264 -7 -621 91 283 -67 -214 -54 47 -68 -285 98 50 -317 -203 349 -40 -183 -69 506
8165 506 426 -305 258 584 -181 -213 41 518 -63 -379 655 441 -140 -201 317 289 -127 -332 74 224 -299
8186 -299 12 486 117 -282 -156
8191a56
$$ Imaginary data points
##PAGE= N=2
##DATA TABLE= (X++(I..I)), XYDATA
0 0 0 0 0 8 -8 5 -8 16 -24 24 -32 45 -48 61 -74 94 -104 130 -150 174 -211 244 -277 323 -371 426 -481
27 -481 546 -623 699 -786 883 -992 1105 -1236 1372 -1528 1700 -1882 2081 -2310 2559 -2828
43 -2828 3132 -3475 3857 -4285 4779 -5349 6013 -6801 7756 -8931 10433 -12426 15187
56 15187 -19311 26123 -39368 74648 -360875 -922475 45480 451276 -114004 -400923 336753
67 336753 720020 173842 -274222 120327 541819 438887 89491 -212774 -454204 -263172
77 -263172 291560 415908 -105613 -284267 182605 283902 -338735 -569732 -13912 243115
87 243115 -264998 -568132 -264132 -79270 -142625 196111 631192 277474 -401664 -223955
97 -223955 443831 349989 -274786 -222423 372518 409715 -98956 -219500 181635 487061 442704
108 442704 125473 -378102 -612276 -160480 346031 19098 -595469 -343532 359108 218262
118 218262 -482360 -393905 358793 454584 -197571 -501119 -221842 -11205 62584 290261
128 290261 346198 -7930 -150547 250547 456563 58828 -203134 103405 280680 -94309
138 -94309 -389300 -168001 149754 237370 210557 14444 -363437 -399491 94993 305125 -221885
149 -221885 -581925 -100354 357462 -14257 -443653 -52339 527184 375625 -140109 -249109
159 -249109 -46253 76747 169836 231875 42443 -173123 17458 322934 170350 -153120
169 -153120 -24393 273671 88828 -330398 -328565 -29215 71985 31756 52379 -59033 -281475
180 -281475 -167495 215065 196252 -232932 -304733 86725 184352 -163094 -232887 164508 374304
191 374304 136540 -86313 -70097 -25629 32474 181311 164491 -116863 -211750 83886 251624
202 251624 -1051 -169178 57953 201489 -51831 -273041 -151063 13639 13397 31145 59093
213 59093 -91147 -206689 13240 250433 69553 -222289 -117784 139542 55698 -166001
223 -166001 -69646 184055 199629 61101 14356 -11280 -65599 22006 172754 60503 -205919
234 -205919 -169419 127754 183922 -39753 -97101 80395 116359 -64466 -174264 -132831 -81529
245 -81529 -18097 64345 518 -171876 -120277 165861 234352 -39735 -197219 -14087 127236
256 127236 -22290 -157405 -37136 130561 144590 94422 58510 7486 16722 132349 146151
267 146151 -66987 -226720 -88780 104743 50470 -94198 -46796 98561 102407 -11015 -93835
278 -93835 -125364 -105305 -20826 6901 -121701 -205771 -21447 222587 176655 -44893 -59118
289 -59118 121468 151149 -27549 -134695 -49669 67643 93849 54289 3448 7285 107082
300 107082 185710 78328 -124782 -164312 -38637 -3497 -125175 -185891 -78956 42619 53754
311 53754 7705 -25602 -32370 -558 35583 -21888 -145222 -146012 25902 153161 91569 5585
323 5585 78073 205038 188678 48033 -47275 -32022 19318 20541 -43392 -99892 -51100 77315
335 77315 122374 13621 -97197 -68719 5548 -36560 -158987 -197001 -114052 -19505 8828
346 8828 -2797 2410 52477 121225 130244 42445 -51951 -39699 43319 63500 -482 -26429 52758
359 52758 148781 149160 63204 -11946 -16680 7983 -23151 -119713 -183534 -127838 -17265 14556
371 14556 -46226 -74237 -4979 68577 36382 -63861 -108436 -54899 15983 22298 -15461 -7919
383 -7919 79152 167686 164605 84359 31006 52670 79339 31361 -60119 -92934 -33409 38908
395 38908 38215 -20936 -47415 -5963 31802 -14820 -116213 -160427 -106912 -37755 -39559 -80847
407 -80847 -62549 32552 108930 88688 15988 -5680 42384 77596 37298 -28161 -26134 49402
419 49402 107775 85008 26221 15366 55477 67457 3196 -83829 -108535 -64882 -27281 -47620
431 -47620 -88276 -74931 -3464 45886 13893 -54449 -66628 -10862 24653 -11901 -56792 -24627
443 -24627 63693 109901 79828 37487 45560 84173 86790 30554 -31861 -36144 11400 37137 1263
456 1263 -42014 -27705 19530 22516 -31419 -80173 -79110 -49730 -34205 -48781 -74984 -65318 -1551
469 -1551 56720 39057 -19682 -17392 48066 68710 7592 -39133 379 66100 75181 38052 14433
482 14433 28817 59591 63210 11235 -57176 -62930 -6989 12452 -40348 -71696 -21291 30925
494 30925 8995 -39554 -46378 -28272 -19346 -12897 -15558 -42901 -43272 27454 91992 55587 -12750
507 -12750 10725 78913 61300 -19813 -37788 13754 39554 19143 416 -5126 2393 39100
519 39100 62149 930 -88877 -78125 9 -6104 -84432 -80448 12379 42546 -12233 -29894
531 -29894 10787 21179 -531 -23 -11514 -60590 -53938 43585 93890 27696 -11261 58085 96539
544 96539 21436 -34611 7303 33092 -18286 -45394 -15448 -9680 -16424 39910 87063 15149
556 15149 -77454 -43487 25218 -21247 -94140 -52100 16274 -13027 -48269 10929 64776 35615
568 35615 21170 51174 7716 -90226 -67513 52223 61746 -31122 -23245 74029 70879 -7492
580 -7492 11668 79389 28818 -71724 -64309 -20297 -57835 -69352 32845 88723 -5668 -75636
592 -75636 -7082 44154 -12505 -41813 -3722 -31248 -100160 -50571 58852 47042 -6728 69971
604 69971 143848 22057 -114946 -22646 125525 59797 -84810 -58712 40301 23335 -7439
615 -7439 62453 95651 8023 -44518 -10047 -42765 -126762 -70666 65609 36654 -104367 -91984
627 -91984 41895 64583 5264 25892 43909 -56196 -111113 -2500 61483 -30014 -36476 127155
639 127155 155058 -48604 -124109 77029 198319 36150 -125610 -78437 -3701 -29173 -26500
650 -26500 32326 27453 -6711 25836 14645 -109582 -127649 55256 129429 -69768 -209107
661 -209107 -54456 110634 55635 -3690 83691 100280 -32692 -65566 46189 50924 -43725
672 -43725 11594 134508 34858 -151451 -63904 176750 168929 -44145 -114549 -35234 -30984 -73142
684 -73142 -32647 542 -38587 -18136 49004 -28606 -152156 -27255 203215 118559 -179818
695 -179818 -196282 60403 130709 -23575 -27041 127394 114520 -39750 -46924 52010 41241
706 41241 -51 59126 48571 -120027 -164824 39246 164431 29394 -88089 -23809 2770
717 2770 -89450 -82835 33862 32284 -56129 -25565 32469 -60079 -102743 102465 249064 43385
729 43385 -190511 -76773 132324 70703 -65955 19057 134535 35289 -87562 -28766 53411
740 53411 30758 27818 49387 -62507 -193364 -91735 101969 68472 -81584 -45876 57579
751 57579 -28928 -138899 -22719 120560 36990 -79922 -18344 31383 -56619 -37272 156375
762 156375 188463 -28873 -127302 20467 89770 -20891 -34435 85601 66960 -82851 -91318
773 -91318 25400 40276 -3381 42883 42883 -113714 -182063 -12990 109288 1666 -75276 30684
785 30684 61739 -76346 -90567 90687 144133 -11207 -77574 12493 15931 -60463 16151 159708
797 159708 97566 -71195 -63929 40501 11789 -49269 24111 71267 -54439 -139857 -32175
808 -32175 54253 -9251 -23295 69786 37714 -128075 -132738 39815 84731 -28299 -38085 50630
820 50630 15013 -75253 5478 141788 86904 -40907 -18144 36083 -41061 -80482 55286
831 55286 139376 14749 -88226 -13605 45108 -18939 -24438 59453 24930 -113576 -109348 16562
843 16562 27232 -42312 13517 101155 10284 -120299 -49503 88822 55351 -41983 -15596 28215
855 28215 -32999 -49485 63272 113647 19280 -24961 36022 14934 -88766 -57978 78525
866 78525 67936 -71877 -87764 18067 32829 -25510 6213 61129 -9066 -97156 -52115 14575
878 14575 -20907 -35069 51734 73811 -34435 -71429 40652 98726 18910 -26631 18284 8811
890 8811 -57941 -27299 67531 60590 -8739 8767 49216 -12693 -71505 2804 73513 -6963
902 -6963 -99792 -52805 19870 -5206 -26011 33842 52502 -21951 -54528 -3511 6437 -35447
914 -35447 -12356 46414 11655 -57850 -14754 76399 61268 -4996 8124 38390 -15083 -62577
926 -62577 -7466 45470 4048 -30281 12132 28442 -24664 -30626 35137 38877 -39721 -65853
938 -65853 -17147 -6489 -36561 -10198 44978 26906 -23350 -5169 35382 12962 -17845 13279
950 13279 32909 -15984 -41686 13724 54334 24000 6571 36812 29472 -27197 -33863 13903
962 13903 13929 -35515 -37267 3932 336 -30485 -9697 31005 12377 -30862 -26659 -7763 -23951
975 -23951 -31205 5333 24396 -6479 -15394 26346 43356 10193 -1138 25894 22240 -18265 -24496
988 -24496 8293 17253 1212 10481 26272 4900 -18887 -50 16960 -14302 -43981 -23392
1000 -23392 424 -16988 -29901 -172 25882 11551 -5747 702 3008 -7987 -2896 12309
1012 12309 4332 -10667 5612 33440 27261 7064 14359 29632 12612 -15435 -16246 -4351 -8192
1025 -8192 -13500 -4629 -2161 -11851 -8543 7752 2854 -22014 -28879 -12254 -8560 -24041 -23823 -204
1039 -204 15953 13077 9461 13262 13756 12736 12465 6646 -4650 -3701 11363 17694 8159 5036 17100
1054 17100 20979 6248 -8325 -9688 -9932 -16033 -18373 -15184 -13785 -11721 -1813 7816 3926 -5588
1068 -5588 -4869 1130 -1708 -11245 -12017 -1160 9911 14644 14240 15158 18533 21815 16502 2922 -7711
1083 -7711 -6562 -880 -3697 -10357 -7808 2473 6994 590 -6993 -10232 -11508 -14720 -18366 -20701 -19050
1098 -19050 -11479 -1282 6295 7025 6656 10876 15098 11109 1856 -3425 456 7544 10275 7686 9067
1113 9067 16658 23193 18228 3958 -4967 -3803 -3902 -12396 -21469 -17499 -5508 827 -1495 -3966 -1950
1128 -1950 -446 -2435 -8510 -14192 -14558 -7856 -31 3046 3617 9371 18539 20918 14535 6744 2395
1143 2395 95 -522 -1444 -4756 -6456 749 11380 9249 -2420 -5676 263 -1939 -17199 -25590 -18608
1158 -18608 -10172 -9120 -6243 736 4844 6124 9975 9508 509 -5625 1417 6416 -186 -1763 10241
1173 10241 21226 18642 15191 15705 9425 -1593 -1479 2239 -7965 -21004 -11438 5846 905 -13240
1187 -13240 -5498 11308 4246 -16089 -19730 -11213 -11212 -12400 -3439 431 -5396 1944 21068 20352 1135
1202 1135 -752 15555 10514 -13441 -14292 7611 13798 4211 6908 12896 374 -7286 7844 11786
1216 11786 -17968 -33966 -8881 7287 -16019 -27175 5407 28016 5319 -15854 -5414 4774
1228 4774 -1899 485 8221 -4566 -15622 10081 34417 14038 -7093 18597 40091 4092 -33119
1241 -33119 -12242 20062 5929 -14945 -3987 3020 -13110 -7372 20450 9438 -29384 -25293
1253 -25293 7705 -6457 -45285 -23935 30168 27332 -17509 -19445 13320 16369 3097 12304 12593
1266 12593 -17425 -19957 18509 24908 -11776 -5378 45554 37949 -30665 -42629 17257 34737 -12860
1279 -12860 -31490 -4932 -4686 -23504 -1160 28109 4271 -21280 5566 16962 -30672 -46376
1291 -46376 18230 54462 -1838 -41979 1136 36867 12659 2410 29625 19148 -25453 -19548
1303 -19548 16602 445 -26648 15383 53973 -4698 -66931 -18397 50796 18792 -41737 -23733
1315 -23733 7032 -24538 -42134 6729 33621 -1438 -10106 20886 1352 -46309 -10487 64196
1327 64196 37688 -46173 -38161 32195 29690 -12969 13558 55331 13285 -40223 -14861 16141
1339 16141 -11888 -16588 35243 27894 -53732 -59991 30754 57009 -14508 -36034 16244 9344 -54038
1352 -54038 -39456 35153 37924 -9771 -2177 20701 -16583 -33851 36626 73505 -4206 -60032
1364 -60032 -6129 32531 -16204 -27553 45657 58569 -24885 -56052 319 15916 -21936 -3215
1376 -3215 37125 -14033 -81228 -29662 55208 28249 -30201 5177 41542 -24242 -70945 2365
1388 2365 65654 18026 -25543 8590 16025 -30070 -7502 71772 55690 -35496 -40093 21551
1400 21551 3591 -48988 1262 74039 20486 -67693 -36326 32482 8285 -25862 20238 34822
1412 34822 -46548 -78997 4523 51198 -1393 -13571 42559 25015 -59296 -44241 52913 56914
1424 56914 -19477 -23212 20367 -9894 -49076 16694 83200 23438 -50141 -16005 18884 -32799
1436 -32799 -45765 39346 61316 -36123 -76663 1378 37656 -12594 -8309 52654 21204 -70404
1448 -70404 -53950 36302 37143 -14840 11460 49875 -10329 -61529 10389 78584 22382 -35169
1460 -35169 4065 20141 -46969 -49258 50019 73669 -17330 -50318 9553 10815 -46484 -17429
1472 -17429 58291 23761 -68058 -50845 23553 11276 -23902 27904 65002 -13874 -77219 -11846
1484 -11846 51823 8849 -21449 27745 31390 -44674 -47620 42887 63994 -5550 -20118 20630
1496 20630 -9903 -68995 -19371 67416 34495 -48140 -30062 24871 -4422 -37936 19498 60823
1508 60823 -7180 -63065 -17106 21424 -8989 -4532 55514 41559 -43211 -44907 34782 43013
1520 43013 -16369 -9367 38339 2794 -60786 -23103 51388 34131 -17067 -499 15954 -35214
1532 -35214 -52979 17528 51035 -14264 -49684 25 17205 -30158 -21230 48973 45815 -29829
1544 -29829 -43663 5397 7884 -17638 15303 50491 1161 -49741 -5311 46526 13110 -20300
1556 -20300 18439 32752 -30892 -58637 5113 44906 5941 -15748 10961 2751 -37211 -16338
1568 -16338 38797 22446 -32640 -21175 17590 -5461 -35106 11256 57924 16760 -35455 -12866
1580 -12866 20011 -1573 -12723 23203 26436 -23479 -32040 16100 25767 -10826 -4847 31561 7948
1593 7948 -47969 -33762 21939 19195 -18213 -10174 12658 -10666 -29901 6881 32764 -938
1605 -938 -24846 2171 9962 -23784 -19920 32485 39631 -10546 -23831 13235 18326 -8971 -547
1618 -547 27031 6622 -29184 -12419 19750 6282 -12076 12511 25541 -14030 -36863 -1141
1630 -1141 23542 -4543 -21595 2637 9007 -17251 -14577 20208 21508 -8841 -9480 10986 -1321
1643 -1321 -22706 -557 29440 10431 -18717 -3164 19407 3544 -11892 7838 17609 -10653
1655 -10653 -25712 -2753 8785 -8430 -8968 13311 8933 -18850 -16671 10060 8880 -13112 -9907
1668 -9907 7293 -1385 -15112 1328 21734 10928 -4412 5892 12119 -3886 -10286 10019 16372
1681 16372 -4052 -10548 8051 12903 -2861 -2420 12921 6682 -15048 -14514 1293 -1051 -13344
1694 -13344 -5465 7132 -638 -11480 -1109 10019 882 -7829 -588 2546 -8428 -7942 7181
1707 7181 11425 529 1055 11946 8981 -4874 -3218 7572 2221 -11129 -8057 2690 226 -5341
1721 -5341 1037 7705 -270 -8749 -4394 -266 -6754 -9924 -2214 1752 -2549 -1698 7160 10130 4832
1736 4832 4396 7354 3064 -3200 341 5894 2458 -1620 3859 10045 5358 -447 2339 4813 -2458
1751 -2458 -10102 -8328 -5097 -6662 -7583 -3035 -153 -1442 -1171 1204 -340 -4107 -4090 -1968 -2721 -4128
1767 -4128 48 4946 5722 5312 7344 7988 4133 1228 1502 567 -3684 -4756 -943 1331 -902 -1210
1783 -1210 2007 2899 -768 -4195 -4824 -4749 -4944 -5270 -4045 -1841 1085 4330 5421 4580 4603 5065 3993
1800 3993 1007 -626 907 2442 2025 2353 4526 4914 3047 2011 860 -1931 -5493 -6705 -5489 -5627
1816 -5627 -6796 -5305 -1585 164 -1298 -2230 -1496 -713 -2153 -3140 -3970 -2244 1309 3513 3119 2320 5590
1833 5590 8931 5681 209 -26 2843 1649 -3057 -3040 939 2517 1020 337 622 -1011 -2208 -1599
1849 -1599 -2358 -5852 -5461 -931 844 -1441 -493 4171 5128 2068 903 1719 404 -364 2858 3584 -1087
1866 -1087 -1990 5156 7775 -618 -5325 1636 5514 -3394 -11174 -5186 1592 -331 -5128 -3481 -1450
1881 -1450 -1811 -124 652 -4012 -6333 974 4025 -4239 -7699 3912 12622 3662 -5017 1546 7997
1896 7997 995 -3101 3659 5061 -3145 -2796 6544 5681 -4528 -1937 9712 4843 -11208 -10216 3694
1911 3694 5527 -3327 -3952 1134 -754 -2259 4099 3552 -5664 -3476 8593 2298 -16161 -9532 16292
1926 16292 16170 -8778 -12586 8580 11470 -6616 -8587 6120 4893 -8644 -6727 2887 -596 -4089
1940 -4089 8529 11252 -8464 -17118 1328 10312 -5057 -10783 4153 5555 -9474 -5965 12541
1953 12541 9231 -6608 748 12560 -5223 -22678 827 27477 8857 -19034 -4786 20131
1965 20131 8055 -11942 1489 16917 1960 -15050 -6997 71 -5098 3641 17716 2631 -21543
1978 -21543 -9086 17277 5317 -19020 -5970 15276 -4082 -28350 -6013 23539 9986 -9665
1990 -9665 3920 11738 -12929 -19331 13150 23959 -8690 -21283 5369 13962 -8727 -6432 20834
2003 20834 17334 -12259 -15929 354 -4488 -10751 10202 18601 -12783 -28087 6465 26186 -3190
2016 -3190 -16258 15454 20044 -22978 -33239 11050 30516 1077 -8865 13141 8333 -16797 -3450
2029 -3450 28008 15309 -18218 -11857 7246 -8686 -20103 11506 31314 -1749 -26711 -4015
2041 -4015 8031 -14360 -11830 20320 11793 -32404 -29679 16640 21222 -10367 -1112 29461 7103
2054 7103 -34916 -16326 27705 18500 -12442 -1358 15057 -9362 -21867 15433 35358 888
2066 888 -20380 1181 2416 -26264 -15197 28449 22019 -23375 -22857 12982 6571 -18520 7019
2079 7019 36726 627 -42798 -15410 26130 9632 -11095 16879 28935 -13674 -32685 10031
2091 10031 32266 35 -12788 10758 211 -36560 -18041 33516 26187 -20242 -17077 10487
2103 10487 -7973 -31912 2524 36093 1839 -35275 -10068 15298 -7726 -11304 32194 35625
2115 35625 -21398 -37959 10129 27324 -7283 -7119 28078 13987 -32972 -21794 26719 23150
2127 23150 -9967 -152 15319 -18789 -41554 3503 39767 4988 -27463 -1067 13871 -19507
2139 -19507 -22232 26429 35949 -12219 -28121 4563 6528 -16040 6669 43063 12153 -39649
2151 -39649 -19857 26485 12155 -18740 6322 29236 -12110 -45828 -7376 30138 7257 -12962
2163 -12962 7445 3341 -33456 -25013 27114 29052 -15791 -17374 14817 1317 -29953 -691 43883
2176 43883 19841 -26253 -13635 14861 -2756 -14054 23669 36409 -13473 -38274 2848 24332
2188 24332 -8190 -13440 24251 19616 -31704 -34506 14323 25190 -4672 -4522 12824 -10077 -33833
2201 -33833 -825 34342 9104 -18914 3101 16438 -18898 -26987 23169 41337 -7259 -32959
2213 -32959 -737 11586 -13889 -6462 29502 17901 -28415 -25146 13036 9389 -15408 2221
2225 2221 25124 -5874 -38768 -9285 27420 11549 -9295 8758 12416 -20672 -23027 17920
2237 17920 26814 -8315 -12755 15020 5833 -26737 -6713 37953 23226 -22761 -19091 11340 1516
2250 1516 -19324 4444 28195 518 -27026 -5200 15133 -1900 -7599 17231 14125 -24094
2262 -24094 -27936 9940 18333 -6602 -4805 17778 2734 -26540 -8857 25006 12837 -16799
2274 -16799 -6598 10441 -10070 -23224 9413 31541 2830 -20823 -1409 11558 -8194 -11527
2286 -11527 14325 15600 -14818 -18878 6380 9635 -5254 4402 20738 1407 -23805 -8138 15906
2299 15906 3680 -12785 3398 14771 -7872 -19678 7461 24192 2324 -11590 3594 5759
2311 5759 -15066 -12238 14087 15166 -8280 -9520 8312 4007 -9967 1132 16592 687 -19779
2324 -19779 -8806 6325 -2875 -8952 8032 13332 -8264 -15776 4498 11551 -5141 -7980 7093
2337 7093 3621 -15161 -9336 13743 13492 -3885 -1704 9840 1400 -10572 388 12678 1718
2350 1718 -10671 -1239 6323 -3032 -4835 9693 11455 -6366 -11183 1820 3618 -8160 -5124 8321
2364 8321 3818 -10132 -4517 9771 6573 -4303 980 8411 -1644 -11047 -495 9377 1290 -5060
2378 -5060 2833 6186 -3410 -5772 4522 6057 -6077 -8451 -485 -1427 -8236 -3412 6543 2002 -7195
2393 -7195 -2592 5154 263 -5655 1199 6396 -1769 -6683 2474 8882 2491 -932 5795 7041 -1298
2408 -1298 -3525 3789 4584 -2632 -3095 2383 935 -4361 -1402 4159 502 -4983 -2089 1472 -2460
2423 -2460 -5397 50 3123 -1717 -3363 2072 3835 -520 -826 4093 4007 -2189 -2590 3276 3297 -1815
2439 -1815 -1328 2421 1655 -2953 -2558 614 -143 -3082 -2685 -1186 -3023 -3112 -557 -55 -1867 -2362 870
2456 870 1035 -990 -472 3102 2791 413 1019 3708 3137 839 1545 3716 2010 -657 431 2778 1655
2473 1655 -1570 -822 700 93 -2512 -2657 -1745 -1680 -1822 -1795 -1774 -1252 56 1068 -267 -1477 340 1671
2491 1671 608 -1331 -147 2009 1262 579 1227 2185 536 -442 -16 10 -2060 -3038 -1384 -57 -2039
2508 -2039 -2618 -797 1211 599 -1729 -1776 -632 82 -269 -1455 -1047 1310 3518 2780 990 1315 4694
2525 4694 4479 277 -1388 975 2025 -114 -1365 409 1586 674 -217 656 -310 -2567 -2025 -878
2541 -878 -2269 -4439 -3159 524 1082 -431 -320 937 1326 740 216 -1566 -2383 190 2016 -1341 -3692
2558 -3692 1126 6624 2824 -3307 -1890 3434 1366 -5016 -4317 599 691 -1945 -918 1503 1028 1162
2574 1162 2823 1644 -2448 -3069 1331 1285 -1689 -685 3252 2618 -68 2394 4203 594 -1736 1911
2590 1911 2381 -5133 -6675 2768 7001 -1710 -6200 2236 7041 -838 -5924 -640 3019 -2299 -5717
2605 -5717 -2315 -550 -1033 2413 4461 -850 -4533 1316 4250 -2631 -6118 1372 4533 -4165 -6825
2620 -6825 3316 7322 -456 -2454 5333 3422 -7305 -5399 6404 5342 -5964 -4899 5794 4495
2634 4495 -3932 -29 8100 3928 -4711 -2450 865 -2870 -2603 5809 4741 -6341 -5224 6961 5893
2649 5893 -6165 -3395 9003 2869 -12729 -8073 8511 6482 -6017 -1268 7876 -65 -9717 -220
2663 -220 10036 834 -8771 -1675 3292 -5642 -6356 6851 9184 -4765 -6439 3313 852 -8304 -656
2678 -656 11513 1287 -14203 -4964 10541 2879 -7421 4795 14075 -2514 -15069 703 13504
2691 13504 1789 -6472 4979 7026 -8328 -8700 9890 12179 -4261 -6415 4525 -1075 -12467
2704 -12467 -1212 13994 2880 -13165 -3278 7381 -4683 -10165 9083 16085 -7079 -18630
2716 -18630 1694 12003 -3603 -6372 11772 9971 -12757 -12707 9037 10088 -5428 -1392 9499
2729 9499 -3763 -18812 -2043 17254 4298 -12100 -1155 7496 -9236 -14076 9326 18032 -4195
2742 -4195 -13214 3382 5361 -10148 -2535 21195 12274 -15965 -12489 12087 8632 -7843 2730
2755 2730 17570 -59 -20473 -5077 13963 3470 -6714 6441 6876 -15988 -17741 11039 17577
2768 17577 -6846 -12117 6205 2675 -18057 -7599 19687 13553 -11991 -8773 7212 -1688 -11804
2781 -11804 8641 22171 -3173 -21628 -1865 12964 -3516 -8546 14151 15418 -14303 -21095
2793 -21095 5152 12898 -4566 -3183 11615 -1592 -22903 -6129 21180 10261 -10647 45
2805 45 12066 -8258 -19919 7602 25920 2273 -15509 238 7522 -8435 -4592 20851 15902
2818 15902 -16040 -16880 7097 5097 -12557 -249 20961 2179 -25565 -11407 15258 6700 -8608
2831 -8608 3891 9726 -13728 -21554 6838 19595 -1590 -8766 10259 6445 -19185 -11057 21637
2844 21637 18492 -12104 -13134 6680 445 -14517 4112 24395 4084 -20399 -6339 10373
2856 10373 -4243 -10916 12976 17963 -13119 -23956 4063 17233 -1211 -3315 14385 5487 -20884
2869 -20884 -12255 17190 12661 -8939 -1301 12553 -6038 -21241 4669 26904 4666 -18208
2881 -18208 -3986 7414 -10489 -13319 13035 18401 -9620 -18410 3660 7005 -9195 -1561 18865
2894 18865 4956 -22785 -13371 13193 7507 -8189 4189 16373 -5076 -21258 1107 19531
2906 19531 2635 -10205 4843 7012 -14911 -14100 15106 19863 -5867 -11694 5800 2520 -14036
2919 -14036 -2707 19762 8584 -15509 -9133 8173 572 -7767 9524 17972 -6169 -20413 -418
2932 -418 12557 -2005 -6597 10876 8475 -15309 -15016 11077 14188 -5114 -5238 6938 -2121 -17470
2946 -17470 -3226 16895 6632 -11028 -3067 6824 -5613 -10747 8587 15866 -4791 -15010 707
2959 707 6488 -6515 -3738 14184 9396 -12513 -10745 8214 6798 -6173 644 12113 -1079
2972 -1079 -15754 -2718 13706 4961 -5295 3289 6614 -7758 -11712 6617 12792 -2883 -7672
2985 -7672 3631 2168 -10150 -2995 13280 7378 -10453 -7839 5125 81 -8192 2545 12489
2998 12489 -969 -13514 -2673 8208 138 -5125 5268 6632 -7923 -10482 4300 8309 -2751
3011 -2751 -2764 6005 801 -10287 -3516 10018 5161 -7082 -2180 5556 -2047 -8461 3313 11329
3025 11329 -215 -8461 275 5401 -2861 -4075 7398 7416 -5442 -7147 3934 5402 -2946 -348
3039 -348 6873 1504 -8164 -2931 6587 2319 -3769 1122 4659 -4257 -8613 2058 6918 -2111 -6098
3054 -6098 1155 2827 -5346 -4543 5495 5401 -4478 -4814 2730 1885 -4236 -407 6198 962 -5377 -1271
3070 -1271 4748 868 -2861 2236 4434 -2660 -5484 1311 3929 -1565 -2587 2995 2189 -3977 -2856
3085 -2856 4396 3222 -3515 -1976 3069 823 -3755 267 5557 2206 -2861 -359 3177 2 -2292
3100 -2292 1451 2736 -1678 -2810 1247 1890 -1791 -1551 2381 503 -4131 -2880 1316 -17 -3271
3115 -3271 -1340 1684 -768 -3012 404 3054 74 -2381 73 1842 -1036 -2062 1456 2766 -136
3130 -136 -1008 1601 1921 -182 -184 1809 279 -1849 -908 1109 -151 -1426 550 2119 427 -1662 284
3147 284 1808 -499 -1651 43 1088 -589 -1199 1211 2001 285 -254 1015 798 -720 -813 661 302
3164 302 -1028 -1303 241 172 -868 -125 223 -1090 -1638 -288 -145 -1846 -2087 -152 842 -715 -840 914
3182 914 1695 -109 -603 549 739 -173 153 779 834 405 814 1469 1071 346 535 722 -64 -581 -2 145
3202 145 -130 93 619 270 -458 53 1082 47 -1397 -683 636 614 -1291 -537 944 1128 -522 -288
3220 -288 421 144 -343 -303 -570 -973 -581 230 137 -1096 -660 646 96 -1185 -1253 81 -275 -1325 -478
3239 -478 630 -143 -593 618 1429 30 -888 627 1296 -95 -629 902 1529 181 -147 1369 1072
3256 1072 420 219 1102 -150 -1005 356 1799 -373 -1750 537 1640 -574 -1980 265 1774 -985
3272 -985 -2238 37 802 -1606 -1214 1671 988 -2040 -1216 1295 719 -1755 -526 1632 -264 -2509
3288 -2509 3 2105 31 -1736 1043 1418 -2140 -2160 1905 2464 -1818 -1838 1962 1134 -2803 -1112 3349
3305 3349 2047 -2346 -1054 2330 545 -1903 1459 4433 2 -2817 607 3167 -534 -1777 2603
3320 2603 2475 -2785 -3094 2357 2442 -1929 -733 3293 -173 -5435 -1376 4090 887 -4196 -849 2882
3336 2882 -1747 -4806 1191 4995 -651 -4411 556 1853 -3066 -2227 4449 3724 -4102 -4084 3309 2265
3352 2265 -3167 -21 5280 247 -6208 -1498 4518 621 -3212 2663 4775 -3679 -6386 3345 7052
3367 7052 -1583 -4519 2851 3187 -5168 -3770 6400 6088 -3208 -2998 3109 470 -5307 1209 8177
3382 8177 388 -7469 -1322 5247 -1099 -4136 3890 6734 -4811 -8349 1389 4634 -2806 -2659 5447
3397 5447 1754 -9128 -4715 7584 5303 -5739 -2215 5159 -1342 -9197 198 10204 2659 -5830
3411 -5830 -593 3862 -3403 -3751 7316 7767 -5367 -7141 3683 3886 -5130 -665 10113 4065 -9856
3426 -9856 -5821 6392 3433 -4333 1627 7213 -3997 -10736 1633 10431 691 -5785 3382 4639
3440 4639 -8221 -7930 6818 9688 -3675 -6099 2918 554 -7587 244 11442 2913 -10496 -4426
3454 -4426 5013 -2059 -7474 5466 11551 -4274 -13327 -315 8731 -1153 -4033 7005 4728 -10106
3468 -10106 -8797 7521 8501 -3243 -1120 7400 -787 -12177 -884 13564 5251 -7926 -1999
3481 -1999 4943 -4669 -7694 7841 12770 -3229 -10547 1643 4657 -6561 -3360 12045 6940 -12044
3495 -12044 -10163 6735 5749 -5146 489 9727 -1745 -14026 -2968 10288 2667 -5726 3758
3508 3758 5919 -8836 -11310 6994 12680 -2859 -8195 3502 1720 -10396 -3865 13508 8220
3521 8220 -9484 -7019 5266 64 -8171 4074 14427 -945 -14723 -2662 9375 496 -4560
3534 -4560 8003 9179 -8534 -11777 5536 10111 -2058 -2877 7533 1011 -13016 -4504 13322
3547 13322 7538 -7650 -3232 5646 -4054 -11543 3649 14914 259 -12088 -941 5609 -5186
3560 -5186 -5634 10001 9914 -9202 -11955 3505 5665 -4921 -537 10892 1738 -14086 -5585 9690
3574 9690 4229 -5547 1998 7355 -6793 -13120 3935 13605 167 -7462 3195 3961 -9373 -6134
3588 -6134 11404 10943 -6910 -8289 4768 2114 -7157 1400 13612 2827 -12047 -4410 7281
3601 7281 818 -5083 5779 9408 -6003 -12454 2456 9750 -1987 -4044 6178 2805 -11668
3614 -11668 -7668 9181 7929 -5807 -4270 5679 -1330 -10794 -188 12675 2637 -9644 -2304
3627 -2304 5208 -3212 -6307 7065 10731 -4414 -10331 1810 5934 -3780 -1745 9345 4165 -10441
3641 -10441 -6511 7643 5316 -4465 592 7464 -2563 -11722 235 11280 2284 -6581 1447 4990
3655 4990 -5140 -7053 6721 9764 -3157 -7123 2509 2741 -5939 -1365 9638 4138 -8570 -4706
3669 -4706 5160 1326 -5555 2143 8020 -2857 -10571 -133 7156 -809 -4931 3752 4551 -6997
3683 -6997 -7666 4784 7056 -3237 -4128 3855 1286 -7110 -1780 8554 4064 -5296 -2605 3659 -977
3698 -977 -5151 3063 7887 -969 -6723 924 4829 -2060 -2809 5681 4448 -5933 -6101 4115 4744
3713 4744 -2796 -1314 5163 636 -6783 -1766 6352 2286 -4218 -624 3342 -2251 -5143 2356 6211
3728 6211 -1034 -4579 697 2096 -3607 -2662 4105 2962 -4487 -3466 2792 1037 -3692 246 5122
3743 5122 150 -6103 -1501 4012 843 -3299 1324 3470 -2027 -4124 1581 4413 -586 -1708 1785
3758 1785 1464 -3266 -1332 4228 2557 -2305 -1170 2609 12 -3148 565 4109 -440 -3692 -139
3773 -139 2524 -889 -2087 2012 3200 -2470 -3553 941 2467 -1617 -1975 1827 1114 -2970 -1807 2283
3789 2283 999 -1708 -543 1507 -872 -3004 522 2717 -460 -2601 468 1634 -1377 -2022 1444
3804 1444 2079 -1518 -1739 1244 1357 -1672 -412 2226 831 -1924 -967 2167 1002 -1011 424 1672
3820 1672 0 -1471 280 1969 102 -715 1145 1224 -1177 -1055 1421 1112 -1670 -1253 889 157 -1603
3837 -1603 -591 1222 147 -1985 -1003 773 -118 -1437 -289 1202 100 -1758 7 1017 13
3852 13 -439 212 418 -308 -393 873 658 -858 -288 821 325 -970 -125 1145 346 -810 -391 1043
3870 1043 226 -545 471 1112 520 -552 486 1203 5 -127 666 851 186 -271 582 639 -2 -73 422
3889 422 79 -726 -121 264 -645 -1109 -217 543 -694 -1260 -120 485 -904 -1019 -259 526 -582 -951 215
3908 215 504 -326 -509 535 461 -455 -95 498 125 -432 0 593 94 -444 470 791 190 -46 430 661
3928 661 -544 -307 1077 1009 -371 -67 1472 648 -669 -119 1225 478 -679 27 516 78 -348 763
3946 763 583 -484 -751 351 -126 -1029 -805 382 144 -1207 -841 482 159 -932 -244 1096 -600
3963 -600 -1625 -310 1005 -521 -1358 66 1199 -425 -1052 806 1269 -556 -929 612 393 -915
3979 -915 -210 1913 700 -1453 276 1811 404 -1175 629 1917 -375 -1827 417 1414 -232 -619
3995 -619 1439 1333 -1815 -1624 1362 1525 -1743 -1229 1348 629 -2317 -804 2132 972 -2014 -497
4011 -497 1053 -1175 -2091 676 2153 -1569 -2673 1111 1710 -1772 -1695 2287 2058 -2475 -2576 1588 1328
4028 1328 -1851 -162 2699 236 -3199 -52 3170 377 -2121 787 2510 -1605 -3108 1451 3668
4043 3668 -527 -1586 1832 1529 -3032 -897 3987 1790 -3353 -1415 2799 403 -3715 417 4540
4058 4540 152 -4677 -834 3120 -523 -2721 1351 2874 -3102 -4162 2052 2721 -2112 -1816 3344
4073 3344 903 -5176 -2147 4548 2112 -3506 -1017 3074 -1193 -4309 1636 5486 -330 -4422 300
4088 300 3172 -2744 -2912 4445 4764 -3454 -4603 2651 3168 -2647 -667 4910 1239 -5554 -1801 5034
4104 5034 1434 -2909 1760 4618 -2475 -6099 2071 6567 -805 -4127 1990 2525 -4687 -3899 5249
4119 5249 4978 -3941 -4200 2729 326 -5298 -114 6987 1023 -7155 -2384 3882 -182 -4158 3080
4134 3080 5362 -3667 -7130 1706 5182 -1763 -2678 4615 2608 -6852 -4385 6196 5154 -3778 -2082
4149 -2082 4398 -366 -7088 418 8556 1766 -5821 -575 4039 -2341 -4703 5092 7242 -3286 -6702
4164 -6702 2213 4136 -3221 -1419 7032 3265 -7511 -4716 5327 3373 -4106 506 5802 -1966
4178 -1966 -9222 -534 7678 909 -5288 947 3369 -5400 -6438 5221 7431 -3148 -5540 2437
4192 2437 1197 -6039 -1165 8424 3593 -7556 -3834 4783 729 -4650 3129 8184 -2234 -9172
4206 -9172 234 7044 -580 -3299 4649 4909 -6630 -6911 5365 6740 -3073 -2573 4943 692 -8298
4221 -8298 -1641 9016 3925 -5435 -1798 4076 -2658 -6380 3664 8840 -1820 -8039 416 3812
4235 3812 -3729 -3161 6820 4999 -7558 -7280 3934 3605 -4207 -554 6683 -283 -9704 -2324 8117
4250 8117 2879 -4622 1132 4547 -4587 -7326 3722 8753 -1070 -5289 2709 2667 -5384 -2735 8318
4265 8318 5659 -6317 -5151 3979 1667 -5218 1516 9155 -117 -8946 -1585 6193 367 -4369 3832
4280 3832 5895 -5351 -8396 3459 7013 -2115 -2947 4286 1782 -7440 -3818 7389 4392 -5138
4294 -5138 -2693 3723 -1541 -6932 1811 8714 -191 -7874 -987 4151 -2835 -4657 5095 6514 -4665
4309 -4665 -7270 2565 4784 -2686 -1334 6341 1998 -7677 -3652 6217 3353 -3663 447 4912 -2154
4324 -2154 -6839 1550 7840 241 -5126 983 3221 -4246 -4454 5437 6244 -3791 -5137 3048 2315
4339 2315 -4338 -818 6814 1997 -6981 -3385 4109 1190 -3442 1466 5009 -2561 -6792 468 5036
4354 5036 -1283 -3339 2856 2492 -5491 -4555 4954 4942 -2625 -2941 2846 258 -5392 -445 6422 1927
4370 1927 -4850 -1332 3579 -825 -3273 2700 5582 -1720 -5280 949 3631 -1509 -1278 3858 2329
4385 2329 -4362 -3061 3469 2822 -2800 -278 3889 -789 -5366 -127 5366 637 -3612 185 3154
4400 3154 -1994 -3755 2056 4246 -1585 -3952 900 1506 -2915 -1605 3913 1971 -3624 -2809 2110
4415 2110 986 -2683 194 3612 -735 -4269 -28 3768 -211 -2279 1666 2437 -2720 -3214 2344
4430 2344 3609 -1486 -2078 1858 1524 -2901 -1194 3288 2017 -2251 -1444 2036 -46 -2228 818 3266
4446 3266 -729 -2914 635 2361 -805 -1411 2029 2295 -2205 -2393 1558 2019 -1548 -1023 1820 315
4462 315 -2991 -1346 2312 678 -2282 -807 1675 -788 -2344 62 2175 -372 -2242 549 1315
4477 1315 -1140 -1119 1764 1542 -1419 -1582 1435 1029 -1541 -202 2302 606 -2194 -515 1960 780
4493 780 -1618 32 1926 -254 -1583 100 1831 -170 -1249 492 937 -789 -762 952 1150 -1090
4509 -1090 -688 928 560 -1121 -241 1410 -162 -1413 -257 1355 -229 -1426 -18 853 -701 -1652
4525 -1652 426 1056 -482 -1273 172 371 -938 -1034 815 561 -419 -448 446 446 -295 200 805 331 -562
4544 -562 523 970 14 -515 679 753 -450 -758 683 1057 -273 -391 779 768 -543 -781 533 181
4562 181 -603 -340 307 669 -751 -210 457 193 -527 -157 427 -327 -427 144 103 -431 -630 244 268 -803
4582 -803 -570 281 -71 -1122 -980 240 122 -586 -371 615 434 -247 -294 561 60 -448 116 619 197 130
4602 130 546 495 298 64 555 695 -454 29 638 96 -608 316 797 8 -623 -9 652 -160 -970 -52
4622 -52 774 -303 -1113 -209 194 101 -356 -110 182 -449 -127 335 5 -436 -89 227 -315 -732 -155 821
4642 821 -199 -504 115 565 -780 -883 748 490 -820 -417 852 777 -546 -351 1163 782 -464 -232
4660 -232 1220 459 -558 382 972 -135 -764 553 1003 -417 -388 651 365 -1017 -940 1057 755 -865
4678 -865 -598 1064 313 -1103 -560 1270 123 -1401 -718 821 -526 -1406 -81 1342 -424 -1512
4694 -1512 313 750 -1079 -871 1029 105 -1538 -783 1171 499 -1123 18 1671 3 -1817 -51
4710 -51 2355 268 -1537 219 1881 -543 -1012 1145 2420 -383 -1468 1025 1056 -942 -659 1942
4726 1942 852 -1685 -797 1588 113 -1460 665 2087 -785 -2199 323 1857 -739 -1688 1610
4741 1610 1454 -2261 -2328 1668 1937 -1407 -1597 1609 544 -2878 -1199 2322 886 -2101 -570 1632
4757 1632 -529 -2127 1101 2705 -811 -2481 469 1809 -1450 -1441 2518 2246 -2223 -2122 2527 1827
4773 1827 -1668 -395 3182 535 -3749 -858 3483 1001 -2266 177 2149 -1042 -3104 941 3447
4788 3447 -536 -2673 741 1393 -2319 -1594 3287 2197 -3101 -2202 2338 605 -2884 145 4180 25
4804 25 -4720 -650 3184 -190 -2822 1668 3388 -2157 -4284 1223 3698 -1205 -2038 2270 1271 -3596
4820 -3596 -2085 3588 2704 -2592 -1184 2747 -213 -3746 1052 5059 313 -3868 39 3213 -1229
4835 -1229 -2649 3271 4329 -2796 -4443 1465 2880 -1959 -1385 3861 1382 -4659 -2789 3470 1928
4850 1928 -2895 -159 2904 -1802 -4864 900 5103 9 -3136 1198 2098 -3361 -3379 4153 3971 -3070
4866 -3070 -3925 2327 1620 -3670 -758 5130 1872 -4872 -2253 3121 860 -3218 1397 4319 -1798
4881 -1798 -5371 896 4496 -192 -2432 3244 2114 -4239 -3375 4388 4325 -2421 -1874 3394 193 -5199
4897 -5199 -166 6212 1465 -5246 -1385 3016 -1313 -3827 2627 5204 -1999 -5494 670 3531 -1958
4912 -1958 -2094 4112 2071 -5599 -3706 3806 2738 -2746 -318 4377 -716 -5872 130 5770 910
4927 910 -3942 453 3143 -3166 -4286 3957 5777 -2072 -4262 2012 2269 -3692 -1487 5596 3246
4942 3246 -4820 -3116 3330 1219 -2934 1529 5341 -852 -6086 114 4936 -407 -2953 2780 3377
4957 3377 -4357 -5355 3163 4913 -2211 -2977 2819 864 -5278 -2024 5741 2609 -4444 -2087 2946
4972 2946 -271 -4351 1633 5591 -970 -5499 -11 3532 -1354 -2619 3730 3304 -4359 -4376 3009 3488
4988 3488 -2828 -1411 4321 770 -5840 -1618 5403 2272 -3458 -24 3773 -1511 -4635 1899 5414
5003 5414 -851 -3887 1051 2674 -2931 -2173 4305 3778 -3547 -3356 2823 1406 -3098 -33 4742 264
5019 264 -5595 -1438 4312 469 -3198 1106 3207 -2657 -5083 1637 4504 -1341 -3292 1748 2008
5034 2008 -3576 -2810 3767 3204 -2915 -1997 2528 181 -3867 345 4703 243 -4773 -512 3468 -586
5050 -586 -2854 2462 4052 -2098 -4542 1672 3678 -1620 -1923 3370 2282 -3809 -2436 3436 2348
5065 2348 -2456 -838 2707 -552 -3890 190 4227 56 -3298 -65 1969 -1876 -2650 2419 3232
5080 3232 -2107 -3416 1246 2120 -2592 -1321 3384 1204 -3561 -2006 3103 1299 -2389 46 2798
5095 2798 -670 -3723 22 3470 -224 -2023 1061 1820 -1900 -2340 2219 2717 -1450 -1843 1743 1095
5111 1095 -2290 -511 3396 1421 -2676 -1008 2187 211 -2386 577 2778 -522 -2968 183 2569
5126 2569 -683 -1623 1315 1142 -2049 -2094 1531 1613 -1595 -1245 1458 88 -2541 -342 2442 422 -2156
5143 -2156 -247 1401 -724 -2219 720 2091 -516 -2184 443 1686 -895 -835 1545 1138 -1705 -1362
5159 -1362 1525 1056 -1097 -124 1546 343 -1369 86 1426 86 -1043 266 1513 -559 -1192 1046
5175 1046 2230 -567 -1323 765 997 -1213 -893 1790 1008 -1010 -1031 807 253 -1068 -209 1053 7
5192 7 -1776 -305 521 -129 -1038 346 633 -1021 -1526 743 902 -536 -765 496 142 -1066 -621 1007
5210 1007 978 -1078 -467 1039 427 -940 -39 1121 129 -769 126 766 -86 -567 493 662 -375 -484
5228 -484 720 438 -372 -244 591 416 -757 -129 789 122 -598 40 716 -225 -1108 -285 724 -247 -1177
5247 -1177 -354 371 -322 -693 27 455 -358 -459 58 266 -567 -613 809 -55 -634 -103 367 337 -601 235
5267 235 792 151 -513 311 440 -124 -647 262 997 -217 -715 324 519 -186 -254 509 572 -82 42 611
5287 611 363 -4 -68 693 35 -189 34 576 -117 -424 122 163 -394 -354 137 -1 -732 -533 197 373 -489
5308 -489 -440 89 453 -725 -599 401 -158 -509 -165 537 -340 -418 146 422 123 -298 185 392 -344 -372
5328 -372 83 620 -513 89 450 300 -614 -62 764 366 -356 -106 742 75 -305 152 743 -28 -211 279
5348 279 573 21 -199 245 632 -431 -302 562 284 -718 -470 811 -36 -849 -383 553 -189 -1112 347
5367 347 540 -341 -883 313 556 -687 -812 423 575 -922 -551 932 459 -805 -318 919 30 -669
5385 -669 58 1081 94 -867 429 866 -646 -617 648 1166 -428 -1052 806 675 -912 -276 1057 581
5403 581 -947 -413 1185 553 -952 -62 1248 -258 -1158 96 1122 -502 -946 201 580 -1497 -1152
5420 -1152 1015 938 -1109 -907 764 124 -1544 -555 1929 476 -1823 -674 1188 -44 -1547 360
5436 360 1921 -513 -1579 352 1143 -600 -1054 1497 1081 -1356 -942 1500 1067 -883 -227 1867 -158
5453 -158 -1716 164 2126 427 -1698 255 1641 -936 -1819 763 2175 -340 -1693 672 1229 -1199
5469 -1199 -1217 1650 1023 -1921 -1625 1416 708 -1733 -30 2417 -415 -2699 -487 2137 88 -1836
5485 -1836 569 1700 -1784 -2383 1201 2281 -1061 -1463 1587 1200 -2006 -702 2743 1781 -1727 -1117
5501 -1117 1875 -33 -2013 390 3042 -135 -2532 331 1805 -774 -1565 2077 1827 -2033 -2530 1751
5517 1751 2138 -1716 -761 2218 810 -3113 -1326 2791 1085 -2449 -436 2203 -901 -3124 606
5532 606 3415 -537 -2995 391 1795 -1963 -1683 2547 2031 -2666 -2423 1755 1035 -2163 -126 3486
5548 3486 302 -3546 -888 2996 590 -2152 899 2999 -1515 -3587 1282 3712 -355 -1895 1483
5563 1483 1564 -2636 -2134 3241 2632 -2068 -1301 2052 450 -3020 307 3610 358 -3749 -599 2268
5579 2268 -841 -2577 1900 3670 -1813 -4132 999 2825 -1581 -1537 2664 1665 -3736 -2126 3016 2031
5595 2031 -2622 -687 2334 -504 -3966 -56 3930 200 -3152 71 1977 -1929 -2447 2811 3671
5610 3671 -2009 -3042 1659 2009 -2354 -1157 3758 1811 -3696 -1859 3047 1322 -1938 351 3280
5625 3280 -798 -3968 119 3807 -54 -2383 1373 2027 -2630 -2971 2924 2825 -1948 -2140 1837 821
5641 821 -3346 -776 3886 1419 -3598 -1280 2642 -623 -2809 1543 3704 -1324 -3863 197 2850
5656 2850 -982 -1967 2271 1993 -2993 -2908 2327 2546 -2185 -982 2740 347 -3677 -788 4428 1311
5672 1311 -2753 48 2344 -1248 -3269 2079 4174 -793 -3259 970 1886 -1953 -1394 2980 1997 -2867
5688 -2867 -2523 1949 1336 -1995 -160 3019 79 -3930 -631 3390 239 -2431 701 2267 -1959
5703 -1959 -3330 1903 3362 -1186 -2676 1611 1307 -2738 -1429 3064 2101 -2988 -2108 2004 250 -2328
5719 -2328 171 3802 -61 -3631 -146 2682 -428 -2001 2025 2812 -1964 -2887 1741 2630 -1110 -1208
5735 -1208 2339 794 -3314 -1304 2636 1876 -2307 -583 2147 -287 -2859 381 3215 214 -2764
5750 -2764 -84 1699 -1319 -1817 1835 2033 -1866 -2629 1068 1423 -1908 -941 2346 665 -3026 -1423
5766 -1423 2135 789 -1947 -385 2073 -892 -2792 398 2895 140 -2202 618 1715 -1567 -1694
5781 -1694 1577 1993 -1035 -1494 1343 924 -1657 -288 2649 846 -2250 -647 1804 73 -1333 870
5797 870 2219 -786 -2251 514 1936 -539 -1466 1136 885 -1567 -1771 1485 1468 -1502 -1289 1073 210
5814 210 -1621 -278 1685 453 -1819 -188 1253 -581 -1507 611 1548 -981 -1923 377 933 -682
5830 -682 -1024 1235 1083 -1383 -874 1578 1257 -922 -360 1405 429 -1428 -336 1635 393 -1293 132
5847 132 1235 -164 -815 786 1429 -710 -952 442 564 -946 -433 1255 704 -1126 -952 926 278
5864 278 -1135 -96 1314 -107 -1381 -471 982 -289 -1151 -53 756 -722 -1420 142 1235 -511
5880 -511 -966 544 277 -764 -517 881 268 -630 -296 494 -178 -729 276 1096 -55 -960 223 1122
5898 1122 32 -469 280 990 -295 -730 712 943 -44 -595 793 474 -457 -333 666 346 -647 -321
5916 -321 523 -114 -582 26 275 -264 -458 83 363 -483 -844 274 554 -481 -1054 317 466 -827 -793
5935 -793 264 456 -578 -310 283 142 -574 -116 375 75 -295 265 474 -314 -435 313 733 -320 -105
5954 -105 253 772 -78 5 461 423 -381 -90 839 381 -341 -52 302 359 -325 -29 427 282 -334 -199 399
5975 399 -124 -301 293 287 -207 -304 304 5 -332 -392 471 97 -646 -384 181 -85 -621 -195 351 -71 -591
5996 -591 -145 209 32 -729 97 724 -167 -185 421 714 38 -216 336 213 -33 87 436 107 -390 223
6016 223 673 1 -328 -155 500 71 -479 424 687 -26 -615 495 559 -460 -607 117 354 -496 -283 343
6036 343 -57 -421 -95 272 -306 -648 -62 445 -341 -340 237 80 -439 -530 197 174 -513 -384 627 461 -402
6057 -402 -112 544 271 -519 -145 739 -79 -430 98 698 129 -383 451 952 -131 -657 712 441 -243
6076 -243 -166 722 579 -678 -27 500 317 -629 141 559 -93 -770 236 584 -114 -952 279 636 -664
6095 -664 -732 337 484 -494 -688 233 125 -920 -597 966 162 -991 -270 732 -4 -1003 397 1153
6113 1153 -436 -988 97 938 -124 -861 779 999 -771 -595 796 1097 -496 -397 1131 180 -914
6130 -914 241 1374 273 -1144 384 968 -75 -1261 470 1207 -716 -1125 518 878 -1140 -870
6146 -870 1250 675 -1240 -863 1021 615 -957 -79 1281 -159 -1531 -426 1210 -27 -1119 334
6162 334 862 -889 -1039 1214 1437 -965 -636 934 543 -1196 -551 1750 561 -1297 -783 1513 494
6179 494 -1476 331 1858 -68 -1927 341 1405 -101 -1098 1076 1213 -1149 -1457 1117 1340 -813
6195 -813 -720 1285 200 -1702 -622 2036 526 -1662 -248 1448 -258 -2087 863 1915 -482 -1955
6211 -1955 310 1324 -1367 -1234 1537 1169 -1856 -1951 1405 1095 -1309 -392 2151 181 -1923 -420
6227 -420 2093 368 -1786 465 1918 -520 -1712 1052 2369 -511 -1720 1163 1041 -1541 -1075 2211
6243 2211 1682 -1540 -1085 1329 520 -1939 18 2494 11 -2513 -697 1788 -370 -1575 987 1964
6259 1964 -1328 -2655 947 1744 -1332 -1041 1758 866 -2471 -1385 2128 1091 -1889 -519 1846 -78
6275 -78 -2707 227 2687 101 -2221 256 1388 -939 -1429 1832 2330 -1500 -2096 961 1364 -1283
6291 -1283 -573 2460 947 -2662 -835 2372 1031 -1425 190 2375 -669 -2703 613 2723 -99
6306 -99 -2038 780 1527 -1711 -1631 1941 2323 -1833 -1651 1341 567 -2127 -366 2487 488 -2840 -640
6323 -640 1828 -202 -1597 774 2385 -1361 -2953 698 2220 -889 -1539 1432 1552 -2442 -2021 2331
6339 2331 1811 -1485 -872 1958 211 -2396 -52 3090 691 -2289 -157 1953 -584 -1848 1490
6354 1490 2600 -1270 -2402 945 1580 -1440 -965 2219 1715 -2453 -1923 2027 1476 -1467 -429 2255
6370 2255 -51 -3018 -503 2385 75 -2053 143 1737 -1453 -2341 1465 2211 -1142 -2068 1256 823
6386 823 -2099 -989 2180 1183 -2637 -1149 1571 358 -1745 473 2598 -111 -2808 186 2160
6401 2160 -54 -1672 1047 1965 -1601 -1997 1631 2026 -926 -1177 1790 765 -2252 -830 2291 1124
6417 1124 -1634 -708 1408 -282 -2239 625 2347 -564 -2342 -34 1656 -759 -1549 1398 1720 -1684
6433 -1684 -2270 1254 1225 -1456 -719 1652 145 -2339 -517 1698 448 -1550 246 1753 -654 -2187
6449 -2187 728 2273 -650 -1765 708 1286 -1204 -1014 1795 1580 -1682 -1495 1230 1001 -1388 28
6465 28 2256 351 -1835 -79 1750 288 -1389 511 1552 -642 -1729 757 1690 -722 -1184 737
6481 737 924 -1650 -784 1698 1043 -1465 -811 1261 41 -1753 -266 1628 343 -1884 -110 1143
6497 1143 -459 -1074 772 1412 -797 -1542 466 963 -884 -951 1205 574 -1421 -833 1454 649 -986
6514 -986 -252 928 245 -1589 138 1632 86 -1150 369 1221 -432 -947 836 1045 -577 -963 766
6531 766 706 -881 -402 1036 618 -1149 -592 988 331 -559 325 1186 -151 -1152 84 1294 -242
6548 -242 -1296 129 882 -817 -978 703 603 -690 -774 578 303 -734 -401 923 497 -695 -329
6565 -329 806 264 -704 -84 805 -187 -915 41 655 -169 -384 576 883 -665 -473 1158 870 -666 -310
6584 -310 863 345 -643 -349 776 218 -798 0 469 -205 -594 0 751 175 -744 32 497 -535 -446
6603 -446 211 433 -592 -485 444 222 -849 -387 211 64 -714 -96 727 97 -271 18 381 -72 -594
6622 -594 297 626 -33 -124 463 216 -267 -155 612 344 -590 88 314 317 -539 -86 549 -25 -570 -157 596
6643 596 86 -806 4 539 -170 -775 179 622 -209 -543 309 37 -195 -327 58 151 -650 -332 187 -70
6663 -70 -458 -330 164 -344 -500 -94 359 -256 -326 104 373 -126 -562 80 175 -248 -78 368 436 12 -174
6684 -174 266 334 -418 -460 654 304 -168 80 425 238 -192 39 311 -171 -273 489 263 -513 -189 489
6704 489 280 -404 -224 150 343 -426 -145 238 39 -547 -385 371 -60 -532 -381 394 -98 -462 -34 102
6724 102 -403 -246 14 267 -317 -183 459 125 -221 -114 406 209 -287 154 537 21 -323 258 525 -32
6744 -32 -194 -207 245 -219 -37 107 303 -200 -171 294 383 -312 -185 434 256 -570 148 496 -157 -357 90
6765 90 595 114 -624 -66 501 -318 -515 382 458 -417 -399 -195 -19 -431 -375 385 653 -777 -166 335 -176
6786 -176 -321 -249 586 -43 -858 272 725 -202 -588 405 428 -523 -463 613 682 -576 -221 712 166 -652
6806 -652 -24 811 272 -577 -206 468 -3 -485 272 246 -301 -628 373 435 -352 -738 814 388 -811 -669
6826 -669 558 143 -792 -295 624 92 -1079 -74 990 269 -749 156 629 -370 -761 200 731 -278
6844 -278 -731 703 462 -966 -144 1346 549 -911 -200 833 322 -523 432 921 -383 -898 295 1179
6862 1179 23 -728 461 891 -759 -844 1076 895 -463 -613 475 586 -918 -612 1180 466 -827
6879 -827 95 694 -254 -983 427 1116 -460 -962 585 957 -778 -814 863 594 -1077 -1362 918 814
6897 814 -1064 -498 1105 456 -1372 -323 1182 297 -1326 291 1166 -507 -1016 715 1495 -108 -738
6914 -738 755 976 -1090 -519 1439 1226 -1365 -1058 893 354 -1150 52 1651 -37 -2096 -187
6930 -187 1263 -148 -1005 643 1098 -970 -1799 520 1174 -819 -843 768 580 -1309 -1020 1491 474
6947 474 -1378 -389 1224 -329 -1619 61 1569 -445 -1653 391 1344 -470 -1231 879 1387 -1288
6963 -1288 -1194 831 1292 -920 -288 1384 633 -1539 -212 1666 748 -1013 24 1087 -495 -1630
6979 -1630 463 2006 -129 -1463 372 771 -1238 -995 1329 1382 -1316 -1109 843 638 -1351 -122
6995 -122 1695 496 -2083 -757 1341 508 -1451 429 1248 -612 -1680 420 1544 -638 -1184 1231
7011 1231 807 -1461 -1244 1252 1005 -1494 -609 1040 43 -1272 -257 2056 254 -1617 26 1323
7027 1323 22 -1423 623 1646 -643 -1740 339 1312 -766 -641 1521 826 -1640 -914 1535 829
7043 829 -1116 -339 1395 -238 -2027 148 1843 227 -1227 280 1023 -1033 -1599 910 1607 -850
7059 -850 -1587 653 827 -1213 -727 1872 1080 -1824 -1068 1194 330 -943 280 1495 -247 -1615 218
7076 218 1555 154 -884 677 1238 -1433 -1400 1238 1364 -863 -689 1277 434 -1163 -707 1604 562
7093 562 -1509 -638 1368 22 -1060 644 1601 -169 -1956 139 950 -609 -789 1087 949 -1303
7109 -1303 -1444 756 752 -1055 -439 1279 260 -1760 -851 1528 470 -1217 -55 1394 -433 -1573
7125 -1573 380 1732 -265 -1385 355 778 -598 -731 1302 1190 -918 -842 1233 899 -792 -290 1434
7142 1434 474 -1220 -367 1284 215 -1132 199 1157 -518 -1653 477 1387 -241 -1032 606 648 -1146
7159 -1146 -940 800 953 -991 -556 593 324 -1400 -37 1491 -37 -1263 -90 1147 -201 -954
7175 -954 438 1079 -545 -1351 278 884 -492 -738 786 829 -916 -342 830 794 -646 -506 934 326
7193 326 -1272 -146 1004 245 -789 246 954 -746 -506 463 1049 -786 -709 473 645 -565 -733
7210 -733 769 347 -1059 -432 902 307 -763 -41 978 -410 -726 -249 881 -233 -796 79 658
7227 658 -695 -625 564 397 -638 -303 458 530 -756 -226 826 209 -914 -348 571 117 -563 274 609
7246 609 205 -649 425 581 -173 -326 378 561 -237 -495 405 690 -309 -306 356 -35 -518 -205 604 66
7266 66 -573 -244 577 230 -539 38 651 -418 -733 -36 655 -82 -591 371 348 -278 -381 573 419 -123
7286 -123 -329 513 -29 -548 -211 314 -259 -361 85 251 -232 -370 141 318 -293 -313 218 418 -375 -197
7306 -197 233 481 -192 38 376 607 -264 -217 471 122 -533 69 345 68 -221 44 330 -247 -116 370
7326 370 777 -417 -288 452 490 -72 8 353 203 -471 -248 151 218 -403 -192 253 -125 -546 -93 127 -79
7347 -79 -541 -201 591 -165 -326 -75 145 -44 -109 236 170 -284 -399 557 180 -206 215 359 310 62 43 528
7369 528 127 -215 43 594 149 -129 -84 272 -148 -268 -28 180 -298 -61 79 392 -158 -390 267 316 -110
7390 -110 -196 149 123 -466 -175 337 -140 -335 -131 203 -206 -243 227 224 -91 -542 -20 206 -57 -303 304 265
7412 265 -349 -57 1 162 -378 -98 310 -18 -164 116 353 -19 -232 365 410 -99 -507 173 400 -165 -380
7433 -380 507 122 -242 -316 232 279 -405 -268 268 -3 -284 -299 6 -130 -344 432 -7 -171 9 -121 237
7454 237 -544 -183 190 148 -338 -194 609 249 -293 -205 424 115 -230 -258 439 -78 -199 25 239 2 -203
7475 -203 613 375 -425 -152 409 115 -170 70 607 113 -605 21 841 156 -406 -27 460 -199 -436 426
7495 426 129 -254 -120 389 156 -358 -440 311 217 -439 -417 542 -134 -655 77 693 -244 -578 111 386 -226
7516 -226 -540 543 635 -322 -322 403 317 -415 -376 715 116 -579 -110 577 159 -322 -45 336 -95 -686 234
7537 234 673 33 -571 444 337 -491 -252 474 939 -494 -290 712 474 -705 -178 796 335 -822
7555 -822 -335 433 4 -710 -63 754 -319 -999 133 540 -264 -656 276 355 -289 -688 418 392 -481 -295
7575 -295 597 388 -852 -339 784 253 -728 -76 838 -254 -991 334 838 -103 -740 197 427 -419 -312
7594 -312 853 528 -846 -485 757 150 -657 1 872 48 -882 -299 894 -37 -571 339 681 -248 -678
7613 -678 505 776 -661 -747 471 486 -964 -876 709 253 -1039 -682 802 21 -1025 13 1112 -175
7631 -175 -1011 235 860 -347 -905 459 793 -868 -1183 740 641 -415 -562 860 680 -1213 -416 1348
7649 1348 179 -829 -266 1062 16 -739 164 1440 -84 -1073 434 591 -244 -732 628 1109 -746
7666 -746 -622 641 337 -1025 -391 806 25 -1194 -513 831 258 -1009 -169 1214 -227 -1246 446
7683 446 1285 -313 -874 727 812 -672 -525 1008 609 -1162 -748 823 376 -771 -135 1384 355
7700 355 -1243 -169 784 -129 -901 647 1318 -545 -1249 436 678 -404 -866 1104 634 -1211 -521
7717 -521 1122 534 -850 -312 924 -103 -1202 -588 1415 46 -1269 60 935 -325 -641 763
7733 763 953 -749 -908 367 863 -748 -852 1114 556 -1129 -410 1212 122 -756 225 1206 -297
7750 -297 -1191 86 1049 205 -941 764 833 -388 -877 879 854 -493 -533 826 538 -1090 -41 1262
7768 1262 379 -833 -307 1035 494 -924 236 1251 -175 -1342 253 948 -148 -688 350 613
7784 613 -914 -791 993 749 -912 -465 1117 211 -1252 -337 1026 463 -1025 -42 863 -406 -821
7801 -821 586 989 -316 -973 736 753 -663 -565 865 742 -864 -654 1029 553 -672 24 783 103
7819 103 -1145 -145 917 5 -622 130 740 -442 -1078 573 1018 -585 -1082 613 435 -750 -567
7836 -567 1164 681 -1012 -564 739 28 -573 -146 638 49 -931 -95 1018 -439 -624 521 502 -512
7854 -512 -937 362 681 -740 -363 832 515 -818 -550 641 692 -672 -187 1150 -77 -1156 -45
7871 -45 822 0 -524 224 1000 -222 -964 587 410 -352 -678 819 583 -651 -183 633 320 -912 -334
7890 -334 647 103 -633 -399 1149 -117 -695 68 741 70 -768 129 214 -469 -853 744 389 -645 -425
7909 -425 495 225 -506 -271 955 -80 -859 -23 690 42 -498 183 901 -253 -448 440 905 -241 -483
$$ [...]
8191D9
##END NTUPLES=NMR FID
##END=
