##TITLE=1H_LR-673-R2-HCR6
 D2O, 8 sc, 
 23.12.2019
##JCAMPDX= 6.0         $$ Bruker NMR JCAMP-DX V2.0
##DATA TYPE= NMR FID
##DATA CLASS= NTUPLES
##ORIGIN= UXNMR, Bruker Analytische Messtechnik GmbH
##OWNER= root
$$ XWIN-NMR		Version 3.5
$$ Mon Dec 23 16:26:59 2019 Russian Standard Time (UT+4h)  she@DPX200
##.OBSERVE FREQUENCY= 200.1315
##.OBSERVE NUCLEUS= ^1H
##.DELAY= (6, 6)
##.ACQUISITION MODE= SIMULTANEOUS
##.ACQUISITION SCHEME= undefined
##.AVERAGES= 8
##.DIGITISER RES= 18
##SPECTROMETER/DATA SYSTEM= spect
##.PULSE SEQUENCE= zg30
##.SOLVENT NAME= D2O
##.SHIFT REFERENCE= (INTERNAL, D2O, 0, 15.7039)
##AUDIT TRAIL= $$ (NUMBER, WHEN, WHO, WHERE, WHAT)
$$ ##TITLE= Audit trail, XWIN-NMR		Version 3.5
$$ ##JCAMPDX= 5.01
$$ ##ORIGIN= Bruker BioSpin GmbH
$$ ##OWNER= she
$$ F:/spectra/data/she/nmr/H-F/1/audita.txt
$$ ##AUDIT TRAIL=  $$ (NUMBER, WHEN, WHO, WHERE, WHAT)
(   1,<2019-12-23 16:25:50.26 +0400>,<she>,<DPX200>,
      <created by zg, POWCHK disabled, PULCHK disabled
       configuration hash MD5:
       00 E9 B6 7A A2 85 ED C7 34 08 36 98 17 FE 4E 26
       data hash MD5: 16K
       25 75 C5 4D D8 52 2E EB 00 5A B9 6E 8E 2E 44 1B>)
$$ ##END=
$$ 
$$ hash MD5
$$ 21 0B FB 1D 13 3F 8E 75 E6 23 01 AD 8D 81 08 98
##$RELAX= 
##$RELAX= 
##$RELAX= 
##$RELAX= 
##$RELAX= 
##$RELAX= 
$$ Bruker specific parameters
$$ --------------------------
##$DU= <F:/spectra>
##$EXPNO= 1
##$NAME= <H-F>
##$PROCNO= 1
##$TYPE= <nmr>
##$USER= <she>
##$AMP= (0..31)
100 100 100 100 100 100 100 100 100 100 100 100 100 100 100 100 100 100 
100 100 100 100 100 100 100 100 100 100 100 100 100 100 
##$AQSEQ= 0
##$AQ_mod= 1
##$AUNM= <au_zg>
##$AUTOPOS= <>
##$BF1= 200.13
##$BF2= 200.13
##$BF3= 200.13
##$BF4= 200.13
##$BF5= 200.13
##$BF6= 200.13
##$BF7= 200.13
##$BF8= 200.13
##$BYTORDA= 1
##$CFDGTYP= 0
##$CFRGTYP= 5
##$CHEMSTR= <none>
##$CNST= (0..31)
1 1 145 1 1 1 1 1 1 1 1 1 1 1 1 1 1 1 1 1 1 1 1 1 1 1 1 1 1 1 1 1 
##$CPDPRG= <>
##$CPDPRG1= <>
##$CPDPRG2= <>
##$CPDPRG3= <>
##$CPDPRG4= <mlev>
##$CPDPRG5= <mlev>
##$CPDPRG6= <mlev>
##$CPDPRG7= <mlev>
##$CPDPRG8= <mlev>
##$CPDPRGB= <>
##$CPDPRGT= <>
##$D= (0..31)
0 1.2 0 0 0 0 0 0 0 0.06 0 0.03 0 0 0 0 0.0002 0 0 0 0 0 0 0 0 0 0 0 0 
0 0 0 
##$DATE= 1577103949
##$DBL= (0..7)
120 120 120 120 120 120 120 120 
##$DBP= (0..7)
150 150 150 150 150 150 150 150 
##$DBP07= 0
##$DBPNAM0= <>
##$DBPNAM1= <>
##$DBPNAM2= <>
##$DBPNAM3= <>
##$DBPNAM4= <>
##$DBPNAM5= <>
##$DBPNAM6= <>
##$DBPNAM7= <>
##$DBPOAL= (0..7)
0.5 0.5 0.5 0.5 0.5 0.5 0.5 0.5 
##$DBPOFFS= (0..7)
0 0 0 0 0 0 0 0 
##$DE= 6
##$DECBNUC= <off>
##$DECIM= 24
##$DECNUC= <off>
##$DECSTAT= 4
##$DIGMOD= 1
##$DIGTYP= 9
##$DL= (0..7)
0 120 120 120 120 120 120 120 
##$DP= (0..7)
150 150 150 150 150 150 150 150 
##$DP07= 0
##$DPNAME0= <>
##$DPNAME1= <>
##$DPNAME2= <>
##$DPNAME3= <>
##$DPNAME4= <>
##$DPNAME5= <>
##$DPNAME6= <>
##$DPNAME7= <>
##$DPOAL= (0..7)
0.5 0.5 0.5 0.5 0.5 0.5 0.5 0.5 
##$DPOFFS= (0..7)
0 0 0 0 0 0 0 0 
##$DQDMODE= 0
##$DR= 18
##$DS= 0
##$DSLIST= <SSSSSSSSSSSSSSS>
$$ [...]
##$SUBNAM2= <"">
##$SUBNAM3= <"">
##$SUBNAM4= <"">
##$SUBNAM5= <"">
##$SUBNAM6= <"">
##$SUBNAM7= <"">
##$SUBNAM8= <"">
##$SUBNAM9= <"">
##$SW= 24.9337058887773
##$SWIBOX= (0..15)
0 0 2 0 0 0 0 0 0 0 0 0 0 0 0 0 
##$SW_h= 4990.01996007984
##$TD= 16384
##$TD0= 1
##$TE= 0
##$TE2= 300
##$TE3= 300
##$TEG= 300
##$TL= (0..7)
0 120 120 120 120 120 120 120 
##$TP= (0..7)
150 150 150 150 150 150 150 150 
##$TP07= 0
##$TPNAME0= <>
##$TPNAME1= <>
##$TPNAME2= <>
##$TPNAME3= <>
##$TPNAME4= <>
##$TPNAME5= <>
##$TPNAME6= <>
##$TPNAME7= <>
##$TPOAL= (0..7)
0.5 0.5 0.5 0.5 0.5 0.5 0.5 0.5 
##$TPOFFS= (0..7)
0 0 0 0 0 0 0 0 
##$TUNHIN= 0
##$TUNHOUT= 0
##$TUNXOUT= 0
##$USERA1= <user>
##$USERA2= <user>
##$USERA3= <user>
##$USERA4= <user>
##$USERA5= <user>
##$V9= 5
##$VALIST= <valist>
##$VCLIST= <CCCCCCCCCCCCCCC>
##$VD= 0
##$VDLIST= <DDDDDDDDDDDDDDD>
##$VPLIST= <PPPPPPPPPPPPPPP>
##$VTLIST= <TTTTTTTTTTTTTTT>
##$WBST= 1024
##$WBSW= 4
##$XGAIN= (0..3)
0 0 0 0 
##$XL= 0
##$YL= 0
##$YMAX_a= 402276
##$YMIN_a= -319359
##$ZGOPTNS= <>
##$ZL1= 120
##$ZL2= 120
##$ZL3= 120
##$ZL4= 120
##$ABSF1= 10
##$ABSF2= 0
##$ABSG= 5
##$ABSL= 3
##$ALPHA= 0
##$AQORDER= 0
##$ASSFAC= 0
##$ASSFACI= 0
##$ASSFACX= 0
##$ASSWID= 0
##$AUNMP= <proc_1d>
##$AZFE= 0.1
##$AZFW= 0.1
##$BCFW= 1
##$BC_mod= 2
##$BYTORDP= 1
##$COROFFS= 0
##$CY= 11.3945322036743
##$DATMOD= 1
##$DC= 2
##$DFILT= <>
##$DTYPP= 0
##$F1P= 16.9975609425685
##$F2P= -3.02152046262296
##$FCOR= 0.5
##$FTSIZE= 0
##$FT_mod= 4
##$GAMMA= 1
##$GB= 0.15
##$INTBC= 1
##$INTSCL= 1
##$ISEN= 128
##$LB= 0.24
##$LEV0= 0
##$LPBIN= 0
##$MAXI= 10000
##$MC2= 0
##$MEAN= 0
##$ME_mod= 0
##$MI= 1.114404
##$NCOEF= 0
##$NC_proc= 0
##$NLEV= 6
##$NOISF1= 3.799351
##$NOISF2= 2.8
##$NSP= 1
##$NTH_PI= 0
##$NZP= 0
##$OFFSET= 15.70392
##$PC= 1
##$PHC0= -10162.15
##$PHC1= 30.8008
##$PH_mod= 1
##$PKNL= yes
##$PPARMOD= 0
##$PSCAL= 0
##$PSIGN= 0
##$REVERSE= no
##$SF= 200.130013532006
##$SI= 16384
##$SIGF1= 3
##$SIGF2= 2
##$SINO= 400
##$SIOLD= 16384
##$SREGLST= <1H.CDCl3>
##$SSB= 0
##$STSI= 0
##$STSR= 0
##$SW_p= 3612.71676300578
##$SYMM= 0
##$S_DEV= 0
##$TDeff= 0
##$TDoff= 0
##$TI= <>
##$TILT= no
##$TM1= 0
##$TM2= 0
##$TOPLEV= 0
##$USERP1= <user>
##$USERP2= <user>
##$USERP3= <user>
##$USERP4= <user>
##$USERP5= <user>
##$WDW= 1
##$XDIM= 8192
##$YMAX_p= 0
##$YMIN_p= 0
$$ End of Bruker specific parameters
$$ ---------------------------------
##NTUPLES= NMR FID
##VAR_NAME=  TIME,          FID/REAL,        FID/IMAG
##SYMBOL=    X,             R,               I
##VAR_TYPE=  INDEPENDENT,   DEPENDENT,       DEPENDENT
##VAR_FORM=  AFFN,          ASDF,            ASDF
##VAR_DIM=   8192,          8192,            8192
##UNITS=     SECONDS,       ARBITRARY UNITS, ARBITRARY UNITS
##FACTOR=    0.0002004,     1,               1
##FIRST=     0,             0,               0
##LAST=      1.6414764,     0,               0
##MIN=       0,             -319359,         0
##MAX=       1.6414764,     402276,          0
$$ Real data points
##PAGE= N=1
##DATA TABLE= (X++(R..R)), XYDATA
0@%%%%%%%Qj6J6j6J7k5L2m0N6o4P4r0J06j26J48j74K01k30K65l04L49l95M44n05
31b69N69o37P14p97Q92r94J104j229J363j511J673j849K048k269K513k787L098
48A632l455L861m333M893n566O397p445Q824j0730J3549j8217K7722q0001K16363
62A53494J65013j88304k6599J7160j74486k44837M0002J81733J15809R6564J32074
73B67623m3004k11001j55270m0810m5121N3069K27865J88017l0540p8283m4066
84H8479j62060k19427L0806K33996J10741o548J09897R1177j86911k84776n7001
95b51627R0337N1788J10187K07144N9373j54277j23624l2085j14137j19312J18382
106a57851K59553J07513l8586k4261o8757j84095j30150M3701J04305J02652J50978
$$ y = [0, 0, 0, 0, 0, 0, 0, 0, 8, -8, 8, -8, 9, -16, 16, -24, 32, -32, 42, -48, 58, -68, 80, -94, 107, -123, 142, -162, 187, -208, 236, -269, 300, -337, 377, -420, 472, -522, 582, -647, 716, -795, 878, -971, 1077, -1192, 1321, -1466, 1632, -1823, 2038, -2295, 2598, -2968, 3429, -4016, 4808, -5922, 7627, -10590, 17132, -62869, 153494, 318507, 130203, 103604, 120764, -53722, -298559, -258557, -76824, 38985, 135549, 267623, 224619, 13618, -141652, -182462, -227583, -174514, 53351, 241368, 210828, 132545, 88479, -73581, -293008, -262202, -28206, 82535, 75987, 185884, 277061, 90150, -194626, -251627, -161290, -109502, 685, 207829, 267202, 112925, -10699, -42784, -156921, -276233, -157851, 101702, 209215, 170629, 146368, 77611, -106484, -236634, -192933, -88628, 14024, 165002]
117A65002R5434j06718j82612o8187l2249p9739M1317K25806J58789m1576o2881
128A12386k7075j49856j99593K6147K15735J17186j880N5626N1991j27351k06487
139a33171p7322M2848P2998J23404J41542K9909q1290q4943r5636j33297l4183
150b29141J51222J67813M3072O331J8138q9998j88255q6303O2896P0536O4084
161i605J37089J08390p9143j77776r2323k3414k5352M5702J53113J23833M643
172A65157m5601o6187j30510j21477J8726J23173R9681O7563O2865j5443j32506
183B5441j35864m8017J0022N2678J23298J24843J7503o7000o8525q6202j15039
194a66862k9617J17192J44112O1002J5464n309q8205j46802p3834L7034O9523
$$ y = [165002, 260436, 153718, -28894, -97081, -129330, -209069, -167752, 58054, 216843, 175267, 112386, 85311, -64545, -264138, -237991, -22256, 94930, 93050, 148676, 200667, 73316, -133171, -210493, -167645, -94647, 28757, 170299, 200208, 118918, 33975, -61661, -194958, -229141, -77919, 89894, 132966, 139297, 157435, 67437, -120818, -207121, -144225, -73689, -9605, 127484, 235874, 156731, -21045, -113368, -136782, -162134, -116432, 36681, 160514, 165157, 119556, 53369, -77141, -198618, -179892, -56719, 42962, 110525, 173390, 157947, 25441, -110423, -158440, -148418, -95740, 27558, 152401, 169904, 102904, 34379, -51823, -166862, -196479, -79287, 64825, 125827, 141291, 135982, 47777, -99025, -172859, -135825, -66302]
205f6302P5948J04003O8323m7352j21173r9805n5841j1077O5626J22851R2964
216A28165K2580k9662q0843j22395q2437K1932Q1464Q0945Q0759O3297k5864j17113
228B0828j12036m6275J143M7978J08656J10675K7034n4846p8984q5459p7134j4102
240a52522P5610J10016Q0367L1984k5097q8173j09291o3505O212N8656R5235R5379
252A14871L7318m3737q6220q6796o6096j3472O5149J08639Q1874K4642k6749p4333
264C5090j04126p2870N920O9483Q8607P8033M0363k6509q7536r7671n8151p07
276a30074N6098R2872Q6078L4634l1874q0822r3385o2283j94N9693Q9383Q0168
288A00294L6304k9343q1177r2001n8720k021N5362R0028Q2533L2531l0661p7567
$$ y = [-66302, 9646, 113649, 181972, 134620, 13447, -86358, -142199, -153276, -87650, 35201, 128165, 150745, 121083, 40240, -82155, -164592, -142660, -61196, 19749, 100508, 163805, 137941, 20828, -91208, -137483, -136340, -88362, 20294, 130969, 158003, 103157, 24173, -61286, -138420, -152522, -76912, 33104, 113471, 145455, 120358, 32185, -77106, -140611, -134399, -75743, 19492, 114871, 152189, 108452, 22232, -64564, -130660, -144132, -78983, 29656, 111530, 136172, 109423, 35090, -69036, -141906, -135986, -66503, 22104, 100137, 140500, 113991, 26455, -71216, -129367, -130074, -73976, 18896, 104974, 139608, 107734, 26912, -66473, -128756, -128950, -69257, 20126, 100294, 136598, 107255, 26078, -65923, -124643, -126664, -71302, 18726, 101259, 133790, 103129, 25562]
300B5562q8740n9262k929N5593Q8618Q0513L2669l2053p6615q3781n7654o294
312a24373N3481R2112P8787K6405k9669o9195q6022o2411j943N9369Q3903P1878
324I2322L2991k4547p6548q7008n3018o46M9350Q4240P8701K8268l1508o8502
336B4095p9295o0349m949N9017Q4900O5313K8401j8506p0562r0194n3453P230
348a08352M9331P2458P5576L6493l1503p6114p4715m7991q068M7278Q6688P1557
360I2638K1458k6029o1180q1116n8524K182N5477P2371O4951L4793k3632p5219
372A8170p7962m2325k199L9987P9344P6574K3526l4006o1120o8481n6328o349
384a11169N5395P8589N8743K5521j7779o5261q1954m6834O219M3129O7217P0845
$$ y = [25562, -63178, -122440, -125369, -69776, 18842, 99355, 132024, 99971, 23356, -60425, -118079, -124373, -70892, 21220, 100007, 126412, 96743, 27548, -58474, -120885, -122828, -63459, 20444, 92322, 125313, 100766, 24218, -62790, -115808, -116454, -67104, 17136, 95837, 124105, 92597, 24095, -55200, -115549, -120498, -61481, 23419, 88732, 117133, 98627, 28065, -62129, -115582, -108352, -59021, 13437, 89013, 125506, 94003, 17889, -56826, -104817, -112885, -65607, 21081, 92638, 114096, 88067, 26887, -54229, -112753, -110571, -55094, 17277, 82228, 117021, 93389, 18170, -59792, -102117, -104316, -64329, 15015, 91589, 115115, 81109, 19989, -48492, -104820, -111169, -55774, 22815, 81558, 107079, 89300, 24039, -57915, -104749, -98530, -55401, 11816, 82661]
396H2661L1430l1563o7422o5482m6524q940M7049Q1002O2005J6977k1099n4933
408B5161p6340n3633N017N1217O4387N9058L2783k2569o9176p0550l8878k103
420i5626L8236P3511O7582J9333k9361n4664o4566n1730l416N0804O9842N4365
432G4310K4631j7576o2300p3781m0381N905L8494O2447O4856K7348k9686o1154
444A3113n9888m2050o348M2991P1503N7388J8277k0548n4328o9539m4922N516
456h8835M4712N9215N4666K8489k1948o2003o4254l6548q79L7453O5491N9439
468G4998J9463k5186n3071o0520m4260o15M3554O3038N2567K1606j9773n5794
480A6007o2942l8102N00L7227O1007N8294K2059k6141n5712n6812l6469k720L6840
$$ y = [82661, 114091, 82528, 15106, -50376, -96900, -105840, -58791, 22211, 84216, 101193, 80094, 25161, -51179, -104812, -99795, -48578, 15809, 74867, 107650, 85081, 15905, -54645, -93523, -95626, -57390, 16121, 83703, 103036, 73675, 19011, -45555, -97285, -100701, -49897, 19945, 74310, 98941, 81365, 19065, -54716, -95097, -89192, -50698, 11749, 76605, 103953, 74267, 13113, -46775, -88825, -95173, -52182, 19321, 76709, 94986, 74438, 20110, -49429, -94351, -88835, -44123, 15092, 69758, 98247, 76299, 14296, -49958, -86506, -87385, -49932, 15559, 74998, 94461, 69275, 16204, -44316, -88576, -89191, -45637, 17401, 69968, 91574, 71801, 16007, -46935, -85037, -84537, -47310, 13697, 71991, 94050, 67909, 12197, -44615, -81084, -83804, -46964]
493d6964O1476N4708K1275k2041n4144n9894l6788J425L7266N6929N2664K2752
505H8664j9792n3501o0570l7359J928L8453N6549N0435K1608j9616n1911n7555
517d2667l6773j036L6082N9157N2985J7780k3907m8429n2505l7167l843L5534
529d4789N9138N1498J9002k1970n1450n4126l0992l29K8681N3548N6767K3214
541H8192k6270n3542m9462l0966l380L2342N7000M8626J6595j7575m5507n6005
553c9952l7190K724L6633N0414M6224K1641j9063m9383n0071l2557n587L1747
565d4420O0637N0161R348k3818l6803m5855m1749o218L8730N6030M2571J7920
577G6534j6574m8484n2745k7063K307K4733M7871N3592K1128k5674m6860m3394
$$ y = [-46964, 14512, 69220, 90495, 68454, 14310, -45584, -82372, -80947, -43681, 13248, 65912, 88664, 68872, 15371, -45199, -82558, -80630, -42177, 14372, 64807, 86415, 66799, 14888, -42667, -79440, -80476, -44394, 14763, 67748, 85528, 61621, 13192, -39313, -76480, -80323, -44789, 14349, 65847, 84849, 62879, 11429, -42697, -73689, -74018, -45337, 8211, 64978, 88192, 61922, 8380, -41082, -72048, -75428, -43086, 13914, 62540, 79135, 61560, 16053, -39952, -77142, -74418, -37785, 12629, 58853, 80494, 61431, 12048, -38023, -70580, -76167, -44420, 16217, 66378, 75726, 51908, 15105, -30750, -72499, -78717, -39987, 16043, 58614, 76534, 59960, 11476, -41269, -68332, -66025, -41292, 6579, 60171, 81299, 55625, 8765, -34629]
589c4629l2415o333L4095N5017M0891J3877j1033m1789n7621l4753Q894L4055
601c1744M0951M2470K4412j8347m8187m4128k8125q795K6923N9853M8702N624
613F9609k3320l1556m2356m0732m112L7789M8868L7590J8961j2598m6340n0345
625c8542k4098L73K1654M8141N2026J5227k7070l8993l7341l4101q031L5540N2565
638A7350L2581J1887m517l6236n8595l5068J0657L3701L7089L8651K3306j6520
650E4286m6035m1542k4964o251K5548N1444M2293R882j5637l2725m7070l6713
662f7484L550L5480L9014L4846K2626j2324m7461m5697j7983j34J5911M3400N1162
675E4906J6435k5254l7966l5775l1671o594L3166M8697L2661J0512q524l5217
$$ y = [-34629, -67044, -73377, -39282, 15735, 56626, 70503, 59470, 17681, -39940, -74693, -65799, -31744, 9207, 51677, 76089, 57742, 9555, -34573, -62698, -71493, -44570, 15283, 63985, 69609, 46289, 14733, -27623, -68355, -72467, -34678, 14190, 51780, 70741, 58143, 11803, -38542, -62640, -62267, -40613, 7528, 59554, 74781, 47711, 8718, -28623, -62724, -70755, -35215, 17350, 49931, 61818, 57301, 21065, -37530, -72598, -61941, -28240, 8849, 47500, 70806, 54286, 8251, -33291, -58255, -64506, -38958, 12486, 54779, 64661, 49024, 16299, -30771, -67484, -63934, -28454, 10560, 45406, 68032, 55708, 8247, -37450, -55433, -55567, -39656, 3744, 54906, 71341, 46087, 8121, -27654, -59325, -65919, -32753, 15944, 48605, 59117, 50593, 15376]
687A5376m8426k8485M765K4645L7547M2721K0952k0120m2083l7042k4480o811
699f1441K6368M8823L6127P907j1521k9575m5528l4152L708L2433L5801L2184
711D1134K2884j0402m4981m4982j8955L005J9059L8688M2593J5528j9712l4765
723I094l5091k7937n414K6243M3002L6476J4980j4170l8246m1195k0763J873J8073
736c3075L6675M2700J8634k0963l8668l1862k1941q041K0384M5429L9933R322
748E8527j7025l0665l6563k8478j987K6654L9783L2370J2926j1166l1912l8528
760b6064k7778k709K5934M1685L3913R882j3838k9529l5774k7498l080K4957L9218
773I319L3446J3100j3382l2163l6601k3858j827K1057L7933L5578J4732j4435
$$ y = [15376, -33050, -61535, -56770, -32125, 5422, 48143, 69095, 48975, 6892, -30150, -54630, -61441, -35073, 13750, 49877, 57784, 46263, 16688, -28840, -62992, -59284, -26851, 8950, 41134, 64018, 53616, 8635, -36347, -55302, -52297, -33238, 5450, 48043, 63571, 43859, 9094, -25997, -53934, -59348, -33105, 9897, 46373, 61353, 47183, 8937, -32258, -53021, -51148, -33075, 3600, 46300, 64934, 43971, 5303, -26559, -48500, -56541, -36157, 9272, 49205, 58527, 41502, 10837, -25726, -54204, -56191, -29537, 10246, 42616, 55542, 44376, 12464, -26064, -53842, -56551, -30617, 11068, 44981, 54863, 41025, 11496, -24278, -51776, -54856, -29899, 9319, 42765, 55865, 42483, 10320, -26281, -50139, -51966, -30909, 7024, 42602, 57334, 42899]
785D2899l4947l5835k0619j64J9217L3853L6271J6747j4740l4344l4314k1875
797d7851l363K0638L9526L3989R199j3777k6541l3181k7844m782K5517L8910L0667
810D1107J0313j2135k9064l2911k4085m597K0111M0273L4668Q020j6713k5326
822I661k8902k7909o168K5786L8798K6853R734o817k7734l9356k4049M256K2009
835b3838K9053L0477J7163j2233l2695l1822k0896m370K1449L7787K9089O849
847D6013q647k2720l6451k8670J994K7233K9299K4758J6971p986l4027l3750j5655
860d1638k148J3268L5232L7290Q493j8756k3455k4964k6941p911K5956L7298K2497
873C4221R138l498k6664l9114k0767N524J7123K6042L2451J7307j5125l1244k5096
$$ y = [42899, 7952, -27883, -48502, -48666, -29449, 4404, 40675, 57422, 42682, 8338, -25976, -47851, -51214, -30576, 8950, 42939, 52138, 38361, 11820, -21361, -49205, -53987, -28470, 10440, 41107, 51420, 39285, 10221, -22690, -46775, -51372, -31261, 9012, 43680, 51700, 34987, 9661, -19241, -47150, -53318, -27532, 11266, 38119, 47853, 41036, 13302, -26054, -50103, -45847, -23838, 5215, 35692, 52855, 40622, 7927, -23895, -44791, -49161, -27712, 10075, 39164, 46013, 37366, 14646, -21805, -50475, -48481, -21248, 8051, 32809, 49780, 41794, 7767, -25983, -41638, -43786, -30518, 4714, 42004, 50497, 31741, 8286, -16678, -43619, -51530, -25574, 11724, 34221, 43359, 39861, 13197, -25917, -46684, -41160, -24037, 2005, 34456, 51763, 36638, 5394, -19702]
886a9702j9802q775J9781L9929K6241L129o691j8106l6139k9260M930K6870K3622
899F027K1911J9422n657l4760l3104j2324r87J0681L2245L5311P708j5981k0938
912I554k5186k7311n223K7108L1844J8384J1391m59k7551l8891j6168O491J2866
925b3151K2350L4363J7144j8512k9364j9449j7731j1515J7622L8762K5131K215
937C7865n438j7654l4276k6496N837K2780K0676K3057K0366q369l4568k7543r773
950c3536m485R266L3462L2667M024j4280j5559k4858k8776m040K7757K9148J5422
963B6212J1831M68k7684l6039j3899N666J0424K2395L3961J3835j7923k5998j7316
976a4067j9239j1387J9173L6653K1167K642l117j7386l4641k2653P181J9045J7472
$$ y = [-19702, -39504, -48279, -28498, 11431, 37672, 40801, 34110, 16004, -20135, -49395, -44465, -17595, 6027, 27938, 47360, 41703, 6943, -26161, -38485, -39472, -28791, 3454, 38765, 46473, 30492, 9554, -15632, -42943, -48166, -21058, 10786, 29170, 40561, 40102, 12551, -26340, -42508, -36017, -23151, -801, 33562, 50706, 32194, 2830, -16619, -34350, -45865, -28243, 10519, 35650, 37865, 32427, 14773, -19503, -45999, -40162, -17382, 3294, 26351, 46717, 38348, 3780, -23763, -33536, -38021, -28755, 4707, 37374, 41398, 27118, 11559, -13299, -42075, -46115, -18358, 10790, 26212, 38043, 38511, 10827, -25212, -39111, -33445, -23021, -626, 33335, 47170, 29247, 3249, -14067, -33306, -44693, -25520, 11133, 32300, 34942, 31825, 14439, -20202, -42855, -35674, -16629, 843]
989H43K3907K0755r224l3057k4495r553n991R182L3209K9985K187j2504j3624
1002A1620k4121k7906j527K5396K4799J5012J3141L88k7192l2644j2485L140R361
1015b3018K3119L2184J0749j7593k1059j6548j9588j0237J8924L3096J7995M995
1027C3019j256j8063l3544k0236O984J6713J6506K4329J7951j0353k8527k1672
1039a8149j0869o913J0271L1190K6467K863r003j3804k5647k5094M73K3210K1609
1052F604J5158J3983j939k6137k8323j0764N08P833K3723K9769Q920j4481j9084
1065E770j8211j9788o698J9385K8681J6254O181j232j8510l0350j7562N033J3531
1078a7516J8029K4473J4927j0763k5499j9651j2903n621J2129K9024K1707L609
$$ y = [843, 24750, 45505, 36281, 3224, -21271, -30824, -36815, -27633, 5576, 35561, 37748, 25244, 11620, -12501, -40407, -41934, -16538, 8261, 23273, 36414, 36802, 9610, -23034, -35519, -32379, -23018, 101, 32285, 43034, 25441, 4382, -12166, -31754, -41991, -23067, 10029, 28024, 33019, 31763, 13700, -19844, -40080, -33096, -16383, 123, 24452, 42403, 32050, 3523, -18149, -29018, -35931, -25660, 5530, 31997, 34860, 25857, 12053, -13594, -38688, -38215, -15005, 6604, 21762, 35745, 33806, 7669, -20654, -31418, -30910, -23077, 646, 30415, 39335, 24854, 5770, -12441, -32229, -38927, -19542, 9139, 25393, 31574, 30342, 11832, -18518, -36080, -31047, -17516, 513, 24986, 39913, 29150, 3651, -16000, -28903, -34524, -22395, 6629, 28336, 31945]
1090C1945o356j4010k5408k1969J350J9433J9409J7397J4213m572k5576k5245
1102a9389j0227J34Q776K2306K5959P927j1179j7336j9430j8971m284J7726K5028
1115G040J6814P764l091j9081k7104j4374K639J1865J8686K2616J2300r604k1377
1128E093j9261j3936n105J3242K6204K0066M876o615j5297k3481j7998P18J5870
1141a5624J9255J7863J1552m960k1238k3179j2676j139J1143K2633K1145P849
1153C2624q266j7123k0488j6588j402J5203K0903J6631R729l674j9212k5069j3199
1166b9931J946J1549J8592K0727J0179q406j9276j9458j3280k762J2322K1762
1178C964J9033P371n935j6887k2007j5015N60J2953J9082J8797R429o775j8917
$$ y = [31945, 25589, 11579, -13829, -35798, -34448, -15015, 4394, 21791, 36004, 31432, 5856, -19389, -29616, -29482, -20706, 1600, 27559, 35486, 24307, 6971, -12459, -31430, -35714, -17988, 7040, 23854, 31618, 28527, 9446, -17658, -32032, -29393, -17528, 1158, 23774, 36074, 26470, 5093, -14168, -28104, -33209, -19967, 6237, 26303, 31179, 24564, 9267, -14214, -32212, -31494, -15624, 3631, 21494, 33046, 28086, 6848, -16331, -29007, -30146, -19003, 3630, 24775, 32624, 24358, 7235, -13253, -29841, -31243, -16040, 4863, 21494, 31223, 27549, 8337, -16732, -29931, -27985, -16436, 2156, 22883, 33062, 24656, 5380, -14078, -27358, -30120, -17798, 3964, 22997, 30368, 24433, 7546, -14461, -29476, -28916, -15963, 3119, 21916, 31345, 24570, 5653]
1191E653j9640j2681j928J0854K0913J9940P592p256j7011j9665j4645o55J2917
1204a5612J9322J7284Q689m793j8264k1533j2658P72J1157J8469J7983R364o054
1217B4126j8406j9720j2952m96J2474J8397J7266Q240n253j6740k0625j3380M8
1230b7021J1465J8798J7912Q638o715j8361j8603j1084j205R282J9043J9700Q490
1243C0339q217j7857j7867j0795j625R875J8584J8393Q260o764j7329j8545j1329
1256b4877n57J0469J7728J7213Q185n711j6488j9381j2145o00J2027J7888J6517
1269B0268O547n447j5383j7878j3003j652J1403J9091J6504O782o627j5405j7265
1282a2065j1718j376R657J7825J8346P782p581j6787j6775r928j228Q656J6490
$$ y = [5653, -13987, -26668, -28596, -17742, 3171, 23111, 30703, 23447, 6436, -13229, -27874, -28529, -15612, 3710, 20994, 29683, 24890, 6626, -14907, -27565, -26793, -15636, 2833, 20816, 30180, 24126, 5720, -14000, -26952, -27448, -14974, 3423, 20689, 28929, 23676, 6936, -13689, -27069, -27021, -15556, 3242, 21154, 29792, 23077, 4716, -13887, -24971, -26176, -16894, 2149, 21849, 30339, 22122, 4265, -13602, -24397, -26022, -16147, 2437, 20830, 29090, 22326, 4997, -13548, -24877, -25434, -14965, 2763, 19976, 28161, 22450, 5962, -13419, -25564, -26164, -14137, 3751, 20268, 26815, 21368, 5985, -11893, -24896, -26548, -15145, 3946, 20450, 27232, 20605, 5200, -12065, -23783, -25159, -15502, 2323, 20669, 28451, 20870, 4083, -12692, -22620, -23848, -15192, 1298]
1295A298J8432Q381o637j7535j6809j0224l90R197J6603J6946P349o159j5210
1308E242j6823j2060j338J0427J8593J5917N359o141j3974j5675j2640k421J0859
1321a4675J9314J5640M806o665j3454j4978j1666l267R836J8636J6612N503p104
1334A8538j4214j5329j1260j042R547J6104J5581P634n417j5439j7064j0141J
1347b2501R685J5764J4814O997n238j4054j6643j1588j007J0926J6841J4149N340
1360B3485m786j3107j5768j1970j415R973J7007J5759N024o995j3219j3471j0826
1373b0309l297Q964J8389J5552M221n914j2850j5174j0982r86J0070J5318J4039
1386A7041O755n115j4081j5709j0025r01R475J5675J4291M643m077j1935j5871
$$ y = [1298, 19730, 28111, 21474, 3939, -12870, -23094, -23484, -14287, 2316, 19262, 26611, 20452, 5242, -11581, -23641, -24979, -14552, 4041, 19958, 25317, 19176, 5202, -10473, -23113, -25534, -14675, 4639, 20279, 25085, 18420, 4966, -10012, -21678, -24945, -15109, 3527, 20139, 25642, 18538, 4324, -11005, -22265, -23307, -13760, 2344, 17925, 25559, 20142, 4703, -12361, -22502, -22501, -12816, 2948, 17762, 24759, 19521, 5467, -11176, -22764, -23771, -12845, 3996, 18145, 23485, 18699, 5592, -10176, -22146, -23561, -13588, 3419, 19178, 24202, 17207, 3988, -9483, -20309, -23606, -14642, 3747, 19299, 23520, 17606, 4756, -10418, -21400, -22386, -12316, 3002, 17041, 23796, 18681, 4600, -11109, -21134, -22035, -12560, 3115, 17406, 22049, 17972, 6037, -9834]
1399i834j2759k74J1899J5398J1196N654k621j2424j7355j0412L52Q865J4742
1412B427J4549O393o473j3171j3186j0083k336Q706J6631J3730M683m448j2184
1425E238j5571j0452M31R239J3101J2997Q243m691j5098j4257p784j714P176J6064
1439B922J4622L837n694j0395j3560j2315j413J1292J5080J0619N139k206j2437
1452E491j6242r501R17P815J3218J4421N788o193j2023j2177j0038k695R038J6007
1466C826J1745L909k823j0622j6287j0627K451Q976J0924J2374Q465m872j4588
1479B851j3345o639j575N903J5068J4595L185n657r480j3120j1988j77J1001J3086
1493C708J0045N712j909j3240j5049o991R8N949J2467J5171N382p465j0755j0710
$$ y = [-9834, -22593, -22867, -10968, 4430, 15626, 21280, 18659, 6235, -11120, -21532, -21180, -12315, 2427, 16976, 23369, 16896, 3725, -9461, -19544, -21880, -13174, 3457, 17187, 21870, 17422, 5238, -10333, -20785, -20354, -11115, 1986, 14983, 23226, 18535, 3437, -10820, -18604, -20318, -13142, 2922, 17544, 21381, 15687, 5292, -8268, -20583, -21996, -10704, 4376, 14995, 20134, 17928, 5491, -10751, -20252, -19335, -11520, 1698, 16119, 21907, 15714, 3691, -8486, -18524, -21219, -12181, 3826, 15571, 19480, 16657, 6035, -10252, -20879, -18428, -9452, 1472, 13846, 22311, 17439, 2851, -10494, -17133, -18708, -12805, 2263, 16858, 20043, 14386, 4906, -8214, -20202, -20379, -9378, 3708, 13753, 19465, 17556, 4316, -10733, -17724, -17626, -11677, 790, 15961, 21343, 13878, 3123, -7587]
1507g587r741l447R781J5959R745K699j653r637j5297j0614K111Q776J0250J1984
1521A3329P786m892j3777j2077o450k188O255J4924J2710K548n007p767j2870
1534g476j1903K10J0696J1759Q698O493j507j3047j4604o297J364M452J1797J4296
1548A4931N114o933j0168r501r793k963Q854J4957R314K804j754r216j5245q632
1562a8231K174P576R442J1312P684n046j2847j0653o082k686N962J4729J1546
1575A4880K062m181p708j2649j0586O92J0104J0367P849O824j611j2517j3679
1588a0153n537O37M495J1506J3318M514o349r216r890r169k194R007J2455Q719
1602A2143L714j110r946j4138p549K306O274Q798J1983O352n524j1746r680n656
$$ y = [-7587, -17328, -20775, -10994, 4965, 14710, 17409, 15756, 6119, -9178, -19792, -17681, -8905, 1345, 13329, 21115, 16223, 2446, -9631, -16081, -18269, -12014, 2910, 15620, 18168, 13161, 5394, -7476, -19379, -19169, -8473, 3286, 11984, 18477, 16970, 3923, -10681, -16978, -15614, -11162, 635, 14931, 20045, 13112, 2944, -6557, -16350, -19313, -10459, 4498, 13812, 16616, 14862, 5646, -9599, -18231, -16057, -8481, 961, 12273, 19957, 14911, 2064, -8589, -14671, -17357, -11395, 3334, 14880, 16942, 12761, 5053, -7596, -18182, -17490, -7386, 2981, 10830, 17654, 16043, 3526, -10153, -15690, -15053, -10558, 948, 14266, 18780, 12431, 3215, -6675, -15844, -18038, -9031, 3424, 12143, 15857, 14747, 4801, -9337, -16886, -14580, -8306, 492, 12475, 18827, 13303, 1557, -8123, -13779]
1616a3779k735O345J3160J0654J858l118p312j2632r555P98R060R660Q402O226
1630A7032k634j1877j1506n460m6M509J1352J2157L548n247q709r487q342k366
1644a7076Q797J1386Q354M118j610j0268j2586o336J678N183Q819J1474N581m353
1658A3161j1021r682o001j851O107J1899R343L406l042q517j1044q192P39P489
1672g206R004R149M935k931j0563r991n672j081N064J1205J0839K548m503p770
1686C027r288p576j015O695J0821Q176M376k881r505j0872o048O23N367R112J0178
1701A1190M293l950r318q997o891l97N888J0486Q518L567k349q984j0239p034
1715a4217M66O204R430Q947L886l302q810r408n743j622O061J0398R083K930l487
$$ y = [-13779, -16514, -10169, 2991, 13645, 15503, 12385, 5073, -7559, -17114, -16316, -7256, 2404, 10806, 17032, 14398, 2521, -8985, -14445, -14491, -9982, 1370, 13527, 17075, 11828, 3119, -6368, -14710, -17076, -8279, 3107, 11461, 15579, 13969, 3701, -8885, -15221, -13543, -8360, 459, 11933, 17514, 13161, 2140, -7542, -13543, -15394, -9287, 2612, 11955, 15361, 12319, 3802, -7242, -15434, -14695, -7206, 1798, 10947, 15882, 12951, 2388, -7603, -13275, -14356, -9292, 1913, 12752, 15300, 10797, 3027, -6261, -13837, -14852, -8157, 2664, 10840, 15216, 12335, 2830, -8042, -14090, -13467, -8100, 1012, 11190, 15483, 11533, 2215, -6782, -13673, -14070, -8182, 2304, 10822, 14389, 12040, 3056, -7183, -14217, -13751, -7547, 1883, 10830, 14716, 11414, 2604, -6804, -12547, -14169, -8108, 2290, 11373, 14303, 10816]
1730A0816q003r264o955l65O321R496Q732L780l692q231r370n510j054N645R548
1745A894Q952L423l574q123r499o105J30N829Q801Q345L885k888q400r290n953
1760a2573m47N875R482Q036L453k939p979r468o298j06O225Q806P669L670k367
1775A1039q720q737n642o54N237R182R093K867l930p023q625o560r55O686Q862
1790B120P534L064k123p970r582n668M65N213P883R086L860l740q377p972n463
1805a1670j056N753R359P302K614k356o347r544o815M99O262P617P169M488k597
1820A0678q852q163m816p94M250R212R015K170l679o483p533o825q47O413Q828
1835B574O383L107j818p433r492m857Q00M391P339Q622L533l894p706p167n099
$$ y = [10816, 2813, -6451, -13406, -13771, -7450, 2046, 10778, 14558, 10866, 2635, -6735, -12245, -13299, -7654, 1894, 10846, 14269, 10695, 2572, -6927, -13032, -12902, -7073, 1728, 10073, 13958, 11070, 2670, -6620, -12573, -13020, -7145, 2337, 10373, 13826, 10887, 2908, -6560, -12858, -12964, -6739, 2067, 9736, 13406, 11039, 2319, -6418, -12060, -12714, -7477, 1705, 10798, 13665, 9735, 2712, -5913, -12473, -13428, -6742, 2120, 9654, 12718, 10595, 2625, -6957, -12625, -12160, -6947, 936, 10022, 13882, 10142, 1765, -6207, -11670, -12726, -6973, 2386, 9688, 12302, 9946, 3599, -5945, -12760, -12261, -5999, 1618, 8787, 13275, 10678, 1826, -6337, -11153, -11947, -7697, 1515, 10530, 12700, 9021, 2538, -4995, -11820, -12667, -6254, 2574, 8957, 12064, 10246, 2813, -6679, -11536, -10736, -6345, 994, 9616, 13149, 9255, 1549, -5618, -10717]
1850a0717j310N264R383O719J807j498n991r744o416J468N764O468O942M391k432
1865A0098q114q153m241m79M112Q538Q091J805l298n660p513o311n71O051P958
1880B313O084L160j796p698q745l867L20L797P314Q377L187l817p024o786n336
1895a0517j496N990Q767N588K048j417n863r015n825J454N485O155O518M164k848
1910I188p704p304m146p00M176Q632O830J970k821n341p327o481L23N608P041
1925A944N766L640j593p834q481l430M92L515O811P756K984l579o276o445n022
1940i752j398N449Q068N917K309j932o158q179n217J465M227O189O895L581k891
1955H573p354o590l922j063M018Q284O693J429k189n168p738n522N88N421O120
$$ y = [-10717, -12027, -6763, 2620, 9339, 11146, 9648, 3657, -6087, -12503, -11035, -5271, 1197, 8139, 12530, 10098, 1984, -6169, -10410, -10889, -6777, 1761, 9852, 11657, 8359, 2699, -4814, -11125, -11696, -5645, 2313, 8397, 11557, 9761, 2063, -6682, -10549, -10229, -6432, 882, 9259, 12446, 8629, 1605, -5181, -10517, -12013, -6023, 2744, 8332, 10380, 8963, 3100, -5915, -11740, -10286, -4801, 1354, 7872, 12036, 9188, 1484, -5820, -9966, -10666, -6490, 2142, 8972, 10942, 8121, 2780, -4547, -11028, -10705, -5097, 1944, 7710, 11350, 9757, 1923, -6558, -9988, -9496, -5981, 830, 8586, 11570, 7991, 1715, -4730, -9752, -11150, -5701, 2367, 8284, 10593, 8661, 2503, -5676, -10893, -9428, -5201, 988, 7883, 11464, 8573, 1219, -5371, -9293, -10356, -6338, 1946, 8639, 10068, 7879, 2711, -5027, -10549, -9961, -4540, 1580]
1970A580N474L566j636p327p632l604N75L728O315P199K335k739o243n930n230
1985i569n64N146O787N803K698k079o243p472m215P26L807N877O819L643l292
2000G872o786o322l476o02L806P191O512J766k567n431o849m417l28M667O401
2015A437N917L110k456o386o536m044j10M053O557O067K252k757n333o367m322
2030h918o87M924O727N258K293j988n889o737m083K36M275N546O101K676k354
2045G380o202n822l962k08L561O537O411K068k623n300o742m025j61M386O182
2060A480N532K277j725o091o067l775l49L480O776N986J682k285n604n485m306
2075h474l10L637O741N545J994k357m950o237m326R2M131N882N568J978j707n312
$$ y = [1580, 7054, 10620, 8984, 1657, -5975, -9579, -9004, -5276, 1039, 8238, 10573, 7834, 1591, -4339, -9569, -10133, -4987, 1800, 7603, 10301, 8222, 1979, -5493, -9708, -8982, -5175, 702, 7521, 11164, 7872, 1086, -5236, -8712, -9314, -5508, 1683, 8195, 9961, 7394, 1963, -4886, -9303, -9631, -4964, 1437, 7354, 10464, 8008, 1622, -4914, -8958, -9068, -5015, 1542, 7609, 9861, 7104, 1771, -4596, -8918, -9605, -4681, 2046, 7304, 9597, 7609, 1720, -5017, -9100, -8864, -4589, 957, 7058, 9734, 7380, 1178, -4644, -8606, -8814, -5253, 1284, 7695, 9763, 7140, 1840, -4902, -8927, -9088, -4702, 1480, 7012, 9289, 7564, 1473, -4594, -8369, -8718, -5238, 1538, 7524, 9206, 6921, 1317, -4168, -8474, -8784, -5147, 1594, 7139, 9133, 6776, 1826, -4411, -8737, -8645, -4514, 1368, 6936, 8914, 7207, 1895]
2091A895o579l565j27L874N828N125K362j884n128o119m086K81L487N913N352
2106F629K089j869m954o114m000M5L670O072N093K369j778n439n989m049j9L731
2122d513N939N299K033j872n340n553l882m18L950N621N035K192j713m736o213
2137d171l960NM085N248N167J952j785m922n308m217r7L610N924M574K308j989
2153F424m646n857l906M1L815N424M945K302k172m952n629l496k4L376N319N079
2169F043K353j805m954n567l896L77L379N450M484K088j354m806n847l680L20
2184g415L131N671M988J703j885m896m990l745l44L610N419N058J690k253m293
2199A449n219l454k88L428N382M338K402j762m852n381l505L39L087M926N304
$$ y = [1895, -4684, -8249, -8376, -4502, 1326, 6451, 8813, 6929, 1801, -4318, -8404, -8123, -4636, 1277, 6629, 8718, 6849, 1895, -4219, -8219, -8174, -4504, 1568, 6661, 9030, 7252, 1813, -4176, -8225, -8244, -4513, 1426, 6725, 8758, 6886, 1546, -4007, -7889, -8307, -4357, 1264, 6299, 8491, 6778, 2042, -4171, -8131, -8126, -4041, 1207, 6374, 8326, 6541, 1619, -3689, -7906, -8003, -4393, 1531, 6105, 8413, 6424, 1778, -4079, -7985, -7944, -4129, 1295, 6240, 8542, 6370, 1418, -4211, -7707, -7731, -4355, 964, 6043, 8396, 6591, 1637, -3930, -7826, -7449, -4070, 1380, 5864, 7952, 6598, 1792, -4055, -7735, -7415, -4284, 1387, 6375, 8078, 6193, 1297, -3693, -7438, -7782, -4172, 1247, 6305, 7995, 5742, 1449, -3770, -7224, -7512, -4084, 1298, 5636, 8038, 6276, 1424, -3957, -7462, -7123, -4036, 890, 6194]
2214F194J722j477m911n620l434J89L520N151M253K041j532m648n524l392L12
2229g156L410N019M364J836j381m491m962l836K38K904N355M688J736j946m689
2244A089m734l137k1K816M889M923J647j602m649n314k961k90L641M824M486J866
2260G473j334m863n295k791j83L175M878M607J444j844l839m787l479j53L440
2275c551N145L559J536q84m266n172l425L31L170M510M476J693j658m533m453
2290c522k681n38L113M974M066J480j490m017m915l112L04L109M090L962K143
2305F966j302m291m956k646j79K733M626M366J475j913l667m546l293k45L641
2320c231M658L124K078j130m204n346k532O39K460M494M209J642j650m311l964
$$ y = [6194, 7916, 6439, 1528, -4092, -7526, -7337, -3817, 1334, 5587, 7628, 6096, 1448, -4076, -7468, -7156, -3746, 1273, 5637, 7473, 6092, 1601, -3361, -7197, -6959, -4055, 1300, 5988, 7724, 5778, 1089, -3645, -6782, -6803, -3987, 902, 5825, 7472, 5870, 1221, -4093, -7054, -7344, -3703, 1121, 5607, 7473, 6139, 1276, -4019, -6810, -6993, -3818, 1060, 5667, 7111, 5267, 1428, -3359, -6838, -6991, -3551, 1594, 5153, 6689, 5805, 1539, -3633, -7058, -6727, -3557, 953, 5429, 7122, 5464, 931, -3522, -6203, -6741, -3628, 1346, 5412, 6892, 5402, 1385, -3530, -6642, -6338, -3229, 861, 4823, 6966, 5664, 1373, -3583, -6229, -6408, -3675, 951, 5317, 6792, 4879, 1212, -3334, -6627, -6872, -3231, 1427, 4551, 6629, 5499, 1295, -4051, -6583, -5944, -3484, 1010, 5219, 6861, 5211, 900, -3064]
2335c064l004l52K844M876L779J280j143l706n183l157J042L241L425L560K295
2350F733j130m659m487k393l2K573M293M364J027j594l343m245l630j01M079M027
2366A482K945J833p16m440n190j911M24K027M220M115K010k154l966l504l035
2381e860n75L204M731L048J383j161l300m770k936Q28K805L282L735K345j603
2396E156m775l831j983m77K325M509M302O81j643k969m089l251M62L002L869K761
2412D049K124o91m837m716j364L46J940L645M368J773k500l146l693k812n72L094
2428b992M575K910R08n48l477m758k332P80K508K675L917K271j905m231l359j526
2444d584r43K041M623L731Q72j295l045m130l327P05K971K891L264K236j060m247
$$ y = [-3064, -6068, -6420, -3576, 1300, 5079, 6359, 5216, 1510, -3673, -6830, -5788, -2547, 878, 4438, 6733, 5603, 944, -3543, -5936, -5968, -3395, 898, 5262, 6289, 4695, 1352, -2893, -6523, -6624, -2545, 1482, 4427, 6260, 5544, 1104, -4086, -5997, -5573, -3546, 674, 4789, 6799, 4645, 679, -2825, -5860, -6435, -3231, 1500, 4548, 5931, 4770, 1470, -3300, -6236, -5408, -2603, 679, 4414, 6759, 5156, 381, -3450, -5433, -5910, -3585, 924, 5226, 5907, 4264, 1295, -2794, -6045, -5583, -2581, 1288, 4049, 6173, 5482, 645, -4071, -5435, -5089, -3149, 496, 4864, 6637, 4137, 991, -2702, -5514, -6086, -2992, 1583, 4493, 5401, 4853, 1376, -3382, -5714, -4934, -2426, 249, 4166, 6437, 4532, 301, -3058, -4584, -5527, -3486, 1137, 4868, 5740, 4445, 1400, -2730, -6057, -5352, -2381, 510, 3774, 6010, 4950, 703]
2460G03m048j436K52J166L933M199J315k261l029l032k882o16L082M183K331J075
2476D935k08l539m583k130J085J774K965M042J699j623m079k979j999p21K179
2491c182M541L136P52j378k552l979k778L96K901K963K800K002p43m407l752j297
2507d577j11J854L571L900R18k068l054k604k813m93K758M087K449J074n58l359
2523I74l940k054K76K203L196L420J403j634l364k844k106r88K583M031L197N93
2539D946j331k332l673k800O51K253K965K904K063j460l790l160j787K38J612
2554b701L329L569J070j143l275l255k578n3K652L325K914R12p15k915m015j921
2570d800L07J788L110L544J182j501l077k940j993m32J993L862K681R62j320k438
$$ y = [703, -3345, -4781, -4529, -3363, 570, 4769, 6084, 3823, 794, -2238, -5120, -5736, -2654, 1529, 3860, 4935, 4727, 1188, -3395, -5525, -4440, -2666, 299, 4341, 6040, 4417, 338, -2641, -4640, -5361, -3182, 1359, 4495, 5247, 3869, 1317, -2662, -5440, -5044, -2143, 820, 3620, 5622, 4879, 472, -3280, -4577, -4688, -2834, 737, 4637, 5555, 3487, 433, -2171, -4984, -5477, -2719, 1368, 3817, 4891, 4333, 974, -2966, -5020, -4744, -2541, 655, 4075, 5478, 3844, 480, -2364, -4470, -5458, -2875, 1156, 4353, 4946, 3615, 1283, -2390, -5190, -4539, -2286, 679, 3583, 5646, 4186, 396, -2764, -4551, -4313, -2701, 628, 4197, 5267, 4124, 849, -2406, -4984, -5037, -2385, 940, 3854, 4766, 4051, 1136, -2879, -4800, -4493, -2705, 405, 3949, 5131, 3630, 553, -2387, -4380, -4812, -2819, 1043, 3724, 4686, 3366, 928]
2586I28l406k236M45J892L093K966J586j262l651l045j550l48J723L389L316J039
2602D879j146k783l230k337J83K426L006K316J120o58k830l651k126O86J763L167
2618G85K864J191j434k629k959j872p90K082L735K869P63r11k898l380j890L7
2634d437K163K552L159J508j251l222l038j154m22J741L061K753J209j605k237
2649G80k841k238m2K348K896K642R03n32l272k933k192K40K423K575K675J007
2665D439q93k960k982j894pK319K722K594J004r38k530l140j965J58J885K748
2681E60K709J093r57k650l009j703l7J991K673K922O50n85l003k820j840O9J854
2698b083K642K884P91j039k315l030j900K61J694L134K292P47q89k604k286k165
$$ y = [928, -2478, -4714, -4269, -2377, 716, 3682, 5268, 4006, 355, -2690, -4240, -4588, -2865, 524, 3840, 4879, 3733, 950, -2280, -4617, -4434, -2008, 998, 3314, 4434, 3776, 946, -2705, -4831, -4145, -2382, 785, 3649, 4840, 3406, 777, -2182, -4054, -4844, -2762, 973, 3842, 4605, 3694, 796, -2584, -4474, -4437, -2274, 278, 3437, 4945, 3694, 472, -2566, -3720, -4142, -2401, 660, 3413, 4622, 3017, 780, -2061, -4299, -4341, -1993, 903, 3545, 4448, 3916, 644, -2289, -4481, -4241, -1818, 757, 3432, 4439, 3546, 586, -2396, -4290, -4297, -1978, 744, 3338, 4342, 3404, 874, -2266, -4231, -4073, -2188, 560, 3269, 4362, 3405, 755, -2254, -3957, -3994, -2003, 670, 3592, 4242, 3657, 654, -2166, -4006, -3937, -2083, 559, 3443, 4234, 3195, 880, -2150, -4050, -3789, -2095, 1039, 3331, 4078, 3189, 585, -1701, -3866]
2714c866j55J853K744K775P94j123k409k540k087j5J944K924K332P01o80k446
2730G46k880j615l60K096K550K508R49q55k465k790j911L31J700K632K569R03
2746D108j109k506k484j786j49J968K808K142J027j033k258k864j583J86J368
2761b165K568K816R45j187k334k562j757k16J822K745K548N94q95k515k359j924
2777c876K32J833K221K395R77o45k404k655j538m6J478K854K239M85o67k491k420
2794b028j712j92K117K548K216O10m97k468k467j626j40J725K799K093J006j397
2810B587j866k332j942K43J569K637J839P34n55k151k709j404k61J181L050K323
2826B943O54q15k238k163j746K36J333K409K179O48p27k108k305j670j93K109
$$ y = [-3866, -4021, -2168, 576, 3351, 4145, 3022, 613, -1927, -4014, -4029, -2085, 839, 3171, 3872, 3192, 746, -2134, -3749, -4109, -2013, 537, 3045, 3994, 3139, 674, -2116, -4027, -3696, -1996, 636, 3205, 4108, 2999, 493, -1991, -3777, -3926, -1958, 850, 2992, 4019, 2986, 728, -2136, -3719, -3533, -2165, 403, 3219, 4164, 2977, 643, -1919, -3676, -3892, -2070, 675, 3223, 3817, 2922, 407, -1952, -3876, -3644, -1811, 410, 2805, 3782, 3137, 733, -1922, -3460, -3506, -2028, 826, 3065, 3550, 2883, 392, -2028, -3740, -3932, -1815, 733, 2949, 3559, 3062, 594, -1873, -3499, -3639, -1914, 885, 2978, 3984, 2587, 721, -1611, -3553, -3310, -1741, 896, 2735, 3469, 2914, 763, -1946, -3350, -3611, -2430, 620, 2943, 3597, 2782, 544, -1619, -3365, -3129, -1796, 613, 2792, 3440, 2713, 605, -1700, -3370, -3563, -1454]
2842a454J981K129Q87q52k124k471j203L6J402K422J915Q08p45k054k296j698
2858c317N4J463K519K160N74m78k531j954j662J01J546K051J874J148q15k117
2874F16k273j660K28J297K392J653J107n37k394k272j471m5J646K286J943J014
2890C530j066j630k409j302m85J563K493J582R51m46k025k674r52l79J239K537
2906E27K052O13n57k088k286j430OJ397J886K391J103q62k112k506j469N05J367
2923a463J855K051Q43q17k081k039j175j42J371K207J880N45n12j976k236j336
2939c025K1J591J760J933R98o81k054k015j275l28J444J758K409L77p38j640j942
2956a407j406j38J179K231J771R41p83j938k124j345L51J306J637J821J038p78
$$ y = [-1454, 527, 2656, 3543, 2691, 567, -1904, -3107, -3071, -1669, 753, 2668, 3476, 2731, 677, -1619, -3317, -3263, -1800, 719, 2879, 3453, 2975, 444, -1510, -3172, -3071, -1525, 526, 2400, 3548, 2733, 616, -1657, -3317, -3089, -1792, 600, 2253, 3360, 2823, 429, -1843, -3314, -3359, -1713, 573, 2516, 3530, 2464, 834, -1575, -2877, -3362, -1799, 694, 2276, 3227, 2781, 756, -1918, -2870, -3249, -2010, 527, 2579, 3192, 2635, 547, -1739, -3169, -3163, -1766, 120, 2511, 3614, 2752, 640, -1866, -3335, -2830, -1463, 392, 2443, 3286, 2469, 388, -1651, -2826, -2968, -1597, 610, 2490, 3035, 2523, 547, -1689, -3025, -3004, -1413, 347, 2280, 3278, 2597, 543, -1472, -2747, -3075, -1631, 127, 2536, 2913, 2175, 535, -1407, -2813, -2951, -1772, 459, 2230, 3171, 2388, 450, -1674, -3019, -2668, -1362, 275, 2096, 3134, 2356]
2972B356j794k043j491L14J176J987J609L59j34j492k361j461J72J423J741J923
2988B284M68k88j757k102j153l64J378K224J911L64j098j160k047j358J91J043
3004a464K056J733N47m36k223j880j081K73J454J429J783N60o04j786j968j197
3020b804M5J355J835J917K41l50j508k170j362O6J400J910J452R01o08k077j925
3037a682j108L64Q66K010J512Q28p20j506j606j629OJ333J770J859L77o54j518
3054E02j667j275J16J269J442J374J122o84j899j450j159j68Q66K126J736N19
3070B770o13j929j429j490K03J247J947J379K69o88j148j900j307K03R98K326
3086H38J131O63p26j577j491j416K4J247J823J067Q13k29j869j697j025J54R21
$$ y = [2356, 562, -1481, -2972, -2658, -1482, 505, 2114, 2473, 2339, 847, -1514, -2975, -2803, -1380, 361, 2284, 2752, 2464, 707, -1395, -2548, -2912, -1534, 690, 2601, 2965, 1867, 707, -1340, -2698, -2507, -1464, 592, 2325, 2872, 2436, 213, -1667, -2748, -2475, -1021, 408, 2191, 2751, 2147, 361, -1607, -2804, -2759, -1404, 431, 2348, 2589, 2239, 731, -1439, -2801, -2735, -1335, 575, 2027, 2928, 2320, 243, -1682, -2790, -2426, -1560, 450, 1962, 2790, 2070, 564, -1042, -2671, -2665, -1332, 438, 2297, 2674, 2020, 502, -1165, -2440, -2324, -1055, 387, 1761, 2883, 2199, 300, -1150, -2309, -2477, -1611, 515, 2251, 2770, 2157, 228, -1201, -2691, -2488, -1241, 706, 2085, 2354, 1666, 518, -1382, -2689, -2486, -1488, 838, 1969, 2632, 1906, 329, -1162, -2578, -2554, -1307, 516, 1583, 2396, 2167, 298, -1399, -2424, -2270, -1349]
3103a349J650J752O30p65j325j837j161j05J002K084J479Pn4j461k062r72L5J347
3121a105J679J211N84m65j554j681j147J78J145J653J099R07m14j894j306j465
3137b575K61J356J227J762M96m97j332j741j024j09Q89J897J295O38n28j814j577
3154a376p45m8J039J887R87O63o44j397j569j232L47O81J650J800J03p9j597j402
3172i32j067k09R78J982R65P13o95j403j297j044P1O68J628J465N69q70j064j681
3190a223j165P58N27J342J541N97o87j276j690j002K39P88J930Q60R80r06j137
3207D76j583r52j00P72J877J176N08p26r52j680j041L19J269J108J189P84p68
3224A676j378j465m64m08J283J412P44N92k83j387j232j119J00P25J460J559M03
$$ y = [-1349, 301, 2053, 2683, 1918, 593, -1244, -2405, -2510, -1508, 576, 2055, 2062, 2008, 547, -1515, -2487, -2452, -1105, 574, 1785, 2369, 1904, 350, -1331, -2478, -2300, -1155, 498, 1597, 2504, 2090, 196, -1110, -2575, -2314, -958, 269, 2031, 2527, 2030, 698, -1043, -2067, -2176, -1287, 610, 1905, 2543, 2015, 201, -1376, -2121, -2169, -1130, 757, 1744, 2407, 1763, 366, -1203, -2435, -2088, -1407, 243, 2043, 2146, 2067, 470, -932, -1999, -2208, -1230, 752, 1717, 2430, 1735, 332, -965, -2009, -1938, -1270, 358, 1823, 2392, 1522, 458, -1223, -2388, -1630, -1103, 239, 1780, 2377, 1690, 414, -1276, -2278, -2039, -1251, 679, 1539, 2519, 1613, 476, -1107, -2059, -2159, -1387, 490, 1666, 2174, 1448, 496, -1184, -2225, -1906, -637, 471, 1660, 2444, 1676, 298, -1167, -1631, -2039, -756, 656, 1400, 1992, 1709, 322, -910, -2029, -1929, -1204, 256, 1815, 2218]
3241B218l93j510j705p55J97P55J533J554N81q72j170j404r13l1R15J022J713
3258A735L76n71j520j182r91J99R33J423J064N29n69j094j527p67R7R83J288J291
3276A697K16n26j204j258q60p2J248J111J235L68l60j165j520o89J20Q47J147
3293C35J236M67p14j123j342p44k06Q99J771R98O0%j204j356j001P4J075R86J477
3312A688M65n87j304j211o99k79R86J324J314N0n54r68j328q82J40R48J252Q43
3330A198M21J88j517j583m50J55P06J328J152N44q98j078j327n01k46R11J251
3347B54J522j71m10p05j509q91K45N69J430J140N91q61j086j140n68k07R86J416
3365F05P30K16l76o86j353j071K59J059J012J077N10m68j227j183o74l1R33J083
$$ y = [2218, 1825, 315, -1390, -2145, -1948, -1193, 340, 1894, 2475, 1603, 433, -971, -1884, -1915, -1000, 22, 1735, 2111, 1540, 20, -1162, -2153, -1954, -1021, 402, 1466, 1995, 1426, 332, -1195, -1962, -1865, -882, 406, 1697, 1913, 1387, 183, -1075, -1935, -2007, -759, 352, 1587, 1955, 1595, 430, -1090, -1779, -1659, -812, 335, 1571, 2038, 1324, 201, -1141, -1885, -2091, -1192, 579, 1577, 1637, 1637, 433, -923, -1924, -1850, -775, 211, 1688, 2153, 1566, 262, -949, -1648, -1927, -941, 383, 1697, 1747, 1193, 225, -1103, -1985, -1845, -897, 355, 1198, 1619, 1807, 290, -1293, -1743, -1588, -882, 446, 1598, 2142, 1244, 166, -1161, -1662, -1908, -997, 254, 1776, 1605, 1195, 490, -1019, -1910, -1665, -1096, 334, 1474, 2065, 1204, 118, -1022, -1590, -1797, -811, 605, 1335, 1551, 1175, 489, -864, -1935, -1676, -617, 395, 1472, 1982, 1514, 287, -896, -1570, -1601, -668, 415]
3383D15J098L78m56j451j009q00R6P74J546J014j98L19j586j151p42J07P93J138
3401B85R21R87n78j579q81p23j1O19J548P94M09o72n41j601n59O1P64J264P98
3420A305J77j76j221j012n08k1M72J725R51J49p29j189p12n09k71O97J350N57
3438A035M39j75j039j274o73L1J204O55R18N64n90r73p41j040j53J127J307N47
3456A169M21n60p82j091r21J14Q16J357O64M84o70q50j165o06n2N78J661R01p9
3475A389k64p58j395n19K19Q07J017Q75J45k78j162r86n55J43P12Q54Q87L78k51
3494A258j143r59l29m31Q77J315Q07j5k68p20j452n58J41P33J531O79J03m46r04
3513B19j042p40o6O66J384Q78M27n72p98j076n29j98M90J257R35J88j27j303o92
$$ y = [415, 1513, 1891, 1435, -16, -1025, -1825, -1729, -955, 591, 1605, 1407, 1726, 140, -1011, -1753, -1646, -853, 285, 1206, 2193, 1615, 36, -845, -1568, -1579, -960, 588, 1382, 1791, 1119, 578, -1023, -1582, -1521, -757, 507, 1305, 1482, 1306, 85, -927, -1435, -1456, -984, 741, 1692, 1841, 1112, -77, -789, -1298, -1569, -872, 478, 1035, 1474, 1299, 260, -1014, -1687, -1656, -452, 203, 1121, 1685, 1095, 122, -619, -1659, -1812, -685, 622, 1169, 1590, 1030, 248, -843, -1764, -1650, -834, 523, 1187, 1671, 1001, 151, -1014, -1620, -1672, -1094, 567, 1468, 1389, 1125, 367, -1028, -1547, -1328, -521, 496, 1371, 1516, 1238, 76, -910, -1465, -1322, -610, 244, 1131, 1509, 1258, 115, -844, -1173, -1604, -727, 588, 1395, 1380, 1112, 392, -1060, -1618, -1477, -744, 787, 1466, 1569, 1123, 219, -823, -1563, -1629, -963, 421, 1299, 1726, 1154, 356, -720, -1249, -1447, -957, 300, 1235, 1423, 1296, -7, -699]
3532f99j191P37M86J058Q35J38k22r95q07r48N42O23N01J093N16p75o17j153o18
3551a496lJ055O41J047nj61j251o86l12j06P33P13J023K52m76p51q18r78K27R09
3571d43N55Q14L43k74p87q11o65K2O97Q52O77K56j24r13j170p43M66P50O34Q35
3591I71L46l42p33j066n26J39N65Q01J072J28j32j008j112m40J06Q01Q85R92M4
3610A491k84j017p75q13O6O67J126P20M88m33j018r02o77L39M46R67R98j37j08
3629A144j315n29n04k00R24P70Q66J16q7p97q82j029K49R45O40Q34K26n69o01
3648B01j222l48J73O14Q85J092l49p2p29r53o26J86P16P63Q84n3r6j143o41p59
3668a477L74P34P51M53M25m66o95o76o89N1L64J299N92J28o05k08r63n37k16J040
$$ y = [-699, -1890, -1153, -667, 391, 1226, 1364, 1142, 147, -660, -1608, -1066, -443, 58, 1151, 1667, 892, 275, -878, -1496, -1499, -444, 197, 1244, 1239, 1078, -173, -859, -1171, -1277, -544, 169, 1192, 1444, 968, 217, -601, -1579, -1352, -443, 112, 926, 1269, 995, 208, -603, -1268, -1246, -549, 303, 980, 1236, 1112, 199, -971, -1714, -1248, -498, 136, 971, 1317, 975, 242, -824, -1350, -1211, -646, 155, 1227, 1355, 1223, 215, -897, -1337, -1231, -430, 455, 1447, 1491, 1207, 190, -585, -1398, -1332, -665, 461, 1181, 1669, 1236, 218, -684, -1361, -1022, -576, 391, 1389, 1252, 1144, -171, -700, -1204, -1404, -480, 290, 1156, 1272, 1185, 388, -494, -1523, -1274, -329, 311, 1145, 1371, 802, 201, -1021, -1369, -1196, -582, 303, 1395, 1046, 974, 245, -708, -1334, -1148, -432, 331, 1215, 1162, 1066, -77, -718, -1477, -1103, -369, 382, 835, 1260, 794, 99, -577, -1266, -1215, -851, 448, 1040, 1168, 563, 355, -608, -1145, -1361, -321]
3688c21Q42M72J76o36k4j180p47J79R21L27J020M09p60q06m88n25P2N23J123K50
3708H27M55n10m88j089m17J17O63P18P68j2N5j001p86m81K00N63P04O67K26j37
3728A042j166n85l79K87K07P81N49K73m89k98q23p32P2Q24O56M94K95l48l88q79
3748f07m87j79J001N52P89j29p2o30p60k79l46J048L93L71M48j64r22o69m72Q1
3768a033L19Q88O25M16k82q44p52l62l83Q68R71P16k54K78j053q48k23n7L77J168
3788E35J13L07k38o47m99j91k13N97N80N41L42n96m79p47m79R5O45P07N10M48
3808A331n37p46m59q71K48M30R63L36K73j33q89n23l10q5O18M85M70M24j88q88
3828e1o77l36L00K47P56O63M5k98l51r91m60K41O02N76N06L88o10m27p89k39J20
$$ y = [-321, 521, 993, 1169, 533, 509, -671, -1418, -1239, -318, 9, 1029, 1438, 678, -128, -616, -1141, -1069, -546, 577, 827, 1282, 772, 284, -805, -1222, -1105, -442, 276, 1044, 1032, 1087, 86, -700, -1181, -981, -418, 286, 953, 1179, 1042, -124, -709, -1088, -801, -594, 187, 736, 1009, 520, 222, -601, -1333, -1261, -437, 219, 713, 1008, 660, 272, -607, -1094, -1273, -272, 280, 1069, 940, 868, 238, -522, -801, -1147, -99, 294, 665, 1113, 949, 27, -642, -1114, -1033, -714, 174, 799, 1215, 933, 89, -663, -1025, -1408, -540, 431, 1147, 893, 1171, 118, -730, -953, -1010, -633, 535, 648, 955, 717, 70, -429, -620, -833, -236, 344, 885, 1227, 631, 152, -595, -1074, -979, -334, 373, 883, 1331, 794, 48, -411, -1282, -1034, -604, 359, 695, 968, 835, -54, -577, -887, -972, -354, 131, 601, 1025, 837, -51, -728, -1064, -764, -517, 239, 902, 947, 649, 298, -693, -1153, -912, -310, 266, 772, 1160, 550, 123, -666, -905, -785]
3849g85L89O92M83J11j26m08j047k84P1M42M46R59R7l29o39p22m01J29M92N36
3869A06O31L56k45r53n32k83j09O21O42P73J38l57o08p06n04K02M94N72N46J9
3889H03l18m34m39k17l16N09N43J047j46l78r00n6m60l5L70P31J73K63L76j067
3909D9j12j119J05O52O00O87O6l82J20j105m67K63J56O24M61K63k45k69q59n16
3929a028M40r0J358n8M4j25m44n40o06K11O79L81O11j8j32p09l19m67j34N54N98
3950B06P02k1Mj274k75j10P4k2R05M60L55k20o12o18p55L14M69N52L19M85j55
3971G83p12l17o80RO01L28N88L34l31l98o76l13LJ14J201L69j56j07k10p00n36
3992h06O6N07L35L67L60j00p39m42j14m28L86J099L49J9j53k94n72m57r9L14O85
$$ y = [-785, -396, 296, 779, 890, 764, 356, -691, -975, -904, -462, -16, 943, 1040, 711, 72, -650, -1051, -922, -430, 106, 737, 1093, 848, -105, -637, -920, -1029, -408, 234, 1007, 1145, 788, 180, -526, -1030, -828, -334, 238, 784, 803, 485, 51, -388, -605, -921, -412, 131, 1178, 1032, 654, -246, -302, -762, -797, -427, 304, 477, 740, 1116, 49, -63, -1182, -1077, -425, 175, 862, 928, 546, 666, -439, -906, -643, -487, 137, 598, 861, 616, 347, -512, -1028, -588, -678, 680, 622, 666, 541, 97, -443, -1049, -838, -159, 222, 833, 815, 683, -26, -345, -812, -946, -392, 206, 908, 887, 891, -383, -658, -768, -694, -716, 189, 649, 1004, 784, 172, -446, -1201, -887, -418, 134, 453, 938, 783, 71, -246, -926, -917, -316, 12, 600, 934, 603, 205, -471, -784, -781, -667, 534, 903, 747, 640, 430, -270, -806, -740, -233, 102, 469, 829, 729, -10, -452, -566, -994, -608, 491, 840, 859, 706, 412, -160, -617, -716, -402, 283]
4013B83K21K11m2l88p96k90j80N84M88O23L61l18m74q38j13j87L54R31L09k18
4033E21L61q10l57m35M78O3K91M34M70k91p60n27k21P6L65O70J26K54k75j45o64
4054c76k38j45M35L84M40O3P5o28n69m6l26L17P71N04m5M7o98k28m16j79R53J48
4076B43O27m39K66m37j035J60l49Q29P6P58J81l78n15k16m13J22J55O17L00L71
4096I23k01r42R3m14k14N01N53K82P9J21q01o08J00l5J14O25M64l9J98n97m79
4117b77l06l00P42K24M58J90l91j46o45k62j19N75O18J97L5k86j65m18m72Q8N28
4138a32J54N67J30k93o33R5n19l2K68M37M20M24m70j00n14p3m34L16L54O37n4
4159E48n0k42q39j90K91M43J38M73L39n49k68n32k67j22L75N89L89K8J37p77R
$$ y = [283, 504, 715, 673, 285, -511, -801, -981, -397, 91, 714, 1075, 757, 283, -555, -668, -855, -501, 430, 739, 521, 882, 72, -285, -720, -242, -179, 112, 546, 1016, 725, -35, -562, -783, -707, -342, 328, 454, 708, 433, 288, -376, -614, -759, -324, 60, 500, 563, 638, 10, -559, -605, -931, -614, 157, 661, 616, 663, -35, -263, -679, -858, 95, 243, 870, 431, 697, 260, -775, -615, -964, -135, -59, 699, 880, 502, -13, -229, -642, -520, -365, 252, 552, 923, 722, -220, -127, -541, -755, -254, 299, 581, 660, 781, -20, -628, -528, -563, -449, 176, 640, 601, 799, 202, -277, -583, -883, -141, 83, 541, 731, 340, 194, -451, -713, -832, -257, 361, 558, 593, 307, 142, -276, -748, -660, -132, 22, 589, 719, 426, -207, -112, -631, -663, -395, 42, 462, 886, 416, 316, -198, -271, -705, -389, -35, 602, 548, 498, 256, -583, -773, -482, -39, 99, 572, 911, 362, 94, -438, -705, -827, -452, 137, 526, 554, 691, -86, -77]
4180g7p50L6N58M27L28Q6k42k47l00n84M05L52K50K88L37p03j49l89k48N6L11
4201b55N23K3J03L37p82j39p19K91N36K6M96N5j7m97l12m13J27L32L48N52j55
4222D60Lm30l40m06J49L94L26N27j17k9k61p77K29k28J10O24L76j22l88O4m44
4243b80m72J90K94N92K60j91Q0k99p29j19L16J65J99M34J49k37j14n42k53R8M76
4264A7p7M63j1J65m54p22J41O2O5K25N47O9K63m60n70n08R8M48K06K01O43n02
4286C09k96o11M2r0K65L48M55R7j10j89m85n41N35P0L00M35j49K9m16k79m51K25
4308e07K32M89m7M93m67q2m97L3O2J98L10K18L68l06m42o69j0O5K55M28K99L65
4330G88o57j42n41L02k14O4M64M69lk3l55n65r5j0J55N12J97j5k5n34Pk34l73
$$ y = [-77, -827, -791, -233, 194, 522, 608, 366, 119, -181, -765, -360, -8, 242, 530, 867, 164, 15, -374, -622, -566, -255, 268, 291, 394, 731, -51, -190, -909, -618, -82, -56, 440, 495, 478, -19, -331, -744, -617, -285, 63, 615, 460, 463, 33, -307, -713, -564, -170, 156, 683, 566, 537, 276, -501, -272, -500, -390, 234, 610, 488, 100, 164, -280, -752, -562, -268, 324, 584, 393, 473, 174, -555, -674, -358, -193, 6, 440, 589, 352, 238, -304, -557, -459, 17, -60, 403, 392, 557, 103, -619, -478, -416, -351, -126, 421, 490, 753, 293, -277, -785, -687, -239, -33, 168, 811, 309, 13, -598, -556, -646, -381, -33, 422, 519, 409, 220, -265, -806, -271, -201, 99, 534, 385, 414, -2, -281, -732, -507, -275, 214, 167, 660, 193, 111, -386, -353, -291, -93, 217, 435, 803, 497, 55, -614, -624, -559, -304, 124, 423, 788, 131, -11, -552, -250, -464, -400, 64, 533, 530, 507, 152, -413, -508, -518, -363, 149, 346, 331, 306, -228, -221, -455, -828]
4353h28N86L86K28K52l52k25p43K42j37K66M21J23N15m28j73l30m34K27L10O15
4373E21k87N28m59l99j73k15Q6Q7O62K68j15j73l77k38k43j08O31K38J70J66m22
4394A48J37o24l41K48M7N01P9K15j30m30j58N7k12K30N32P3o4K2k46m29L0k70
4416e85L66M87J48L5p7l47Pm51l03N08L04k7L28K97o63O4n04K17K25M7K67j03
4438B40L45q21j8j15j00J85M04M88j18k75Q7l41k21k91P1O13Q8K20j21j85k50
4459a15m74K87L31Q8M71l42r7j99j69l79k09O38L67K03L5r6l32J3k97j11N59L9
4481B11R0o2Kj37j80m13K2L28L46J61N45l46p49n6j33m4K70K16M71q7p3j95l36
4504a49m22K94J61M58M8K89k67l99k39k18Q7RM21M01l7j19k67j44j0n66Q22Q2
$$ y = [-828, -242, 144, 372, 624, 272, 47, -696, -454, -591, -325, 96, 219, 734, 306, 133, -197, -631, -404, -94, 521, 234, 762, 303, -96, -269, -484, -398, -311, 351, 619, 504, 331, -46, -284, -527, -635, -4, 234, 404, 570, 148, 285, -339, -680, -432, -385, 116, 195, 410, 280, -150, -308, -251, -463, -233, 299, 372, 308, 330, 84, -345, -315, -585, -219, 268, 416, 451, 374, 27, 34, -417, -720, -212, 92, 65, 393, 690, 27, 91, -413, -196, 29, 76, 343, 240, 585, -236, -254, -369, -469, -284, 120, 608, 490, 215, 302, -39, -260, -551, -480, 133, 221, 441, 320, 135, -115, -589, -302, 29, 117, 588, 246, 149, -50, -219, -598, -807, -169, 198, 401, 436, 340, 8, 21, -276, -387, 172, 211, 301, 239, 241, 104, -76, -489, -467, -139, 207, 368, 913, 567, -182, -238, -371, -415, -145, 71, 542, 455, 382, 187, -149, -571, -277, -116, 342, 390, 679, 412, 13, -226, -444, -357, -348, 73, 474, 437, 318, 51, -93, -103, -669, 153, 235]
4526B35M23l46Q1m12k33k49J6K08K04P8M45j36k23m37n3j49Q4K74O58j23j11j79
4548E5k72k3k53M73J95lM81m6n03m65j95J48K78L88K27m3k45k20l90j54L74J51
4570d2kK05N00l35j41o35J09kK14J58L23r9O4k61n01j23k90N08M62K05J33k0o59
4593b29j40p8Q7L18K57p4M98l40l32P9j44J3L5J45L80J0j37m65k50j89K70m3M09
4616H0K26K07l32j01l77k4l3K18M71m4k4j21J63n83j35R1J26L13L35K9l04P5j99
4639E7l56N3L24L7L28k64L64n15q1o35K79O66k4M6K71j68m07r7k70j31O62j5P5
4662A99K91j96j48m81j68K4L35L52K38j97m6j16l26J23j69L70Q4J82P0j79k82
4683d0k82J16l5L81k15N71P0k53m44k16J94j00j17K70L20K51j43m45Oj63j37K24
$$ y = [235, 658, 312, 393, -19, -252, -501, -485, -277, -73, 5, 450, 314, 91, -346, -399, -548, -464, -190, 468, 345, 234, 55, -217, -240, -493, -20, 175, 172, 653, 607, 104, -361, -556, -408, -130, 258, 485, 442, 197, -23, -413, -567, -193, -42, -44, 161, 661, 326, 185, -450, -341, -343, -129, 29, 352, 253, 317, 56, -445, -568, -858, -350, 112, 317, 450, 430, -229, -369, -447, -360, -42, 215, 141, 639, 299, -33, 46, -98, -85, -50, 95, 475, 485, 348, -117, -367, -556, -286, -329, 80, 306, 513, 181, 80, -297, -321, -354, -136, 335, 291, 267, 146, 309, -274, -409, -318, -192, 121, 456, 485, 181, 256, 57, -299, -246, 78, 115, 443, 179, 543, 28, -53, -688, -409, 257, 233, 279, 550, 382, -25, -122, -392, -523, 139, 124, 199, 490, 294, 146, -335, -503, -479, -144, 208, 446, 249, 203, 87, -239, -116, -285, 85, 169, 351, 421, 242, -40, -322, -206, -241, 140, -75, 496, 566, 313, -131, -347, -153, -253, -370, -100, 220, 471, 328, -117, -111, -274, -411, -187]
4705a87L92K47j13l88L07o66J42l1J80J63Q5L0K6n2l97j69q0O92j51N30l10J4
4727B64j21l32k38K47N2l0K59J85J39k20o04O4K26j71N07K26J4m99L05p14J88
4748b53K51J25R8J42k54J50J2l38O4j15n0L56n7K33j93k76k40j02K23J27N21j92
4770B32L0o3k06j96m77N26lJ59J2K99j69Jj79m08N77j48J27N9L08k24j65l18J13
4793a13k63K56K13N0J99n5j76o32Q2K05n8M16J49Jk51p4l53j07L05j9M19L59n7
4816D96j7n33n19K44j57K50J81L84M6k06k74p2l11J20K14K72J82m1n5k57R8l19
4838b74L29K5p1K25m2k13k1j79Q8m5M05j80L00M2k32j42k46n9O8M50j59n2K8M72
4862E17p04q3j74J59L48K01q4J79j77n18J03L4R1N9J03M7K05j32k14m22K27l3
$$ y = [-187, 205, 452, 339, -49, 258, -408, -266, -297, -117, 46, 131, 161, 187, 135, -262, -431, -511, 181, 30, 560, 250, 264, 143, -189, -427, -180, -128, -158, 101, 286, 425, 205, -399, -335, -109, -280, 227, 453, 467, -32, 273, -441, -253, -2, 123, 221, 363, 109, 259, 271, -67, -3, -118, -168, 188, 131, 364, 171, -105, -345, -447, -224, -97, 424, 232, 262, 199, -7, -203, -680, -154, -157, 2, 14, 313, 144, 145, -34, -442, 135, -13, 114, 173, 481, 257, 92, -226, -113, -376, -120, 93, 143, 342, 287, 111, -521, -439, -234, -292, 124, 273, 274, 23, -51, -404, -511, -206, -225, 194, 553, 496, 479, -54, -573, -329, -486, -236, -55, 329, 375, 169, -105, -177, -488, -368, -154, 118, 300, 259, 204, -53, 45, -274, 55, 80, 9, 234, 192, -21, -42, -221, -133, -178, 227, 47, 347, 389, 157, 15, -231, -290, -222, 228, 69, 17, 45, 517, -187, -270, -444, -285, 63, 264, 180, 359, 182, -336, -233, -199, -108, -49, 54, 101, 306, 174, -40, -462, -235, -268]
4884b68J6M64J01M9j40m8m60R6p2K81K0L60k06J0j04l61r3O9j11N31J12L9p2p1
4908A42m70k76P57j59K5M82j09n07L94p10j09L69R1K76K0K15k17k13j36J43k66
4929b58l9N73J63j82m4j36l30o0O2J51J83J14L0N9l65l4k4j66L44K72R2k1j43
4952B41l52m3r4k32L33K66K14o8k19N9j95l50K59J94K5M11r9j66o5l04m7j8J90
4975f0J65J02N9j6l4m48oJ03M22o2k39N29n58nm24L33j6J19L07N0j92J99j40n23
4999c35L43m36Q14m03K58N5l91L1j07l48K37N58l7R7j96M1m44J34l01K96j39N41
5021B68k52K29K39m91j99J18k17J91J10jM10l84J11k04k34L11j41ML5K64J65l40
5043hk91O4l0K07N5M10k62l07o1P8r1J08J77Q8k18K89J71n20j5o4L3pL72j40P1
$$ y = [-268, -252, 212, 313, 362, 222, 174, -286, -190, -262, 19, 39, 399, 193, 203, 99, -262, -355, -286, -397, 134, 246, 285, 213, 142, -328, -604, 153, -6, 19, 501, 392, -115, 279, -431, -540, -171, -80, 196, 216, 431, 214, 1, -135, 8, -258, -297, 276, 439, 257, 213, 77, -253, -313, -251, -100, 83, 197, 227, 286, -79, -113, -137, -303, 41, 313, 405, 384, 241, -111, -154, -248, -480, -147, 119, 333, 265, 46, 105, -90, -440, -181, 13, 38, 449, 350, 184, 119, -185, -232, -250, -60, 105, 207, 266, 250, 216, -232, -238, -135, 287, 225, -14, 515, -43, -48, -472, -139, -155, -36, 271, 321, 129, 328, 188, -335, 8, -428, 386, -17, 241, 296, -95, -64, -171, -519, -282, 276, 239, 336, 140, 181, -263, -129, -430, -134, -273, 268, 16, 245, 484, -7, -206, -88, -305, -114, -4, -5, 405, 21, 132, -72, -306, 5, -136, -132, -97, 167, 332, -8, -299, -235, -265, -58, -3, 407, 145, -162, -223, -145, -236, -128, 49, 137, -81, 208, 379, -141, -156, -220, -187, -194, 178, 38, 109]
5068A09R2k92p5r5J55Q8j8mO6PL4l32J84r9K37q8m4L0Q0K57k97l13K8J28J58K64
5094B60lm21K15K1l07K41k73N83Q3l50O6j38j6m55K49J00k5L51q5K5q3m36J06
5117b92l12L29N22K53l75M7j23m26J00L35O1j7Q8M63l69m65J42k78K19JM3L60
5139C06L05n90j22j76k28M61K65n1n5Q6n8k56p7k19k5M78K6L08m00K80l05l7k95
5162c79K63J20j2%L60j62j7Q1k22l00J8N21L8K13o03J14l3j07j73k68P58O2P8
5185C50m2n64L7j14J86M8L65r1K24M0m73k38J24o2K4K17K21j31J25m71o1q5N24
5208A53m3n4m2J97j89l17k8J18q2N98J52k31Q7j50j65l48mK9K22K14N1k57J50
5231F1k55L1j2k31M93J16j21J70kl79k30K53L3k9K6K67J09m22m5N4m35K31J34
$$ y = [109, 201, -91, -166, -261, -106, -18, -36, -40, 26, 33, 67, -265, -81, -180, 57, -31, -75, -45, 35, 292, -5, -318, -290, -162, -4, 260, 257, -164, 51, 72, -235, 6, -267, 316, 399, 49, 115, -23, -39, -494, -245, -145, -170, 181, 96, 121, 38, -398, -292, -604, -275, 247, 500, 125, 172, 49, -377, -277, 58, 119, 102, 190, 653, 284, -181, -39, -317, -98, -97, -54, 306, 611, 21, -101, -277, -505, -44, 221, 170, 115, 201, 143, -113, -190, -409, -434, 44, 70, 378, -22, 258, -47, -84, -379, -116, 4, -8, -8, 352, 190, 173, 254, 32, -268, -250, 271, 309, 522, -81, 33, 0, -107, -280, -548, 210, 272, 350, 308, -256, -219, -333, -147, -99, 266, 175, 399, 439, -34, -272, -148, -210, -186, 31, 252, 121, 246, -225, -286, -371, 153, 110, 56, 14, 211, 22, -295, -323, -205, -287, 311, 463, 232, 319, 169, 4, -344, -348, -319, -97, 117, 168, -89, 61, -194, -163, -175, -406, 87, 203, 82, 252, 250, -129, -359, -106, -73, -102, -76, 191, 300, -122, -167, -113, -548, -317, -183]
5254a83L39ol4P2j4k56l66M9L35JM26Q9n81j00K29k65K9J35O73m15j9J11k70k14
5278b35j48J99%Q7N41k61l89M62o49Q2J81j14J69L79l37N33k34J17o18L84j50
5299aO4J87k99M68k67K4n73M6L17J30K0p8J82k55m5L7L2R8l2j5J59r9K0k30q6
5324a96l97L78m2P37l99K94j79l14j51O0Q4J09L33o3Qr0k26k37K74M0L27j53n9
5347A38j13K45n33J57K41j5k56L03J02l10O8L0n90L46k80N57J21K40k94r3p2J18
5369A10l49L1M19m3k06J43p5j14j4Q9r2j34M03k09M9O6k36L7M1J79k42N12k2k23
5393A20j89r2pl8L33l5pq2O3j63K49l54jM10j24r7j9lN0o8Q7j71J14j50L84j5
5419A95K5k29j66j90J38N1M56k14r3L32k34j10R7j97J53K49k88K87l45o3R7J13
$$ y = [-183, 156, 150, 116, 188, 174, -82, -448, -399, -64, -63, 363, 452, -129, -229, 0, -265, -236, -101, 572, 157, 138, 249, -21, -235, -383, -184, -184, -97, 444, 183, -206, 256, -393, -311, -130, -244, -75, 304, -33, 500, 266, 383, -235, 149, -1, 63, 250, -49, 419, 152, 176, -397, -351, -34, 96, 116, 38, 220, -35, -80, -43, -11, 87, 55, 40, 199, 100, 120, -110, -196, -593, -215, -257, 480, 81, 375, 196, -118, -269, -209, -125, -16, 317, 254, 262, 172, -54, -291, -17, 23, 350, 197, 138, 25, 270, -263, -106, 135, 120, -136, 167, 269, -41, 27, 57, -533, -187, -467, 90, 211, 451, 157, 64, -8, 110, -239, -208, 211, 168, -38, 105, 30, -84, -98, -9, -101, -235, 168, -41, 8, 74, -162, -125, -84, 95, -147, 365, 343, 120, -69, -161, -168, -206, 127, 92, 85, 3, 66, -97, 152, -202, -203, 207, 83, -14, -33, -36, 14, -54, 33, -138, -24, -174, 210, 195, 220, -9, -175, -365, -227, -176, 280, 66, -27, 305, 71, -39, 58, -139, 14, 263, -25, 262, -83, -146, -49, 64]
5441F4j29o6N4j05K16O0k67j78K75l55P79m39J73k66L23j40J57j61j78l5M29l77
5463a66M61j51J12l00Oj6j26L56o6O4r0j29j92J52J62j50%M50j33K0k14k49j69
5486c68J62L19q0J55jr2L0l87m2K2K45l7N51m85J26j49P0j24o0j01J20N55l98
5509C1R9K6m10K56k07L96k97L77n3j70P9P1l78j43K58j14M37J3j51k12KO3K99
5532B72k64R2N1l5J71l67J51Q8j26k27O92n92L23k40J72k63j26m7M61l2K44k73
5554A25q1o3j76j06K14o5J13p2M64l36k33K33l05J54P2L55j28K4r6q4j13m3Oj05
5578b46J42K67j78K92l8l46LNl6K76J83j14k08R1k76o1P9L39m71L59K60m99J81
5601Dj16J6k37J16L08K58j47L3k34j00k63RK01J28K13n2j95j78L9J45j24K42m7
$$ y = [64, -65, -131, -77, -182, 34, 94, -173, -351, -76, -431, 348, -91, 82, -184, 139, -1, 156, -5, -183, -218, 211, -166, 295, 144, 256, -44, -38, -54, -180, 176, 110, 174, 84, -45, -237, -85, 77, -73, -73, 377, 244, 264, 50, -199, -368, -206, 113, 33, 188, 187, 95, 125, -262, -304, -282, -37, -74, 477, -8, 118, -31, 39, -85, -145, -246, -126, 429, 31, 130, 156, -254, 2, -205, 191, -106, 271, 218, 48, 127, 198, -180, -323, -65, -179, 258, 271, 120, -92, -90, -27, 272, 8, 100, 151, 116, 287, -80, 71, 159, 33, -194, 498, -94, 229, -11, 161, -102, -228, -275, 186, 154, 398, 125, 44, -19, -195, -301, -87, -152, -39, -111, 353, 17, -216, 17, -288, -134, -62, 293, 165, 189, 93, 9, -104, -147, -141, -246, -104, 163, -15, 277, 239, -107, -104, -99, -135, 141, 324, 210, 2, 93, -183, -244, -165, 174, -297, 62, 322, -177, 4, -112, -96, -333, -217, 91, 349, 202, 235, 1, -99, -362, -353, -152, -24, 189, 137, -58, -236, -197, -52, -176, 66, 19]
5624A9l4J85n2j11M6l49J85J12K61k91J19M8k34J09J17m42l6J90K28r4N3K47m49
5647a73l4j65J26J77kJ67j03j46M44n66R9L96m2l66M30J69l54j52j83K24J68K53
5669C67l48O1K56m33k16M28m51J76K45J70J55p0k87R7j38j11j32K25k6K63k37
5690fn2J52k11k82L40K25Q1J85l65j22j81N43k03l33L93p9J2N5o39M12k39P5J76
5713f3J69j58l2L76j54j55j13J65j21J1M59l34l34M33j89m27K48N6K80J50q1n5
5735A31j15j31l0LJ53j2P5j17L89k98K0L8k6m6J16k3j54J19q2j98J03l3N9N8j66
5760a67k3K71k41K37o2K17o70M62O9r0l0L32l96j17Q2J6L05n06M35k87j7K00l7
5783a7o8r0R1K38k97P2j2L48j84QJ16k83K60o1j68J02L9k70k38K06L24l15N21
$$ y = [19, -15, 170, 118, 7, 53, -296, -111, 1, 262, -29, 90, 138, -96, 13, 130, -312, -348, -158, 70, -24, 29, 276, -173, -207, -372, -246, -69, -71, 96, -7, -153, 291, -275, -176, 220, 178, -188, 242, 411, 57, -95, -278, -54, 114, 367, 19, 80, 336, -97, -313, 115, -336, -160, 85, 255, 410, 340, 53, 150, 12, -99, -231, -6, -32, 231, -6, -58, 94, -117, -399, -59, 166, 247, 432, 67, -55, -236, 307, 104, -229, 164, 85, 97, 152, -487, -75, -314, -239, -63, 106, -52, -84, 292, 138, -17, -130, 35, -86, -75, 384, 50, -284, 149, -40, -467, -219, -163, 117, 267, 186, 131, 16, -115, -145, -142, 11, -1, 74, -43, 346, 48, 68, 106, 80, 34, 150, 127, -27, 92, 10, -188, -85, -118, -59, -1, -167, -190, 81, -160, 77, 15, 232, -438, 24, 93, 3, -27, 305, -91, -208, -126, -110, 195, -311, 124, -163, -180, 20, -17, -85, -175, -84, 154, -143, -71, -83, 265, 81, 89, 205, -78, 182, 121, -47, 55, 94, -176, -414, -208, 116, -199, 322]
5806C22m0j05R6Nn00K14P6pJ44j46o4L83m57j83J53K96k35m5K26j47j97nJ44J07
5830C5J27o9J25j0j85J6l5q8M4J41O0j41J81l40K2r7l3K46L61l81r0L66k26ok05
5855a82L70l58K84l00K97q0j84L46k22j32M3J10K04J17k42k37j53M37j53K25m86
5876b96K14J22K1j49L3M2k48K66j32K01j08J22j74k19K58M4j75K52J43q2k51L90
5898B74m26j40L25J8q8K78j43m7l48j02L33J19Jj13K19J79o91J06K6k3K57K85
5920B99l30J27l83J08K69j36M3k9K86j04j22K16j11m19L92j41J28J33l67M15k09
5941F5lj72J8r7N8K41j13K05j32j42J48m1j74K98m34J54JJ50J0k18L1q5J5L85
5965A68j85K85mj57j75k10K68m5N0p7J69K15j14m4j80l31M55j65Q6m7m3l1L4K70
$$ y = [322, 282, 177, 273, 278, -222, -8, 68, 61, 205, 59, -5, 378, -79, -262, -109, 187, -48, -93, 133, -14, -211, -216, -72, 35, 162, 93, 218, 208, 23, 39, 4, -84, -40, 101, 161, 20, 201, -139, -117, -214, -247, -1, 360, -21, -111, 255, 29, 23, -182, 188, -170, 114, -186, 111, 31, -153, 193, -29, -161, -118, -8, 196, 313, 71, -166, -319, 118, -35, 190, -296, -82, 40, 61, -88, -55, -13, -261, 5, -127, 74, -34, 88, -86, -305, -47, -3, -178, 74, 217, 135, -116, 274, -152, -292, 33, 51, -37, 241, 98, 51, -297, -399, -66, 53, 54, -59, 160, 339, -352, -246, -220, -243, 14, 299, -31, 96, -287, -179, 90, -46, -3, -32, 254, 150, 28, 244, 133, -286, 106, -35, 93, 226, -141, 274, 65, 62, -110, -92, -189, -131, 110, -3, 202, 70, -72, 76, 35, -139, 159, -275, -121, -120, 30, 40, -178, -147, -232, -217, 168, -17, 268, 264, 107, -68, -278, -10, -55, -5, -82, 87, 302, 188, 144, -36, -367, 88, -77, 9, -38, -81, -112, -78, 192]
5989A92m1m40N8K48N1JK37l45q2J07j24J81Pk07O6K21n9k96q6L77J17J11m9j72
6013G3J54j83M9m2j94J52q4J45p7K58k81j86K14K0j70J00K29k19j3r9J35J06k91
6036b04J65J42J28l62K35r1k95PJ00L01o4J52k85N8o1k8o3J18K38j67q7K75l07
6059i5K33M5k17l1j39O5L53J3j44j66k85N63j99q6J59q0J96k65m2J36j63O4k2
6082a07j41N39m3k71J61n56M18J48n16M83k47k08L57j91M01k09JO1j21K84p4j54
6104A5k63K28L0j74p5M02j51J37r5j47J63p5R1J00r0O7j67q0K18k33r0L27m34
6127b96J38K7R4K46ll05L00l89J03M47k30R2Ll28Q6k8L4j57J65R4q3o8O4K6j40
6152a08j33L14l71M66M7o6j30k99l3L38k11K21jM7J05j78Kk10J7K32r3q7L56p6
$$ y = [192, 151, -289, -231, 17, 68, 69, 306, -39, -121, -14, -138, 43, 50, -157, -91, 130, 71, -225, -311, 66, 183, 294, 245, 73, 227, 44, 93, 51, -143, 9, -75, 70, -7, 251, -30, -216, -2, 18, -152, -52, 177, -42, -55, -154, -19, 87, -204, -39, 103, 231, -131, 104, 13, -282, -275, -175, 126, 62, 214, -71, -13, -74, -102, -165, -47, 191, 24, -63, 212, -95, 138, 183, -34, -65, -204, -139, 214, 227, 83, -83, -368, 195, -4, -90, 69, -11, 185, -80, -122, 14, -149, -85, -107, -248, 291, 248, -23, 138, -418, 0, 148, -368, 115, -132, -340, 17, -174, 227, 18, 19, 80, -41, 243, 169, 15, -248, -20, 10, -164, -239, 163, 12, 149, 54, -93, 70, -5, 86, 186, 96, 163, -4, -84, 134, -99, -189, 138, -296, -158, -131, -37, 209, 206, -99, 201, -188, -85, 362, 132, 224, 227, -101, -15, -43, -9, -166, -1, 93, 10, -58, 6, 32, -108, -241, 73, -298, 168, 215, 149, 19, -280, -313, 25, -186, 35, 34, 81, 186, 8, 10, -200, -183, 49, -44, -131, 225, 149]
6176A49r2j23R8j64R1L54k47m9J15k36J76Pj73K30Q3p1K2k19O3p7J47J7j59J99
6200A41m8k85M10m28J21k80J02J26N7K43L49n77K77r6r4q7P2j24K32K87p04K32
6222g4k76K92j77J38k42L63n3J55k8k31R0R6l17M85j75j85K56j85K15n58N30k31
6244a12L53j90j4O8M3j66J35j25%m0K52J12l54K4K04m2p5l46M76r5j22J19k41
6267a36J64j29J69L2j77J00r6J55j68j60J13O6KJ21J15J00j38K29l34K46o04M46
6289A16j04J76k1k28LM4j6j78M63l25R7P3j32J46O2O2m04K8N43m39P3J87k38J0
6313bN8j20O9J86j3l89L35Pk64O3R3j23K35k60K89l0M2k38j22L63k47K0K02n6
6337I8n9O4o5k84N8J34K19R5k56K57Mq0k58l0p5M9L25j05k47J30j08K99l36K29
$$ y = [149, 57, -66, 32, -132, -41, 313, 66, 17, 132, -104, 72, 79, -94, 136, 219, 148, 170, -49, 14, -63, 84, 101, -58, 141, 93, -192, 218, -210, -89, -369, -267, -141, -84, 159, 508, -69, 208, 112, 18, -69, 3, -121, 111, 398, -306, -74, -350, -58, -235, -97, -339, 24, -29, 126, 98, -133, -43, 53, -264, 221, 46, -139, 117, -68, 147, -411, 119, -112, 241, 51, 37, 105, 148, -18, 117, -8, -8, -48, 204, 316, -38, -14, 190, 148, 73, -273, 203, 108, -14, 105, -136, 28, -101, 68, 100, -77, 23, -73, 82, -86, -246, -133, -67, -65, 56, 171, 271, 133, 362, 28, 274, -330, 116, 12, 188, 167, -61, -58, -14, -30, -208, 255, -70, 27, 100, -32, 114, 176, 238, -166, -138, 405, -34, 39, 226, -12, -2, 56, -64, 5, 191, 178, -211, 124, 131, -133, -70, 23, -100, 135, -125, 164, 134, 176, -62, -184, 179, -68, -48, 154, 98, 39, 103, 38, -246, -188, -54, 165, 260, 4, 261, 265, 185, -73, -103, -178, -129, 196, 91, -156, -26, -134, 165, -171, 58]
6361E8M6p3Qj57R6j73R0J61k41K62n2M4k9j09j26k8L98j88j77L95j75J46j76l97
6385c97J04K48m0J66j28L0J28j85J54k27L78j47k23K60L2l50R9J97k14r9L42j72
6407d4Rj0L45j59r4j15J10K35k57k7K10J6j63J21l59j6O3k4L53q6L9k87J46j64
6431a58L33j56k63M08l14K94p0k98N06l66J67M6k05K03mR6m3l56j0Q6K85K02j86
6454A97k29k02K76k28J06j08p1K13k7J75k74J41k5m8K0m9K54Jj64K22k78J26j71
6477a43M3J09l6k8OQ5J13m4k37n9K87J30j4p4m4j98Jj47N7K44R4K0j01l37L17
6502D4J36k07PO2q9J51j63M71k19k02j30O8K59k76J09Kk03M01j98j67q8N12j46
6525A34k32P0J48q3om51P40o39J79K22p4J97k40P4j26N7N1l0J3J02k9k02J11q8
$$ y = [58, 104, 31, 39, -118, -22, -195, -105, 56, -185, 77, 25, 69, 40, -69, -195, -223, 175, -13, -190, 205, 30, 176, 0, -397, -293, -45, -85, 81, -47, -17, 111, -74, 80, -147, 231, 84, -139, 121, 153, -197, -98, 99, -115, -214, 128, -44, -35, -45, 300, 141, 47, -68, 42, 277, 20, -7, 203, 219, 56, 177, -182, -198, -135, -159, 194, 108, 147, -140, 6, -158, 175, 19, -244, 164, -150, 144, 74, -224, 282, -84, 83, 129, -76, 127, 123, 219, 176, -180, -190, -104, 181, 383, 197, -32, -234, 42, -186, -80, -188, -259, -46, -73, 102, -172, -31, -56, -104, -84, -133, 121, 122, -42, 180, -98, 28, -143, -100, 9, -27, -55, -49, 36, 149, 105, -132, -191, 96, 226, 212, 138, 94, -104, -103, -250, -193, 51, 145, 165, 64, -273, 44, 180, -27, -20, 42, -47, 104, -59, 412, 193, -9, -139, -71, 188, -88, 21, 23, -180, 221, 23, -144, -232, 280, 134, -98, -28, 120, 37, 31, -420, 320, -319, -140, 82, 8, 205, -35, 39, -87, -30, 21, -9, 4, 106, 77, -125, -14, -102]
6549a02k57O60l41L2J53j71j11P7N2j34J66k7j49J6K64j66Q6l27M83J9l28L84
6571B79k52J21l55J73J82m26L46j04R7p8j04J23L3K13l76K2J62j66L60r2j15m11
6593c68J30K99J50j37M35n97Q8j08k0J09k12L04R3l0j9j89p7j04O51l54P0j7l72
6616b75R3L10j03J17k87J49k89J53J4L51j50j98J78n4O0r5J17r5K09j19m7K51
6638B90ll08R8k00O0N5o0J33j38J94pj3L1k66K43Q6m15J74k69L92j71L74m29K67
6662A18j04J81l51PJ54n9K62n3k29K48Nj64P6j01J41l51M58j26l21P8L27k93O8
6685b9mLj94L29N9k37K6j18J51rp8R5j24J83k99R9j12R5L00k02o3j26L96j09p0
6710c8J75p8n8j09K26J3J00k87J19K6k45Q0N4l6K46j35j05r9q8L54r0N6k13K40
$$ y = [-102, -359, 301, -40, -8, 145, -26, -137, -60, -8, -142, 24, -3, -152, -136, 128, -38, 48, -279, 204, 223, -105, 279, 27, 148, -207, -34, 148, -278, 68, -36, 61, -17, -121, 2, 35, 248, -128, -106, 56, -110, 250, 158, 43, -368, -238, 61, 211, 74, 509, -88, 0, -108, -128, -19, -231, 73, 166, 136, 117, -72, -149, -253, 398, 44, 114, 97, -275, -182, 128, 25, 142, -145, 4, -285, -132, -118, 233, 83, -115, 63, 9, 69, -26, 91, -4, 205, 86, 39, 290, 287, -21, 77, -123, -63, -8, -68, 65, -73, 121, 114, 101, 132, -134, 109, 195, -220, -46, -315, 77, -94, 280, -149, 118, 14, 195, -156, -149, 5, -54, 208, 155, -74, 174, 179, 15, 91, -10, 131, -220, 238, 112, -209, -131, 196, -97, -29, -33, -30, -224, 105, 164, -73, -47, -165, -14, -23, -101, -6, -130, 53, -246, -147, -259, -164, 136, -66, -129, -255, 141, 32, -38, 137, 59, 1, -108, 118, 131, 231, -56, 63, 89, -156, -76, -22, -58, 188, 53, -52, -151, -239, 115, 25, 81, -132, 108]
6734A08p8k47J70K1j81L42q9jm5j72KN2J02k47K52J97n8k30p0K55l76L69j87J41
6758C0p7J87j06K79m13k17M34j12j09L41k30j81J61Q2J68m56o0L38NNJ36l09L00
6781A96k07j12K71k45J10Q5O1j42%k6o2N1L15m07J85M5m3N7k87O2r2K51j02R4
6805E8J20j18j66J28J72j44J6r4J16k55o6M72r0M8j83n0o1J51R8j63J90J32k30
6828H1j94L68l73K48j6j87k05P9L01K3o8PJ76n5q1r1M8n8R7k25J10o4%P4J61k38
6854h2J98k01r2N9J85q3j92J39J67l06N1K28k30L32j88J2L6k12j00R3L60n4j4
6877A06q4m6K77l84n2K69k58Q7O3q7K40p5j8l20O5K34k68J57Q0j52J58m7J32O6
6901A43qN3q1r5J54k85j59k3L26K2K6P7j4k05j96J71j63K96jo6N0q2J08k68m5
$$ y = [108, 30, -217, -47, -26, -207, 135, 46, 45, 0, -172, -170, -118, -16, -263, -11, 186, 128, -102, -172, 83, -293, 76, -111, 30, -47, 140, 34, 313, -100, -317, 117, 5, -104, 237, 7, -174, -13, 69, 237, -219, -279, 59, 64, 69, 205, -104, 196, -11, -123, 148, -97, 13, 98, 159, 17, 17, -9, -71, -20, 295, -112, 73, 118, 75, 132, -155, -93, -185, 66, -36, 58, 178, 60, -106, 22, 194, 50, 66, -28, 88, -167, -233, 239, 149, 197, 14, -36, -97, 54, 152, -11, 179, 311, 81, -113, 255, -118, 130, 114, -73, -278, -199, 102, 125, 57, 64, 240, 185, 104, 13, 61, 3, 100, -125, -15, -79, -79, -5, 156, -82, 116, -85, -177, -118, 67, -16, -208, -69, 98, -208, -157, 71, -159, 173, -15, -3, 33, -179, -279, -186, 174, 120, 106, 22, -24, 253, -131, -183, 86, -172, -85, -22, -109, 131, 56, 38, -282, -217, 17, -251, -94, -14, -166, -8, -55, 77, 143, 135, 188, 107, 12, 166, -119, -278, -301, 25, 47, 73, 150, 136, -69, -265, -94, -257, 39, 38, -28, 22, -60, 48, -220, -265]
6926b65k57L75J46n9J1j50j7K07k59R8Q2R9J49m1j26N0l4j88J83l05K91R7q5L84
6950C86k43j6K53m46J49l46M97k84K85o3k57Q5k9N9k28L57k08k23M04j56O7j12
6972f9q0M23m42n8J66L9k19jK21j43K96L38k71k67L17j14j15p0k32J14N4J24J06
6995A17m56M49j46j40K11k78J78r8j99M05N1k19M3J75J05l40K9J83j7M0k03j37
7017b47J60M3O8J39j81Q0k0J77j7L7J80n28J97o8J62j04j74k97M66j12j84L03
7039H0j1J93k49q3j68L15J59m38J43o2J80m10Q1M36j22r4K86j79k02K91j99q6
7061a39M4L12k63Q0j5j68M12k60m8l21K81P8J38k1j11K52m75K66J7k59N2J68Q3
7084A03o1q5J08M1k29J63R9k87l0j02L35j00K39k99j98J26J84J43r0L9q0l2J7
$$ y = [-265, -522, -147, -1, -60, -49, -199, -216, -9, -268, -170, -88, 11, 160, 119, -7, 43, 9, -179, 4, -301, -10, 87, 2, 386, 143, 127, 380, -66, 83, -263, 234, -50, 235, 172, -85, 0, -29, 30, -198, 159, -49, -272, 132, -24, 43, -69, -149, 274, -168, -226, -60, -21, -240, -241, -20, -163, 133, 471, 200, -67, 250, 136, 21, -49, -281, -167, -113, 11, 117, -339, 110, -36, -176, 35, -243, -65, -163, -362, 43, 94, -125, -82, 93, 198, -142, -113, 70, 53, 93, -110, -247, -87, -44, 24, 163, -18, 62, 42, 219, 202, 239, 419, -109, 88, 20, 182, 78, -96, -393, 73, -39, -223, 80, 69, 262, 13, -70, -238, 77, 236, -202, -59, -121, 59, -351, -270, 166, 44, -50, 236, 57, -145, 146, -53, -139, -95, 217, -46, 34, 19, -149, 263, 3, -45, -366, -85, -7, 131, 110, -1, 251, -224, 42, 59, -200, -148, 20, 103, 42, -43, 65, 106, -123, 40, 139, -148, -178, -280, 55, -45, 194, -105, -303, -177, 7, 150, 60, 99, 19, -13, 4]
7107Dj27J82p9K05l08J9R6j62n3J16J9MN9L4J30J57m32J39j39j63L73o6k95L97
7131A10l2l16L50l72J87OO0J90j8j19j36j8L5L23j04o9Pj39l81L17K18m53O63
7154C09m49P3J45k57R0J8o5N9P4J20k18J19k66J5L71k68j14k4J57J31q0M22j70
7177A92m64J42N5J40q0%K27k11n3P2J2K53l44N0L39m72K48k58P6J12j71J63l84
7200c56O58m78L65m50K96M1j85K49j97K69l02P9J15j48n6L35j74k52L77j93K4
7221A7m5j03k06K09K31nL02m31j54J52J86k50k66L15K35qp2J4j40j22J1j16L15
7244F9J16J08m55NK78j61n3J67m4J03N9r9l3J44l34J44j50L14p0mk75K58j87j1
7268a11K79l6m73K03M11l37J52n8k52L70k48L81k69o0J87k02k04J34K7N6L6J50
$$ y = [4, -123, 59, -20, 185, -123, -104, -8, -170, -223, -107, -88, -84, -25, 9, 139, 296, -136, 3, -136, -299, 74, 8, -287, 110, 78, -238, 112, -260, -73, -67, -7, 183, 165, 46, -90, -108, -73, 250, 146, 77, 84, -55, -436, -119, 99, -354, 309, -140, -67, 78, -179, -89, -71, -136, -77, -3, 117, -101, 18, -248, -233, 138, -130, -244, -268, -111, 20, -60, 362, 192, -272, -130, -75, 65, -15, -15, 212, 1, -52, 20, 32, 285, -59, -9, 330, -142, 106, -152, -76, 36, -135, 28, -356, 302, -176, 189, -261, 35, 76, -109, 140, -57, 212, -90, -11, 104, -44, -100, 235, 61, -191, 186, -7, 17, -28, -131, -337, -128, 103, 98, 400, -31, -185, -33, 153, -97, -363, -48, 187, 179, 107, 121, -19, -141, -130, -246, 69, 185, 293, -162, -157, 121, -40, -93, 74, 30, 133, 192, 93, 60, 204, -130, 14, -136, 178, 108, 104, -171, 87, -100, -111, 168, 132, -341, -138, 273, -64, 88, 30, -222, 148, -100, 281, 12, -48, 139, -63, -267, -133, -106, -50, -14, 136]
7290A36l5k76Qk19L73k63L80n9J28j75J04j86N7MO7O9o9k03J2J87r3K57lm09J5
7315a93L07M4k04L7j19K0j10J99K90l82L29j72J61k37r9K62L5l18K94O8m9l48
7337a85P1J99Mj11k49M70q4J50m22M3%J34m8p2k8L30l15N4J07m18L15M6m06M09
7361fJ85lJ94l56O1k21M15m40J50J68j19l51O18l79K2j02J71o9k2m6J15k1J36
7384A00L5k39N3K90j75o4J02j7k06J62K47j26J14o32L67NRo3n3j42k0J56k11M53
7408A45l58M4J68M1j04k68M47Q4j77J39l68Q7p6M6L8j6j82M14j96K58l49J75K86
7431B78j46q2j15O3O5J36k15J03j88J27m2K28J34k29j00k64Q4o7L34q0K52j09
7453A67l16L66o1k10J95oj23K00j19j50J80K72m45J53M6Q7l52J03o0p0K17o4n9
$$ y = [136, 101, -175, -167, -386, -13, -276, 104, 45, 173, -2, 102, -84, -27, -23, 44, 113, 44, -159, -147, 40, -53, 204, 201, -208, -193, 114, 158, -46, -9, -128, -108, -218, -19, 271, -111, 218, 46, 207, -30, -129, 133, 168, -150, 144, 212, 163, -185, -114, 85, 89, -22, -271, 199, 115, 265, -157, -114, -114, 20, -28, -100, -128, 202, -113, -59, 48, -370, -55, -9, -415, -6, 179, 176, 370, 14, 75, -146, 269, -171, -21, 147, 28, -323, 295, -84, -62, -164, 7, -62, -84, -130, -15, -36, 100, 135, -104, -51, 239, 64, 0, 102, 85, -121, 41, 288, 162, 276, -356, 11, 16, 25, -38, -91, -233, -253, -97, -308, 145, -213, -169, -1, 40, -64, -332, 115, 199, 22, 161, -207, -120, -196, -150, -112, -128, -310, 104, -92, 166, -183, -8, 278, 132, 50, -65, -2, 63, 199, -16, 87, -101, 26, -16, 212, 346, 117, 17, -247, -163, -230, 104, 24, 276, 167, -149, 217, 156, -54, 141, 135, 12, 212, 93, -57, 123, 395, -50, 103, 149, 236, -116, -13, -73, -143, 74, 10, -49]
7476d9lo9J5K25m2K26k57J27k49Q1j09J26J02k60k2j2J53pN8K75j51L3N7oj13
7501A29R8Q7k41n5K27l26pJ30N1O4l6j95l9L04l25P7J36j22nP9K3J14k37J33j37
7526g3k4n9J09m9K26k25K05l3j63j49L36k19r5L5L0K51l60L95j07J40l39J92r2
7549f8N6K33k02o9K03j80j99M36Nj58q3K21n0R9j25J22k14K69l17p9K89j44k14
7572a69L81q2k74K00J03l75L31k18m5j4J34qJ27l38M96k28N8L3k59q4J13Q2M54
7595D18j69J84n33J5j34m7L38k06OK51j98J58l9j4k2P2K23l10m1J4K10j7j12m63
7619d16L99J43k61QM23k27k85K47p9k8n7L74m22N0L27l20K3k9N7L16j97p2j39
7642a65K64on64L72pj4k16K27M18j35k89J3J86J27j51K2K6nJ02m9J64k37J47m26
$$ y = [-49, -52, -121, -106, 119, 77, 303, 46, 173, -76, 5, -104, 22, 124, -136, -158, -170, -17, -24, 34, 309, 158, 191, 248, 242, 129, 227, 314, 73, 18, 245, -81, -88, 42, 93, 157, 121, -74, -113, 191, -134, -57, 79, -43, -48, 31, 54, 168, -69, 64, -73, -97, -156, -47, -96, 130, -95, 110, 77, -86, -235, 101, -118, -213, -178, -148, 103, -257, 138, 31, 171, -168, 24, -68, -12, 221, 19, -50, 153, -27, -226, 210, 215, 57, -26, 195, 145, 244, 119, 241, 27, 296, -21, -100, 189, 45, -169, 212, 130, -144, 56, 159, -216, 115, -103, -148, -162, -28, -36, 91, -247, 249, 21, 79, 112, -147, -231, -118, -36, 418, 249, 433, -100, -85, -219, -266, 72, -134, -128, 123, -75, 83, 44, 30, 8, 80, 303, -7, -48, -34, 176, 159, 47, -416, -17, 126, -135, -127, 296, 69, -216, 31, -48, -76, -133, 241, -181, -131, 196, -124, -101, -130, -73, 243, 46, -26, -165, 99, 93, -471, -99, -106, -120, -336, -109, 309, 174, -115, -102, 84, 211, 60, 82, 108, 103, 205, 156, 320, 83, 230, -196]
7666a96oM94l94kj4J29L36m84j57J98j00J50J59k20q4J72O1Oj99J76M8N8p0k35
7690a74J02J67N4m65N15j56K44m18L58m79J25J30q7J4K79m78O5Q2J06J80k50m9
7712a35k7J72J3O2j69K4K15m21J9l8M05j21K01j59k44K15k01J91K4Q3j65K67l92
7735a81jJ45N2J53K9l29M0K33j88K65j79o0O8n4k67L67k44j00J55j32J68k23L03
7758B0j47K38m34J10L17j43l3J50j97J72j92q9L66k21J9J8L61j41o6k42J25K34
7780B25k54J5o3J80p8K23k7k23k48Q3N9j69K00L6J85j53n6l2J85r9j22J92L5N2
7804A46m4k59L73m51K16J64P5j17Q7k03L16m8m19k29N5N27j77j58L02j4k93jJ08
7827d4j42J93j36L88l58k11J15O8J87o0J39k23L51j84J34j28k41J23k0K15J85
$$ y = [-196, -202, 292, -102, -104, -118, 11, 347, -137, -294, -96, -196, -46, 113, -107, -191, -19, 42, 48, -151, 25, 73, 131, 61, -174, -72, 95, 149, -316, 199, 43, 287, -131, 227, -252, -127, 3, -84, -70, 209, -269, -204, -122, -16, 164, -86, -135, -162, 10, 23, 85, -84, -60, 155, -266, -247, -285, 120, -1, 200, 41, -203, 12, -189, 2, 26, 109, -56, 211, -181, -182, -37, 15, 168, 197, -132, -92, 141, -47, 218, 39, -21, 47, -7, -274, 93, -151, -251, -96, -228, -60, -283, 20, -127, 111, -323, -213, 104, -39, -72, 78, -119, 53, -139, -228, 138, -83, -64, -46, 315, 174, 108, -134, -9, 225, -29, -14, -77, 103, 25, 248, 221, -2, -250, -167, -108, -277, -77, -41, 144, -9, -65, -97, 88, -11, -133, 59, 94, 146, 102, -157, 216, -235, -19, 145, 220, 103, 190, -13, 303, 255, -164, -393, -338, 189, 12, -146, 156, 142, -151, -152, -44, -186, 7, -129, 259, -99, -310, -195, -127, 60, 0, 139, -84, 267, 83, 217, 89, -152, -29, -49, 166, 351]
7848C51l10j41m0L96l48m1K46j52n8L78j52k80J84j21r7Q0j0K0M19k60N7J20k41
7871@j92J54J75q8p0J60l43J51K27r2k58L3J01Q7p0m0Q6m33M02K69k96J67p0k84
7895b24Q7p1J49O6J56K4k31J04r4K7J13n7P6l26Q8j09K23J16l0k42K26k00M06
7918B77k66k72Qn6M23Ol09L25k18J14P4P3O8j63j88k4L68k17q3K26k38K7j2M7
7942a0r4J29r8j35JJ77L20l19k41K67L13m94J42j5Q4k6L0j34j8l1K54k31L23p6
7966A18j01m6K5l04RJ26K20o9k05K70K53j71j29l06K61J16J03k97J82Q8j94J1
7988d0p3k4K29j2p1J49l25j10J14m2M59l62JJ3J65j58P6j41PK90o7k66J70q7k9
8013a34o9L23r7j34N3L21k74p1L39m87K85N5l48L42o8J30m39J32K98q3k1m5J37
$$ y = [351, 41, -100, -140, 256, -92, -133, 113, -39, -97, 281, 129, -151, 33, -88, -185, -105, -115, -95, 324, 64, 121, 241, 0, -192, -38, 137, 49, -21, 139, -204, -53, 174, 82, -176, -143, -42, 45, -25, -65, 21, -412, -10, 259, -37, 130, 60, -224, -137, -208, -59, 7, 163, 187, -44, 60, -34, -7, 106, 49, 125, -201, -113, -222, 1, 117, 87, -155, 71, -129, 277, 11, -261, -253, -309, 114, 120, -189, 136, -82, 32, 106, 179, 247, 84, -104, -128, 240, 23, -60, 166, -72, -45, -57, -10, -104, 25, -73, -208, -207, -30, 290, -29, -270, -3, 310, -184, -42, -57, 27, 1, 31, -103, -121, -152, 102, -129, 194, 118, 17, -29, -4, -308, -299, -173, 47, -22, -227, 43, 296, 125, -4, -310, -49, 67, 170, -127, 55, 143, -51, -40, -113, -137, 92, 80, 9, 158, -167, -277, -163, -205, 254, -108, -107, -94, 71, -87, -11, -152, -145, 145, 78, -188, -18, -105, -134, -203, 120, 23, -111, -58, 263, -11, -82, 257, -230, 55, 110, -238, 104, 36, 166, -273, -141, 157, 74, 53, 8, 145]
8036A45l14L0J67k1r1j49K60Jl60L83k31J47J98j74R9q1j08K32j02j5J36j52j57
8059a57J36J49r0j00l1J18n7j22L26ql52O2J51k1j24L91n01N3K22j65R8j28J37
8082a3K2j9j59Q5j36M52k68K17q2j84OL03k97N8J83j71k7J44J64k25J02k59O8
8105c6L6o9O1K84J2n73K93k76L26J77k74Q8J34l65J06j23n5K78J36j12Qj57P7
8128b4Q5j19m3P1K17j92o1J09N6j04n5J18j04P8J42l46K63j3j34rr5O2J12J38
8152A52l69J00K68J42k16k86K57J33j62L41n19L13q3J18j37j22r0K99j81P5J07
8173A40o5r8n3J24K1q9O2l74K93L39k63j55o5J64J26J2k14L9
$$ y = [145, -169, -139, 28, 7, -84, -233, 27, 28, -332, 51, -180, -33, 165, -9, 90, 9, -99, 133, 31, 16, 152, 0, -157, -21, 128, 38, -62, -93, 25, -32, -154, 172, 164, -188, -126, 25, 4, -120, 271, -230, -177, 45, -120, -22, -150, -13, 9, -10, -169, -84, -220, 232, -36, 181, 99, -85, -79, 224, -73, -15, 168, -3, -30, 114, 278, 53, 155, -104, -36, 0, -69, -8, 276, 288, -285, 8, -268, 58, 235, -39, 49, 183, -182, -76, -199, -254, 24, 160, 48, 56, -101, -24, 61, -58, -101, -30, 187, -5, -66, 43, 99, -5, -60, 58, -46, 32, 174, -172, 91, 78, -56, -65, -160, -98, 14, 152, -217, -117, 151, 293, 77, -209, 48, 181, 19, 360, -159, 154, 71, 189, 52, -70, -160, 139, -42, 33, 140, 75, -23, -76, 48, 69, -20, 42, -332, -39, 300, 37, -118, -183, -19, 107, 119, -95, -56]
8191e6
$$ Imaginary data points
##PAGE= N=2
##DATA TABLE= (X++(I..I)), XYDATA
0@%%%%QqQj6J7k5L2m0N6o5P8r5J14j38J62j93K26k63L07l53M06m67N33o07O86
29C63p77Q77r83J105j236J381j541J712j903K114k346K600k875L182l524L901
45B050m328M809n353N975o694P543q555R788j1332J3326j6024J9893k5946L6849
59B2001o2581K31073K11783l80054j09405J6368q1926j38651J65696K60469R4630
70B29403l9090j1981j33570k23228r2834J00292R5311J09770J78982Q1858j61827
81A33086j86812o4259o8939p9369J43258K82772Q4292j11771k6106l426k02505
92i9779k19580P4422K31991J12856N2538Q6606n5499k32484j41719L5533J3614
103a41501l892J71179K32374L764j76894j17281o5325j06754k0664J55521J70301
$$ y = [0, 0, 0, 0, 0, 8, 0, 8, -8, 9, -16, 16, -24, 32, -33, 45, -50, 64, -74, 88, -105, 121, -142, 165, -188, 218, -249, 284, -323, 363, -414, 463, -520, 585, -651, 730, -811, 901, -1002, 1112, -1234, 1366, -1509, 1673, -1851, 2050, -2278, 2531, -2822, 3153, -3541, 4002, -4553, 5235, -6097, 7229, -8795, 11098, -14848, 22001, -40580, 190493, 402276, 22222, -87183, -70815, -152741, -291392, -125696, 134773, 229403, 190313, 178332, 44762, -178466, -271300, -171008, -75697, 34073, 213055, 294913, 133086, -53726, -117985, -186924, -266293, -123035, 159737, 244029, 132258, 106152, 102726, -99779, -319359, -244937, -12946, 99910, 152448, 239054, 183555, -48929, -190648, -155115, -141501, -145393, 25786, 258160, 261924, 85030, -32251, -97576, -204330, -224994, -69473, 100828]
114A00828P0202L1819l0786j79155j87742n159Q5622L2794Q7222J91806O8355
125B65806j59052j59155m0945o9015p6381J28544K59231Q1388j03111n5904j8124
136E3282j37165j53953L3627J62226J24329P7927M1538p1941j57285j01925l0380
147a59720j5333O8068J90010J36485m7554j05642n6062r0200j25632J0316J60861
158c4403J24451L5651M1520j165j52421j85896k8366Q7135O8824P8636J22583
169A56549M6213r7176j26047p6409o4831j9853J08815J66600P3514k1371m0925
180A05079q1972j37977q1329N0530J06171R2733Q8448M3132p4342j36056q1216
191a06799l0460j6645O0164J58788J18893k1575q5470p1812r0098r0805J5154
$$ y = [100828, 171030, 202849, 172063, -7092, -194834, -199993, -114371, -81577, 5645, 197451, 265806, 106754, -52401, -93346, -162361, -238742, -110198, 149033, 230421, 127310, 71406, 53282, -83883, -237836, -204209, -41983, 82346, 160273, 201811, 129870, -27415, -129340, -159720, -175053, -106985, 83025, 219510, 171956, 66314, 10252, -79948, -205580, -195264, -34403, 90048, 125699, 167219, 166054, 13633, -172263, -200629, -113494, -44670, 33966, 156549, 202762, 105586, -20461, -96870, -161701, -181554, -72739, 93861, 167375, 146004, 105079, 23107, -114870, -196199, -145669, -39498, 53235, 141683, 184815, 110473, -25583, -106799, -137259, -153904, -93740, 65048, 183941, 162366, 76896, 5084, -85014, -175819, -160665]
202a60665J23036J11276N0170K4392k4188j13155j32490m5708L9338P4687J00451
213D7144R7302K0658p0274r8122q8017o6651O119J01850J20955N8614O489k7027
225A09040q9136j26406o2594M1540Q5605Q5408Q2973L8056o0026j17457q8422
236a01419l3841P180O3321J13596R0394Q872n6802q7105r4563o1344J8365Q5300
248d8046R7346P2636K4657m6365j03263r5491l9944J5499O3667J01063Q9132J5294
260A46185n9626q6752q2767n6976O298Q1444J06058O8109J1393m0611q4587r6528
272h8360n3152J9538P4063R1564P3348K1609m5113r1035q9249m8918J4598P1820
284d9287R4432P1043J6596m2225q5555r0337m8780J6472O9581Q9596P2075J9876
$$ y = [-160665, -37629, 73647, 123817, 148209, 124021, 10866, -121624, -167332, -127994, -53307, 47144, 144446, 165104, 94830, -3292, -91309, -157960, -151841, -49991, 70964, 129578, 136067, 109040, 19904, -106502, -169096, -127556, -41951, 43457, 126430, 164486, 104460, -12997, -101419, -135260, -128080, -64759, 48837, 139231, 148103, 91301, 4196, -90367, -151711, -133346, -48046, 49300, 121936, 146593, 100228, -3035, -98526, -138470, -122971, -59304, 41759, 130891, 146185, 86559, -193, -82960, -139936, -133638, -52194, 53864, 121973, 133366, 92755, 8168, -88360, -141512, -121974, -47911, 43653, 117001, 138610, 93497, 2462, -86787, -135705, -121107, -49287, 45145, 116188, 132784, 90559, 5004, -85333, -134113, -117641, -48060, 41536, 113611, 133487]
296A33487m4165q6946q6084m5573J3949O7035Q9635P1082J8856m3520q5704q5148
308h3096m2768J4153O2774Q7458P3776J8766m8045q3639p7477m4307P817O5500
320d9088R2028O7423J2423m0259p6982q3978m7284J6504O5851Q2238O6474K0307
332A25657m2481q3402p6641l9733Q236O0028Q9394O8596R143m2811o9500p7587
344g1101n1238J2833P1025Q0588N5408J8858l1816q0879q4372l6579J9112N4777
356d3384P6524O9469J7680m6587p5440o8213m2491N724O2896Q6074N6963J0107
368A09322l2469p0627q1621m1223K0713N8735O9074O2327K3733m1354q0996o8125
380g2511l1573O152N1782Q3312O4193O767m0131o3316p1170m6122J4080O4340
$$ y = [133487, 89322, 2376, -83708, -129281, -115332, -48297, 41338, 112420, 131276, 87756, 2052, -83096, -125864, -111711, -48937, 38521, 112297, 131063, 83018, -621, -78098, -122405, -114588, -49088, 42940, 110363, 122786, 82527, 5545, -78433, -125717, -109213, -43362, 38876, 105350, 125657, 83176, -226, -76867, -116600, -108364, -48336, 41058, 109654, 118797, 75986, 6486, -71101, -122339, -109506, -38481, 42107, 97515, 116373, 84557, 3678, -80694, -117273, -98161, -43384, 33140, 102609, 120289, 73702, -1738, -69951, -112442, -106718, -43822, 42252, 99215, 109322, 76853, 6226, -75395, -116618, -95905, -37170, 31904, 94231, 117964, 76610, -4386, -72511, -104084, -97932, -46150, 37162, 101355, 108122, 67991, 4675, -66495, -112617, -98537, -34197]
392c4197P1250N1416J9187l0749p6034p5113l0511J4590M8406P3356O5389J2132
404A09122m4931o5411o0673m1080M757O0231P8403M9471Q879k8336o4842p5185
416f9595l7189K0006N3043O3437N7518K0016l9482p2396o0614l0337N676M9279
428d0638P6462N5549O380l4902n8893o6933m0608J5484N8505O4163M7047J7187
440I8803k9770o9732o6828k7376J3385M5202O6468N8078J1103l8516o1203n8765
452e9151l6835Q505N6130O7919M5101R506k7023o0913o7015l3048J6641M9653
464c0530O0327N0987J5173l5236o3535n7559k9687Q602M7392O6781M9282Q426
476I0423l2345n6877o0269l2535J2831M8630N9399M7938J4653l0518o3218n9772
$$ y = [-34197, 37053, 88469, 107656, 76907, 873, -74240, -104751, -90161, -41755, 31601, 96990, 109122, 64191, -1220, -61893, -102973, -98216, -37985, 40418, 89889, 98768, 70432, 5590, -69595, -106784, -86778, -33735, 29702, 87220, 107236, 67754, -4642, -65256, -95593, -89917, -40638, 35824, 91373, 97753, 62851, 3958, -62975, -103583, -88099, -29594, 34569, 81616, 98803, 69033, -699, -67527, -94903, -81518, -36316, 30152, 88230, 99333, 60817, -386, -59151, -95986, -87481, -31351, 36568, 81669, 91175, 64152, 3239, -63776, -96824, -80183, -30530, 29797, 80784, 95957, 60721, -2814, -60373, -90060, -81458, -34066, 32715, 81997, 90423, 58078, 1201, -59068, -91603, -78772, -30142, 29257, 77195, 91848, 61330, -1888, -61660]
488f1660k6327J3171M4179N8475M8714J2994l0899n8916n8208k9884J2423M7336
500b8602N8433M4534J1462k7514n6629n8439l0872J1593M7787N8708M3490J0303
512H4254k8293n4627n6609k9900J1495M4324N7415M5690J2168l1477n7278n2701
524e5539k4510R317L9148N7140M7710J1266l0230n5636n4725k6062J3563M2603
536b5955M9708M2656J7743k5225o0344n7317k1739J5109L8268N1552M5035J1804
548H1295k9994n1509m9628k8981P436M4381N6317L8751Q498k4474n0772n3293
560e1973k5502J1437L7313N1330M7839J2682l5585n4802m0796k0432R89L3756
572c3744N8863M6109N747k9211m7558n0712k7321J4345M1946M4027L7010J8161
$$ y = [-61660, -87987, -74816, -30637, 27838, 76552, 89546, 58647, -269, -58477, -88361, -75938, -28602, 29831, 74365, 85827, 58313, 1684, -56755, -87627, -76034, -28247, 30461, 73951, 84254, 55961, 1334, -55275, -85175, -73680, -29356, 28059, 73749, 85917, 54440, -2838, -55539, -80049, -70732, -31584, 25556, 73266, 84532, 54302, -1334, -56059, -82121, -68558, -25955, 23753, 66409, 84152, 58927, -1417, -58734, -80473, -65364, -27096, 24456, 69491, 81295, 51301, -208, -49836, -78817, -71381, -27000, 29317, 68068, 76566, 52092, 1320, -51973, -77475, -66038, -28725, 22605, 70444, 83126, 47541, -7261, -48057, -68489, -67500, -33744, 25119, 71228, 76975, 47764, 206, -50506, -77827, -63482, -21536, 22491, 59501, 77662]
584G7662k2523n7007n1623j7926R903L2641N1648M4818O772k9834m2839m5306
596d3614l2421O452M7653N2518K9564O984j7086m6668n3103k2339J3128L1691
608b7241M5078M8174J4025l6321n2442l4805j8864j370L2350N6429M0068L292
620F8373k3219m1665m9232k7840J4497L8331M0071L7117J8310k4670n5764m3372
632d9063j3779N263K7464N1966M3068J594k7861l4516l9987l5765K879M7486N1639
645C0388K6034N579j5165m3119n0162k1252J3759K9783M1524M1853J1796k9314
657D1704m4246l6251k4611L46L7993N2266L0552K646j6480l8387n0450k4936J7705
670e2149L4738L2992L4347K0596k1236n3405m1927j3546N413K6894M8361L9931
$$ y = [77662, 55139, -1868, -53491, -71417, -61514, -28873, 22775, 67593, 74365, 44531, 1692, -43614, -76035, -69583, -21930, 30588, 60152, 67136, 50050, 3382, -49721, -72060, -58932, -27241, 17837, 66011, 80036, 43715, -8727, -43532, -62396, -63766, -31416, 25013, 65081, 68373, 45154, 3489, -45743, -73583, -59086, -20755, 19316, 56433, 74743, 50073, -5691, -49063, -62842, -57579, -30115, 21851, 64919, 66513, 38652, 4136, -35851, -71616, -68737, -21251, 30388, 56422, 62001, 46836, 3717, -46445, -67697, -53938, -24155, 17369, 59222, 71018, 41704, -2542, -38793, -63404, -63058, -25065, 27201, 57753, 60399, 43919, 5532, -44918, -69854, -52149, -17411, 15581, 49928, 70524, 49288, -4117, -46044, -59590, -54177, -27283, 21078, 61009]
682F1009K363k7105l4874l7611k8108N783L8351M2216K8760J2296j6480m6062
694E38m5782j6369J1102K6652M1381L9079Q287k8351l8326l2454k4934l43L6330
707b3190M8533K7325L333j3952l5347m8207k4829J5228L5639L3656K9588J4418
719F2195j9127m4739l8759j5736N458K6465M1498L5864P911k1230l8790m0908
731c9898k0595J1264L1830L3945K8724J5020j5528m5683m2367j2435J0729K2544
743b2450L5179L8355J2121k5134m1475l3448j7016L302K8063M1547L1475N371
755E5890j9706l4317l6072k1128M006K8661M0587L3534O230k2587l6736l2371
767c4009j8263L269K6454L9517L2237O837j9777l5917l5488j9003O426K7381L6534
$$ y = [61009, 63372, 36267, 1393, -36218, -64326, -58543, -20192, 22024, 50784, 63080, 46600, 538, -45244, -61613, -50511, -23859, 17522, 56601, 64888, 36537, -1789, -34243, -59177, -59520, -23190, 25343, 52668, 56001, 42049, 6702, -41505, -66334, -51106, -15467, 18189, 47777, 62195, 43068, -1671, -40430, -56166, -50708, -24243, 17255, 53119, 61030, 39800, 1010, -39898, -60493, -49229, -17399, 16546, 45270, 60290, 44762, -921, -43288, -55723, -44994, -22450, 12729, 51084, 63205, 38071, -3404, -36852, -53868, -50566, -22503, 19044, 50519, 55890, 36184, 1867, -34205, -55333, -51327, -22666, 17921, 51455, 57685, 35098, -1638, -34009, -52272, -49003, -22549, 16968, 49205, 56042, 36265, 348, -35140, -54143, -47717, -20336, 16198]
780A6198K9995R785j7882l7156l7706j7776R200K8019L2708K7592J1553j5354
792C9176l7477l8565j6420Q349K5226L4492L1591R332k1504l6012l0365j6330
804d8507J110K4497L9391L1772N111k0252l3347l1498j7517M345K3332L5129L2573
817D6139J0007k2406l7583k8949j2348N31K0609L9427L2695L125k0831k8575l0567
830b8726k2765L448L1469L5457K1688P147j1582l3087l6663j5954P428K3155L2804
843A3819L0938O458k1230l0290k6418k0138j531K8592M0136K2739J445j1924k7678
856D918l6651j8916J0859K4573K6218K7737J4667j8790l9173k7156r403n6J7412
869b3761L8165L1992N55j9725k3855k8977k3809M534L0794L0668J9414R964r678
$$ y = [16198, 46193, 55978, 38096, 940, -36766, -54542, -45342, -17323, 15385, 42977, 54530, 39176, 1699, -36866, -53286, -44937, -19711, 14781, 46372, 55704, 34200, -1812, -32177, -48507, -47397, -22900, 16491, 48263, 53374, 33122, -225, -31723, -49240, -44895, -21563, 13566, 46139, 56146, 33740, -3843, -32792, -45140, -44609, -24000, 15427, 48122, 51247, 30416, 1841, -28726, -51491, -48043, -16574, 18883, 40571, 47718, 36136, 3049, -33614, -49568, -42140, -18985, 13819, 44757, 51215, 29985, -305, -26723, -46861, -48392, -19800, 20336, 43075, 44520, 32596, 4918, -31733, -50649, -39790, -15217, 11001, 38738, 53405, 34615, -4558, -31714, -41117, -41173, -23761, 14404, 46396, 46951, 27226, 3371, -25606, -49415, -44881, -14087, 16581, 35995, 45959, 36281]
882C6281l4666l4934j1248P638J6486L0786L3217O002k3727k7093k1035k0926
894d3219m338K8981L9525J7791M32p156k4583l7709j9543J2417K4249K2853K5590
907C5290J4746j7543l6305k4645j0113k128J8192L8474K6974k133j4999j9686
919F124k9904k4795O952L0526K5493J6234J3839q133l6678l3216o210P425J1819
932b0524K8541L3722N751k3268k5206j9886j9976l238K7860L5089J5609K834n115
945C2193k5667l7180j5533J3796J9199K0214K7288J4066j9779l2810k0029j0586
957c4828n546J8241L8850K4271m072j3299j6568k9671k3811Q291K8619K1724J6443
970B8644J3957q924l5198k9287n076M310J0721K8941L1847L892k2001k1535j9546
$$ y = [36281, 1615, -33319, -44567, -36929, -20443, 10343, 43560, 49562, 25835, -1258, -22293, -43219, -47557, -18576, 20949, 38740, 39172, 32016, 7433, -30276, -49819, -37402, -13153, 9700, 35290, 50036, 32493, -3812, -28457, -38570, -40698, -22506, 15968, 42942, 40809, 25810, 6124, -23780, -48575, -41623, -11097, 14396, 30630, 44469, 36336, -342, -33558, -39768, -32343, -20524, 8017, 41739, 47490, 24222, -984, -20870, -40846, -44084, -16224, 18865, 34474, 37308, 32193, 6526, -30654, -46187, -32391, -13192, 7022, 34310, 48376, 28597, -4213, -24242, -34828, -40374, -22133, 16717, 40988, 36916, 23617, 7049, -22622, -46433, -38142, -9523, 12201, 28644, 42601, 33677, -1521, -30808, -35884, -31574, -20853, 8088, 39935, 43827, 21826, 291, -19255]
983a9255k0715j467K7915L0903J2707M600k547k6019l5886j2848J2835J6291J9482
996E996K7287J2341k0236k9808j7453j0774o206J8494L6138K1192l306j0204j5611
1009G850k9740k1528Q281K5272K0143J7413J3911j0692l3421k5106m661J771J0155
1022b0352K8646K9050K027j8556j8241k0034k1750L66K7194K7203J2170N867l352
1035C0238k5298l2705j0387J0150J3933J9699K6440J0136j8284k6401j7228j2944
1047c2651m458J9863L2929J7485j625q228j6832k8266j8186Q883K1040J8352J8375
1060B6681J3171j1623l0108k2913o467M84J2451K8512K4592L00j5413j6613k0208
1073a7154j9846J724K4093K4050J3335P442n270k5648k8629r050P313J3376K1166
$$ y = [-19255, -39970, -41437, -13522, 17381, 30088, 34688, 32141, 6122, -29764, -42612, -29777, -13486, 5996, 33283, 45624, 25388, -4420, -21873, -32647, -38853, -20359, 15779, 36971, 33665, 23461, 7850, -21890, -43418, -35137, -9865, 10278, 27691, 41602, 30910, -2511, -27617, -32278, -30507, -20352, 8294, 37344, 39371, 20815, 2574, -17460, -39210, -38844, -11650, 15553, 27723, 33590, 30238, 4940, -27765, -38152, -28002, -14069, 5630, 32070, 42206, 23922, -2479, -19707, -32651, -37109, -17246, 15683, 33168, 31543, 23315, 6483, -21783, -39969, -31086, -10046, 8306, 26681, 39852, 28229, -1879, -24792, -31259, -30775, -18324, 10188, 34780, 35080, 19667, 3054, -17154, -37000, -35276, -11183, 12867, 26202, 33644, 28374, 2726, -25903, -34953, -27640, -14264, 6902]
1086F902K4093O511j6371k1664j7108j4338k779J9631K9033J6177R01o763j8637
1099E588k7936j5226Q820J9219J7300J7951J0635j0879k6433k0743q434L55J3071
1112a6712K6430K2059J560j2769j7627k1383j6531L726K1025K1119J4272P366
1124C2535o897k3536k4610r759N007J2993K1767K1975N772j4589k0946j7588j2847
1137c0723r3J7968K4494J5550K978p700j8302k4376j3236N243J7119J9669J7673
1150B6264O861j0813k2098j9359j0884J037J5444K3932J7075K562r141j7333k1929
1163a8382j4887M394J8761K0097J4517O417p941k1357k2089r748L528J4150K0915
1176H375J8130M989j0708j9411j9532j2594K247J7036K1483J5068M528q155j9623
$$ y = [6902, 30995, 37506, 21135, -529, -17637, -31975, -34754, -15123, 13910, 30087, 30988, 24225, 5588, -22348, -37574, -28754, -9535, 7765, 25716, 36351, 25472, -961, -21704, -30138, -29783, -16712, 9718, 31777, 33337, 20568, 2941, -18442, -34973, -31247, -10222, 10897, 25169, 32535, 25638, 2102, -22508, -32267, -27260, -14267, 7500, 29475, 35247, 20658, -288, -17876, -30723, -30816, -12848, 11646, 27196, 30174, 22474, 4172, -20204, -33440, -28197, -11078, 8591, 26264, 33125, 22312, 214, -19145, -30029, -28992, -13548, 10384, 27459, 30021, 20880, 3547, -18382, -33269, -28875, -10114, 9983, 24500, 30917, 22976, 1619, -20470, -30218, -26690, -12540, 8375, 26505, 31494, 20786, 1375, -18157, -30751, -28504, -11468, 10015, 25083, 29611, 21456, 1833]
1189A833k1110j0604M147J4598J8866J7321O244r940k0747j9344j0260K384J5005
1202a1607K0762J5935L874q890j7714k0363j2128L580J6524J9120J4719N001p744
1215B1069j9011k0454j1282L605J5537J9740J4983M145q507j7711j9288j1707
1227b8881K850J5276J9605J4899M696q414j8908j9490r876M490J3647J7193J5648
1240B2735O768q583k0277j9544q769M243J3381J6940J5817N704q274j9251j9250
1253a8360r578L914J4126J7947J4550M729q023j7865j8422j0376K966J4132J8834
1266H574J4407M287r279j7133j7120r713J738J3105J8788J5467M892r823j8063
1279A27j7151q690K997J2255J7278J4840N983q194j9054j8430q257M403J2531
$$ y = [1833, -19277, -29881, -25734, -11136, 7730, 25051, 31295, 21355, 608, -18736, -28996, -26612, -11607, 9155, 25090, 28964, 20074, 2360, -18003, -30131, -26551, -10027, 9093, 23812, 28813, 21069, 2058, -18396, -29678, -26073, -10536, 9204, 24187, 28332, 19825, 2114, -17174, -28881, -26031, -10755, 8850, 23749, 28445, 20031, 1123, -18367, -28243, -23753, -10106, 7087, 22735, 29503, 20920, 643, -18901, -27670, -23427, -10046, 6894, 22711, 28415, 20141, 890, -18360, -27938, -24024, -9898, 8049, 22599, 27328, 19305, 1440, -16982, -27358, -24392, -10260, 8574, 22981, 27268, 17989, 856, -16264, -25977, -24239, -11134, 7654, 23121, 28013, 18190, 127, -17024, -25714, -22717, -10462, 6816, 21656, 27639, 19445, 391, -18039, -26296, -21893, -9362]
1292i362J5662J4233O522p503j8359j9208q333M525J2810J6127J3739N180q060
1305A7973j6589j7934q564K571J2380J7623J4525M343r393j7057j5442q217J238
1318b2543J1503J8183J5788L674r845j7748j4954o940J630J0379J7061J5681M843
1331B6712r750j7359j5865p451K582J1511J6166J3729M360p189j6201j7013r160
1344b4928L110J3282J6114J2807L725p510j5251j6166r047J868J2138J7491J3475
1357B1108K500q133j4720j4636q866R55J2191J6373J4131M110q885j6697j4764
1370a5333o416K101R429J5628J5238M587r458j6220j3883p729J290J1308J6422
1383F964J2798L492p152j4864j5648q820L006J1780J5259J2661L450q039j4203
$$ y = [-9362, 6300, 20533, 27055, 19552, 1193, -18015, -26348, -21823, -9013, 7114, 20853, 26033, 17973, 1384, -16550, -25114, -22543, -10163, 7460, 21985, 26328, 16935, -122, -15564, -23781, -22543, -11040, 7143, 22931, 26605, 16760, -988, -15942, -22882, -21252, -10873, 6188, 21869, 26712, 16962, -397, -16262, -23713, -21131, -9620, 6546, 20275, 24635, 17446, 1245, -15768, -24928, -21818, -8536, 7578, 20385, 24110, 16600, 1349, -14817, -23864, -21996, -9858, 7633, 21108, 23608, 15475, 755, -13881, -22747, -21792, -9601, 6772, 20903, 25013, 16128, -569, -15333, -21749, -19648, -10219, 5409, 20647, 25234, 15776, -444, -14327, -22056, -20766, -9458, 6964, 19762, 23254, 16102, 1238, -14410, -23230, -20224, -8444, 6815, 19476, 22926, 14887, 684]
1396F84j3636q652j53J1625J8429J2492P93p838j1686j4638j0161J802J2640J5443
1410G144J1427L888o618j5661j4662o581K225R114J5166J3953L495q579j4095
1423B16j2992q742J481J2161J5081J0141L490m616j4433j6401p602M014J0542
1436g660J2675J3154M618q398j4774j2238o682l03R827J7156J2277M25o800j1438
$$ y = [684, -12952, -21604, -21757, -10132, 8297, 20789, 21582, 13744, 2058, -12580, -22741, -20939, -8299, 7144, 18571, 22459, 15841, 180, -14482, -21063, -18838, -9724, 5442, 19395, 22890, 14311, 216, -12776, -21518, -20037, -7876, 7205, 17346, 20836, 16220, 1787, -14614, -22216, -18202, -7660, 5015, 18169, 22787, 14389, -385, -12623, -19305, -19608, -9781, 7375, 19652, 20077, 13277, 1839]
$$ [...]
8191d3
##END NTUPLES=NMR FID
##END=
