##TITLE=1H_LR-673-R2-HCR5
 CDcl3, 8 sc, 
 23.12.2019
##JCAMPDX= 6.0         $$ Bruker NMR JCAMP-DX V2.0
##DATA TYPE= NMR FID
##DATA CLASS= NTUPLES
##ORIGIN= UXNMR, Bruker Analytische Messtechnik GmbH
##OWNER= root
$$ XWIN-NMR		Version 3.5
$$ Mon Dec 23 14:39:18 2019 Russian Standard Time (UT+4h)  she@DPX200
##.OBSERVE FREQUENCY= 200.1315
##.OBSERVE NUCLEUS= ^1H
##.DELAY= (6, 6)
##.ACQUISITION MODE= SIMULTANEOUS
##.ACQUISITION SCHEME= undefined
##.AVERAGES= 8
##.DIGITISER RES= 18
##SPECTROMETER/DATA SYSTEM= spect
##.PULSE SEQUENCE= zg30
##.SOLVENT NAME= D2O
##.SHIFT REFERENCE= (INTERNAL, D2O, 0, 15.7039)
##AUDIT TRAIL= $$ (NUMBER, WHEN, WHO, WHERE, WHAT)
$$ ##TITLE= Audit trail, XWIN-NMR		Version 3.5
$$ ##JCAMPDX= 5.01
$$ ##ORIGIN= Bruker BioSpin GmbH
$$ ##OWNER= she
$$ F:/spectra/data/she/nmr/H-F/1/audita.txt
$$ ##AUDIT TRAIL=  $$ (NUMBER, WHEN, WHO, WHERE, WHAT)
(   1,<2019-12-23 14:38:09.84 +0400>,<she>,<DPX200>,
      <created by zg, POWCHK disabled, PULCHK disabled
       configuration hash MD5:
       00 E9 B6 7A A2 85 ED C7 34 08 36 98 17 FE 4E 26
       data hash MD5: 16K
       01 A2 2C 8F CC DC 46 AC AF FF 18 86 ED 72 12 52>)
$$ ##END=
$$ 
$$ hash MD5
$$ 9B CF B3 71 A9 EB 99 97 B7 6C 82 CB 03 36 A1 E3
##$RELAX= 
##$RELAX= 
##$RELAX= 
##$RELAX= 
##$RELAX= 
##$RELAX= 
$$ Bruker specific parameters
$$ --------------------------
##$DU= <F:/spectra>
##$EXPNO= 1
##$NAME= <H-F>
##$PROCNO= 1
##$TYPE= <nmr>
##$USER= <she>
##$AMP= (0..31)
100 100 100 100 100 100 100 100 100 100 100 100 100 100 100 100 100 100 
100 100 100 100 100 100 100 100 100 100 100 100 100 100 
##$AQSEQ= 0
##$AQ_mod= 1
##$AUNM= <au_zg>
##$AUTOPOS= <>
##$BF1= 200.13
##$BF2= 200.13
##$BF3= 200.13
##$BF4= 200.13
##$BF5= 200.13
##$BF6= 200.13
##$BF7= 200.13
##$BF8= 200.13
##$BYTORDA= 1
##$CFDGTYP= 0
##$CFRGTYP= 5
##$CHEMSTR= <none>
##$CNST= (0..31)
1 1 145 1 1 1 1 1 1 1 1 1 1 1 1 1 1 1 1 1 1 1 1 1 1 1 1 1 1 1 1 1 
##$CPDPRG= <>
##$CPDPRG1= <>
##$CPDPRG2= <>
##$CPDPRG3= <>
##$CPDPRG4= <mlev>
##$CPDPRG5= <mlev>
##$CPDPRG6= <mlev>
##$CPDPRG7= <mlev>
##$CPDPRG8= <mlev>
##$CPDPRGB= <>
##$CPDPRGT= <>
##$D= (0..31)
0 1.2 0 0 0 0 0 0 0 0.06 0 0.03 0 0 0 0 0.0002 0 0 0 0 0 0 0 0 0 0 0 0 
0 0 0 
##$DATE= 1577097489
##$DBL= (0..7)
120 120 120 120 120 120 120 120 
##$DBP= (0..7)
150 150 150 150 150 150 150 150 
##$DBP07= 0
##$DBPNAM0= <>
##$DBPNAM1= <>
##$DBPNAM2= <>
##$DBPNAM3= <>
##$DBPNAM4= <>
##$DBPNAM5= <>
##$DBPNAM6= <>
##$DBPNAM7= <>
##$DBPOAL= (0..7)
0.5 0.5 0.5 0.5 0.5 0.5 0.5 0.5 
##$DBPOFFS= (0..7)
0 0 0 0 0 0 0 0 
##$DE= 6
##$DECBNUC= <off>
##$DECIM= 24
##$DECNUC= <off>
##$DECSTAT= 4
##$DIGMOD= 1
##$DIGTYP= 9
##$DL= (0..7)
0 120 120 120 120 120 120 120 
##$DP= (0..7)
150 150 150 150 150 150 150 150 
##$DP07= 0
##$DPNAME0= <>
##$DPNAME1= <>
##$DPNAME2= <>
##$DPNAME3= <>
##$DPNAME4= <>
##$DPNAME5= <>
##$DPNAME6= <>
##$DPNAME7= <>
##$DPOAL= (0..7)
0.5 0.5 0.5 0.5 0.5 0.5 0.5 0.5 
##$DPOFFS= (0..7)
0 0 0 0 0 0 0 0 
##$DQDMODE= 0
##$DR= 18
##$DS= 0
##$DSLIST= <SSSSSSSSSSSSSSS>
$$ [...]
##$SUBNAM2= <"">
##$SUBNAM3= <"">
##$SUBNAM4= <"">
##$SUBNAM5= <"">
##$SUBNAM6= <"">
##$SUBNAM7= <"">
##$SUBNAM8= <"">
##$SUBNAM9= <"">
##$SW= 24.9337058887773
##$SWIBOX= (0..15)
0 0 2 0 0 0 0 0 0 0 0 0 0 0 0 0 
##$SW_h= 4990.01996007984
##$TD= 16384
##$TD0= 1
##$TE= 0
##$TE2= 300
##$TE3= 300
##$TEG= 300
##$TL= (0..7)
0 120 120 120 120 120 120 120 
##$TP= (0..7)
150 150 150 150 150 150 150 150 
##$TP07= 0
##$TPNAME0= <>
##$TPNAME1= <>
##$TPNAME2= <>
##$TPNAME3= <>
##$TPNAME4= <>
##$TPNAME5= <>
##$TPNAME6= <>
##$TPNAME7= <>
##$TPOAL= (0..7)
0.5 0.5 0.5 0.5 0.5 0.5 0.5 0.5 
##$TPOFFS= (0..7)
0 0 0 0 0 0 0 0 
##$TUNHIN= 0
##$TUNHOUT= 0
##$TUNXOUT= 0
##$USERA1= <user>
##$USERA2= <user>
##$USERA3= <user>
##$USERA4= <user>
##$USERA5= <user>
##$V9= 5
##$VALIST= <valist>
##$VCLIST= <CCCCCCCCCCCCCCC>
##$VD= 0
##$VDLIST= <DDDDDDDDDDDDDDD>
##$VPLIST= <PPPPPPPPPPPPPPP>
##$VTLIST= <TTTTTTTTTTTTTTT>
##$WBST= 1024
##$WBSW= 4
##$XGAIN= (0..3)
0 0 0 0 
##$XL= 0
##$YL= 0
##$YMAX_a= 402982
##$YMIN_a= -324394
##$ZGOPTNS= <>
##$ZL1= 120
##$ZL2= 120
##$ZL3= 120
##$ZL4= 120
##$ABSF1= 10
##$ABSF2= 0
##$ABSG= 5
##$ABSL= 3
##$ALPHA= 0
##$AQORDER= 0
##$ASSFAC= 0
##$ASSFACI= 0
##$ASSFACX= 0
##$ASSWID= 0
##$AUNMP= <proc_1d>
##$AZFE= 0.1
##$AZFW= 0.1
##$BCFW= 1
##$BC_mod= 2
##$BYTORDP= 1
##$COROFFS= 0
##$CY= 11.3945322036743
##$DATMOD= 1
##$DC= 2
##$DFILT= <>
##$DTYPP= 0
##$F1P= 16.9975609425685
##$F2P= -3.02152046262296
##$FCOR= 0.5
##$FTSIZE= 0
##$FT_mod= 4
##$GAMMA= 1
##$GB= 0.15
##$INTBC= 1
##$INTSCL= 1
##$ISEN= 128
##$LB= 0.24
##$LEV0= 0
##$LPBIN= 0
##$MAXI= 10000
##$MC2= 0
##$MEAN= 0
##$ME_mod= 0
##$MI= 1.114404
##$NCOEF= 0
##$NC_proc= 0
##$NLEV= 6
##$NOISF1= 3.799351
##$NOISF2= 2.8
##$NSP= 1
##$NTH_PI= 0
##$NZP= 0
##$OFFSET= 15.70392
##$PC= 1
##$PHC0= -10149.05
##$PHC1= 11.0008
##$PH_mod= 1
##$PKNL= yes
##$PPARMOD= 0
##$PSCAL= 0
##$PSIGN= 0
##$REVERSE= no
##$SF= 200.130013532006
##$SI= 16384
##$SIGF1= 3
##$SIGF2= 2
##$SINO= 400
##$SIOLD= 16384
##$SREGLST= <1H.CDCl3>
##$SSB= 0
##$STSI= 0
##$STSR= 0
##$SW_p= 3612.71676300578
##$SYMM= 0
##$S_DEV= 0
##$TDeff= 0
##$TDoff= 0
##$TI= <>
##$TILT= no
##$TM1= 0
##$TM2= 0
##$TOPLEV= 0
##$USERP1= <user>
##$USERP2= <user>
##$USERP3= <user>
##$USERP4= <user>
##$USERP5= <user>
##$WDW= 1
##$XDIM= 8192
##$YMAX_p= 0
##$YMIN_p= 0
$$ End of Bruker specific parameters
$$ ---------------------------------
##NTUPLES= NMR FID
##VAR_NAME=  TIME,          FID/REAL,        FID/IMAG
##SYMBOL=    X,             R,               I
##VAR_TYPE=  INDEPENDENT,   DEPENDENT,       DEPENDENT
##VAR_FORM=  AFFN,          ASDF,            ASDF
##VAR_DIM=   8192,          8192,            8192
##UNITS=     SECONDS,       ARBITRARY UNITS, ARBITRARY UNITS
##FACTOR=    0.0002004,     1,               1
##FIRST=     0,             0,               0
##LAST=      1.6414764,     0,               0
##MIN=       0,             -324394,         0
##MAX=       1.6414764,     402982,          0
$$ Real data points
##PAGE= N=1
##DATA TABLE= (X++(R..R)), XYDATA
0@%%%%%%%Qj6J6j6J7k5L2m0N5o3P3q9J05j25J46j71J98k25K60k99L42l88M36m95
31b64N59o25P00p83Q76r78J087j207J338j484J643j816K013k230K470k741L046
48A604l396L797m263M816n479O298p338Q704j0598J3415j8105K7790q2410J95388
62A30223J82793j46189l4705k0362j81458k33966L0312J77687J39393J13188J23643
73B80559m6884k09432j73118o0507l4462P2389K27609J89771j2313q0292p2088
84H1232j72183k08108K6109K25191J33419K1952R9303O6123j87276k81776p3761
95b69775Q5918P5932J23606J98840O4073j42778j42769o3111j10237r6679J20810
106a56170K55577J24431k6685m1192q9264j86519j30877M2640J19049J19009J48138
$$ plain form
0 0 0 0 0 0 0 0 0 8 -8 8 -8 9 -16 16 -24 31 -32 41 -48 57 -68 78 -93 105 -120 140 -159 183 -205 231 -264
31 -264 295 -330 370 -413 463 -515 572 -635 703 -781 862 -954 1059 -1171 1299 -1442 1604
48 1604 -1792 2005 -2258 2558 -2921 3377 -3961 4743 -5855 7560 -10545 17245 -65165 130223
62 130223 313016 166827 132122 111760 -69698 -303664 -273352 -95665 43728 156916 280559
73 280559 233675 24243 -148875 -209382 -243844 -171455 56154 245925 233612 153320 81232
84 81232 -90951 -299059 -272950 -47759 85660 107612 206915 273038 85762 -196014 -269775
95 -269775 -183857 -107925 15681 214521 278594 135816 -6953 -70064 -180301 -276980 -156170
106 -156170 99407 223838 197153 155961 66697 -119822 -250699 -208059 -89010 29999 178137
117A78137R0050j00746j90844r6361l8491n5452N4673K19888J66811k6058p8356
128A23251n6236j50468j85128K2064K11534J39418J7430M4285L2707j31767k11861
139a44771q5985N0736R1695J30244J41948L4801q8412j09711j06487j20262k4839
150b31043J48281J78812O1555J468k025r9544j89963r5550O5928R5414P9533J28115
162A40981J00899p6379j88920j14059k2989m925N4680J54081J33925J0114o3446
173A23962q6865j31815j16831J9182J34585J19347P1430N1020k5071j38389j48536
184a27981n2097K4208O7553J26103J29732K4058p9935r5156r3082j01522k2868
195b00987J19392J58474P4659O086k5163r5752j49271p9944M2552Q9611Q9565
$$ plain form
117 178137 268187 167441 -23403 -119764 -158255 -213707 -159034 60854 227665 201607 123251
128 123251 67015 -83453 -268581 -246517 -34983 104435 121865 166150 198857 67090 -144771
139 -144771 -230756 -180020 -88325 41919 183867 218668 130256 20545 -85942 -206204 -231043
150 -231043 -82762 96050 157605 159073 157048 57504 -132459 -228009 -162081 -66667 12866 140981
162 140981 241880 165501 -23419 -137478 -160467 -165392 -110712 43369 177294 187408 123962
173 123962 37097 -94718 -211549 -192367 -57782 61565 132995 184015 158944 20555 -127981
184 -127981 -180078 -155870 -88317 37786 167518 191576 111641 16485 -76597 -178119 -200987
195 -200987 -81595 76879 151538 157624 132461 36709 -112562 -192506 -149954 -60343 29222
206B9222J01556O4074n3788j37235j14017n1515L261P5082J31145J02547J7901
217A68233m7558r4502j24421q3354K4849R9538R8069Q1636N1880l4499j27548
228A2323j25592m7487J7618O3570J14314J14018K7712o8683r9803r1591p1299
239a54900n920Q6481J25417Q6816K2129m0075r9046j17241o5077J7989P7006J04634
251C8213R5962L4158n5071j04645r6779o1183r97P6250J20472Q9500J7638m5155
263A08363q8241j08914p1780J4087Q6000J03311P9620L1615l8948j01018j07817
274i3722n6960J2359P2650J04071Q8869K7651m6790r5769j00684o0356J0739P6067
286f1875J02322Q2672K7343m2190r5914j01260n6622J1049P1718J01063Q4552
$$ plain form
206 29222 130778 194852 141064 3829 -110188 -161703 -158442 -83360 47785 150332 168233
217 168233 120675 26173 -98248 -181602 -156753 -57215 40854 122490 174370 139871 12323
228 12323 -113269 -160756 -143138 -79568 34746 148764 176476 107793 7990 -83601 -154900
239 -154900 -160820 -74339 51078 137894 160023 119948 20902 -96339 -161416 -143427 -66421 38213
251 38213 134175 168333 113262 8617 -88162 -149345 -150342 -74092 46380 135880 153518 108363
263 108363 20122 -88792 -160572 -146485 -60485 42826 122446 154061 115113 14095 -93722
274 -93722 -150682 -138323 -65673 38398 127267 154918 108128 12359 -88325 -148681 -137942 -61875
286 -61875 40447 123119 150462 108272 12358 -88902 -145524 -134475 -62757 38306 122858
297A22858K6115m5461r3235r6304n6610R755P0685J00774Q2736K5372m5352r2590
309H743r3117n4038P327O8161J02822Q2644K0387m6283q5485r1600n9363Q620
321a31182P4040R8506P3973K2880l8632q9219r6005n1428J2918O6800R3410Q0928
333A16989K2683m6498q6049q5896n4518N564P2293R8863P0804J6612l5892q1688
345A3267r5477n4519J8618O9836Q4394P2960K8745m1897r2001q6219m2464Q126
357a16631O0785R5173P6761J4244m5021p6305q4098n5393J1206P2230Q8061O4932
369A05944K1718l5664q6902q8629m0418J5043N6829Q6165P7809J8872m9752q0611
381D04p3139m7598L773O7092R3443O3678J1776l5257p5171q7170m7612J9158O4224
$$ plain form
297 122858 148973 103512 10277 -86027 -142637 -132882 -62197 38577 121313 146685 101333 8743
309 8743 -84374 -138412 -131085 -62924 39898 122542 142929 96646 11161 -80439 -139802 -131182
321 -131182 -57142 41364 115337 138217 99585 10366 -85639 -137067 -124149 -57349 36061 116989
333 116989 139672 93174 7125 -78771 -133289 -127725 -55432 43431 114235 130847 94955 13267
345 13267 -82210 -136729 -118111 -48275 36119 109079 137824 95927 3926 -82293 -124757 -116631
357 -116631 -55846 39327 116088 130332 85311 9006 -75092 -130485 -119279 -47049 41012 105944
369 105944 127662 91998 5096 -83533 -123951 -108908 -52079 34086 111895 130767 81015 404
381 404 -72735 -120333 -116560 -49468 43975 107653 119429 84172 9001 -78169 -125781 -106623 -42399
394d2399P7232O7637K3762m2851q4500p5501l8372P113N8703R0065O7135Q540
406A16564m1911o8469p7148n0624J3533O9144P9559N7310J8642l4335q0666q0222
418g8623l5381J5447N4247P8983O8942J4479m5956p3056o8087m3094O784O3548
430d1767Q3822N6392J0699l3893p1397p8806l9927J8958N8579P1067O0634K0222
442A14583m1035p7390o8494l3872Q662N4826Q1003O0913Q689l9597o6310p0949
454f8971m1681J5042O1724P2283N2691J5734l3879p3845p1848l2751J5158N3064
466c7279P2788N9744J1709m1278o8578o3913l5876R669N6504P5506N3944R198
478A02138l6305o7060o7293l4209J4591N3622O9973N5801J2968m0227o9392o2788
$$ plain form
394 -42399 34833 102470 126232 83381 -1119 -76620 -114992 -107879 -49176 40889 108024 116564
406 116564 74653 6184 -70964 -121588 -108055 -38911 40648 97958 116600 82265 1599 -78623
418 -78623 -114004 -98557 -44310 34673 103615 118094 72138 -918 -69005 -112099 -105315 -41767
430 -41767 42055 98447 109146 75253 3856 -74950 -114877 -95919 -37340 33727 94361 114583
442 114583 73548 -3842 -72336 -106208 -97546 -42720 38283 99196 107885 68288 1978 -68971
454 -68971 -110652 -95610 -33886 38397 91088 106822 72943 -902 -72750 -105501 -90343 -37279
466 -37279 35509 95253 106962 65684 -2894 -66807 -102683 -93014 -36510 38996 92940 102138
478 102138 65833 -1227 -68520 -102729 -88138 -34516 35457 91258 104226 63999 -5393 -68181
490f8181k9514J1839N0731P0254N5544J0559l8006o6984o3158l1769J3226N3812
502c1647O8332N0865R731l5174o4145o3537l3375J3998N4852O7742M8642Q521
514I4805l4789o2861o1530l1160J2958N1010O7819N2242P205l9859o1694n5542
526f1396k9567Q638N0165O9462M9790O835l7377o1884n9041k6942J4994M7430
538b8893O0800N0785J2667l7629o6480n5861k3959J2366M6374O5312M8065M370
550H7917l5284n5489n6568l3840J3496N5162O3356M0889N961l1631n8720n6489
562f1240k5783J1686M5739O4630N0508K037m2058n3270m5540l0378L759N0838
574b9072O8559M2138O56l1769n4804n7104k5984J8611M6248N2735M4489J3201
$$ plain form
490 -68181 -97695 -85856 -35125 35129 90673 101232 63226 -3758 -66916 -98685 -85459 -31647
502 -31647 36685 87550 97281 62107 -2038 -65575 -98950 -84952 -30100 37642 86284 94805
514 94805 60016 -2845 -64375 -95535 -82577 -31567 36252 88494 95699 55840 -5854 -61396
526 -61396 -90963 -82325 -32160 37302 87092 93927 56550 -5334 -64375 -91317 -76323 -28893
538 -28893 31907 82692 95359 57730 -8750 -64611 -88570 -76204 -29830 35482 83547 87917
550 87917 52633 -2856 -59424 -93264 -79768 -24606 38750 79639 85600 53969 -4751 -61240
562 -61240 -87023 -75337 -29598 35032 85540 87577 45519 -7751 -53291 -83669 -79910 -29072
574 -29072 39487 81625 82281 50512 -4292 -61396 -87380 -68769 -22521 30214 74703 87904
586H7904l4850o2111n1156k2301J0642M5655O3421M1643q03l1283m7105n5321
598e5665l4216J7419N5978N3216L2803R075k5739n8137n5903j9944J4340M0368
610b6405N8580M8661J304m2440n0157l9520k7291M422M7748O3020L6148J337k7107
623D8300n2289n6227k2411K1404M2546M7750M2330J0852l6432n7759m3158j8481
635g3575P139M1429O1607L8446l797k9171m2622n1908l3517J8695N5202M9465
647C7393K7175P041k3550n4293n1653j7125J5041L7185N2899M3501K900l7089
659C9425m8700m1527k4750J0711M7739N3212K9751L069k3062n1145n2867j7720
671g5864K1095L7319M3003M1958J2189l7423n7601l9105j3167Q131L7394N6106
$$ plain form
586 87904 53054 -9057 -60213 -82514 -71872 -26217 37204 78847 78044 46761 -344 -55665
598 -55665 -89881 -72462 -16484 36732 69535 78610 52871 -5266 -61169 -81113 -66773 -26405
610 -26405 32175 80836 82140 39700 -10457 -49977 -77268 -72846 -25098 37922 74070 75407 48300
623 48300 -3989 -60216 -82627 -61223 -18677 29073 71403 82255 45823 -11936 -55094 -73575
635 -73575 -66436 -25007 36600 75046 71249 42078 -544 -52452 -85969 -67274 -12072 37393
647 37393 64568 71609 48059 -6234 -57887 -75012 -59971 -22786 30113 73614 76514 39425
659 39425 -9275 -50802 -75552 -64841 -17102 36110 65861 68930 45868 -5277 -58144 -75864
671 -75864 -54769 -17450 25553 67511 79700 42277 -15324 -54429 -67596 -59465 -22071 34035
683C4035L6931l604l0527m1511m4930k5607J4701M5120M7687L2587O635l0032
695D1485n3256m2906j2418J1769L4465N1572L9324j653l4438m1628l8309k5593
707g1586Q965M7216N2351K6689m75k3244m5920m7929j7770J9551L8183M2070L4589
720F2690O728l1782m9351l8491j5570R659L7675N1081L3829j579l0819m3692m0512
733e0134j7402J5343L8067M2572L2580O504l0104n0099l9100j1700J2842L3141
745a7490M7433L6152j231l4140m2225l3952j8427Q966L9491M9525K9596l814k8056
758C1828l9933l7932j9746J1625M0270M8841K8334m174l0076l8472l4933j8989
770f3357J0254L9337M7052K8108k503k7642m0587l7880j6565J4063L8730M2566
$$ plain form
683 34035 70966 67362 36835 -4676 -49606 -75213 -60512 -15392 32295 64882 71517 41485
695 41485 -11771 -54677 -67095 -55326 -20861 30711 70035 68382 33944 -7684 -45993 -71586
707 -71586 -62621 -15405 36946 63635 63160 39916 -6004 -53933 -71703 -52152 -13969 28101 62690
720 62690 69418 37636 -11715 -50206 -65776 -56117 -18442 32639 66468 64889 34070 -9622 -50134
733 -50134 -67536 -52193 -14126 28446 61026 67530 37426 -12673 -51773 -63473 -50631 -17490
745 -17490 29943 66095 64864 30724 -11501 -45453 -63880 -54914 -15423 34102 63698 59884 31828
758 31828 -8105 -46037 -65783 -54158 -13888 34953 63287 59113 29037 -9435 -44368 -63357
770 -63357 -53103 -13766 33286 61394 58891 31249 -9338 -47218 -63783 -49720 -10990 31576
782C1576K7019l23k6447m1181l8610j5948J6073L8286M0577K5082J747k4360m3516
795a0025l8793j3954J6101L6423M1109K7475j451k8352l9368l2440j6571R831
807e0015L7655M5807K6011m717k7022l7529l4819j5439J3602L5481M0936K7659
819E7610n17k9175m0961l0797j2542R534L4079M4833K6027n501k5881l4135l5640
832d3066j9701J6649M1273L6934J8121J649j9687m0692l8678j1760J6958L2833
844i167L8162K6108j703k8322l5099l0582j6988J0585L9243M1246J8612l588j9255
857B9252l6783l9412j1910K0367L2006L0948K7117N198k9518m3329k7031p210
869e0305Q336K9145M3274K5559p336k5443l0679l3357j8237J6740L8991L2781
$$ plain form
782 31576 58595 58272 31825 -9356 -47966 -63914 -47841 -9555 31022 56104 57851 33491 -10025
795 -10025 -48818 -62772 -46671 -10248 30861 58336 56885 28533 -10835 -43275 -59846 -50015
807 -50015 -12360 33447 59458 54741 27719 -9810 -44629 -60068 -46466 -10985 29951 57610
819 57610 57093 27918 -13043 -43840 -56382 -46848 -12769 32064 58091 52590 26709 -7426 -43066
832 -43066 -62767 -46118 -4845 32089 50210 51859 32172 -8520 -47198 -58958 -42000 -9167
844 -9167 28995 55103 53400 25078 -10021 -40603 -57591 -47006 -7763 33483 52095 48507 29252
857 29252 -7531 -46943 -58853 -38486 -6480 24468 51585 56783 27265 -16064 -43095 -50305
869 -50305 -41969 -12824 30450 56009 48673 23230 -7449 -40806 -59043 -42303 -3312 29469
881B9469J7168L818k0492m1845l4336n177J4652K5999L6571K9362m070l1387l1759
894a2027k4294j6990Q156L9396L9521J4764n102j6149l3501l9148j0853K1833
906c4394L0543K7359K4512N123k8864m0715k3743o677P029K8624M2321K1930r610
919D3438k3050k7007l2110j7535J7815L7510K8100J5814N439k0278m2564l0829
931d5257r14J3827K1292L4743K9719n214l1315k9208k2160j5210Q112L7341L6851
944C2607J1976m160j4723l2861l6730q158K1590K6029K6446K4830L280k9643l6699
957a6216j9918p060M250K8827M2085J8473j2334k0502k3453l0255j7185J7988
969c5300L5395K5581J4776N236j9983m0624k7681k75J2657K0071L3821K7017o692
$$ plain form
881 29469 46637 50455 29963 -11882 -46218 -51395 -36743 -10744 25827 55189 51119 19732 -12027
894 -12027 -36321 -53311 -45155 -5759 33762 48526 43424 27275 -6226 -45374 -56227 -34394
906 -34394 -3851 23508 48020 53143 24279 -16436 -40179 -46856 -39827 -11203 31118 53048 43438
919 43438 20388 -6619 -38729 -56264 -38449 -939 27161 42975 48414 28136 -14428 -45257
931 -45257 -46171 -32344 -11052 23691 53410 48196 16881 -12327 -34487 -49697 -41585 -4244 32607
944 32607 44583 40423 25700 -7161 -43891 -52049 -30459 -4430 22016 46846 50126 20483 -16216
957 -16216 -36134 -43194 -38944 -10117 31968 50441 38107 17605 -5848 -36103 -53288 -35300
969 -35300 95 25676 40452 45688 25705 -14919 -42600 -42875 -30218 -10147 23674 50691 43999
982D3999k9295k6140k0616j5747R177L6272L2915J0185l088j2887l2620l5082
994d2927n820K1556K4293K3965K3244J866k8354l4057j7284p253L953K8344L9102
1007C0628J6471j1269j8649k3461k9412j4650J9146L2577K2797J4260M501k0449
1019B2490l7665k4469J18J0715K0164L2484K4207p446k7506k4107k0991j3599
1031d5605J0911L5034K9004Q569k168j3308l1494l1367m071J8735K2911K3875
1043B1026K1996J54k8004l1055j7198o103O379K7915L3798J3893r087j7363k3817
1056g466k7720j1136J8237K9121K1974J4811L006k1777l5231k0768nJ0069K0408
1069f477L0290K0548p541k4136k3313k0107j2273J1693L1845K6589J0095k560
$$ plain form
982 43999 14704 -11436 -32052 -47799 -38622 -2350 30565 40750 37662 24775 -7845 -42927
994 -42927 -48747 -27191 -2898 21067 44311 46177 17823 -16234 -33518 -40771 -36818 -8474 30628
1007 30628 47099 35830 17181 -6280 -35692 -50342 -31196 1381 24178 38438 42939 22490
1019 22490 -15175 -39644 -39526 -28811 -8647 23837 48044 40598 13092 -11015 -32006 -45605
1031 -45605 -34694 340 29344 37913 35745 22437 -9057 -40424 -44495 -25760 -2849 21026
1043 21026 43022 43176 15172 -15883 -33081 -39184 -32805 -4890 28908 42801 33714 16351 -7466
1056 -7466 -35186 -46322 -28085 1036 23010 37821 40827 19050 -16181 -36949 -36954 -26885 -6477
1069 -6477 23813 44361 36820 12684 -10629 -30736 -43009 -31316 529 27118 37213 34653
1081C4653j5629l0143k6506l177J6790K1126K4030J9532j515k5383k7754j7356
1093c1332p277Q237K7465L0816J2074p648j7175k4113k5195q252J7006K6436K1146
1106B2188J4188J295k0313l1979k0406j610J0913K1813K8111J6523o835k1812
1118A2076k3107j9880q586J1951K7708K4404J1409k197j6870k9355k3086k036
1130c7569J4324K1537K3535J6999l200k3631k5937j6532n445Q985K4617K8054
1142B5737J2251o292j8075k4665k1580o130J4834K4722K1595J3188j996j9717
1154A3872k7265j8573l344J0782K2473K5835J4136o332j9770k3235j9577o052
1166c7050J3022K5348K2005J0911l264j6896k6065k0587k789J3205K1455K2721
$$ plain form
1081 34653 19024 -11119 -37625 -40802 -24012 -2886 21144 40676 39161 13778 -13976 -31332
1093 -31332 -38609 -30372 -2907 27909 39983 32335 15160 -8953 -34148 -42400 -25394 1042 22188
1106 22188 36376 37671 17358 -14621 -35027 -36637 -25724 -3911 24200 40723 33888 12076
1118 12076 -11031 -30911 -39497 -27546 162 24566 35975 33778 16908 -12447 -35533 -37569
1130 -37569 -23245 -1708 21827 38826 35626 11995 -13942 -30474 -35919 -26934 -2317 25737
1142 25737 37988 31696 13621 -11044 -32624 -38754 -23920 802 22397 35585 33589 13872
1154 13872 -13393 -31966 -35310 -24528 -2055 23780 37916 31584 11814 -11421 -30998 -37050
1166 -37050 -24028 1320 23325 34236 30972 14076 -11989 -32576 -35365 -22160 -705 22016
1178B2016J4179l911k0642k5200j6899l735J1089K2608K3506J1752l868j8574
1190A2321k4891j8599l316J3034K1200K1396J4002l463k0236k5259j6756k060
1202c2627J1143K0684K3116J2801n130j9095k3392j7186m419J2078K2673K2167
1214B2813J1038m812j7765k3685j6976l704J1442K1549K2663J1510m801j9155
1226A0117k2316j6449m167J1006K1914K2088J1757n089j8636k2735j6634k837
1238c1981J1818K0176K1116J1893l935j8328k3910j6756j806J2247J9792K0602
1250B0928J1629m147j8170k2927j5996k603J0857K0949K1135J1164n525j8403
1262H891k0870j4952m053R831K1259K2252J0981o943j8671j9595j4512l810R207
$$ plain form
1178 22016 36195 32284 11642 -13558 -30457 -34192 -23103 -495 23011 34763 30895 12321
1190 12321 -12570 -31169 -34485 -21451 -251 21145 35147 31684 11448 -13811 -30567 -32627
1202 -32627 -21484 -800 22316 35117 29987 10892 -12500 -29686 -34105 -22027 646 22813
1214 22813 33851 29039 11274 -12411 -29387 -33091 -21649 -100 22563 34073 29272 10117
1226 10117 -12199 -28648 -32815 -21809 105 22193 33950 28861 10225 -12510 -29144 -31981
1238 -31981 -20163 13 21129 33022 29087 10759 -13151 -29907 -31713 -19466 326 20928
1250 20928 32557 28410 10240 -12687 -28683 -31286 -20429 520 21655 32819 27294 8891
1262 8891 -11979 -26931 -30984 -21153 106 22358 33339 26396 7725 -11870 -26382 -30192 -20985
1275b0985K0658K2318J1100o319j8769k0864j3888k663R749J9901K0947J0355
1287C1540m979j7145k1514j5301l046J1715K0650J9336Q890m574j6037k0764j6099
1300b7328l588J2041K0902J9353Q836n305j6370j9483j4856l917J0041K1156K0301
1313B1783R368o661j7571j8606j3630k898R176J9506K0170J0410n930j7939j9812
1326a2634j3599j849J0471J8367J9236R716m984j6958j9507j3998k713J0728J9654
1339A930J8992P783n842j4689j8310j5600l944J1659K1292J8287O317n578j4073
1352H224j8487j4887l489J0972J9565J8891P937n991j5815j7948j3596k852J0327
1365a7149J9152J8149Q013n246j5034j9655j4399o89J1473J7424J6211R507l600
$$ plain form
1275 -20985 -327 21991 33091 26772 8003 -12861 -26749 -29412 -19663 238 21185 31540
1287 31540 26561 9416 -12098 -27399 -30445 -18730 1920 21256 30146 25572 9535 -11229 -27328
1300 -27328 -30916 -18875 2027 21380 30216 24911 8541 -10942 -25798 -29715 -19674 1482 21783
1313 21783 31151 24490 6919 -11687 -25317 -28215 -19039 467 20637 31047 25117 7178 -12634
1326 -12634 -26233 -28082 -17611 756 19992 29708 24724 7766 -11741 -25739 -28452 -17724 1930
1339 1930 20922 28705 22863 8174 -10136 -25736 -29680 -18021 3271 21558 27875 22297 8224
1352 8224 -10263 -25150 -28639 -17667 1898 20789 28726 22735 6920 -11028 -24624 -27476 -17149
1365 -17149 2003 20152 28165 22919 7885 -11770 -26169 -26858 -15385 2039 18250 27757 24157
1378B4157j6372j9930j3223j282J0794J8551J6953P417n385j4442j7563j4503
1390b4828k791J1548J9550J6448O393m506j4637j8312j3080j227R346J7619J8436
1403A9959Q115o807j5888j6053j2263l307J0116J9322J6504N970m804j3132j8774
1416a1042j4725M15J2105J6290J4415Q488l600j5771j9061j0982j059R676J7771
1429B920J6726O232o205j3054j6878j3842k373J3002J7815J3717O024k661j4597
1442F826j9556j1384R55R408J5018J7168Q995p052j6328j5500j0247k749R839
1455a4607J7973J5722N342n144j2571j7662j3291N65J1509J4726J4270Q584m641
1468B0775j5962j7236r263q77P825J7591J6511N296o761j2458j4571j3817k439
$$ plain form
1378 24157 7785 -12145 -25368 -26650 -15856 2695 19648 27065 21680 7238 -10325 -24828
1390 -24828 -27619 -16071 3479 19927 26320 21814 7177 -11135 -24215 -25442 -16096 1523 19959
1403 19959 28074 21267 5379 -10674 -22937 -26244 -16128 3194 19698 25668 20864 7732 -11042
1416 -11042 -25767 -25352 -13247 3043 17458 25946 22346 6575 -12486 -23468 -24527 -14851 2920
1429 2920 19646 25878 19673 6619 -10259 -24101 -26474 -13472 4343 18060 24084 21423 6826
1442 6826 -12730 -24114 -23159 -13751 1267 18435 27430 20378 4050 -11450 -21697 -24446 -14607
1455 -14607 3366 19088 24430 19286 6715 -10947 -24238 -23673 -12164 2562 16832 25416 20775
1468 20775 4813 -12423 -21686 -22563 -14738 2853 19364 24660 17899 5441 -9130 -22947 -25386
1481b5386J2835J7499J1914N997k726j4078j8787j0204J633R062J4056J5977P742
1494B5534o896j4976j4119j0340l031J0275J8046J4120L588m051j1615j7532j2778
1507b3775J832J1567J2903J3038Q480m032j6656j5603p721q54P253J6065J6836
1520A9333M488p813j1571j3673j2631j392J2154J5889J0998N812k417j3802j7685
1533a2310r763K369Q130J3478J5232P342p848j3977j2499r655k893R859J7485
1546D950J2594K908l785j0683j6973j2035K288J1446J2255J2055Q079m567j5820
1559B712j4925o767k78O670J5583J4907M358o753j1383j3594j1741l00J2040J4450
1573D979J0352N240k849j3457j6581p945K322P251J2377J5318N854p228j3618
$$ plain form
1481 -25386 -12551 4948 16862 22859 20133 6055 -12732 -22936 -21303 -12241 1815 17792 25534
1494 25534 18638 3662 -10457 -20797 -23828 -13553 4493 18613 22201 18150 6535 -10997 -23775
1507 -23775 -21943 -10376 2527 15565 24045 20013 3357 -12246 -19967 -20821 -13568 2497 19333
1520 19333 23821 16008 4437 -9236 -21867 -23259 -11105 4784 15782 21594 19177 5375 -12310
1533 -12310 -22073 -19704 -11574 1904 17136 24478 16630 2653 -9846 -19501 -22394 -12535 4950
1546 4950 17544 20452 16667 5984 -10989 -23024 -20736 -9290 2965 15020 23099 18532 2712
1559 2712 -12213 -18980 -19258 -12588 2995 17902 22260 15507 4124 -9470 -21211 -21511 -9471 4979
1573 4979 15331 20571 17722 4265 -12316 -20261 -17939 -10688 1689 17007 22861 15633 2015
1586B015j1897q605k582R716J6434J1617L111m092j0953j5541j0292K335J0084
1599h650J1530J1790P006m839j4550j3613o888o45P562J4690J3892K760n626j0391
1613D028j3239j0849j88J1465J3527R697N451l099j3639j5232p077J743P115J2711
1627B414J3275N801p271j2497j1499p758j525Q720J4663J1253L364l996j1232
1640C712j4214r196K210R380J1303J1248O025n238j3294j2487o566o81P636J4161
1654C999J2654K451n813r952j2410r566N4J0095J2956R885M365l865j2057j3502
1668a0706o778Q85P128J2227J2655M403p034j1272j1172p571j58Q397J3204J0290
1682A4498L451m209j0387j3869p412J535Q589J1168J1012M702n431j1767j1988
$$ plain form
1586 2015 -9882 -18487 -21069 -11353 5081 16698 19809 15717 4764 -10777 -21069 -18734 -8650
1599 -8650 2880 14670 21676 16837 2287 -11326 -18214 -18859 -11297 3393 17285 20045 14419 4028
1613 4028 -9211 -20060 -20248 -8783 4744 14441 19892 16793 3154 -12078 -19155 -17412 -10297 2414
1627 2414 15689 21490 14219 1722 -9777 -17535 -19060 -10340 4323 15576 18940 14944 3712
1640 3712 -10502 -19698 -17488 -8108 3195 14443 20468 15230 1936 -10551 -17117 -17798 -10162 3999
1654 3999 16653 19104 13291 3339 -9071 -18637 -18583 -8488 4468 14353 18718 14853 2796 -10706
1668 -10706 -17484 -16599 -9471 2756 15411 19814 12780 1508 -9664 -17235 -17393 -8996 4208 14498
1682 14498 17949 13740 3353 -10516 -17928 -16393 -7804 3364 14376 19078 13647 1880 -10108
1695a0108o788k46Q118J3199J0725K824m995j0257j1683q161L77Q852J2450R995
1709A4302L555m847j1046j1960o475O80P297J2310J0346L881n494j0882j0888
1722i221p256K24P971J2114J0174L111m061j1154j1381o949R42P860J1603R813
1736A3790L292m305j0721j1295p113P72Q194J1168J0030K992m706j0136j1262
1749i300o559M73P810J1611R647L180m988j0383j0670o747M11Q117J1850Q969
1763A3421L214n105j0279j0848n861O59P682J0632R838L162n029j0333j0591n910
1777a5348L41P712J1613Q835K587m362r406j1202o675J433Q023J0029Q803L320
1791A5703m048j0483j0223n966Q96P128J1378R137K115n294q798r864o964L69
$$ plain form
1695 -10108 -16896 -17142 -9024 4175 14900 17724 12729 2472 -9211 -17372 -16995 -8143 4307 14302
1709 14302 17857 13010 1964 -9996 -16471 -15791 -8494 3816 14162 18043 12549 1667 -9221
1722 -9221 -16477 -16253 -8282 3832 14006 17117 13056 1902 -9479 -16428 -15486 -7626 3977 13790
1736 13790 17082 12777 2056 -9239 -16352 -15580 -7386 3782 13812 16804 12098 1962 -9300
1749 -9300 -15859 -15386 -7576 4035 13682 16862 11874 1491 -9179 -15926 -15515 -7398 4452 13421
1763 13421 16635 11530 1251 -9597 -15458 -14799 -7117 3515 13353 16515 11486 1153 -9438 -15348
1777 -15348 -15007 -7295 4318 13153 15740 11378 1972 -9230 -15905 -14472 -6449 3580 12383 15703
1791 15703 11655 1172 -9051 -15017 -14121 -6993 4385 13522 15637 10343 1545 -8319 -15283 -14914
1805a4914Q470J1188P512L129m055j0014j0856n262J455O686J0082R457L225n761
1819A0342r884q810o207M24P628J1186Q096J691l851q854j0867o252K267P778
1833e313Q817Q073L873m483j0089j0264m466Q99O632J0464Q803J766n189q214
1847A309r133o904J070Q335R779O943K822l489r662j0347m878J987O119R333R390
1862A2674K504n672r442p855n321n20P652J0604P302J389l677p951j0562n602
1876a4477K278P490Q152P513L629m562r865q798m412N89O530J0309P887J034m578
1891H719p779r029o118J187Q646R170O137K383l332r547r685m114J820N854Q720
1906C032R026K210n668q915p572m738K10P242R719O511J827l514q272r786m885
$$ plain form
1805 -14914 -6444 4744 12256 15385 11330 1316 -9540 -14802 -13347 -6661 3421 12878 16103 10342
1819 10342 458 -8352 -14559 -14135 -6507 4679 12775 14466 10615 1761 -9106 -15358 -13091 -5313
1833 -5313 3504 11577 15450 10967 878 -9386 -13852 -12953 -6321 4143 12946 14712 9523 1309
1847 1309 -7824 -14728 -13658 -5323 4456 11399 14221 10732 1070 -9277 -14155 -12168 -6049 3284 12674
1862 12674 15178 9506 64 -7791 -13112 -13632 -5980 4624 11926 13315 9638 1687 -8875 -14477
1876 -14477 -12199 -4709 3443 10956 14585 10023 158 -8640 -13052 -12463 -5933 4376 12263 13297 8719
1891 8719 940 -8089 -14207 -13020 -4374 4796 10933 13316 9984 437 -9248 -13362 -11542 -5688 3032
1906 3032 12058 14268 8600 -315 -7887 -12625 -12415 -5173 4546 11057 12884 9370 1098 -8688 -13573
1921a3573K548O713P780P201L067m484r870p331m048L36O139R918P561O40m544
1936H053p323q499n794J602P832Q408O216K179l415q918r194l316J829N178Q597
1951C435P740K065n447p830p614m608P99P099Q412O570J239l314q083q829m306
1966a2672K401O494P231O972K755m657r359p326l147P66N730R086P162M34m301
1981G569p354p699m735J516O945P972O032K036l953q730p595l356J402N534Q101
1996C685P110J504m838p787o900m349J061O572Q145N830J153l596p298q058m048
2011a1814J776O176P945N854J887m333q108o939l349J031N643Q069O371J230m472
2026F967p148p125m188J651O473P520N786J373m123p891o771l401J449N484P653
$$ plain form
1921 -13573 -11025 -4312 3468 10669 13736 9252 -618 -7949 -11997 -11661 -5522 4396 11957 12597 8053
1936 8053 730 -7769 -13563 -11961 -4129 4279 10495 12674 9259 341 -8853 -12169 -10340 -5162 3435
1951 3435 11175 13240 7793 -37 -7651 -12259 -11460 -4361 4051 10621 11860 8546 463 -8366 -12672
1966 -12672 -10271 -3777 3454 10426 13181 8524 -835 -8161 -11308 -10542 -4812 4274 11436 11870 7569
1981 7569 215 -7484 -12219 -10703 -3758 4214 10246 12282 8329 -401 -7996 -11352 -9950 -4416 3685
1996 3685 10795 12299 7461 -326 -7226 -11575 -10514 -3942 4203 10033 11186 7590 292 -7766 -11814
2011 -11814 -10038 -3862 4083 9937 11824 7491 -617 -7556 -10905 -9874 -4231 3838 10209 11439 6967
2026 6967 -181 -7306 -11494 -9843 -3370 4150 9936 11309 7186 -705 -7476 -10877 -9428 -3944 3709
2041C709O540R83m722o870o803l685R16O369Q012N296R33m169o645p057l876J428
2057i641N934P906N439J322m316p269o455l448J022N985P450N850O05l715o825
2072a56o634l982J618O156O822N663Q89l586p005o774l705J330N949P215N435
2087I235Q55l705o637o641l346J025N859P290N302J105m106o461o662l751J667
2102h971N412P300N372J163l876o760o445l353J616N281P387M795R80l534o688
2117c21o351l286J204N800O806N175N49l829n979o603l249J585N725O840M728
2132H794Q23l482o980o067k568J035N469O558N233Q22l724o486o081k851J432
2147h073M900P284M319R26l477o269o307k799J651N162O466M587Q41l259o446
$$ plain form
2041 3709 10249 11232 6510 -360 -7163 -10848 -9932 -3563 4449 9745 10678 6509 -136 -7193 -11069 -9641
2057 -9641 -3707 4199 9638 10960 6644 -625 -7080 -10528 -9506 -3521 3929 9779 10384 6669 -156
2072 -156 -6790 -10772 -9154 -2998 3824 9487 10376 6790 -215 -6989 -10694 -9364 -3415 3800 9235
2087 9235 10090 6385 -252 -6893 -10239 -9214 -3355 3935 9237 10342 6236 -225 -6887 -10638 -8971
2102 -8971 -3559 3741 9113 10276 6400 -360 -6805 -10158 -8542 -3261 4126 8921 9901 6367 -321
2117 -321 -6672 -9958 -8754 -2954 3852 9027 9576 5747 -232 -6835 -10084 -8499 -2774 4066 8794
2132 8794 9617 6135 -845 -6912 -9480 -8445 -2976 3582 8815 9637 5913 -573 -6654 -9505 -8073
2147 -8073 -3173 4111 8430 9356 5879 -390 -6697 -9496 -7845 -2683 3783 8370 9211 5952 -494
2162d94n981k809J088M958P000N060L72l884n744n823k923J415N056O389M515
2177H195R40l308o453n839k484J407M907O234M523R83l734n957n908k512J577
2192g429M954O034M365O12l226n895n437l208J610N286O026M222O69l024o122
2207e63n409k937J607M664N978M487J126m014n852n204k520J442M761N711M653
2222G930O11l739n433n593k228J669M459N376M627J083l873n515n320k444J318
2237g072M952N638M103M85k802n619n673k628J538M867O054L760J59k710n356
2252c04n444k463J398M484N725L901Q53l374n541n192j978J183M501N778L949
2267G476N56l243n268n163k231J118M612N305L999O24k776n698n557j540J502
$$ plain form
2162 -494 -6475 -9284 -8196 -3238 3762 8822 9194 5310 -434 -6257 -9180 -7765 -2709 3680 8195
2177 8195 9135 5827 -626 -6465 -8949 -7542 -2635 3599 8122 9105 5371 -586 -6494 -9006 -7429
2192 -7429 -2475 3559 7924 8536 5310 -585 -6022 -9230 -7620 -2334 3692 7914 8583 5559 -563
2207 -563 -5972 -8909 -7302 -2638 3340 7827 8953 4939 -913 -6117 -8637 -7195 -2434 3277 7930
2222 7930 8541 4802 -631 -6224 -8452 -6783 -2324 3052 7679 8762 4889 -626 -5946 -8390 -7072
2237 -7072 -2120 3518 7621 8106 5304 -315 -5988 -8616 -7078 -2211 3843 7603 7762 5052 -304
2252 -304 -5748 -8211 -6813 -2329 3396 7297 8150 4776 -765 -5957 -7935 -6752 -2251 3527 7476
2267 7476 8032 4789 -479 -5642 -7873 -6755 -2143 3162 7161 7785 5009 -689 -6246 -7786 -6284
2282f284M205N267L795R32l235n668m735j991J168M677N394L600K92k964m933
2297d80n122k463J525M767N106L745P22l030n679m626j579P42M066N542L735M45
2313G416l188m825m746k445J385M729M799L292J170k816n121n680j683J930L959
2328a824M813M025M20l400m826m251k359J021M461N610L007mk454m682m934k231
2344g608J846M280M382L853P17l351n265l854j902J191L780N192L583j58l016
2359C670m097m491k408J329M533M589K727R54k322n390m633j405J972L036M811
2374B875L951L21l200m798l999k079J062M212N032K977L3k353m374m927j919J964
2390e222L779M106L254J001k926n618l443j205R55L222N193L772k97l393l817
$$ plain form
2282 -6284 -2079 3188 6983 7915 4680 -988 -5723 -7714 -6546 -1869 3525 7125 7417 4453 -480
2297 -480 -5602 -8065 -6540 -1773 3333 7078 7800 4770 -909 -5535 -7114 -6372 -2306 3236 6971 7416
2313 7416 4228 -597 -5343 -7788 -6403 -1674 3125 6417 7587 4771 -350 -6030 -7713 -5783 -1824
2328 -1824 2989 7014 7434 4034 -792 -5043 -7402 -6381 -1920 3690 6697 6693 4239 -443 -5377 -7608
2344 -7608 -5762 -1482 2900 6753 7470 4119 -1146 -5000 -6902 -5711 -1931 3261 6844 6686 3670
2359 3670 -427 -4918 -7326 -5997 -1464 3125 5852 6806 4484 -906 -5539 -6944 -4972 -1936 2875
2374 2875 6826 7147 3947 -851 -4850 -6929 -5867 -1655 3377 6354 6387 4034 -340 -5267 -7186 -5222
2390 -5222 -1443 2663 5917 6918 3992 -1626 -5069 -6274 -5319 -2097 3096 6868 6571 3178 -639
2405f39l956k455J484M441M027L186M83k190n560l867j501J444K934M812L524
2420F167O71l597m134l716j969R51L946N038K787ok418m339m783j226K137L413
2436a078L908K738J451l396m885l208j508N78L776M707L063k81k573l718m572
2451d998j589J461M126M282J913R95k414m643m164n33J040K389M756L543O4l363
2467B865l708l316j845P07L867M734K459p4k086m120m115j370J451L126L656L364
2483E595Q03l151m448l199j032L57L329M561L083m21k447l454l733k073J487L732
2499a011L747K435N79k088m702l272j339J858K155M093L604l13l113l519l026
2514c912k253J257L851L954K253J64k135l608l954j578J906K847L314L387K84
$$ plain form
2405 -639 -4595 -7050 -5566 -1125 2902 6088 6571 4381 -1179 -5046 -6547 -5103 -2169 2643 6167
2420 6167 6838 3241 -893 -4609 -6578 -5627 -1681 3357 6144 6138 3720 -619 -5402 -6628 -4491 -1078
2436 -1078 2830 5568 7019 3623 -1262 -4470 -5978 -5400 -1624 3083 6146 5865 3292 -426 -4998
2451 -4998 -6587 -5126 -1000 3282 5195 6190 3776 -867 -5031 -5564 -4524 -2135 2621 6164 6228 2865
2467 2865 -843 -4159 -6004 -5297 -1430 3304 5763 5689 3603 -517 -4632 -6002 -4551 -1425 2231 5595
2483 5595 6398 3247 -1201 -4400 -5432 -5075 -1746 2815 5898 5477 3030 -424 -4157 -6230 -4743 -1011
2499 -1011 2736 5171 5750 3662 -1040 -4312 -5651 -3793 -1638 2455 6059 5746 2633 -886 -3912
2514 -3912 -6165 -4908 -1057 2897 5150 5314 3179 -429 -4383 -5961 -4055 -1208 2106 5493 5777
2529E777k531m380k921j177M87L113M480K617m61k138l278l759j621J246L678
2544h68L584K096P35k255m368l062j416J166K723M289K853j64k911l262k893j628
2560e381P91L507L944K005K94j853l973l754j028J236L113L379K889L45k842m035
2576a363k806j122O94L455M063J779L2j686l575l634j452J201L521L782J896J51
2592D936j842m088k899r93N33L048L734K468J83k447l484k660j366P33K981L870
2608B707K137Q5k306l395l056j174J037K639L474K621J41k284l427k899j194P90
2624d104L036L734K228K1k379l061l305j549J494L362K839K268Ok275k882l322
2640c889j110J070K730L749K089K42k426l298k596j668J232K966L573J945R8k046
$$ plain form
2529 5777 3246 -1134 -4055 -5232 -4745 -1632 2848 5465 5004 2866 -412 -4171 -5792 -4546 -868
2544 -868 2716 4812 5547 3292 -1076 -4138 -5554 -4388 -1665 2624 5477 5313 2402 -860 -3753 -5381
2560 -5381 -4590 -1083 2861 4866 5160 3307 -666 -4420 -5448 -4212 -1099 2280 5169 5514 2672 -1363
2576 -1363 -4169 -5291 -4597 -1142 2921 4700 4732 3046 -529 -4163 -5615 -4414 -893 2889 4785 4936
2592 4936 3094 -994 -3893 -4886 -4353 -1305 2429 4897 5080 2633 -851 -3511 -4877 -4144 -1163 2707
2608 2707 4844 4929 2623 -772 -3828 -5002 -3965 -1326 2148 4769 4910 2626 -801 -3700 -4894 -4104
2624 -4104 -1068 2666 4894 4915 2536 -525 -3830 -5379 -3885 -523 2316 4584 4590 2315 -567 -3889
2640 -3889 -4999 -3929 -1199 2550 4639 4881 2455 -843 -3439 -5107 -3875 -909 2664 4609 4707 2661
2656B661l431l290q01J097K760L081K522R1k234l243k756j255J140K624L352K162
2672D480j40k146k861k816j458J272K661L368K086L9k299l269k606p57P96K912
2688g38K724K308P0k209k725k967r74Q47K630L246K370k42j939l104k760q94N83
2705c774K916L129J690K36j934k932l067j037J391K522L437J368K89k088k661
2720e15k796j145J062K269L417K089J02k400l138k157j261J002K705L066J704
2735D004r1j450l529k186j141O75K859K967K151l8j807l043k718j049J101K380
2751i15L100J795J09j901k902k442j215R64K659K636K031j81j299l218k398r28
2767d105O65K769K776J744M7j791k955k248j245J460K137K638J785K81j917k502
$$ plain form
2656 2661 -770 -4060 -4861 -3764 -1004 2077 4599 4690 2456 -787 -3543 -4798 -3658 -1034 2318 4480
2672 4480 4340 2194 -667 -3483 -4941 -3669 -1008 2360 4446 4485 2186 -1083 -3689 -4446 -3650 -738
2688 -738 1986 4294 4364 2155 -570 -3537 -4511 -3664 -1034 2212 4582 4340 2401 -703 -3463 -4357 -3774
2705 -3774 -858 2271 3961 4197 2263 -669 -3736 -4773 -3382 -860 2577 3945 4234 2146 -515
2720 -515 -3311 -4456 -3394 -1125 2292 4381 4483 2083 -1055 -3212 -4473 -3471 -766 2300 4004
2735 4004 3913 2463 -1066 -3252 -4393 -3718 -859 2108 4259 4221 2414 -629 -3347 -4396 -3295 -915
2751 -915 2185 3980 4089 2188 -714 -3156 -4371 -3407 -748 1888 3919 3738 2439 -779 -3177 -4105
2767 -4105 -3440 -671 2105 3849 3896 2105 -850 -3098 -4343 -2883 -746 1892 3677 3958 2041 -461
2783d61k852p58Q13K453L002J551J51j781k813k667n17O71K526K703J989l73j321
2800B316l053k197j179J112K304K722J796J2j856k726k694p42J032K403K838J607
2816C695j18j408k793k405q12Q04K348K284J762L14j723k722k310p05P00K274
2832h15K584J754K05j869k565k453q75J152K296K515J834J93j905k761k401p99
2848c910R91K135K750J358N84k151k607j894j058R86K114K681J629j36j535k605
2864f68k182q41R50J900K473J878l9j479k797j834j056R83K297K138J627K85j886
2881A749k101k572j132J159K206K301J891Q9j796k597j864q70R95K027K466J347
2897C298K4j241k611k174r66J287J790K292J576K26j964k026k276q37J059J862
$$ plain form
2783 -461 -3313 -4071 -3258 -805 2197 3748 3899 2118 -695 -3362 -3879 -3208 -682 2021 4010 3637 2316
2800 2316 -737 -2934 -4113 -3001 -697 2025 3821 3833 1977 -749 -3443 -4185 -3153 -750 2088 3695
2816 3695 3577 2169 -624 -3029 -3841 -3037 -689 1595 3357 3671 1948 -774 -3084 -3789 -3089 -815
2832 -815 1769 3523 3728 1859 -706 -3159 -4034 -2882 -586 1929 3763 3956 2051 -710 -3111 -3910
2848 -3910 -2919 -784 1966 3324 3908 1757 -850 -2744 -3802 -2816 -702 1979 3608 3472 1937 -668
2864 -668 -2850 -3691 -2741 -841 1632 3510 3471 1992 -805 -2639 -3695 -2712 -415 1723 3350 3635 1749
2881 1749 -352 -2924 -4056 -2897 -691 1610 3501 3590 1794 -803 -2667 -3537 -2542 -515 1951 3298
2897 3298 3322 2081 -530 -2704 -3670 -2383 -593 1699 3275 3501 1537 -489 -2765 -3602 -2543 -681
2913f81K324J822m7j803k393j977q33J063K008K217J514R9j371k804j689j012
2929c563R00J790K651J343K62j648k416j952j117J160K159K069J563m1j515k087
2945d42k341p35O60K287J751J865oj268k420j788r76O20K591J978J158N2j180
2962A806k324j802j039J109J867J929J413M99j837k444j595m96N75J897K012J637
2978C207O9j825k075j961n99P26K296J738J349M24j800k165j926o14R67J780K117
2995A708J617l32j780j927j901n80P64K088K093J273kj516j899j757j028Q97J647
3012f35K180J655l39j184k481j972q7K60J963K297J602N4j952k042j785n01Q04
3029b163J549K334J324j54j248k164k107k12P92J387K018J549K27j757j799j734
$$ plain form
2913 -681 1643 3465 3418 1615 -778 -2755 -3588 -2525 -517 1700 3214 3313 1942 -862 -2551 -3563
2929 -3563 -2663 -873 1778 3121 3383 1735 -681 -2633 -3750 -2590 -431 1638 3201 3160 1645 -442
2945 -442 -2783 -3518 -2858 -571 1180 3045 3039 1771 -649 -2437 -3413 -2793 -202 1776 2934 2986 1806
2962 1806 -518 -2320 -3359 -2250 -383 1546 2959 3458 1621 -823 -2418 -2914 -2339 -442 1570 3207
2978 3207 3276 1451 -624 -2585 -3184 -2458 -162 1576 2925 3349 1549 -616 -2542 -3156 -2189 -409 1708
2995 1708 3325 2993 1213 -714 -2615 -3195 -2431 -343 1750 3023 3021 1505 -394 -2151 -3179 -2282 -635
3012 -635 1545 3200 2861 1677 -804 -2776 -2863 -2603 -640 1657 3259 3313 1361 -681 -2466 -2967 -2163
3029 -2163 -614 1720 3044 2890 1642 -522 -2629 -2841 -2049 -662 1356 2905 3132 1375 -424 -2158
3045b158q75N30J761K244J314Lj705j486j671j074R68J513K282J243Nj683k009
3062g98j681r2L54J563K184J343k4j518j785j729m05L71J677J825J521m33p83
3079A590k235j889j82N87J868J773Q89L86j123k097k011o09R06J748J980J407
3095B988o12j068j876j700q93J070J876J637J556j99j566j847j667l36L69J985
3111b83J513J602n1j455j659j951m04N79J636K034J012J76j270j895j790o09O37
3128b178J673J862J269k3j250j852j451n89K68K036J995R51O7j320j964j857k54
3145b617O21J609J721J293Q2j209k123j415n94M16J917J687J208K71j887j533
3161e53j555l98O17J297K089Q59K51j352j941j245n63L77J382K094J195j9j259
$$ plain form
3045 -2158 -3033 -2503 -742 1502 2816 2819 1114 -372 -2043 -3117 -2149 -636 1646 2889 2894 1211 -798
3062 -798 -2479 -2571 -2217 -654 1530 2873 2849 1331 -454 -2183 -2588 -2217 -540 1285 2806 2373 1590
3079 1590 -645 -2534 -2716 -2129 -261 1512 2401 2787 1664 -433 -2444 -3053 -2147 -399 1581 2988
3095 2988 2376 1308 -568 -2268 -3161 -2091 -215 1422 2978 2779 1213 -634 -2301 -2637 -2268 -283
3111 -283 1230 2832 2781 1326 -333 -2284 -2688 -2109 -473 1561 2573 2749 1479 -416 -2206 -2815 -2178
3128 -2178 -505 1357 2626 2603 1353 -499 -1950 -2539 -2271 -235 1760 2711 2778 1458 -506 -2363 -2617
3145 -2617 -1996 -387 1334 2627 2709 1500 -623 -2038 -2632 -2216 -299 1388 2596 2867 980 -553
3161 -553 -2108 -2506 -1889 -592 1497 2356 2607 1255 -686 -1931 -2494 -2117 -735 1359 2554 2535 1276
3178A276j743j367r83R03J470J867J120J17j354j884j602k86K53J349K312J160
3194B608l44o89k287j513m78Q62J654J426R64K98j172k091r78q78N20J577K139
3211A618Q95j49r78j537j833q81P60J451K093J292o95n88k121j253o55O38J250
3228f93K026R78J45j298j614j460n07P15J189J939P99K47j129j800j389p66O03
3245b015J843J523J000L2j211j855j291m20Q17R55J966Q54J5j174j541j652k86
3262b440P59J324J862R34o8j233j642j529n06Q15J488J453J274l62j060j744j053
3279a728o65N89J526J509J036j06r85j581j222p90P66J630R57J148j7r96j572
3296e01j621m5M46J278J482J324l00j098j542j643m40O96J455J794J093m14n22
$$ plain form
3178 1276 -467 -1834 -2817 -1914 -444 1423 2543 2660 1306 -578 -2180 -2466 -2213 -864 1448 2608
3194 2608 2264 1575 -712 -2225 -2703 -1841 -187 1239 2203 2501 1329 -762 -1740 -2618 -2098 -521 1618
3211 1618 2513 2364 1386 -151 -1984 -2865 -2105 -654 1439 2731 2036 1448 -673 -1926 -2581 -1943 -693
3228 -693 1333 2311 2456 1158 -456 -1916 -2423 -1708 -519 1420 2219 2466 1337 -463 -1852 -2618 -2015
3245 -2015 -172 1351 2351 2383 1172 -683 -1974 -2394 -1577 -622 1344 2198 2213 1039 -502 -2154 -2440
3262 -2440 -1681 -357 1505 2439 2371 1138 -504 -2033 -2539 -1724 -236 1217 2491 2129 1069 -675 -1728
3279 -1728 -2393 -1804 -278 1231 2267 2161 1176 -405 -1627 -2417 -1651 -21 936 2084 2067 1071 -501
3296 -501 -2122 -2167 -1721 -443 1039 2363 2063 965 -577 -2220 -2660 -1964 -509 1285 2378 1964 1442
3313A442j970j462l41P22J292J488J286m0j069j742j500j93J99J359J761Q13j04
3330A941q18j786r44r02Q84J165J789R03J04r50k086j099k44J09J098K021Q91
3347B076r3j019j222j478m05L90J564J406P89k4p05j755j334p61P89J529J482
3364A229R02j46r06j645j152n18P43J128J635Q24M3j131j468j273n06P03J366
3381a72J242J085j52j093j630j256K27K82J047J602Q84q9r33j426j260o26P21
3398a547J483J383P81j85q97j402j505r5M71J033J343J261k67j219q40j285n46
3415b033L59J529J561N54k4q99j369j644k21P98J118J183Q58J60r88j533j108
3432a699l46N79J369J182J019j49j083j023j504m91N67J412J393N72J21q59j514
$$ plain form
3313 1442 -528 -1990 -2331 -1609 -317 1171 2457 2417 1348 -394 -1894 -2087 -1888 -529 1232 2045 1941
3330 1941 1123 -663 -1607 -2509 -1625 -460 1329 2232 2336 1386 -700 -1799 -2043 -1934 -836 1185 2076
3347 2076 1983 964 -258 -1736 -2141 -1751 -187 1219 2008 1984 1279 -476 -1810 -2571 -1782 -253 1229
3364 1229 2131 1985 1079 -566 -1718 -2236 -1493 -365 1270 2094 2137 1006 -462 -1735 -2241 -1538 -172
3381 -172 1070 2155 2003 910 -720 -1976 -1749 -1467 -420 1182 2066 1977 1044 -382 -1642 -2268 -1547
3398 -1547 -64 1319 2100 1915 1018 -384 -1889 -1984 -1513 -480 863 2124 1857 638 -202 -1487 -2033
3415 -2033 -1674 -145 1416 1970 1946 1047 -322 -1966 -2187 -1389 -271 912 1770 1930 942 -591 -1699
3432 -1699 -2045 -1466 -97 1085 2104 1955 872 -151 -1655 -2146 -1579 -167 1226 1798 1919 1060 -454
3449d54j615QO97R23J642R06j95j214j167j236k00L23J199J455R56k72q46j384
3467d74j034m97M93J312J280Q74L3j240j329j180k37P14J129J376Q58l18q86j260
3485c86j131o48Q16J093J624N69O3j266j055j141q59R71J098J166J001Nr88j488
3503e56q34n92M56J409J439N03j3q77j226j524l02O64J025J462J006l08r54j041
3521b63j201l53L63J387J411O01r3q56j280j014m84N65J097J333P82l27j016j067
3539d15r39k62J38J374R58Q82l6q70j255j290k16M51J393J247P59l22p76r16j157
3558a252o21N34J210J322N39J37j060j395j139M9L04J314J180N66J7j137j185
3575f17j014k51N79J247J150O62o4j119j137j077k03R19O35J233P24m49o33j162
$$ plain form
3449 -454 -2069 -2061 -1364 -441 1201 2107 1912 698 -469 -1705 -1905 -1582 -383 1072 2028 1756 910 -474
3467 -474 -1508 -2005 -1512 -200 1080 1954 1987 747 -582 -1762 -1999 -1285 -156 1220 2078 1760 874 -386
3485 -386 -1517 -2165 -1349 -256 1368 1937 2000 734 -321 -1462 -2321 -1350 -252 914 1915 1920 932 -556
3503 -556 -1390 -1982 -1526 -117 1322 1825 1812 935 -291 -1815 -2117 -1453 -428 1034 2040 1732 778 -263
3521 -263 -1464 -1817 -1454 -67 1344 1945 1852 996 -284 -1298 -1782 -1217 -120 1213 1995 1668 652 -415
3539 -415 -1354 -1616 -1478 -104 854 1736 1700 830 -425 -1715 -1931 -1480 -87 1160 1919 1597 821 -95 -1252
3558 -1252 -1873 -1339 -129 1193 1732 1869 809 -586 -1725 -1676 -1372 -58 1122 1688 1705 568 -617
3575 -617 -1631 -1882 -1303 -56 1094 1756 1692 573 -564 -1641 -1844 -925 -290 943 1667 1218 585 -577
3593e77j131P1N07J119J104N25Q7r80r84j153k26J01J208J348L24J26q36j310
3611f77j248K31O25R92J263L46n3q29r18j255l37N78J284J016J009j45j334j361
3629h13m92k64L42J059J242O65l53p17j290p11l59N62J103J017L70O1n97j108
3647b83j299j95P61Q60R60Q89j75j190q55q48m5L23J182Q88N28J62q20j523p92
3666a472j99M66R02J424M80Q2r05j420q94mK95J224J068O38or83r88j060j10O25
3686h37P48J291N76k31o99j373j124j60Q80P00J152N25J90q84j253r36l4M38J116
3705H5R06P55o88n23q87r86k34K94J236R56M25J05j111p91j011J18J04J127J039
3724I19P51k2j068j255o97n7L61J075J101N56k58r67n43j143l30N65J025J098
$$ plain form
3593 -577 -1708 -1637 -1130 -11 1093 1618 1705 725 -259 -1412 -1638 -1537 -329 1019 1343 1469 633 -677
3611 -677 -1925 -1694 -1069 -77 1186 1532 1479 650 -268 -1523 -1860 -1282 2 1018 2027 1882 548 -813
3629 -813 -1305 -1569 -1227 -168 1074 1739 1386 669 -621 -1332 -1691 -1129 -26 991 1361 1422 825 -283
3647 -283 -1582 -1777 -1016 -156 804 1693 1518 328 -527 -1375 -1420 -1097 85 973 1501 1663 843 -680 -1472
3666 -1472 -1671 -1205 -303 1121 1601 1683 778 -642 -1536 -1540 -1245 -21 1047 1685 1679 696 -292 -1352 -1462 -837
3686 -837 -89 1202 1778 1547 848 -525 -1649 -1809 -929 -229 923 1448 1638 754 -499 -1435 -1469 -1031 85
3705 85 991 1746 1058 535 -352 -1338 -1572 -1278 -42 914 1339 1444 333 -458 -1469 -1351 -1247 -120 919
3724 919 1670 1648 580 -675 -1372 -1429 -1068 7 1108 1664 1406 439 -104 -1247 -1577 -1012 13 1111
3742A111N43k46j052q45q23j66N37J009R00N72k71j010o25o92n89N87J029J167
3760A136N38n18o59q24r96r9N03R53R71M95j44r60q32q66n5L41R43R85N10K3j019
3781D26q13p85j85M36R62R68L47r3q44q92r46k35P90R75R11M82l76q33j062o31
3801a398q2P66Q95P01M29o7q11j075o99q3O66Q14Q47O23k44j013p05q44n78O88
3821a170J314Q04M48l08o34j186m72j25M78P44Q38N30k61m42r88q35J79p7J360
3840A97Q40K56Mq33r28n79j26K90J123M29O01O9q32j180l32k26N12Q49N96Q97
3860A627n10q50q42l66n96O13J075N40N03l5m99j029o26k67L89Q01R11M17l3q04
3880D19p64p18m93M90J154J043N39q28l93j006p77K36J52J190N25L09l69l44p39
$$ plain form
3742 1111 1654 1408 356 -489 -1312 -1478 -941 68 968 1540 1269 259 -366 -1058 -1647 -1060 -31 1136
3760 1136 1674 1156 497 -327 -1323 -1422 -919 34 1005 1500 1356 396 -436 -1302 -1357 -1016 -73 912 1422 1445 426
3781 426 -387 -1172 -1357 -921 41 1009 1356 1263 419 -473 -1419 -1654 -864 111 1022 1504 1128 295 -767 -1398
3801 -1398 -1480 -714 181 882 1311 1244 433 -642 -1341 -1424 -758 56 903 1526 1282 269 -436 -1280 -1858 -1170
3821 -1170 144 948 1396 1088 454 -732 -1204 -1329 -851 -107 731 1261 1000 558 -430 -1265 -1086 -1163 197
3840 197 1037 1293 1297 464 -464 -1043 -1169 -879 244 673 1274 1343 511 -669 -1001 -1227 -715 134 730 1627
3860 1627 1117 267 -575 -941 -1537 -924 151 691 1194 1159 660 -369 -995 -1262 -873 -72 839 1256 1223 419
3880 419 -345 -1063 -1556 -1066 88 1131 1670 842 449 -557 -1334 -1098 -946 244 769 1078 709 365 -374
3899c74o17j78J64J352O17L49j24o79q92n86k86K56R39J016M22l82l98j059n65
3918a025m09O89Q01O51N95k73j030m02p47N1L28R60R80J57k33q47q85o58o7O02
3938g62J252K38O29k96o44j123p86K19N07Q82R12K62L1r26j313l33J33M06N29
3957a83J244K25m08m80j085l87n9L65O74J008L01j69p58r19l97j05O49O27Q21
3976I64K82l59k55j112o25M8K64J056O48L56j27o71j013l92n9L82P11P94J93r9
3996I86p17p92n59o7L66O66Q76N62l10o36o86q30L22j94J443L31K93j25p70q97
4016g38k70j77J52J175N71K23M4p73o18p12J82K95Q97N62P00n41n69q50n60J8
4036i89K55Q49O95N23m61n75p90l55k78M72O61P56L41k15n34q20o28K95K57O40
$$ plain form
3899 -374 -991 -1169 -1005 347 964 1313 1189 510 -382 -968 -1254 -998 -59 957 1379 997 599 -460 -1025
3918 -1025 -1434 -745 56 707 1302 1029 -1 -403 -1150 -1099 -771 189 1169 1326 1093 246 -639 -1297 -1364 -762
3938 -762 490 728 1357 1061 417 -706 -1492 -1273 -766 116 1028 1290 1321 395 -918 -1251 -1118 -712 -183
3957 -183 1061 1286 878 398 -687 -1074 -1133 -768 -94 914 1215 1046 288 -631 -1028 -1133 -484 143 964
3976 964 1246 887 632 -480 -1105 -1057 -793 263 911 1267 1140 469 -544 -936 -995 -613 98 892 1085 986
3996 986 269 -523 -1082 -1149 -783 -117 759 1321 1011 375 -311 -1141 -819 -1013 430 761 1054 929 159 -738
4016 -738 -1008 -1185 -1033 142 713 936 980 207 -411 -1123 -941 -646 251 813 1513 972 403 -447 -1007 -989
4036 -989 -734 115 810 1333 872 297 -493 -848 -1126 -654 7 763 1104 889 355 -465 -1093 -798 -541 99
4056I9O67N44k32n47q06p45l1L32Q80P80M17k18q17q61l85k44N96R79M44P12n23
4077A041n50j080l99k35M91O94J132r2O8p95p47o86K67M28L76P29L21O8o99o17
4097b85n77k55O38N90Q15K21m16n56m96o88N0L00J011N22J21j19k60j087o21m5
4117a137O35O00Q00R8l55l69q36m02m1O83L88O31K94j83l73q88n83J8L03N76J141
4138A000o7o3n23p44q17L12m4J019O62L87n39n77m66m45o8L88N48P37N03o81n83
4159f1j59n68m74R82L53P25L35j73r16m58p75J57N69O38M97M56m14l53q59o88
4179a186L80M73P34L73L30k30o67p78k02J86o0R97K76qJ05l84q27m91lK08Q94
4200A20Q71K12k55r28n90j31p0K05Q34N49L9L7n36q73n05M4N70M34O43P8P0n52
$$ plain form
4056 99 766 1310 1078 531 -275 -1020 -1051 -719 161 941 1358 1140 323 -538 -923 -1167 -571 408 852 1564 1041
4077 1041 491 -589 -988 -1223 -732 -38 1094 1002 1070 275 -472 -1158 -891 -463 -87 642 963 1031 332 -285
4097 -285 -862 -1117 -479 111 926 1147 731 175 -321 -1009 -959 -659 352 874 995 876 616 -471 -1092 -1137
4117 -1137 -502 98 898 996 641 272 -564 -966 -1007 -324 64 695 989 806 433 -455 -1038 -1020 -717 -141 1000
4138 1000 933 870 347 -397 -1214 -902 -946 73 735 1122 583 6 -460 -905 -973 -585 -37 700 1203 522 -61
4159 -61 -220 -788 -1262 -280 73 798 1133 960 44 -414 -1189 -1032 -463 175 672 1128 714 361 -498 -1186
4179 -1186 -806 -333 401 774 1104 874 207 -571 -773 -587 -647 350 626 618 723 339 -488 -979 -982 -774 120
4200 120 991 1203 948 20 -570 -701 -771 -566 268 817 856 893 357 -516 -1021 -977 -407 27 670 748 818 266
4222B66p10m16o7M61P86L87J02k7o45n91k59j56L82N82Q40n2Po96m27p93L8O22
4244c66L33R71K3k44n13r44K53lM5N54P40J24j84l71o77p13j01O96L41Q51k8k80
4266E07l2p15o41j98M84P64N37K78j38o12o43j72k03L29P64O02R8l53p90n48j31
4287h13j57P08M49N55K41l00o93m77k60j09M50L56P86K16Q6r11l90m00k49O39
4307b73P66K09K79k64n55n60m69J55M12O21M74k23J23p59o48j1j41N11O41K31
4327E19P29q20l85m66m05j70O51N24O39p5J84j065l40k97p3O53K37O91J84l29
4347E86p30l02m09J48K32O67K30L94Oo26o30k32j3K19N79L54N33l37m66m89l87
4368f73L4M63Q8O47M0m50j83m29k04l53N43M32L41N62l62m57n49r8k66O13P17
$$ plain form
4222 266 -444 -860 -927 -466 320 707 809 782 137 -454 -713 -869 -487 95 935 883 890 194 -233 -1026 -988 -366
4244 -366 -33 938 961 717 204 -740 -487 -490 -445 109 849 973 789 418 -259 -972 -1073 -377 -36 815 787 507
4266 507 475 -240 -881 -1079 -595 169 706 984 846 234 -409 -581 -784 -455 309 911 1009 656 -134 -682 -813
4287 -813 -970 -262 187 742 983 683 -10 -487 -747 -856 -406 -50 736 952 1038 127 -263 -663 -912 -273
4307 -273 493 702 981 717 162 -398 -867 -712 -300 321 795 572 695 -64 -712 -723 -864 -353 288 519
4327 519 1248 428 43 -423 -828 -998 -347 177 816 741 925 -140 -480 -777 -850 -197 40 731 915 586
4347 586 -144 -446 -855 -707 -475 192 422 816 822 196 -434 -666 -679 -460 119 473 1006 669 203 -286 -673
4368 -673 -639 -176 -88 559 599 149 -34 -463 -667 -1020 -477 -45 296 858 496 39 -510 -608 -874 -261 456
4389D56K54L57n19m68l96l26R6J10P21K05L26n4m51p92o65K20O46M10J28K97J79
4410G34p23m22n52K01M05L06O20L76m59m66k77m16j32M53N21L82L55l77m50k83
4430b04r36K70P49M23K43Q6r8m62j86o11j31M96N48M35L92m85k90p36k49k18Q87
4451g7N08M65l58J53p75M5n19k33O88L16M13K89n80J2q59n4J33J40L24N28K23
4472G82k15m18l96l03r9J32Q33K82M1j2p13m21p1K21l06J080J12Q4K06p59n52
4493d92k38k91P29K81N31L4j9m45p04Jo9L97M17O55q3M8n92l08l58m50O19N51
4515B14K26L67l39m09j41o77k97P34M91L20N04r01J75m54p26J14L32Q69K96k9
4535F69L9p51m04m01k6O18L60M08L51k93m76n64k28l22R21M97J96J56k79m20l82
$$ plain form
4389 456 710 1067 548 80 -316 -642 -546 -436 285 490 816 762 311 -481 -1146 -926 -280 130 258 555 734
4410 734 11 -411 -963 -762 -357 -51 569 945 486 20 -257 -673 -805 -352 169 551 906 529 79 -204
4430 -204 -1140 -870 -121 302 545 631 533 71 -115 -726 -857 -361 187 622 1014 529 239 -497 -746 -964 -77
4451 -77 431 896 538 691 -84 -39 -558 -791 -103 213 626 915 335 347 -512 -566 -433 -293 31 559 782
4472 782 567 149 -247 -550 -649 -517 316 598 639 627 -86 -507 -578 -357 -663 417 529 613 819 60 -492
4493 -492 -730 -1021 -292 -11 520 554 535 90 -614 -613 -682 -285 132 787 704 752 160 -148 -506 -956 -337 214
4515 214 440 807 468 59 -82 -759 -1056 -322 169 489 993 92 267 -187 -913 -799 -467 402 698 669
4535 669 708 -43 -447 -848 -874 -256 104 512 863 570 94 -470 -698 -1020 -99 398 594 750 471 51 -331
4556c31n24J52J34P47j82Q45m33m76L8o44M14O1K97M10K93m72j12o27n95M87p8
4577e96Q96K87J63j77o27m27j02Q4J72M81L08K96j62k83o00k59j63K96O38J44
4597C69K33m7m77m25k58J81m0P72l2L60m98m3l02m93K40J26P12o6K90j48k25p59
4619e30j20k01K80Q68J01K01o5l79m58j39k03O32N32J25j50j09k39m29j14m32
4639h29N64N09L63K5j61o45j94j02M6K06K97L66L09m44j14n42j77j00M99M14K21
4660E11K95n37j19n00m33L97k52O31O93P4k5p86m73l18J11M54M77L98o9J70o39
4681F0m97j04Q8L04L01K58J53k96l62o14J52k7L74L96K87K49k31n65j72j64j68
4702e78L97K09P12J21m29n08l48k47K23Q3N50N20K48n87O6n02k44j85N23K84p9
$$ plain form
4556 -331 -855 -703 -569 178 -4 841 408 -68 -30 -674 -260 -199 98 508 801 329 217 -410 -1005 -518 -596
4577 -596 300 587 750 573 -54 -481 -583 -499 -327 154 462 758 596 313 -287 -546 -709 -413 225 369
4597 369 602 555 78 -347 -605 -424 -464 308 276 636 138 95 -207 -700 -460 -334 378 312 602 454 229 -530
4619 -530 -650 -851 -571 297 398 599 534 155 -303 -442 -645 -13 519 644 494 385 146 -283 -397 -829
4639 -829 -265 244 607 632 471 -174 -368 -470 -424 -218 79 445 754 310 196 -346 -523 -623 -124 290 511
4660 511 806 269 150 -350 -783 -386 -638 -7 686 760 735 -51 -524 -842 -731 -277 200 598 529 699 60
4681 60 -437 -541 -453 -149 152 410 563 267 -95 -709 -557 -584 -210 186 473 722 491 -74 -246 -410 -578
4702 -578 -181 28 740 861 432 -76 -424 -671 -448 -365 185 705 953 366 432 -70 -314 -499 24 308 229
4723B29N78n70m12k74l71M78L90J85L71J03l51l31l59k01p2M99M83K92r1q2n47
4744e3k00l39M5J10P84J00J81l22j67m29l47K7L34N07L62m03L13n61k36l89L4
4765f49N44M36K30Mp6m55k48k87L8L11M07K49OQ6p61l63L7J90O7L56M17J33l11
4788C61n65k88l00L92n1O61q5L18j23m54n44J48J4L46J78P33l06k66p5m31l99
4809g36K0N08N88J5N5j24l85l47j73J14J78O68j03K61o3n27n18p1j30L35N68K09
4831C42j74N8k63n09L5J76K46M27Q4P7j7o74j93j63O5L26K00K05J29J0m79l39
4853d31m5k74M08N9N73N17p11k86l79J03L94j68M48Q7K51l28k51k34n25N63J08
4874a21L03M05m37Q7m4o43k51N53k81O85J86J88j18k35n77j02r9K13N36L57k3
$$ plain form
4723 229 807 237 -175 -449 -820 -342 48 233 604 707 356 25 -334 -535 -607 -108 375 667 576 494 -53
4744 -53 -253 -592 -547 -437 347 447 628 306 139 -290 -637 -610 -276 231 593 190 503 -58 -294 -683 -649
4765 -649 -105 331 561 565 489 34 -214 -501 -463 -152 255 504 510 596 -165 -528 -491 -301 -234 122 539 672 361
4788 361 -204 -492 -792 -400 -451 210 125 443 320 -134 -678 -530 -516 -170 8 741 435 169 94 -337 -736
4809 -736 -716 -208 380 395 450 326 -59 -406 -579 -465 -287 381 278 539 476 -51 -569 -640 -770 -435 133 342
4831 342 168 226 -37 -546 -511 -335 -89 338 422 499 482 -192 -385 -548 -483 -157 43 248 377 387 -92 -431
4853 -431 -476 -750 -342 -283 290 807 96 -190 -569 -466 -72 -240 208 295 546 218 -33 -267 -792 -229 -121
4874 -121 182 587 150 237 193 -450 -701 -148 -429 256 442 630 512 277 -300 -402 -501 -288 248 605 582
4895E82m42j85l64J7J93J54K32M7J00J11j44o04j13J21J67L39K91o0k8n04k65
4916c55q0J01L74k2L84L18n94J73q97j28M00O0P45o2L12l13m86j55k79p8L97L31
4938A46J43L84m62l25K0m86J02M57J85K99q1k01l15k55l1l4K36K68K73J00M9o31
4960a59l05k38K73L80J02O00l21m25L20o60J35k75M01L19L17K84l93l37m37L2
4980c87j40J43M57O04m2l60l65k71o3k1K62N10j28J84m9m39k75q0K27N9L29K52
5002D07P8k27l20l53j36J21K71O09j94J90k74q8n26j39K58M11J20L90K5m46j24
5023E3m25k97M28P8L09M36J86l33o24k67k8J20J00M63L24l17R5k32p8n22J82l
5045c52M96K45M1j62l85k70l00Q9P44L1J18J54l36q1m89J50p5J83P40k20l1Q7
$$ plain form
4895 582 140 -45 -409 -392 -199 -45 187 234 334 445 301 -303 -416 -295 -128 211 502 442 414 -90 -355
4916 -355 -435 -334 40 18 402 720 126 299 -598 -726 -326 -266 479 417 729 416 -70 -225 -504 -582 -185 146
4938 146 289 673 211 -114 -94 -580 -478 -21 164 463 382 181 -134 -389 -420 -454 -218 50 323 423 472 -159
4960 -159 -464 -702 -429 -49 53 653 332 -93 227 -433 -298 -573 -172 147 464 748 355 18 -419 -387
4980 -387 -527 -384 73 677 635 275 -90 -361 -424 -445 -183 327 199 383 334 -105 -380 -460 -233 -174 155 407
5002 407 485 258 -62 -415 -551 -430 -159 450 256 446 172 84 -442 -581 -323 88 208 598 623 177 53
5023 53 -372 -669 -241 -163 146 582 768 435 -189 -456 -484 -364 -264 199 523 206 301 69 -9 -531 -349 -352
5045 -352 144 389 430 268 -117 -387 -687 -598 146 177 295 449 113 32 -457 -307 -382 -199 541 321 290 377
5067C77l90k04k06K11J24M40m6j33r9o8l64q0o2N08O4M25L25q82M21r02M3j4L07
5090b05M66J38J79j21o01j08j45K90K38J15J34k12m5l96j45j56L5L00O30K4Q6
5111E01k31k66k47N8l50N79J34K76j5k61m84l0K0M1K2N00J89k6Ll95j49l20J39
5134c12K7M75L07J8k52m09l50m6K60J38L31L20Q9k01m27m17P6Q4L5L46J99K49
5156E40k19m32j95R5j95L82m7N24J07k17j22m92k97M13j0M22j9K1j00n29N6j04
5178d18P2K90L46L69j82q0o49k4j15M3J63L38L67k49ml74l21p0L94L06k44M37
5200C95N7l9n77j0Rp6M6O03P7l3l81J45k57o37J38O79M2J19J05k69m57p5k53L90
5224b59K73j31O88n45L9k10m76L21j58K79L53m9K85l09l58m16L76j06M05L5N94
$$ plain form
5067 377 -13 -217 -423 -212 -88 352 306 173 74 6 -358 -438 -500 8 72 497 822 -60 361 -541 -498 -512 -205
5090 -205 261 399 578 457 -144 -252 -397 -107 131 246 380 168 123 -273 -418 -574 -539 -239 391 415 501
5111 501 270 4 -243 -185 -535 44 178 454 439 178 -306 -336 -316 -275 -253 247 436 410 413 18 -131 -451 -312
5134 -312 -285 190 497 515 263 -146 -496 -542 -282 -144 187 507 596 395 -32 -449 -373 -289 -254 92 291 540
5156 540 321 -111 -306 -211 -406 -24 -71 453 560 343 221 -271 -568 -155 -165 257 238 259 159 -370 -314 -418
5178 -418 -346 -56 290 659 477 397 -252 -276 -391 -348 -185 153 520 271 267 -107 -428 -498 -104 202 -42 395
5200 395 452 413 -164 -174 -165 -241 -195 408 485 452 71 216 -41 -678 -540 139 181 300 405 136 -321 -396 -649 -259
5224 -259 14 -117 571 26 65 -145 -621 -300 -458 -179 174 125 410 101 -257 -673 -297 -403 2 37 631
5245F31j28l07k11k87LM13j98o2L92J86j16l90m66J92J19J16L14J73K93n64Pm96
5267c86j29J29L34K82K15j17j79m8n47J22j8O35j19L50j5l11k24k91o0K6M64k69
5289a56Q53M3o18j07k16j31o7J77N29K3O5j45l03k13j89q8N63O2L36J06k87m05
5311a68j74j52j6P11j37N60l91j56k86P7l01K16J49P2M13j8l21o2P5k86l52N45
5333bK13N28n42K62m42l87j04K64P3J78L15J26l02l19k22K1j13N05K97p7Lk16
5355E9k33k66L16j10J46K27J45K1k17j23j53l38J46J20M81L46j69o3m73J8Jj33
5377b52L13J05O9K48m15l87n9l8OM30l3N19r3m20j78j89j63K52L16M3J49j31J02
5400A94m82r4J6J05M57R4o0K54m24q0j12m54J41K99L43n6J93j04k19q1k16O3J54
$$ plain form
5245 631 503 196 -15 -302 -299 114 -84 -146 246 432 316 -74 -540 -348 -229 -113 201 374 667 103 110 -386
5267 -386 -515 -386 -52 230 445 328 149 101 -446 -324 -342 293 174 524 509 198 -26 -317 -377 -351 113 -156
5289 -156 697 740 122 15 -201 -332 -399 -222 307 330 395 250 -53 -266 -455 -543 20 82 418 524 237 -168
5311 -168 -342 -494 -510 201 64 624 233 77 -209 -132 -433 -217 -68 4 417 399 78 16 91 -195 -547 -2
5333 -2 211 739 197 459 17 -370 -474 -210 -137 41 356 482 180 -139 -361 -340 -453 52 349 272 275 59
5355 59 -174 -440 -124 -234 -88 139 284 305 88 -35 -188 -526 -380 -260 221 567 398 335 -138 -120 -119 -252
5377 -252 61 166 235 483 68 -319 -378 -416 -410 20 -13 506 413 -7 -185 -374 -537 -285 31 74 223 92 194
5400 194 -288 -382 -366 -261 196 290 230 484 60 -20 -132 -586 -445 -146 197 141 334 230 11 -70 -286 -223 -69
5423f9K96K1q0K62o47n0k70M14O1J52M44m96p7K22k06l49J70K02K14J69p5l50
5445d2K6m60K95j09j1M28K22L9m56k23J81l79J18M01LO35m09j17j80j76P7l04
5467d41L38J29M53l79K64n56k85K47OJ24P2L54j79J91l14l91k77N60K11K11J8
5488C56j28j55l21j41K9K36J28J19L93j38l91P5m13P8p7L81j9L94q2j66l70p3
5510b85n8k7K64N76j88k17N6l0n33J11j09M55L72j03j71r1O7l52L1j19M32O11
5532F92m04J18k89k61K29n65M26N5L24l1M2j53m26m2M0j12N82l0P9K1j07o00O0
5555c52j23K33PM59N6O4j5q63J30J8j19P67m5P5Q2l00j16o5J14j43O10k51J88
5578D11k8n98L29m05j74N21K9K99k86J86k25n1l75j70L65M35j08J58r1k50o0j02
$$ plain form
5423 -69 227 248 168 430 -217 -267 -537 -123 -62 90 534 38 -39 183 -23 -372 -202 0 214 383 308 -42
5445 -42 -16 -476 -181 -290 -301 127 349 388 -68 -291 -110 -489 -371 30 33 668 259 142 -38 -214 -137 -441
5467 -441 -103 26 479 100 364 -192 -477 -230 -224 -100 -28 326 147 338 24 -367 -644 -84 127 338 356
5488 356 228 73 -248 -389 -360 -124 4 123 516 378 -13 62 -351 -273 -350 31 12 406 324 158 -212 -285
5510 -285 -343 -370 -106 470 282 65 121 91 -442 -331 -440 15 387 284 113 22 89 -263 -232 -351 81 692
5532 692 288 406 117 -144 85 -480 -54 1 325 294 336 183 -243 -285 -245 -357 225 195 274 295 188 -412 -352
5555 -352 -475 -242 -235 224 280 344 329 -534 -404 -386 -505 262 217 292 374 74 -42 -107 7 -136 474 223 411
5578 411 383 -215 114 -291 -465 56 85 384 98 284 59 8 -367 -537 -172 263 155 313 222 -28 -88 -190
5600a90J5j45M76R4k7m3o3j79l18k3J27L33Q3O35m76o4k05m30j83L50K89N4J45
5623B55L07l05l24k26o1J3N30j27o3J90j89l5k54j44R3Q3N44j9N2j00n32K22l12
5646d02J34j42N74L68r1n73j4l32p9K51K07L78j72K18p2l63j6j77q3K33L32K60
5668D39m65J57k87j16O3RL64RN5o1Nk31n7n0P6JLN11j05j25k40j40k5j80K77J48
5694C5J91Nj2n64K09j7j43K02J76J61p9J25o08L4j44J04L34O2m5j30L1j14N8j83
5718c12O5L30J43L5K52k85k33m99L27K35J69j47L92j69m67j4Q7k01k9M09K08k75
5740B1K21K1l81J64k25j9k7P06j58k25j63k07J30J98m84N48J6k0J09k09j02j22
5762b08O6K0K12L03j88j8Q7k04m55M90o38M83R3M26k28m73k6Qr6K91L05P0j67
$$ plain form
5600 -190 -175 -320 156 250 223 180 117 -62 -380 -403 -276 57 140 775 299 235 30 -400 -583 -233 56 110 255
5623 255 562 257 -67 -293 -354 -341 189 62 -1 189 0 -35 -289 -433 -340 -257 287 268 320 220 -312 -90 -402
5646 -402 -268 -410 164 532 441 -132 -146 -478 -557 -306 -99 279 107 325 253 -110 -126 -303 -386 -153 179 439
5668 439 -26 131 -156 -272 -209 -200 164 173 228 167 172 -59 -116 -166 -90 -89 -86 425 320 195 -45 -185 -210 -390 -113 35
5694 35 226 231 219 -345 -136 -153 -296 -94 82 243 164 289 -319 -285 -429 -325 9 71 26 -104 -73 -187 -129 -312
5718 -312 -247 83 226 261 513 228 -5 -504 -177 58 227 80 472 303 -164 -178 -91 -292 -321 88 296 21
5740 21 242 263 -118 46 -179 -198 -225 481 323 98 -65 -272 -142 56 -428 120 136 116 225 16 -86 -208
5762 -208 -142 -122 90 393 205 187 274 70 -385 105 -533 -50 43 469 241 -232 -258 -250 -346 -55 250 320 153
5785A53j28K72k94j70k05J04M78j73j0M00k98N5m79j23M60n0L16n5P9l8l68j57
5807b31j87M0J76O36l11O8J94j90l26j04L73p8J43K86l62O6l30l58M1L72j44M10
5829A84J55j32j23j99J62l13j0K34J79J69j00K78n60l01K9J63M8K64K17k65o4
5850A5l03l66K38J72L00J95j21O0l35j09Q9k03J31L65j06J68j31j38j29j8JK33
5872HN0N2p6J48j7j48k72j88R1K79Q3K86%j90l0l97L91k82K67J56k28K22q3k89
5896a67LO9M2K5K5K03j7k08K26l76l52J73L70m3M47r9j71p8k66j06J68J4J66m0
5920HL81m28L8n1l49J08N67j64k2L7j65m6l56M08l19K26J95J32J68k18j25k46
5942b21K9p4K71m4L05j73R7k60l1m6k6N7K42L44l57J7j32q4k97L05Q3J05K67l9
$$ plain form
5785 153 25 297 3 -167 -372 -268 210 37 27 427 129 184 -295 -418 42 -8 308 253 332 294 -74 -231
5807 -231 -418 -378 -202 434 123 191 385 195 -131 -235 138 60 203 489 127 193 -137 -495 -454 -82 -226 184
5829 184 339 207 84 -115 47 -266 -276 -42 137 306 206 484 -76 -377 -348 -185 -137 127 344 79 15
5850 15 -288 -654 -416 -244 56 251 130 190 -145 -254 -165 -368 -237 128 22 190 59 -79 -208 -226 -225 8
5872 8 58 110 34 182 165 17 -255 -443 -352 -73 10 296 296 106 76 -321 70 -212 55 211 -17 205 122 -167
5896 -167 -164 -95 -53 -28 -3 200 183 -25 201 -175 -527 -354 16 -27 420 321 150 72 -194 -300 -132 -118 48 8
5920 8 389 -39 -1 -52 -401 -293 274 110 88 125 -40 -86 -442 -34 -353 -127 68 200 368 150 25 -221
5942 -221 -192 -266 5 -39 266 93 190 -70 -101 -147 -173 -116 126 470 113 130 -2 -86 -383 -78 5 110 377 338
5966C38l84K03l14J31k07L3O48q6k28k8n7l60L23j80K06K35n4m5k81j45o5J99
5988a18n0k4M06j2k82l3P1J06m7l16N66p8o8L04n75K27m21j23L91J83j26J03L42
6011D26l18l49P0l8p1J13K81K33qqn99LL3M9K20P9j1m7m55L54Mj57J86L1K09q5
6037A45r9qj22j07K84l22M8K04Q2J24j68k11J1j04J82n3L97j0P7m91r2Q9j1J74
6061A9j24J55J64k35P2j88j74J13K14ln4J55J2l9N4n00j19L91O3Q7k5L12k36l91
6085b77LJ12pj9P09l68J18o20L12j37n4jL1J63L38l90L82m48O6J6k41M92p1L23
6109D32j58q8j35k81P3Q1j24L92q7K6l45J05J91k21pJ51o5J55kk01M8j55k1K55
6133A9j68K21K62m25M80m80j15j03n0L11M98k56j88J53l65n3rJ76J15J30m8J46
$$ plain form
5966 338 -46 157 -157 -26 -233 -200 448 362 134 106 49 -311 12 -168 38 273 219 174 -107 -252 -317 -118
5988 -118 -168 -192 214 202 -80 -113 -42 64 17 -299 267 189 121 425 -150 77 -344 -467 -76 107 -19 84 426
6011 426 108 -241 -171 -209 -280 -167 114 347 339 331 -268 -265 -232 -183 37 116 105 58 -397 -43 -39 -196 -10 21 230 145
6037 145 46 38 -84 -191 93 -229 -181 23 105 229 61 -150 -139 -243 -61 -114 283 273 350 -141 -233 -144 -155 19
6061 19 -105 50 214 -21 51 -137 -311 -198 16 13 -41 114 126 87 141 -359 -478 -87 -24 63 38 350 114 -277
6085 -277 -274 -162 -169 -188 521 153 271 -349 -37 -174 -228 -229 -198 -35 303 -87 295 -153 -87 -71 -312 180 109 432
6109 432 274 186 51 -230 -157 -76 -200 192 105 131 -214 -109 82 -139 -146 5 -60 95 93 -108 -60 -215 -236 19
6133 19 -149 72 334 -91 389 -91 -206 -309 -359 -48 450 194 6 159 -206 -259 -268 -92 23 153 105 251
6155B51j29j66J68m66L62j47J15K82R1r8k81m76L00J67J10k4l4L68k65J74m95
6176a93j74L8N42k72L76j54o2k72L45m76M12J18j50L10k97j97Mk15O17k45J51
6197B06Pj19L1j90j66l8K38p7K23J51q6j88L2k39J5J26nK15k6N4j10p2p6q1p2
6222b47L14j4k31M57l76K7k5j41J99n8Kn5J75L08k40r2k69j8L13k29J77N58n47
6245a2k25J06J25l73J85K89k23L00J84j48k12j52k06O37l95R9L27l59M03l32m4
6266b6j39p2N66k33L05m02J56k87k74K15j09L29L05L9l64K42k71j16K0nJ00L4
6288A3j0N7L08n20J56k55m4N67j71R8R1j07k82p8P1p3M14J90l05l02K45j05K33
6311A91m85M4J61P0L60k17J31k99Q5m85N81k71N05k06k03J28l23K53r9l0L24j96
$$ plain form
6155 251 122 -44 124 -342 20 -127 -12 270 361 263 -18 -494 -194 -27 83 59 25 393 128 302 -193
6176 -193 -367 -329 213 -59 317 163 101 -171 174 -302 110 228 78 388 91 -106 -102 -317 300 55 206
6197 206 213 94 125 -65 -231 -269 -31 -108 115 266 180 -8 24 -215 -200 -74 -79 136 110 164 54 -18 -94 -175 -247
6222 -247 67 53 -178 279 -97 -70 -95 -236 -37 -95 -93 -148 27 335 95 3 -266 -284 29 -200 -23 535 -12
6245 -12 -237 -131 -6 -379 -194 95 -128 172 356 208 -4 -156 -362 275 -120 -21 306 -53 350 18 -26
6266 -26 -165 -237 329 96 401 -1 155 -132 -406 -191 -300 29 334 373 9 251 -20 -136 -116 -121 -21 13
6288 13 3 60 368 -152 4 -251 -295 272 101 199 290 183 -99 -177 -106 -179 235 425 120 -182 63 -42 191
6311 191 -294 -250 -89 -19 341 124 255 -44 41 -444 137 -134 371 165 -38 90 -233 20 -79 -109 215 19
6333A9L7J73l29L14l13k58L16P7J01p8q8K2p2j88J65j52N04o0J59k33n33N66l65
6356b16j62L42J71o4M9q2k05K44l19K97K4J65r4J2j80M1K2PP2k97K01L52J1m06
6380a5j46k7M5J60k38J22k7J54K17l31M2J98l69K71K54k19J46j89N5j97j19j74
6402c87K65J11J17M9l1K5j53j13n6J22J26J28n5R3j65q0k87J71P3j33K27J17L3
6425A97k17j28m6R8r2N9K14j54N34k55n03o1p4L97Q9J99k12K1m3K9k9k9k0J62
6449A36Q0l01N8J13l17qM1J33m5J31K0K33l68q2j08j01K68o4M36j68J30m4l28
6472a55l18J48j6M4M36q6mj37o8j23j28K23K56L17j12j85J74m48p1Q8J53P4j85
6495a23K85K5J16q20K15J2M21l16M98l71J63J49p3m49M5n4M91k40L42j47k57M
$$ plain form
6333 19 56 229 -100 214 -99 -357 -41 36 137 59 -29 -7 -79 -267 -102 -254 250 190 349 116 -417 149 -216
6356 -216 -378 -36 135 71 120 38 -167 77 -242 55 79 244 150 162 -18 23 45 52 124 -173 28 380 391 -15
6380 -15 -161 -188 -143 17 -221 -99 -126 28 245 -86 -44 154 -215 56 310 91 237 48 103 -94 -213 -387
6402 -387 -122 -11 106 155 124 149 -4 -117 -173 -51 75 203 148 241 76 -4 -291 -120 -47 -180 47 164 197
6425 197 -20 -148 -194 -96 -188 -129 85 -69 465 210 -293 -354 -428 -31 58 257 45 66 23 52 23 -6 -26 136
6449 136 216 -85 -27 86 -231 -239 -198 -65 -110 21 41 274 -94 -176 -284 -385 -117 -181 255 87 217 173 -155
6472 -155 -473 -325 -341 -297 139 53 49 -88 -156 -279 -407 -184 72 389 277 92 266 -182 -253 -165 -12 62 -123
6495 -123 162 187 303 -517 -302 -290 131 -185 313 -58 105 254 181 -268 -223 -277 214 -26 316 169 -88 -84
6517h4j37L3qL71j53l1J27j56j93J75q9Lj6L26n4J6j85m4R5k50J84K53J7j27n8
6542A5R1k62n1L31j77k30O03l61M2K81m89kJ30l8R7k33L95j53q2L89m65K2K91
6565A44k14j5K31l52K60k54J31K4N8J41L3J5j20j65j17J33k7L9J19L30l60M07
6587D41m73j00L12l20K7K73J54l65m0J59l41K69j84K31o2Q0J59M4j45j47ok33
6609b67J78K35j67m4K63j64k87K25j35J46j2M19k53l5N5k65l4M5L13l16j3M30
6631C17j47j57j29k71J83RJ63J64j8J23l6m30l0K25J59q8P7J51P6k28k36J87K41
6654C05j93j04O6j95J08J01k92J26m1P8J81J11L0o6j75j27Q5l68M33k60J50j7
6676f4M86m43k77L51m6J9j1l04J59K17K02j03k09M8k33K53P9pr2o8j56j01K49
$$ plain form
6517 -84 -221 -188 -196 175 22 -9 118 -38 -231 -56 -145 -142 -158 168 114 130 -55 -99 -4 -254 -70 183 200 73 15
6542 15 106 -156 -207 124 -53 -283 320 -41 1 282 -207 -209 -79 -117 -20 -253 142 -11 -93 296 -169 -147 144
6565 144 -70 -85 146 -206 54 -200 -69 -45 13 154 187 202 82 -83 -200 -67 -94 -55 64 394 34 441
6587 441 -32 -132 180 -140 -113 160 314 -51 -91 68 -273 -4 -188 43 -19 61 220 264 119 -28 -34 -267
6609 -267 -89 146 -21 -65 198 34 -253 -28 -163 -17 -29 390 137 102 157 -108 -142 -97 216 -100 -113 317
6631 317 170 13 -116 -387 -204 -195 -32 132 114 237 201 -229 -259 -34 125 37 114 265 341 113 -123 64 305
6654 305 112 8 74 -121 -13 88 -204 -78 -119 -41 140 251 281 215 40 -87 -2 -370 63 -197 -47 -64
6676 -64 422 -21 -298 53 7 26 15 -289 -130 87 289 186 -23 25 -208 45 124 117 25 -43 -199 -300 -51
6699e1N2p8r3O13p32M80j82M9K4o8J30K8J19j19R7l48j48q9Q0J57K71k02j31l8
6723a79J0j63J86J06j20M98k22R9k12m69M39j07rk15O40q5l81M20k02j34L19k8
6745A91k18K01j89J0m9p1L23l55J04j11L30j20q7P5j51K5J38q5p3K08j2j56n3
6768a25J31k51K40k18M17P1j79l0j39j39J41k39K26Q7J49k30L1j03J49j09l2Q6
6790f6L05k64k18P14n46j32k10L04j65L02K31k22j6j28J47k95J15L50l65M85n42
6811b16L21j59M7j06p4J99q5J12K59j88l4n7j2j18J55J68k55m7L24P3l01OJ70
6834A82k26L18n8pj48q5m14K08K61j36L36l34L83j72j10j83L50k12K00k1j48L92
6856C76l56j70k00N11j32o6o2K30j71K3J06J2J50k43J25j94K40j57r7j0o8Or0
$$ plain form
6699 -51 1 -77 -170 443 -289 191 9 58 82 14 144 172 291 172 269 -79 -227 -316 -236 -79 192 -10 -141 -179
6723 -179 -169 -332 -146 -40 -160 338 116 215 3 -466 -27 -134 -143 -358 282 197 -184 236 34 -100 219 191
6745 191 -27 174 -15 -5 -54 -125 198 -157 -53 -164 166 46 -41 34 -117 -92 46 -39 -112 96 84 -72 -125
6768 -125 6 -245 -5 -223 194 265 86 56 -83 -222 -81 -320 -94 -7 142 -88 -57 -160 -11 -120 -152 -66
6790 -66 239 -25 -243 471 -75 -207 -417 -113 -278 24 255 33 17 -111 36 -259 -144 206 -159 326 -216
6811 -216 105 -54 -7 -113 -187 12 -73 39 298 110 76 19 7 -111 44 212 -43 -90 234 307 6 12 182
6834 182 -44 274 216 209 61 -24 -438 -230 31 -105 231 -103 280 108 -2 -185 165 -47 153 132 -16 376
6856 376 20 -150 -350 161 29 -37 -99 131 -40 -17 89 101 251 8 133 -61 179 22 -75 -85 -153 -147 -237
6879b37M30l89N76j55P7j80L2k24j97L70j08r2j01J93j68K53n02J76J12N8K27
6900A51R1N1o70J68K32K12l33P0K22j15j33k7K69j61L4k63P5K99j1j59j54K89
6922A37m07P8j9L21rL69m50O2j11l4j19J09J68Q3q5j27j00j77L42l38J23P2K34
6945A22j66N4j07J84k57M02k42P9N8l4o1K22K4l81k24L37q5j74P0N1K63j36r9
6968a00l4L7K10p9jJ45j40j48J83j07l26J84J46Qj92J3N9j07j97M38K75k41P8
6991A04R7k76r0K22r3R9j6N0n7J4J89l33l0Q0j36K84j1J59N1l78m8kK26K8k56
7016a23O8K03N5l54K10m0J8J43m21M82k00n0J25j99q4l4oJ02K08j22M0k3R3j17
7040b6o5K51j03Q4K28l93N0j95j90L07J30J08j96P8k96L09q6P8r6k77J51L60k17
$$ plain form
6879 -237 193 -196 380 225 302 122 154 -70 -267 103 -5 -97 -198 -5 -173 80 -422 -246 -134 -76 151
6900 151 242 293 -377 -209 23 235 -98 -28 194 79 -54 -81 188 27 61 -202 -127 172 161 2 -152 137
6922 137 -270 -192 -211 110 101 470 20 82 -29 -63 -182 -73 95 178 93 -34 -134 -311 31 -307 -184 -112 122
6945 122 -44 10 -97 87 -170 232 -10 69 127 93 32 254 278 -103 -327 10 -75 -249 -179 -128 135 -1 -100
6968 -100 -134 -97 113 34 33 178 38 -110 73 -34 -360 -176 -30 -22 -214 -201 -142 -249 -446 -8 267 26 104
6991 104 201 -75 -165 57 -36 63 47 97 40 54 243 -90 -120 -40 -176 108 97 256 307 -71 -119 -121 105 133 -123
7016 -123 -55 148 203 -151 59 19 37 180 -241 241 41 -9 116 -83 -167 -201 -207 -105 103 -19 21 -2 91 -26
7040 -26 -91 160 57 141 369 -24 26 -169 -359 -52 78 186 -10 68 -228 81 -5 73 -23 -300 -149 211 -6
7063fo2J24K30m54O0K89k87N4J83J10k37N8j91J29qJ50m0j71o5P6P2M4Rj70N83
7088D80m88k7qJ82j85L7nN1Pm9K66j63r9k06P8K91m09K33N2l4O2m6J04j99m2K98
7114A81O3q8j24L4k25J34k15K5L80j67M03l70M7J94m79K5L93j23M2N8j6j76Q4
7137H0k30R1OL9J14k89J15o3Q0Q3k12P8k18J47L81k73L22m03M3O7k03M23P6k19
7161C5L4K38m33K49j99j82m4K47J41Q5j24l68O3J41j57J92j1j00J75N1j79J13
7183c3k02J71J22K2J52p1k8k27r3M08l41J68K3k8J89k43r0L95l67p7j7K32l41
7206b76M96l05J83J26j18L6j11K20Po4q8j11q1L03m3k03j59K03J1L21m55R1mk97
7230c18M70j29j91P1L7j0j27R3P1k5J37k53K07L78o80J16M8J35k35L79K30k07
$$ plain form
7063 -6 -68 56 286 -168 -108 181 -106 -52 131 241 4 62 -129 0 -8 142 102 -69 -134 -58 14 58 67 -103 480
7088 480 -8 -35 -43 139 -46 -9 -14 37 44 -5 261 98 -1 -207 -129 162 -247 -14 38 4 66 20 124 -75 -117 181
7114 181 244 156 32 66 -159 -25 -240 -215 165 -2 401 31 78 272 -207 -182 211 88 130 188 172 -4 80
7137 80 -150 -59 -53 -14 100 -189 -74 -137 -57 26 -186 -108 -326 -179 202 -71 251 -152 -109 -42 -245 178 254 35
7161 35 69 307 -126 123 -76 -258 -302 -55 86 171 47 -321 -258 -117 -274 -82 -93 -193 -18 33 -146 -33
7183 -33 -235 -64 58 80 232 161 133 -94 -187 221 -120 48 71 43 232 -11 -101 294 -73 -150 -167 65 -276
7206 -276 220 -85 98 224 106 142 31 251 258 194 106 -5 -86 217 174 -29 -188 15 26 347 -108 -17 -21 -318
7230 -318 152 23 -168 -97 -60 -70 -197 -104 -33 -58 79 -174 33 411 -269 -153 -105 30 -205 174 404 197
7252A97l36K82k40qQ6P6j08Q2j1o4J22j60M4K9J98k89K53p6p1j07K3p1K39O3l25
7277a72R6L17k15O7j35J99k15Q6j06o6R8j22J53k6J39n7J67n44L75k33J06l5p6
7300a99M5J39n0M0L1k4J06j4J67k54j9k3K31J16o8J83l65j02lO2r1P9r6j17N82
7325C56q9n19O24o33N59J73r4l91J53j82J01j19K60k27J04j8Pj1j99J91k1p8j7
7348g0Q3j78J72J7j55O8m1P7J54j70J67L6k30n4P1J90j49q5K16J54n35K71J03
7371A12j23J35l58N2J88j82J45J82r6j49jP3j33N2n4K17j6r8n9L44k01l2q6L56
7395B68l55K78j5j21K24j54j97L42p1k33j6K77j59m21O74m07P3J01m54L14J68
7416A16k85L72m11M83l25K42j38R7l27r4J38j96N25j54k3l82J54R6L84k38j81
$$ plain form
7252 197 -139 143 -97 -105 -19 57 -51 31 20 -44 78 -82 -38 -9 189 -100 153 77 6 -101 -78 -149 90 153 -172
7277 -172 -76 241 26 93 -42 157 -58 28 -78 -144 -46 -168 -15 -41 98 41 208 -336 39 -194 -88 -123 -199
7300 -199 -154 -15 -65 -25 6 -18 88 74 241 -13 -32 -55 176 292 224 407 42 -60 -63 -1 -92 -13 -109 -226 356
7325 356 267 -252 372 -261 298 471 377 -14 139 -43 58 -61 199 -28 76 58 65 54 -145 46 25 -53 -70
7348 -70 13 -165 7 24 -131 -63 -104 -27 127 -43 124 160 -70 -124 -53 137 -12 -97 119 273 -262 9 112
7371 112 -11 124 -234 -182 6 -176 -31 151 55 -94 -95 -22 -155 -103 -157 60 44 -54 -113 231 30 -2 -88 268
7395 268 -87 191 176 55 279 125 -72 270 199 -34 -50 227 68 -353 321 -86 -13 88 -366 -52 116
7416 116 -169 203 -208 275 -50 192 54 151 -176 -270 -132 -328 197 43 20 -362 -208 -112 272 34 -147
7437a47QJ38p9kJ87j15n7J01l8Q6k43J40L5j0K3j07N4j05M52k31l58N45k91K07
7461A93j4j4l52J35K11j35O4l7J19n26O69j10k37O0L4P9Rl78J22k5J29j50J57
7484CK36j34Q2k32l2J71m8JO0j66K89l91M41j77J19l67j46L08K31k02J64k04L04
7507C10j45l66K11j50J66N6j88J41L7k32J64j41J66J6j2m8K9J04J79n83J95m8
7529a39J82L07l94k1l10L58l4L78n72n9M50k69l6K5J89l25P98n04q0L4l0m0J03
7552A1Q3m35K49K49j16J0Q1l36L88j91q0l2o6l1J22kR2J44l25o8M15J1j01j21
7576d9k3N0j68M10k4j05j00P4J8r1j15R1k2J24m2j97Q1J43m00M41j69J61k87N5
7600a44M2j17L17J93o53L27j60J62k85M82l31K72j22j13M4J85j12K04j92P2N4
$$ plain form
7437 -147 -139 -1 -80 -82 105 -10 -67 34 -4 82 -161 -21 14 4 27 -80 -26 -131 321 90 -268 277 -14 193
7461 193 179 165 -187 -52 159 24 88 51 170 -356 313 203 -34 26 60 139 148 -230 -108 -133 -4 -154 3
7484 3 239 105 187 -45 -77 94 46 47 107 -59 230 -161 280 103 222 -145 -291 17 248 46 210 6 310
7507 310 165 -201 10 -140 26 82 -106 35 72 -160 4 -137 29 45 33 -15 14 118 297 -286 -91 -139
7529 -139 43 350 -44 -65 -375 -17 -51 327 -245 -304 146 -123 -159 -134 55 -270 528 24 -56 -22 -52 -92 11
7552 11 94 -341 -92 157 41 51 132 -204 184 -7 -87 -119 -185 -216 -94 -96 -4 140 -185 -253 162 173 72 -49
7576 -49 -72 -22 -190 220 196 91 -9 65 83 -8 -123 -32 -54 70 28 -169 -88 55 -345 96 -73 88 -199 -144
7600 -144 -102 -219 98 291 -362 -35 -195 -33 -318 164 -167 105 -17 -130 -86 99 -13 191 -1 71 125
7621A25l49K30k7j22J58N5k00J15j76o1q1K22O4J63M1j58l0J66o5k0k19j5K83
7644I9k33K75j20l81M55J4l60L45m14M98j91K39j77J21k24QK06o2O1l21O4P6j29
7667a51L00J01l97K19l1J04k04J11m3l70K26K67j9J0k1o6j6l86N06j21q7J17J88
7690B37j99r1J89j90J40j16N9l6K34j97k84J44j06L11N4k22K76j17j44r6k8J2
7712a70K68j70J16J25k59o7L32l70L54l22J87J58q9j14K43l98L05n0j15L0N3J60
7734B07J04m14J81k76K55j81Q7M28n42J41jK14j76l0j61K06J44k21K5q7K39j39
7756Cj66K06j55O1K15P5j37L1Q5j84p5j82M62j74L47j65j98j15N7j72K87k93K37
7779E0K16m95L00L7j34Q1N1O4l43K76J39k92J05m8k23K62Q5Q3l54L2M29q0l65
$$ plain form
7621 125 -224 6 -21 -143 15 70 -130 -15 -191 -252 -333 -111 -47 116 157 -1 -31 135 70 50 -169 -184 99
7644 99 -134 141 21 -360 95 109 -251 94 -320 178 -13 226 49 170 -54 -46 160 98 159 -162 -98 -22 -151
7667 -151 149 250 -147 72 41 145 -59 52 9 -361 -135 132 113 123 102 36 20 -366 140 19 -68 49 237
7690 237 38 -53 136 -54 86 -30 29 -7 227 30 -254 -110 -216 95 149 -73 203 86 -58 -154 -182 -170
7712 -170 98 -72 44 169 -90 -157 175 -195 159 -163 24 182 93 -21 222 -176 129 79 -36 -6 47 207
7734 207 311 -103 78 -198 57 -124 -37 391 -151 -10 -11 203 27 -3 -164 42 186 -35 -10 -97 142 3
7756 3 -163 43 -112 -51 164 239 102 133 218 34 -41 -223 239 65 412 247 49 -66 -9 -181 106 -187 50
7779 50 266 -229 71 108 -26 55 106 170 -173 103 242 -50 55 7 -216 46 131 214 -140 -108 321 241 -124
7802a24K00m5k61M61j84J54q6O7k57K72n2j63kj29L13j72J56r3O3j82O7N2j27
7825g2QM5J25k33L77l3q2k51J06j64J54J00j76M3P9j19k7J51R8L6m27K54J67P7
7849B36l21K13j49O9J75l71L77k41J26l02P4J04J41j29j88L52l18K40k05k00L68
7870E1q8q0K47j13k2k50J11K86k53N4m6K71o7K96n32L68l02k18K8L34J70l64K20
7893A01l03L81l7p3j66M3OJ44q6j08K19j42j28N16l70P6j20m8QK34k13K9k7J00
7917C6R1L4m8l1Q9k57k34J76J90n4o8K14J0k31J18j0K32m07m8M51k04j63J59k45
7941b00K49k94L94k75J01K39k93L8m8Q6k75K23L20r7q2L4N1Q2l81L13j9O4k17
7964A3j98M80j99J09k01J2O1k91L61q8j07K05k24K0Q2J3j74j21Q23r06N84k8l17
$$ plain form
7802 -124 76 31 -230 231 47 201 115 182 -75 197 145 -18 -20 -149 164 -8 148 55 118 -64 3 55 -72
7825 -72 -64 -19 106 -127 250 217 135 -116 -10 -174 -20 80 -96 -53 26 -93 -120 31 129 165 -262 -8 159 236
7849 236 -85 128 -21 48 223 -148 229 -12 114 -188 -114 -10 131 2 -186 166 -152 88 -117 -317 51
7870 51 -37 -117 130 17 -5 -255 -144 142 -111 -57 -103 168 101 397 -135 233 -69 -287 -259 75 245 -119 101
7893 101 -202 179 142 69 -97 -54 -48 96 10 -98 121 -21 -149 367 -3 73 -47 -95 -87 147 -66 -37 -64 36
7917 36 127 161 113 82 171 -86 -320 -144 46 -8 -76 138 148 -83 35 25 257 -150 -198 253 49 -114 45 -200
7941 -200 49 -245 149 -126 -25 214 -79 -41 -89 -3 -278 -55 265 168 86 120 171 253 -128 185 166 230 13
7964 13 -185 295 96 205 4 16 77 -214 147 59 -48 157 -67 -47 35 48 -126 -247 576 -330 254 226 -91
7987i1j35M47j06J01q2n11K59L06j01M5k11K04j64J63r3k33K47k26P6j66L33M8
8009A10j01l8N7j37M3M8o4p7J12Q8k5J30m41L99l2o2r1K21n8k46M43l91L8K35
8033A61k74L7O1J90P4l71M5P5l9J54l25L18k34L47j97l4j25L2L69l45q6K31r7
8056c3l43K60olJ58J13k16N4J75m59Q0J76j48R2J50%L9Nl41J0J29M81m06j01K89
8081A55k44j00K33K15m54L26j17J69l25n5K28j24K05l91K00M4l5M30m36K2K26
8102A72n6k82L03j54K46O8m06K9O9K59k39K51k96L20j61J78k96K5Pj15j18L28
8124A32k47K69j58K68k58k09L10j20J39l76J28K45kr6J55j02j41J91J84ol63K87
8146B30j94J04j51L33l39j52R5K48o4N3l87K24P1J29k47j04R2j5K33j40j24K36
$$ plain form
7987 -91 -226 221 115 216 134 -377 -118 188 87 132 -79 125 -39 124 31 -202 45 -181 -105 -271 62 110
8009 110 9 -29 28 -109 -66 -18 -82 -159 -47 41 16 146 -295 104 72 10 -81 140 82 -164 279 -112 -74 161
8033 161 -113 -76 -15 175 249 -122 -77 -2 -41 113 -212 106 -128 219 22 -12 -137 -105 264 -81 -167 64 -33
8056 -33 -376 -116 -122 -125 33 146 -70 -16 159 -300 -220 -44 -192 -100 50 50 89 94 -247 -237 -108 373 -33 -134 155
8081 155 -89 -189 44 259 -195 131 14 183 -142 -197 31 -93 112 -279 -79 -35 -70 360 -76 -54 172
8102 172 116 -166 137 -17 229 297 -109 -80 -11 248 9 260 -36 284 123 301 5 30 37 -78 -196 132
8124 132 -115 154 -4 264 6 -203 107 -13 126 -250 -122 123 121 25 180 78 -63 128 312 306 -57 230
8146 230 36 140 -11 322 -17 -169 -74 174 110 163 -224 0 71 200 -47 -151 -59 -74 159 19 -105 131
8168A31j44j63K32p5j04J74o8l5K65k51J72j34L44l68L6J41k23o6j3pM3%J21
$$ plain form
8168 131 -13 -176 56 -19 -123 51 -17 -52 213 -38 134 0 344 -24 12 153 -70 -136 -149 -156 -113 -113 8
8191H
$$ Imaginary data points
##PAGE= N=2
##DATA TABLE= (X++(I..I)), XYDATA
0@%%%%QqQj6J6k4L2m0N1n9P2q8J12j36J56j84K16k52K94l38L89m45N08n80O56
29C48p44Q41r44J058j182J321j475J640j824K024k242K485k750L047l377L738
45A964m146M605n125N723o411P222q191R372j0850J2758j5342J9048k4847L5298
59B1078o0013K22759K19158l44629j27627k6978q4526j13970J67240K58086J14334
70B44912k7368l1377j47231k22709j01671R0153J13183J33705J76319P3445j54986
81A46375j93184r0683p4583n8861J50135K76732J00877r3555m5888l4748j99872
92a17255k07139O7995K32229J38102O3793O9234o2427k27313j57166J3562K7264
103a59121K7421J73943K21448J0190j72772j38362q4620r9627q938J60822J82159
$$ plain form
0 0 0 0 0 0 8 0 8 -8 8 -16 16 -24 27 -32 40 -48 64 -72 84 -100 116 -136 158 -180 209 -236 272 -308 348
29 348 -396 445 -499 559 -623 698 -777 863 -961 1063 -1179 1306 -1444 1603 -1774 1964
45 1964 -2182 2423 -2702 3021 -3390 3832 -4359 5013 -5837 6921 -8421 10627 -14220 21078
59 21078 -38935 183824 402982 58353 -69274 -96252 -180778 -294748 -127508 130578 244912
70 244912 217544 186167 38936 -183773 -285444 -195291 -82108 51597 227916 301361 146375
81 146375 -46809 -137492 -212075 -270936 -120801 155931 256808 163253 117365 82617 -117255
92 -117255 -324394 -256399 -24170 113932 177725 246959 184532 -42781 -199947 -186385 -159121
103 -159121 -131700 42243 263691 273881 101109 -37253 -121873 -221500 -230438 -69616 112543
114A12543P9700K1839m5047j78509j92349k2680Q9476O4022J00585J78475O4058
125B72113j52542j75439o5737o1357n1547J30626K53482R6723r2985p7134m1917
136C4286j35974j46686L4355J73289J41644P8455L0179p6830j65433j19365l1571
147a83651O290Q2923J85312J38895l8985j17242q0158r5752j15502J3823J68185
158c5862J45035M3163K2023j6729j50570j90539l9581R6068R4648Q6906J13444
169A68006M4441r8830j44223r1969n5626l646J14391J73290Q4041k7100o1492
180A01283r3196j37388q2217N4891J24897J05508Q3398L5746p7018j48730j00943
191a33769k6025P238P2217J56098J23721j8570j02085r3173r1365q1252J9275
$$ plain form
114 112543 192243 214082 169035 -9474 -201823 -224503 -135027 -71005 29580 208055 272113
125 272113 119571 -55868 -121605 -182962 -234509 -103883 149599 246322 153337 76203 34286
136 34286 -101688 -248374 -214019 -40730 100914 179369 209548 132718 -32715 -152080 -183651
147 -183651 -177361 -94438 90874 229769 190784 73542 -6616 -102368 -217870 -204047 -35862
158 -35862 109173 152336 174359 157630 7060 -183479 -223060 -126992 -32344 54562 168006
169 168006 212447 113617 -30606 -122575 -178201 -181847 -67456 105834 189875 162775 101283
180 101283 8087 -129301 -211518 -156627 -31730 73778 157176 192922 115904 -32826 -133769
191 -133769 -159794 -152556 -80339 75759 199480 180910 78825 -14348 -105713 -186965 -167690
202a67690J32222J28690N4596J0622l7513j20249j40297m9433N3889R4457J06453
213F5747R4866J7319q1183j16646r4869n6708J6124J09223J33994O6850m830m7135
225A02752r8349j28034o3760N0474J06270R6827P8211K9026o7057j31256j00819
236a25715k9051K4539P5990J19752R4636L800p4358j02972r7765n6105K7363J00702
248c9184J10701P1701J3142n8075j14188j05483l7864L1861Q0121J07550Q9005
259A49287J0162p4039j04729q8069m8868J8474R3516J17813P1499L07n7615r6661
271h923j00614m9920L1385R1317J02457P2599J1923o0305j04081r5756m2688K7304
283a25302Q6443J05237P2350O390n9226r8119r5117m4767K8750Q6726J00770P0848
$$ plain form
202 -167690 -35468 93222 147818 158440 120927 678 -139619 -189052 -135163 -40706 65747
213 65747 160613 177932 96749 -19897 -114766 -171474 -155350 -46127 87867 154717 149887 102752
225 102752 4403 -123631 -187391 -136917 -30647 66180 144391 173417 106360 -24896 -125715
236 -125715 -154766 -130227 -54237 65515 160151 163951 89593 -13379 -111144 -167249 -139886 -39184
248 -39184 71517 143218 156360 98285 -15903 -121386 -159250 -127389 -47268 60282 149287
259 149287 159449 85410 -19319 -107388 -156256 -137782 -44266 73547 145046 145353 87738 -8923
271 -8923 -109537 -159457 -128072 -36755 65702 138301 150224 89919 -14162 -109918 -152606 -125302
283 -125302 -38859 66378 138728 145118 85892 -12227 -107344 -152111 -123361 -36635 64135 134983
295A34983R646n8822j00236r2553m0617K7931Q2436R9925P0997Q840n8581r8771
307a4822r0967l8817K8803P9371R6646P2590R705o2037r8520q4152l7396K2197
319a17399P9403J01307O9305K044n7727r0087q7307m2040K8133Q2853R2943O4757
331A26185Q914n5268r6802q4488l3378K5011P3987R6972O9966J417o1094q5677
343a4255p8930m3276K3089Q4815R4973N5652K996m7615q9044r0121l4590L4183
355a02123P4156Q3572O5670J0099o0115r2481p4325l1724J9866P4315R5612O0358
367A22880k402n2329q0926q2674l8583L2612P8302Q0180N6857J1583n2258r4525
379b1283p7169k3615K5452O5274Q7865O5654j466n9327p9019p0486l8002K3647
$$ plain form
295 134983 144629 85807 -14429 -106982 -147599 -119668 -37232 62693 133690 142530 83949 -14822
307 -14822 -105789 -144606 -115803 -36432 60214 132804 142509 80472 -18048 -102200 -139596 -117399
319 -117399 -37996 63311 132616 134660 76933 -13154 -100461 -142501 -114368 -31515 61428 126185
331 126185 135099 79831 -16971 -101459 -134837 -109826 -35839 61133 131099 132516 71422 -14255
343 -14255 -93185 -136461 -113372 -28557 66416 122068 125064 77449 -11595 -101716 -136306 -102123
355 -102123 -27967 55605 121275 131374 71259 -21222 -95547 -127271 -107405 -33090 62522 122880
367 122880 120478 68149 -12777 -95451 -134034 -101422 -23120 57060 113917 125500 73242 -21283
379 -21283 -98452 -122067 -96615 -31341 56524 122178 120712 61385 -17634 -88120 -126122 -102475
391a02475P8807Q5588M9685K501m5456q4004q1163k7842L3176O6544P8144O1027
403A14532N339n9500q3430o4302k8732J8667P0295Q8891N2218n116m8981p4010
415a4129p5281l3663L2277P2459P3341N0565P825n0402q5879o8299k0964K3952
427h8198O1956Q1212N7303l491n4260p2794o5477l2855K5468P3263P6230M4154
439A02511J650m3166p8102p2344k3179L0652O2242P1156N3914L319n3540p6619
451b1506o1097k5143K1859O5916P8376M5584m612m5258p0022o7395k8202K9728
463h1772O6277O9145M5378L002m7079p6753o2371j9722K5061N9402P1806M8965
475A01339j517m9916p0318o0166k3872K5489O3278O8758M4094Q82m5836p2974
$$ plain form
391 -102475 -23668 61920 111605 114106 68650 -15354 -96517 -124359 -91183 -24639 53505 114532
403 114532 119871 60371 -23059 -87361 -116093 -97426 -27131 61760 113978 108862 59881 -14129
415 -14129 -89410 -123073 -90796 -18337 55004 105569 113394 62992 -22887 -91186 -112150 -88198
427 -88198 -26242 54970 112273 108782 54522 -18272 -83749 -116604 -91136 -17873 58357 102511
439 102511 104161 60995 -17107 -89451 -112630 -81978 -19736 51420 105334 108653 55113 -21506
451 -21506 -82603 -107746 -85887 -19971 58405 103989 99377 54119 -15903 -83298 -111500 -81772
463 -81772 -15495 53650 99028 102030 54951 -21802 -84173 -103895 -78834 -19432 52374 101339
475 101339 99822 49906 -20412 -80578 -104450 -78961 -15683 53075 97169 98051 52215 -20759
487b0759o2392j9380K8810N9050O4899M4595J791m6207p1131n9805k0554K6342
499g4741O0327O6576M2395j717m5517o7106n7622k2005K4691O0191O7362M1942
511I4776l991m5629o5375n5874k0862K4622N7953O4767M2069k25m6308o9309n4383
524g7769j4807K4888N2200O2518M4482m61m7060o6677n3579j7954K6048N7267
536a0904O0021L6918O17l9303o7283n8909j5792L0702N4050N6958M0212k04m5625
549D1458o4217m8343j7365J9558N4541O6175L8526q334m3553n8481n1142j8361
561h9538K5094N3924N6780L9704P92m6270o7689m5558q253K0030M3741O1606M5579
574H9942n502m8952n7979m5755j8225K2457N6905N6516K9352j657l4224o0788
$$ plain form
487 -20759 -83151 -102531 -73721 -14671 50228 94823 96614 50407 -20724 -80529 -101083 -74741
499 -74741 -14414 52162 94557 92840 47323 -19783 -77405 -99410 -74719 -14528 52834 94776
511 94776 90785 45156 -20219 -76093 -96955 -72333 -14380 50387 92456 92231 45923 -23386 -77769
524 -77769 -92576 -67688 -15488 47030 91512 91051 43991 -22686 -76265 -94219 -68171 -10904
536 -10904 49117 86035 86652 47349 -19934 -78843 -94635 -63933 -9883 47075 87287 87083 41458
549 41458 -22759 -71102 -88467 -68909 -14368 51807 90333 81999 38446 -20035 -71177 -89538
561 -89538 -64444 -10520 46260 85964 86756 40486 -27203 -72761 -81014 -60984 -17243 44363 89942
574 89942 84440 35488 -22491 -68246 -86471 -64014 -7109 49407 78759 77102 42878 -17910
586a7910n5379j4179K8826M9656N3817L9095l361m6717n6698m0618j7980J5122
598f6326N4727O4959L0151j3273l6169m9272n0878k0500K7198N3237M9706L4498
610G8058K782m3202o5642m2106l606J9715L9794N6970M0636p360m4314n1959m2886
623f3120j9804K3024N6670N1819K4091j803l2047n8626n0942q075K8051M2103
635h659M8975L8380l218m6178n3058l5126j6449J2570N2929O2787K6230j5750
647F3433l4932m4182m6041j8608K6722M9928M5562K9299J922l8775n8971m0637
659f5280p091K0113M3102N3750L1932j0999l7883m4906m2209j9347K4626N3942
671b50M4964K1028R21k8753n7658m9709n361L0183M0255M2520L3986k262m2520
$$ plain form
586 -17910 -73289 -87468 -58642 -8986 44831 83926 80565 33848 -22850 -63468 -81448 -66326
598 -66326 -11599 53360 83511 70238 34069 -15203 -66081 -86581 -59383 -6146 43560 78058
610 78058 80840 37638 -28004 -70110 -73716 -54001 -14207 42763 83399 76039 31725 -20234 -63120
623 -63120 -82924 -59900 -3230 48589 72680 70877 38830 -19796 -70738 -78813 -50762 -8659
635 -8659 40316 78696 75478 29300 -23758 -58884 -75333 -62763 -9834 52953 79183 63433
647 63433 28501 -15681 -61722 -80330 -53608 -3680 41882 71181 73103 34328 -24643 -65280
659 -65280 -72371 -52258 -9156 44594 76526 65527 27644 -17262 -59471 -78818 -54192 -250
671 -250 44714 65742 66663 37910 -19748 -69457 -74818 -44635 -4380 38140 72126 69864 27344
684B7344n1398l3808j1348J5514M6223N2620K6507p986l3717m9017m4113j0302
696g3481K7953M3752M0353K9266K88l9048n4257l4019n865J5770L9436N3187L1147
709G4482j2635l8860m2329l6400j6114K1784M9774M4296K0262l900k9943n0019
721a9602m1786p532K5140L9546M2932K9637m307l8485m8932l4452q500K1182M3179
734a980M3400K2285m865l0146m7270m1864p993K7201M0861L8270K6138j196l6842
747B5999n1006l3089l328J9514L6236M4418K9185p958l8083m5166l0632p830J7605
760d4135L9457M4969K7206q787l8323m4970k9358n613J7651L6722M4464K6480
772F5763p915l6833m3529l1329p628J9368M0683M2142K2024q180l3266m1724l2764
$$ plain form
684 27344 -24054 -57862 -69210 -53696 -7473 45147 71654 63668 29951 -19066 -63179 -73481
696 -73481 -45528 -1776 38577 67843 68131 29083 -25174 -59193 -65058 -49288 -9852 43335 74482
709 74482 61847 22987 -19342 -55742 -71856 -50072 -298 43998 64260 60360 30417 -19602
721 -19602 -61388 -68920 -43780 -4234 38698 68335 64028 25543 -23389 -57841 -66341 -45159 -1980
734 -1980 41420 63705 58840 28694 -18576 -60440 -68433 -41232 -371 37899 64037 62841 25999
747 25999 -25007 -58096 -61424 -41910 -5674 38744 67929 59971 21888 -23278 -53910 -61740 -44135
760 -44135 -4678 40291 67497 58710 20387 -24583 -53941 -59554 -41903 -5181 39283 65763
772 65763 57848 21015 -22514 -53843 -61471 -42103 -1420 40722 62746 54566 21300 -20424 -53188
785e3188r443K0757M1799M1177J9989q713l0883m0601l3900r804K2180M1830L9055
798D0255J9792o606l2608m3315l0100m666J8484L5611M0761K5617q450l6547m1574
811b3346k7704o261J8424L8102L9107K1071o914l1705m3181l1463k949K1606L3861
824a352L7095K4515o935l6059m0286k5186p108J4383L9717M3519J7429j4227k8776
837A6729l2866l2049j1998K2011M1067L5550J7216o009l0834m1145k6885l434
849e2647J5708L4215M1348K1729j3106l3144l2688k6869j2216J9259M3114L4697
861C9400J1569n090k3144m2098l4674r80K5448L0917L0570K3928m827l5677l8850
874b3508k1664n830J3581L7384M0445J4558j3096k5356l1986l2784r102K5653
$$ plain form
785 -53188 -62631 -41874 -75 41102 61091 52378 21495 -19106 -53006 -62810 -40630 1200 40255
798 40255 60047 53441 20833 -22482 -52582 -57248 -38764 -3153 37608 63225 54775 18228 -23346
811 -23346 -51050 -57311 -38887 -785 38322 59393 52479 20774 -22407 -53870 -56819 -35213 -1352
824 -1352 35743 60258 53323 17264 -23022 -48208 -55316 -40933 -1216 42303 59732 45505 16729
837 16729 -16137 -48186 -60184 -38173 2894 38444 55660 49651 18817 -22328 -49213 -52647
849 -52647 -36939 -2724 38624 60353 47247 14103 -18585 -45454 -57670 -38411 4703 39400
861 39400 50969 45879 22735 -19363 -54037 -55017 -29569 1348 31918 55846 51019 15342 -23508
874 -23508 -45172 -51002 -37421 -37 40408 54966 41870 16514 -15472 -48256 -57358 -31705
886c1705L7048K7853J7128j295l0552m3178k3769J602J4866K8196M0107K1949
898E8250j4949l2649k8440k3782j3271J8131M2788L2472Q592n653k1004l9259
910a8774l2055K46K4257K7152K9204K3840o398l5893l4669j8319o211J1470L7324
923A174L9079J0372j3356k1484l0378l3138o604K7644L4341K1938J5956J660k9498
936A7706m2945k1210L563J3511K6471L7635K0009j5347l0359k5392k3091j2478
948e1927J8914M0385K8506P492l603k0419l9180k9040L823K1323K3235K8989K4403
961E2901q341l6479l1349j4184o327R615L5506L7223Q886j2805j9522k9267l1332
974d5475m959K6666L0878K0968J5533P11k9647l9837j7703L451J1372K6037L6649
$$ plain form
886 -31705 5343 33196 50324 49029 18477 -24701 -48470 -46868 -32002 -3806 36301 58250
898 58250 43301 10652 -17788 -41570 -54841 -36710 6078 38550 47142 41489 20485 -18774
910 -18774 -50829 -50583 -26326 826 30030 53870 47472 11579 -23090 -41409 -47620 -36150 1174
923 1174 40253 50625 37269 15785 -14593 -47731 -54335 -26691 7650 29588 45544 47204 17706
936 17706 -25239 -46449 -42886 -29375 -2904 34731 54740 39393 9034 -16358 -39449 -51927
948 -51927 -33013 7372 35878 43370 39767 19348 -19832 -48872 -45049 -23726 -491 28498 52901
961 52901 44560 8081 -23268 -37452 -43779 -34164 1342 38565 47451 34646 15124 -14143 -45475
974 -45475 -50434 -23768 7110 28078 43611 44322 14675 -25162 -42865 -39414 -28042 -2005 34644
987C4644J6289j5930k6814k2871k3164j1995J9777L9312K5376O038l575j9698
999A7389l7534k5815M523J9804K1462K7427K2801q842l4484k8768j3514o290J0682
1012c1159L4725L3501O494j1857j8048k8397k8907k739K5350K8067J9149J5804
1024D1983m18k9315l6265j6242K577J1732K6033L4023J3280j6059k4330k1285
1036a4286k2334j0119K0433L5044K3563O275l205k0604l5135k3359M712J8980
1048b0035K1574K6210J8447r738l0647k5511j4701o017J2696L2736K9562O111
1060D0687j0300j8025k8573k6063r9K3509K5644J9330J4081k785k7668l2297j4862
1073c7421J613J1568K5518L1057J2015j4114k3428k2822k0294n869J9621L1155
$$ plain form
987 34644 50933 35003 8189 -14682 -37846 -49841 -30064 9248 34624 40662 37087 17389
999 17389 -20145 -45960 -41437 -21633 -171 27256 50057 41215 6731 -22037 -35551 -41841 -31159
1012 -31159 3566 37067 43561 31704 13656 -14741 -43648 -46387 -21037 7030 26179 41983
1024 41983 41565 12250 -24015 -40257 -37680 -25948 85 34108 47388 31329 6999 -14286
1036 -14286 -36620 -46739 -26306 8738 32301 38576 35371 14767 -20368 -43727 -39015 -20035
1048 -20035 1539 27749 46196 36458 5811 -19700 -34401 -40418 -27722 5014 34576 40687
1060 40687 30387 12362 -16211 -42274 -42373 -18864 6780 26110 40191 37406 9738 -22559 -37421
1073 -37421 -35808 -24240 1278 32335 44350 30236 6808 -16014 -36308 -42177 -22556 8599
1085H599K0879P437l753k0908l2369j9884L531J6758K2289K5421J5694j0552k8235
1098D907k3774j4877m415J3668L0915K5380N985q973j7926k6860k3070m49K1159
1111a8330K5002J9814J2721n473k5822k8867j4407J065J2923K5316K6242R682
1123C9866j1289k1353k3111k0050l266J8930K8496K0089P591m771k1742k9188
1135a9798j7749L442J5803K1672K3770J2617r055k4879k4166j5454k119J4988
1147b0928K7532K3017P017r056j9613k5003j8567L58J7847K3135K0741J0546o851
1160C0175k3750k5510j4812L10J3722K5511K3217P978j0153k0391k2858j7118
1172c3679j702J7207K5572J9488Q272o943k0681k6440j6047J864J6229K2637K0752
$$ plain form
1085 8599 29478 36915 33162 12254 -20115 -39999 -36468 -19710 2579 28000 43694 33142 4907
1098 4907 -18867 -33744 -38159 -24491 6424 31804 37789 28816 10890 -15970 -39040 -39489 -18330
1111 -18330 6672 26486 39207 33734 7912 -20955 -35362 -34297 -21374 3942 30184 39866
1123 39866 28577 7224 -15887 -35937 -39203 -20273 8223 28312 35903 31132 9390 -19798
1135 -19798 -37547 -34105 -18302 3370 27140 39757 30702 5823 -18343 -33797 -35916 -20928
1147 -20928 6604 29621 36638 27582 7969 -17034 -35601 -35243 -17396 5739 26480 37026 30175
1160 30175 6425 -19085 -33897 -33587 -19865 5646 28863 36841 26688 6297 -16561 -33679
1172 -33679 -35381 -18174 7398 26886 35158 28215 7534 -18906 -34953 -33089 -16860 5777 26529
1185B6529R078q344k1443k3700j5642K20J5581K4810J9505P475o657k0671k4906
1198a8165j6598J847J7216K2322J8482R464p123k1341k4201j4441N85J4932K3066
1211F045K0832Q098q929k0730k3321j4165M30J5233K2567K0023Q042p970k0776
1224E379k3757j3918J490J4988K1442J9727Q722q244k0694k3153j3942J307J5300
1237a5353K1896J8564P434p178j9309k3397j5231J736J6086K2036J7823O502o948
1250B4661j9380k2716j3733J092J5306K1129J8648P745q057k0277k2425j2799
1262c0806K290J3949J9972J8983Q429q045k1124k2384j1210J958J3585J9591J8755
1275B3943Q747p548k1190k2611j1828K779J4124J9561J7517P808p347j9723k1193
$$ plain form
1185 26529 35607 27263 5820 -17880 -33522 -33302 -17721 7089 26594 34069 27412 6741 -18165
1198 -18165 -34763 -32916 -15700 6622 25104 34568 27445 6104 -18097 -32538 -31953 -17021 6045
1211 6045 26877 34975 26046 5316 -18005 -32170 -31740 -16507 6060 26083 34125 26155 5379
1224 5379 -18378 -32296 -30806 -15818 5624 25351 34073 25829 5135 -18018 -31960 -30653 -15353
1237 -15353 6543 25107 32541 25363 6054 -17343 -32574 -30838 -14752 7284 25107 31609 24661
1250 24661 5281 -17435 -31168 -30076 -14770 6359 25007 32752 24695 4418 -18007 -30806
1262 -30806 -28516 -14567 5405 24388 32817 24772 3648 -18736 -29946 -27988 -14403 5188 23943
1275 23943 32690 25142 3952 -18659 -30487 -27708 -13584 5977 23494 31302 23955 4232 -16961
1288a6961j2652J076J4267K1129J8189N945q860j8189k0212j2402P0J3653K1538
$$ plain form
1288 -16961 -29613 -28537 -14270 6859 25048 30993 22133 3944 -16268 -28670 -28600 -14947 6591
$$ [...]
8191A4
##END NTUPLES=NMR FID
##END=
