##TITLE=1H_LR-673-R2-HCR4
 D2O, 8 sc, 
 23.12.2019
##JCAMPDX= 6.0         $$ Bruker NMR JCAMP-DX V2.0
##DATA TYPE= NMR FID
##DATA CLASS= NTUPLES
##ORIGIN= UXNMR, Bruker Analytische Messtechnik GmbH
##OWNER= root
$$ XWIN-NMR		Version 3.5
$$ Mon Dec 23 14:46:28 2019 Russian Standard Time (UT+4h)  she@DPX200
##.OBSERVE FREQUENCY= 200.1315
##.OBSERVE NUCLEUS= ^1H
##.DELAY= (6, 6)
##.ACQUISITION MODE= SIMULTANEOUS
##.ACQUISITION SCHEME= undefined
##.AVERAGES= 8
##.DIGITISER RES= 18
##SPECTROMETER/DATA SYSTEM= spect
##.PULSE SEQUENCE= zg30
##.SOLVENT NAME= D2O
##.SHIFT REFERENCE= (INTERNAL, D2O, 0, 15.7039)
##AUDIT TRAIL= $$ (NUMBER, WHEN, WHO, WHERE, WHAT)
$$ ##TITLE= Audit trail, XWIN-NMR		Version 3.5
$$ ##JCAMPDX= 5.01
$$ ##ORIGIN= Bruker BioSpin GmbH
$$ ##OWNER= she
$$ F:/spectra/data/she/nmr/H-F/1/audita.txt
$$ ##AUDIT TRAIL=  $$ (NUMBER, WHEN, WHO, WHERE, WHAT)
(   1,<2019-12-23 14:45:26.78 +0400>,<she>,<DPX200>,
      <created by zg, POWCHK disabled, PULCHK disabled
       configuration hash MD5:
       00 E9 B6 7A A2 85 ED C7 34 08 36 98 17 FE 4E 26
       data hash MD5: 16K
       2C 58 3A 4C E6 55 0B BA 1C 1F 2A C7 EA C8 AA 51>)
$$ ##END=
$$ 
$$ hash MD5
$$ 0E BB 10 8B C1 4B 23 4E 60 DC 20 65 D7 9B 89 F0
##$RELAX= 
##$RELAX= 
##$RELAX= 
##$RELAX= 
##$RELAX= 
##$RELAX= 
$$ Bruker specific parameters
$$ --------------------------
##$DU= <F:/spectra>
##$EXPNO= 1
##$NAME= <H-F>
##$PROCNO= 1
##$TYPE= <nmr>
##$USER= <she>
##$AMP= (0..31)
100 100 100 100 100 100 100 100 100 100 100 100 100 100 100 100 100 100 
100 100 100 100 100 100 100 100 100 100 100 100 100 100 
##$AQSEQ= 0
##$AQ_mod= 1
##$AUNM= <au_zg>
##$AUTOPOS= <>
##$BF1= 200.13
##$BF2= 200.13
##$BF3= 200.13
##$BF4= 200.13
##$BF5= 200.13
##$BF6= 200.13
##$BF7= 200.13
##$BF8= 200.13
##$BYTORDA= 1
##$CFDGTYP= 0
##$CFRGTYP= 5
##$CHEMSTR= <none>
##$CNST= (0..31)
1 1 145 1 1 1 1 1 1 1 1 1 1 1 1 1 1 1 1 1 1 1 1 1 1 1 1 1 1 1 1 1 
##$CPDPRG= <>
##$CPDPRG1= <>
##$CPDPRG2= <>
##$CPDPRG3= <>
##$CPDPRG4= <mlev>
##$CPDPRG5= <mlev>
##$CPDPRG6= <mlev>
##$CPDPRG7= <mlev>
##$CPDPRG8= <mlev>
##$CPDPRGB= <>
##$CPDPRGT= <>
##$D= (0..31)
0 1.2 0 0 0 0 0 0 0 0.06 0 0.03 0 0 0 0 0.0002 0 0 0 0 0 0 0 0 0 0 0 0 
0 0 0 
##$DATE= 1577097926
##$DBL= (0..7)
120 120 120 120 120 120 120 120 
##$DBP= (0..7)
150 150 150 150 150 150 150 150 
##$DBP07= 0
##$DBPNAM0= <>
##$DBPNAM1= <>
##$DBPNAM2= <>
##$DBPNAM3= <>
##$DBPNAM4= <>
##$DBPNAM5= <>
##$DBPNAM6= <>
##$DBPNAM7= <>
##$DBPOAL= (0..7)
0.5 0.5 0.5 0.5 0.5 0.5 0.5 0.5 
##$DBPOFFS= (0..7)
0 0 0 0 0 0 0 0 
##$DE= 6
##$DECBNUC= <off>
##$DECIM= 24
##$DECNUC= <off>
##$DECSTAT= 4
##$DIGMOD= 1
##$DIGTYP= 9
##$DL= (0..7)
0 120 120 120 120 120 120 120 
##$DP= (0..7)
150 150 150 150 150 150 150 150 
##$DP07= 0
##$DPNAME0= <>
##$DPNAME1= <>
##$DPNAME2= <>
##$DPNAME3= <>
##$DPNAME4= <>
##$DPNAME5= <>
##$DPNAME6= <>
##$DPNAME7= <>
##$DPOAL= (0..7)
0.5 0.5 0.5 0.5 0.5 0.5 0.5 0.5 
##$DPOFFS= (0..7)
0 0 0 0 0 0 0 0 
##$DQDMODE= 0
##$DR= 18
##$DS= 0
##$DSLIST= <SSSSSSSSSSSSSSS>
$$ [...]
##$SUBNAM2= <"">
##$SUBNAM3= <"">
##$SUBNAM4= <"">
##$SUBNAM5= <"">
##$SUBNAM6= <"">
##$SUBNAM7= <"">
##$SUBNAM8= <"">
##$SUBNAM9= <"">
##$SW= 24.9337058887773
##$SWIBOX= (0..15)
0 0 2 0 0 0 0 0 0 0 0 0 0 0 0 0 
##$SW_h= 4990.01996007984
##$TD= 16384
##$TD0= 1
##$TE= 0
##$TE2= 300
##$TE3= 300
##$TEG= 300
##$TL= (0..7)
0 120 120 120 120 120 120 120 
##$TP= (0..7)
150 150 150 150 150 150 150 150 
##$TP07= 0
##$TPNAME0= <>
##$TPNAME1= <>
##$TPNAME2= <>
##$TPNAME3= <>
##$TPNAME4= <>
##$TPNAME5= <>
##$TPNAME6= <>
##$TPNAME7= <>
##$TPOAL= (0..7)
0.5 0.5 0.5 0.5 0.5 0.5 0.5 0.5 
##$TPOFFS= (0..7)
0 0 0 0 0 0 0 0 
##$TUNHIN= 0
##$TUNHOUT= 0
##$TUNXOUT= 0
##$USERA1= <user>
##$USERA2= <user>
##$USERA3= <user>
##$USERA4= <user>
##$USERA5= <user>
##$V9= 5
##$VALIST= <valist>
##$VCLIST= <CCCCCCCCCCCCCCC>
##$VD= 0
##$VDLIST= <DDDDDDDDDDDDDDD>
##$VPLIST= <PPPPPPPPPPPPPPP>
##$VTLIST= <TTTTTTTTTTTTTTT>
##$WBST= 1024
##$WBSW= 4
##$XGAIN= (0..3)
0 0 0 0 
##$XL= 0
##$YL= 0
##$YMAX_a= 337937
##$YMIN_a= -270097
##$ZGOPTNS= <>
##$ZL1= 120
##$ZL2= 120
##$ZL3= 120
##$ZL4= 120
##$ABSF1= 10
##$ABSF2= 0
##$ABSG= 5
##$ABSL= 3
##$ALPHA= 0
##$AQORDER= 0
##$ASSFAC= 0
##$ASSFACI= 0
##$ASSFACX= 0
##$ASSWID= 0
##$AUNMP= <proc_1d>
##$AZFE= 0.1
##$AZFW= 0.1
##$BCFW= 1
##$BC_mod= 2
##$BYTORDP= 1
##$COROFFS= 0
##$CY= 11.3945322036743
##$DATMOD= 1
##$DC= 2
##$DFILT= <>
##$DTYPP= 0
##$F1P= 16.9975609425685
##$F2P= -3.02152046262296
##$FCOR= 0.5
##$FTSIZE= 0
##$FT_mod= 4
##$GAMMA= 1
##$GB= 0.15
##$INTBC= 1
##$INTSCL= 1
##$ISEN= 128
##$LB= 0.24
##$LEV0= 0
##$LPBIN= 0
##$MAXI= 10000
##$MC2= 0
##$MEAN= 0
##$ME_mod= 0
##$MI= 1.114404
##$NCOEF= 0
##$NC_proc= 0
##$NLEV= 6
##$NOISF1= 3.799351
##$NOISF2= 2.8
##$NSP= 1
##$NTH_PI= 0
##$NZP= 0
##$OFFSET= 15.70392
##$PC= 1
##$PHC0= -10151.61
##$PHC1= 14.0008
##$PH_mod= 1
##$PKNL= yes
##$PPARMOD= 0
##$PSCAL= 0
##$PSIGN= 0
##$REVERSE= no
##$SF= 200.130013532006
##$SI= 16384
##$SIGF1= 3
##$SIGF2= 2
##$SINO= 400
##$SIOLD= 16384
##$SREGLST= <1H.CDCl3>
##$SSB= 0
##$STSI= 0
##$STSR= 0
##$SW_p= 3612.71676300578
##$SYMM= 0
##$S_DEV= 0
##$TDeff= 0
##$TDoff= 0
##$TI= <>
##$TILT= no
##$TM1= 0
##$TM2= 0
##$TOPLEV= 0
##$USERP1= <user>
##$USERP2= <user>
##$USERP3= <user>
##$USERP4= <user>
##$USERP5= <user>
##$WDW= 1
##$XDIM= 8192
##$YMAX_p= 0
##$YMIN_p= 0
$$ End of Bruker specific parameters
$$ ---------------------------------
##NTUPLES= NMR FID
##VAR_NAME=  TIME,          FID/REAL,        FID/IMAG
##SYMBOL=    X,             R,               I
##VAR_TYPE=  INDEPENDENT,   DEPENDENT,       DEPENDENT
##VAR_FORM=  AFFN,          ASDF,            ASDF
##VAR_DIM=   8192,          8192,            8192
##UNITS=     SECONDS,       ARBITRARY UNITS, ARBITRARY UNITS
##FACTOR=    0.0002004,     1,               1
##FIRST=     0,             0,               0
##LAST=      1.6414764,     0,               0
##MIN=       0,             -270097,         0
##MAX=       1.6414764,     337937,          0
$$ Real data points
##PAGE= N=1
##DATA TABLE= (X++(R..R)), XYDATA
$$ [...]
2418d398j113K049M606L778L53q54k624m430l431P77L034K930L148K075r42m111
$$ -4398 -5511 -3462 1144 4922 5275 4421 1797 -2633 -6064 -5287 -2253 677 3825 5900 4958 847
2434H47l638j987q2J528L885M146R74j522l242l248k840n73K759M258K326J735
$$ 847 -2791 -4778 -4860 -3332 553 4699 5673 4151 909 -2339 -5179 -5752 -2993 1265 3591 5326
2450E326o54l218m675j799O12J183L297M182K429k398l853l003j836j087K022
$$ 5326 4672 1454 -3221 -5020 -4408 -3225 72 4254 6683 4285 432 -2571 -4407 -5494 -3472
2465c472M547L076J029q76k742m138k896O19K160K784L217K526j279l826l565
$$ -3472 1075 4151 5180 4304 1562 -2576 -5472 -4853 -2693 91 3308 5834 4555 729 -2836
2480b836j508m20J417L563M213Q24j516k260l331l112o59L154L733K439J128n33
$$ -2836 -4344 -4764 -3347 216 4429 5253 3737 1477 -1854 -4966 -5625 -2471 1262 3701 4829 4296
2496D296l195m262j579J88J268L199M083J862k198l325k288k169j013J830M015
$$ 4296 1101 -3161 -4740 -4552 -3284 -85 3998 5860 3662 337 -1951 -4120 -5133 -3303 712
2511G12L113J108r40k660l824k636P46J992K776K593K232o97l741l407j481n99
$$ 712 3825 4933 3993 1333 -2491 -5127 -4381 -2389 387 2980 5212 4515 774 -2633 -4114 -4713
2527d713J532L463L281J126j325j945l318k686l64K579L203K340J546o96k924
$$ -4713 -3181 282 3563 4689 3364 1419 -1899 -4585 -4949 -2370 833 3173 4719 4023 1099
2542A099l553j501k38J384K837M112J294j845k874k464k383q98K414L338K518
$$ 1099 -2454 -3955 -4193 -2809 28 4140 5434 3589 715 -1749 -4132 -5030 -2616 722 3240
2557C240J338o70k463l753j965l9J964K426K891J935q38l306k808k021o67J949
$$ 3240 4578 3908 1445 -2308 -4273 -4312 -2348 78 2969 4904 4066 760 -2048 -4069 -4736 -2787
2573b787L185L185L95o21j856k883k742p64K566K883K455J388p65k577l085j489
$$ -2787 398 3583 3978 3357 1501 -1382 -4124 -4888 -2322 561 3016 4404 3639 1062 -2023 -3512
2589c512q93J588K939L477Q83r58k704k683j905m71J381L178K873J122l90k745
$$ -3512 -4405 -2817 122 3599 4482 3524 820 -1863 -3768 -4239 -2858 320 3193 4315 3925 1180
2605A180l149k230M56J346K520K915J484r76k642k192k389l44J474K906K952R24
$$ 1180 -1969 -4199 -3743 -2397 123 3038 4522 3546 904 -1288 -3677 -4021 -2547 359 3311 4235
2621D235j008j587l179k662K0J904K781K351J164o48k229k880j693o89J362K780
$$ 4235 3227 1640 -1539 -4201 -4181 -2277 504 2855 4019 3371 1142 -1738 -3431 -4120 -2758 22
2637B2K905J311j030k136k650k143j67J499K537K711Q29j45k545k962j870Q7J573
$$ 22 2927 4238 3208 1072 -1578 -3721 -3888 -2389 148 2859 3688 3543 998 -1964 -3834 -3747 -2174
2654b174K649K408J012m26k296k923j653m56J879J956K378J025k20k009k729j950
$$ -2174 475 2883 3895 3469 1173 -1750 -3403 -3859 -1980 -24 2354 3379 3159 1150 -1579 -3529
2670c529k63J297K373K894R15n21k227k295j835m46J179K394K956J085o97k197
$$ -3529 -3792 -2495 -122 2772 3687 3166 939 -1356 -3191 -3637 -2458 -64 2892 3977 3280 1083
2686A083k575j884K36R06K566K102J336p37k028k267k367R1J198K502K572N52
$$ 1083 -1492 -3376 -3140 -2234 332 2434 3770 3033 1005 -1262 -3629 -3538 -2340 162 2734 3286
2702C286m9j843k526k109l39J492K233K627O28m12k083j988j699o69J289K153
$$ 3286 3237 1394 -1132 -3241 -3580 -2088 145 2772 3400 2988 905 -1083 -2782 -3451 -2162 -9
2718iK632Q96o87j849k151j749m52J133K241K333J361p40j717k637j305n76J059
$$ -9 2623 3519 2832 983 -1168 -2917 -3369 -2236 5 2338 3699 2959 1242 -1395 -2700 -3276 -2217
2735b217K521J866J294m63k045k039j835l95J647J902J923J080m51j380k388j788
$$ -2217 304 2170 3464 3001 956 -1083 -2918 -3313 -1666 236 2159 3239 2788 1408 -980 -2768
2751b768o19J270K132K107J173m83j704j999j700m87J126J824K453Q29o31j354
$$ -2768 -3387 -2117 15 2122 3295 2812 1108 -891 -2591 -3078 -1952 -128 2325 3154 2523 1169
2767A169k080j678o52J329K192J524J306m51j789k114j459n07R81K272K147Q49
$$ 1169 -911 -2589 -3241 -1912 280 1804 3110 2659 870 -1244 -2703 -3210 -2229 43 2190 3039
2783C039m15j424k124j745l95J072J952J960R68l05j412k086j885j82Q25K203
$$ 3039 2624 1200 -924 -2669 -3064 -1992 -40 1920 2888 2583 1171 -915 -2800 -2982 -2157 46
2799D6J947R29l97j483k013j424k50L51K319J969J022m46j303k543j508j79J321
$$ 46 1993 2922 2525 1042 -971 -2395 -2645 -2294 25 1994 3016 2570 1267 -1276 -2784 -2963 -1642
2816a642J769J694J021k64j608j932j872k4Q87J867K185O84l46j278k273j063
$$ -1642 127 1821 2842 2578 970 -962 -2834 -2858 -1971 -104 2081 2765 2419 1141 -1132 -2195
2832b195n70O88K017J568J251m71j004k210k039K59Q68J800J867J089j77j745
$$ -2195 -2765 -2077 -60 1508 2759 2288 1284 -926 -2965 -2706 -1838 -38 1829 2918 2741 996
2848I96j830j435p54J235J412K045O07J30j330j922j368q05J380J454J654J138
$$ 996 -834 -2269 -3023 -1788 -376 1669 2276 2406 1076 -846 -2214 -3019 -1639 -185 1469 2607
2864B607k29j194j831j624l68P40J751J760R16l87r93j991j471l14P22J694J954
$$ 2607 2378 1184 -647 -2271 -2639 -1899 -148 1612 2528 2141 1148 -843 -2314 -2628 -1906 -212 1742
2881A742O18L51j821j745j453n25J119J480J818J009l99j326j428j718k08Q53
$$ 1742 2360 2711 890 -855 -2308 -2833 -1714 -234 1584 2593 2194 868 -560 -2278 -2486 -1633
2897a633J251J829Q48J93j368j842j574qN39J998J478Q41k08j339j680j459o3
$$ -1633 -382 1447 2295 2488 1120 -722 -2296 -2304 -1765 233 1711 2552 2344 1005 -675 -2134 -2197
2914b197P40J427J212J068j53j412j756q95l14P86J289J497J160l37j270j768
$$ -2197 -1457 -30 1182 2250 2097 685 -1071 -1966 -2280 -1494 -205 1292 2452 2115 845 -923
2930i23j162j50O86J163J681R38k92q82j724j222l26M44J487J910M94k40j121
$$ -923 -2085 -2235 -1549 -386 1295 2233 1941 1059 -665 -1887 -2213 -1769 -282 1628 2122 1882 761
2947G61j358j198p86J191J093J721N39J7j154j274j368l65Q36R46K148M35j51
$$ 761 -597 -1795 -2581 -1390 -297 1424 1963 1980 826 -448 -1816 -2181 -1345 -399 1749 2184 2033
2964B033r59j493j065n22N35J051J638R32k70j163j365j271k41P84J066J550O24
$$ 2033 1074 -419 -1484 -2006 -1471 -420 1218 2150 1880 717 -648 -1919 -2160 -1376 -310 1240 1864
2981A864J60r87j792p66m47N89J105J330Q30k6q66j370j379l45O31J362J402M63
$$ 1864 2024 1037 -755 -1521 -1968 -1379 -274 1056 1886 1860 994 -376 -1755 -2100 -1469 -107 1295 1758
2999A758n2p72j421j031n21P82Q04J912N64O5j298j322j171l35N94J185J591M14
$$ 1758 1706 934 -487 -1518 -2039 -1257 -453 1459 2023 2088 790 -532 -1703 -2038 -1444 -259 1332 1746
3017A746J76r71j248j272j06L27J244J159N95M4r54j175j396J42M46J189Q87J111
$$ 1746 1922 951 -297 -1569 -1675 -1348 -104 1055 1650 1694 740 -435 -1831 -1689 -1243 -54 833 1944
3035A944m46p93j157j274J42L5J387J134O45K21r64j018j471j51M03Q39J691M87
$$ 1944 1498 705 -452 -1726 -1584 -1549 -162 972 1617 1838 874 -144 -1615 -1766 -1363 -524 1167 1654
3053A654J25r74j089j379j44M67J412J085O95j98r12j031j323k77Q13Q49R15J217
$$ 1654 1779 805 -284 -1663 -1807 -1340 72 1157 1852 1654 742 -289 -1612 -1889 -1076 -227 688 1905
3071A905j52j009j312o83m65K97J084J326M29q5m25q80j484l24O51J025R86P39
$$ 1905 1753 744 -568 -1251 -1716 -1419 -335 991 1420 1335 910 30 -1454 -1778 -1127 -102 884 1623
3089A623j34l78j367q36k87P9J137P43R89j06o80j357o25n12O24P83J187Q56l17
$$ 1623 1489 1111 -256 -1092 -1379 -1300 -163 580 1569 1463 783 -574 -1199 -1711 -1087 -304 883 1739 1422
3108A422q36r06p45p21P76J033N95N56K90p89j006j149PL16R52J045P62m99m40
$$ 1422 586 -320 -1065 -1786 -1010 23 618 1174 1464 675 -331 -1480 -1473 -1157 -205 840 1602 1103 663
3127F63j048o32m78O17R56O55Q61k59o14j011r83l02M00P96J276L94J12o61j372
$$ 663 -385 -1017 -1495 -878 78 733 1594 1335 721 -290 -1273 -1575 -1175 -379 897 1291 1403 742 -630
3146f30k19n21K75J161O74O02O4p18q29q25l96M18P11J070K98K79o30j516l07
$$ -630 -849 -1370 -1095 66 740 1342 1406 688 -141 -966 -1362 -944 -233 837 1135 1414 784 -732 -1039
3165a039k32M42O55R65N93J01j062p08o58l50L97Q30Q33L30k14l60j021n25l09
$$ -1039 -1271 -829 -174 791 1384 1485 423 -285 -943 -1293 -896 -66 767 1097 883 523 -498 -1023 -1332
3184a332K47P30P47O78J46o28q83r16k63J087J14Q59O96k41n18j050l35l68J44
$$ -1332 -1085 -355 392 1070 1216 588 -295 -1211 -1474 -387 -273 586 1282 1041 523 -527 -862 -1230 -1086
3203a086R34N92O65J33q79m84j141K57K09P73N83M93M30j233q23k24l53L94O87
$$ -1086 -152 440 1105 1238 359 -125 -1266 -1009 -800 -27 556 1049 1479 246 -577 -801 -1154 -760 -73
3222g3O98N23J8n32p73p40l88N60L82R50K62J13l70j063l45l84L77M22J022K72
$$ -73 625 1148 1166 634 -139 -879 -1267 -707 -325 625 887 1000 630 -433 -778 -1162 -785 -363 659 931
3242I31J2m93q11l34n10N49N02P84O34k59p89o20o12J11k75R98P10L14j64n33
$$ 931 943 450 -361 -695 -1205 -656 -154 630 1264 1005 216 -404 -1016 -905 -1180 -182 528 842 678 145
3262A45k19o29j35J37O75M90R03n46l63o40r14K1M98K78R79O4K63m80q56j59o35
$$ 145 -74 -703 -838 -701 -26 464 1367 821 458 -182 -1096 -1075 -577 -299 680 744 1007 527 -329 -488 -1123
3283a123N88N26L08N44O4p61l00m20l36J97P52O93o4K60m28n14p45j68J46N17
$$ -1123 -535 -9 299 843 907 146 -154 -574 -910 -713 39 732 668 928 500 -14 -759 -927 -781 -264
3303b64L72M31L68o55n79l01k56K90M21P05K25J76m63o50l62m73L72M91N34M30
$$ -264 108 539 907 252 -327 -628 -884 -594 -173 532 757 933 470 -180 -542 -1015 -643 -152 382 812
3323H12J83m86m69q05K3J55M15M95M05j62j39n18p84q8L58L40P62K42rj85n46
$$ 812 995 509 40 -765 -742 -587 -172 323 728 566 427 -91 -875 -963 -605 -265 497 739 730 545 -1
3344am91k09K59J38N92M26O6n03k74m24k01M04j80P11Q19l78l95p99q4lm2L18
$$ -1 -492 -701 -442 -304 288 714 780 277 3 -421 -622 -218 -398 313 1132 754 359 -440 -524 -527 -569 -251
3366b51Q11J33j33R8q77l99m3J3P23K94K02M1q4o60n04o7m9Q13P39L7j96m28n07
$$ -251 560 693 560 658 -219 -618 -661 -648 75 369 571 612 528 -132 -636 -703 -752 61 800 837 641 213 -294
3389b94r6m42L03N34M44J12J87l28o47m31k90L35N24N62J93j13k93o79j09j45
$$ -294 -390 -832 -529 5 449 561 748 420 -227 -658 -948 -613 -89 473 666 553 260 -419 -528 -673
3409f73K58L75N35Q2j6n35k96k15J69j26O83N0L13j55k85l13M4l55K81K64L72
$$ -673 -415 -40 495 577 561 26 -270 -485 -316 -442 241 291 604 449 164 -149 -105 -460 -179 85 457
3430D57J71l13k7o90j56J75K44M9K00L84M4k69n38l16j98M07K53N17p6J98k28
$$ 457 628 315 288 -402 -558 -383 -139 -90 110 494 538 269 -269 -585 -783 -376 -123 394 318 516 288
3451B88o84m1K4R9M65P3L02q6k63l59l12j46L99M75q4N79o55J75n93q9P0oK69
$$ 288 -396 -437 -413 -314 151 224 526 440 177 -182 -494 -640 -241 234 150 729 74 249 -344 -433 -363 -369 -100
3474a00N21k8J0m79j83j88P3J5M67L39J06K2j29n89j90k77L67L54N3%K45l94l13
$$ -100 421 393 403 -76 -259 -447 -374 -359 108 447 553 575 446 -143 -333 -610 -243 111 164 164 409 15 -298
3497b98O5l44M88J47K68j94M23n67nj16j82J71R4L53j9O6j19l62o2k69M20j31
$$ -298 -233 -577 -89 58 326 132 555 -12 -17 -133 -315 -144 -50 303 284 350 231 -131 -193 -462 -42 -173
3519a73L77j51J28k95J66m85j06K85J74NN31l81M2j54m25K5J07K45N36j18k28
$$ -173 204 53 181 -114 52 -433 -539 -254 -80 -75 456 75 117 -37 -462 -437 -330 -85 451 333 105
3540A05K36m40k20m0Q9J8N92J20j31n63J45l58p2N11R6j13M88m10k4k43k1N9J69
$$ 105 341 -99 -319 -359 -270 -252 340 460 329 -234 -89 -447 -519 -8 88 -25 463 53 29 -214 -235 -176 -7
3563gM62k44l5Pj73l08J61k20O3M79K4M04m40J38m01l5l80M65NK67p9K5k27k37
$$ -7 455 211 176 183 10 -298 -137 -357 -294 185 209 613 173 311 -90 -125 -505 -40 -35 232 153 178 -49 -286
3587b86J79j19J49R7L48L1j03l62J5j35%K4M32j83n4j9Kk90L26j76O8L1K98m64
$$ -286 -107 -226 -77 20 368 399 296 -66 -51 -186 -186 -162 270 87 33 14 16 -274 52 -124 -56 -25 273 -191
3611a91N79k71l36J32k33J85%L00J82k49L7j41k46J42Q3K88N4J23m83o0K43k93
$$ -191 388 117 -219 -87 -320 -135 -135 165 347 98 135 -6 -252 -110 -27 261 315 438 -45 -105 138 -155
3633a55L72m22J11K14J19j41j85J9J22l63l3L06L15j17j37k38N09l93P5j06K18
$$ -155 217 -205 -94 120 239 98 -87 -68 54 -309 -342 -36 279 162 25 -213 296 -97 -22 -128 90
3654I0J83j5j63j56k02j42L36N1K2N6K2lJ56k89l3k37R4K22K48J18m15J75m70
$$ 90 273 258 95 -61 -263 -405 -69 -18 4 60 82 79 235 -54 -87 -324 -230 -8 240 358 -57 118 -352
3677c52J99o2M7J32K31k33P1l02L33j59O9k28J09L87k29j41K94j80O1j66j76M37
$$ -352 -153 -215 -168 -36 195 -38 33 -269 64 -95 -26 -254 -145 242 13 -128 166 -14 47 -119 -295 142
3699A42j59n9J03J00k33J01j29J57K7J06j20L1l51K15r2l4R5J32L0J16j28k14
$$ 142 -17 -76 27 127 -106 -5 -134 23 50 156 36 67 -284 -69 -161 -195 -100 32 62 178 50 -164
3721a64L40n02K21K75J14j51k82j8M3N5k83L05K07r4J0k34K59O6o6Q6o29L24J22
$$ -164 176 -326 -105 170 284 133 -149 -167 -124 -69 -352 -47 160 66 76 -158 101 167 101 187 -442 -118 4
3744Dk4J47l08L2j25J0J81K00r9j67K13r4j89K14l7Pq0j10J89o3p0K70n57L44
$$ 4 -20 127 -181 -149 -274 -264 -83 117 18 -149 64 -30 -219 -5 -42 -35 -115 -225 -36 -99 -169 101 -456 -112
3768a12k07N53O6k52k70J03j37j21L45k69K85L63k63J58r2n9l83N03k60n8K18
$$ -112 -319 234 300 48 -222 -119 -256 -377 -32 -301 -16 347 84 242 150 91 -292 211 -49 -107 111
3789A11n5k83J79j57J53L60l10L49l64RO8J60l90J98O2j13K61k3j76j43j5r4L60
$$ 111 56 -227 -48 -205 -52 308 -2 347 -17 -8 60 220 -170 28 90 -23 238 215 39 -104 -119 -213 147
3812A47J6j78R6K13n04J8j28M56l54L97r8n7j25o4L54m49J6L26n2K45j25j85J60
$$ 147 163 -15 81 294 -210 -192 -320 136 -218 179 81 24 -101 -165 189 -260 -244 82 30 275 150 -35 125
3835A25k93J86k02M67j29k00J35J8J7l03qK31j16L60k64M98n36K54l09L67m45
$$ 125 -168 18 -184 283 154 -46 89 107 124 -179 -187 44 -72 288 24 522 -14 240 -69 298 -147
3856a47N0J30kL23m66J7nJ90l01K8L49M7m37N34k90O0j37J32j42r1O4J56m1j43
$$ -147 -97 33 31 354 -112 -95 -100 90 -211 -183 166 213 -224 310 20 80 -57 75 -67 -158 -94 62 21 -122
3880a22j12l04O55q9P1q9m0p1J7M1N25r73P17l87M45j30j48p3M4j16q1M23k06
$$ -122 -234 -538 117 28 99 10 -30 -101 -84 -43 482 -491 226 -161 284 154 6 -67 -23 -139 -220 203 -3
3903cL00K28l68j46j70k28O78m49L96j5j14Lo2l89R4j17J70M14l5k51L34j41o8
$$ -3 297 525 157 11 -159 -387 291 -158 238 223 109 112 50 -339 -245 -362 -192 222 187 -64 270 129 61
3926F1P2p3k79L49R3N7Mj57l45Q3J51k36O17l94J32l2l2n07M88l36K71J62L93
$$ 61 133 60 -219 130 223 280 284 127 -218 -135 16 -220 397 3 135 103 71 -436 52 -284 -13 149 542
3949E42m42Q1l65l6j16N4K12J74K18j92L0j37J07k08J91J63k87NL45m70j8J11
$$ 542 100 181 -184 -220 -336 -282 -70 104 322 130 160 23 130 -78 113 276 -11 -6 339 -131 -149 -38
3971c8k78m1K79Q7K97l92J84k26j79k2l6N76j25M26m19l39L57j88j8nN5P5J8k8
$$ -38 -316 -357 -78 9 306 -86 98 -128 -307 -329 -365 211 86 512 93 -246 111 -77 -95 -100 -45 30 48 20
3995B0J86j19j64j94K09n8K1O40n08j39J18m8k96J1M33J92n5Q8j60j53m48K23
$$ 20 206 87 -77 -271 -62 -120 -99 541 33 -106 12 -36 -332 -321 112 304 249 337 177 24 -424 -201
4017b01L4K81m63M70J83k13k25j03j96K57J63K44R0k73P1j83l09K0L58J35N5L0
$$ -201 -167 114 -349 121 304 91 -134 -237 -433 -176 -13 231 321 48 119 -64 -373 -353 5 140 195 225
4039B25N8j77l3j01k09K33K28k05L18j01j74j70k4p7MM16m8J76J2k20k09j64J0
$$ 225 283 106 73 -28 -237 -4 224 19 337 236 62 -108 -132 -209 -205 211 163 339 351 131 -78 -242 -232
4062b32L3L29j34L73j70M6j25m29K92k47L81J01J35l54K6r1k00j76j7M19J90j34
$$ -232 -199 130 -4 369 199 245 120 -309 -17 -264 117 218 353 -1 25 -66 -266 -442 -459 -40 150 16
4084A6M18k30l45k87j58J70L16L76j04j95o5K51k96l63L63J00K11L06j86K10q64
$$ 16 434 204 -141 -428 -586 -416 -100 276 172 -23 -88 163 -133 -496 -133 -33 178 484 298 508 -356
4105c56R6k68J96N00o6M30n97M8k51L8K7K4L71l3J80N9j42l66j15q3J68J67J02
$$ -356 -260 -528 -332 168 102 532 -65 -17 -268 -230 -203 -179 192 159 339 398 256 -110 -225 -308 -140 27 129
4128A29K68j21K4j73n27R9J41K60O8O3J2o5j8o77L61J65j95L51P0L55n08k68k46
$$ 129 397 276 300 127 -400 -301 -160 100 168 231 243 178 160 -517 -156 9 -186 165 235 590 82 -186 -432
4151d32k4P7M18R9J99k6j99j47J28m22M0L41J22l04N01l84k24R5j29N3J38P9J97
$$ -432 -456 -379 39 138 337 311 112 -35 93 -329 -289 52 174 -130 371 -13 -237 -142 -271 -218 -80 -1 196
4174A96K76k56m09k55K87Q0j5nK24L32l42j17j37m36N30K8K79J71k59K42m26m32
$$ 196 472 216 -193 -448 -161 -81 -96 -101 123 455 113 -4 -141 -577 -47 -19 260 431 172 414 -12 -444
4196d44L24M7K56k0P3ok96J19l08j25J91K17R2K84j38j78l65R1j06J96JL24o3
$$ -444 -120 -73 183 163 236 230 -66 53 -255 -380 -189 28 120 404 266 88 -277 -186 -292 -96 -95 229 166
4219A66J45qm49L5j05j67N35P9j87r7L91n43O1P3k59J98K88J86J7q3k95J96l70
$$ 166 311 303 -146 -111 -216 -383 152 231 44 -53 338 -205 -144 -71 -330 -132 156 342 359 276 -19 177 -193
4242a93J30M20j71K07J03k37m73j54k7n4N06L43j3M9k44m29N4J64k13K09O3L39
$$ -193 -63 357 186 393 496 259 -214 -368 -395 -449 57 400 387 436 192 -237 -183 -19 -232 -23 40 379
4264C79n6j29J74o75q9LMM89R9Q6m1n2k93k54k2J43L75K36j26p3m5m15K5j34L25
$$ 379 323 194 368 -307 -396 -393 -389 100 199 285 244 192 -101 -355 -377 -234 141 377 251 178 133 -282 -257 -391 -66
4289f6L3J43M24l53k45k96K66nK54l60L77R8k31k55j37K2K27J70j09M33o9j68
$$ -66 -33 110 534 181 -64 -360 -94 -99 155 -205 172 270 39 -216 -353 -331 -104 66 -43 390 321 153
4311A53m84L12l60k03P54q0K20L5j66q9l87K23j45q7M28J55l3j26j67k32j30M7
$$ 153 -331 -19 -379 -582 172 92 312 347 181 92 -295 -72 -217 -304 124 279 246 120 -47 -279 -409 -362
4333c62M04J94Q8k0k14j92r2j54L94p2M14L2n2k11m73m2N2J47J48J41K50j89J91
$$ -362 42 236 324 304 90 -102 -194 -348 46 -26 388 420 368 157 -316 -358 -306 -159 -11 130 380 191 382
4356C82n85l46j5L30J23M7M79L00j64q08q3L0j31L27K00M60l36j92j05k88rj75
$$ 382 -203 -549 -564 -234 -111 -64 415 715 551 -257 -340 -310 -441 -114 86 546 210 18 -87 -375 -384 -559
4378e59P60J03L1q7j56k48j27j09j1M65j8K59q4j82j17j87p7K11lJ66K11ql0j69
$$ -559 201 304 335 248 92 -156 -283 -392 -403 62 44 303 219 37 -80 -267 -344 -133 -136 30 241 233 203 34
4402C4m54o6R1N15l0K30K01k57j51m44P6j4J61J13L21L51k60l90k13m67L02O07
$$ 34 -420 -486 -395 120 90 320 521 264 113 -331 -255 -269 -108 5 326 677 417 27 -186 -653 -351 256
4424B56M0j66K95k46k66k72K7J59K18J21k34L30J5o47Lj39J41K72l8O21k23J67
$$ 256 296 130 425 179 -87 -359 -332 -173 45 166 -68 262 277 -370 -367 -506 -365 -93 -131 490 267 434
4446D34m39m47l3K63R8M40J57j58p5j64l91l55N12K9M73K35j32l63j11m74K5L75
$$ 434 -5 -452 -485 -222 -124 316 473 315 240 76 -315 -670 -158 -129 344 579 447 84 -27 -501 -476 -101
4468a01J37M12O5q7m48k22om06J30M53L07O8K2j84j38j32j79n3J79N41J02j71
$$ -101 36 448 513 426 -22 -244 -250 -656 -526 -73 234 302 324 140 2 -130 -309 -362 -183 358 460 289
4490B89j39j80k45j44L32j27K89O1L48J66n75r5m19P7N1O08J66l8k46K86o18j83
$$ 289 150 -30 -275 -419 -87 -214 75 136 484 650 75 -20 -439 -362 -311 297 463 425 179 465 -153 -336
4512c36L30j51L75K00l6j13m59j89j93p5O28mN61k64J8m85j26j81P8J98K00L63
$$ -336 -6 -157 218 418 382 269 -190 -379 -572 -647 -19 -23 538 274 292 -193 -319 -500 -422 -224 -24 339
4534C39j53M6l64J57q5j37J44K98J62l45P4k75k87p2N89j14K28L30m08j38J90
$$ 339 186 232 -132 25 -60 -197 -53 245 407 62 136 -139 -426 -498 91 -23 205 535 127 -11 179
4555A79m24m25L09M90L3J54k2j11j51j76j53j44L34L14M58m33k49j52K2k32K03
$$ 179 -245 -670 -361 129 162 316 294 183 32 -144 -297 -441 -107 207 665 232 -17 -169 -147 -379 -176
4576a76OJ62K26Q8j19p63K94k27j3M44N49N6j02j28l61k53J95k70R7N94k69L69
$$ -176 -170 -8 218 306 187 -576 -282 -509 -522 -78 471 527 425 297 -64 -317 -122 -392 -295 299 30 399
4598C99k0j73n48j0P7K25L62q1J23j9l42j28j28K3K00L0M66j74J41l63m13k41
$$ 399 379 206 -342 -352 -275 -50 312 231 354 335 -7 -135 -263 -240 -40 -10 456 282 423 60 -353 -594
4620e94J84L33N63k24N9k31j21kl08J96j61M25Q4K13k82K9l78j73n9N01O9J04
$$ -594 -410 -77 486 262 321 90 -31 -33 -341 -145 -306 119 203 416 134 163 -215 -388 -447 54 123 227
4642B27L29l86o7m09m29M17M40J74J81j7l26m15J0k79M3O74k55N36L38k36l78
$$ 227 556 170 103 -306 -735 -318 122 296 477 460 134 -281 -271 -550 -507 167 -88 448 786 550 172
4663A72o92J86k02O76p8K92R8k04n39k08l32M86K44J20O06m8j23m39n18J42r0
$$ 172 -520 -334 -536 140 62 354 452 248 -291 -499 -831 -345 -101 19 625 577 454 15 -503 -361 -451
4684d51L16J86R4J08km09j2m12K70M17J44K74l5j60l74k06k83L12JL14L75k0o01
$$ -451 -135 51 145 253 251 -158 -170 -582 -312 105 249 523 488 328 -46 -252 -535 -223 -222 92 467 447 -154
4707a54J81l45r1R0R0J79M02J02j30l44l06L8r6L28K28J73l5Q7m38m81l31O63
$$ -154 27 -318 -409 -319 -229 -50 352 454 324 -20 -326 -288 -384 -56 172 345 310 397 -41 -522 -853 -190
4729a90O2L79M38m68K68o56j92k60k4L77M25Q1K10k26j32l01l09K22L80M11N1
$$ -190 -128 251 689 221 489 -167 -359 -619 -643 -266 159 240 450 224 92 -209 -518 -296 84 495 546
4750E46K6j89l47m50l61M55J13L84K55K61o74J04j02o92L93K80M14O0J53k48m45
$$ 546 572 383 36 -414 -775 -320 -207 177 432 693 19 123 21 -671 -278 2 416 476 629 381 -64
4771f4l86J7m5L09N76qJ21m24l8j18j34m08J81O41J26K20l25k12r5k88K1K47M58
$$ -64 -450 -433 -478 -169 407 399 520 96 58 -60 -194 -602 -421 220 346 566 241 29 -66 -354 -333 -86 372
4794C72q4N5m7l21n10j47L51M41j1K79j06P5l26l03j06o9M33K93J72k7k7m02k43
$$ 372 288 343 296 -25 -535 -682 -331 110 99 378 272 347 21 -282 -388 -457 -24 269 441 414 387 -15 -258
4817b58l9j00N3O15M08j81m17K67m11k72J53J40L66K45n2k05n19j12m19K56L73
$$ -258 -297 -397 -344 271 679 498 81 348 -63 -335 -182 -42 324 569 517 312 -207 -319 -738 -482 -109
4838a09L95J42j04j33m07k48M1J19R7L20O15k42q1n37m52K08k6L6L98O48r3j35
$$ -109 286 428 324 191 -216 -464 -423 -304 -207 113 728 486 405 -132 -584 -376 -402 -366 32 680 587 452
4860D52m08l76j24l3L81K65K24j61J2k5o29k23O19j16K93M66m3l30l41k45m08
$$ 452 44 -332 -456 -489 -108 157 381 220 232 207 -422 -645 -26 -142 151 617 574 244 -97 -342 -750
4881g50M08J14L15M86l59L55l15o92O6J97L7K89M07q9m0o17P4k84R4J46K64M42
$$ -750 -342 -228 87 573 214 569 254 -438 -372 -175 -138 151 558 469 429 -188 -114 -398 -304 -158 106 548
4903E48j16M6p62j17r3K70Q8O11p7N8j53l82n8j71k70K35N70O0j43K90o37k88
$$ 548 432 478 -284 -401 -494 -224 -136 475 398 456 303 -79 -137 -308 -578 -343 227 287 144 434 -203 -491
4925d91q9K71L11J75o6K77j76l12r4k97O2K13M45K53j08j58m77J65k37j04M18
$$ -491 -580 -309 2 177 111 388 212 -100 -194 -491 -429 -216 229 482 374 216 -261 -96 -333 -437 -19
4946a9L29L38m43J11j85o59K47j33K70N3K87N95o42m50J68n63J55M06J55M17k21
$$ -19 310 648 205 316 131 -528 -281 -414 -144 -91 196 791 149 -301 -133 -696 -541 -135 20 437 216
4967B16n2j39n37j52N26k84O36L17n7m56N1m68p0J7M7O30P7K18j74m73l05K49
$$ 216 164 25 -512 -664 -138 -422 214 531 474 18 69 -399 -469 -452 -405 225 302 520 346 -127 -432 -183
4989a83m4n4N91P0J08j94l56l06L7r1m7P79o9K35k23l41k81q6M9O04j39M44j67
$$ -183 -227 -281 310 380 488 294 -62 -368 -331 -422 -469 310 241 476 253 -88 -369 -455 -406 198 59 503 336
5012C36o7l41k74k62K59L80L39j38l1Q7l16m02j49J28J62L31P37k78k64j48o26
$$ 336 269 -72 -346 -608 -349 31 370 232 201 288 -28 -430 -579 -451 -289 42 779 501 237 89 -537
5033e37J31j41M82K60J39K50j27n47j64j58q2K36M01K36Q0p2m63k42N1j69K08
$$ -537 -406 -547 -65 195 334 584 457 -90 -254 -412 -494 -258 143 379 459 387 -76 -318 -267 -436 -228
5054b28K24O44k18j36k67m91J69q0LO27n7M26m15k20k77m90J55N42M01J60J30
$$ -228 -4 640 422 286 19 -472 -303 -383 -380 247 190 616 201 -19 -296 -786 -631 -89 312 472 602
5075F02qq32k3n9l39L90P88J46k53q3n49l4k30L04j09O03L64l25p4l74k57K17
$$ 602 594 -238 -261 -320 -659 -269 519 665 412 329 -220 -254 -484 -180 -289 314 678 353 279 -95 -352 -135
5097a35j8K55L90K9k1j56k71m55k68P2P30J27K90j31o4n80l88J63P6j03N67L17
$$ -135 -153 102 492 521 500 344 73 -382 -650 -578 152 279 569 438 374 -206 -594 -431 -355 -458 109 426
5119D26j42K0m85m20n9L66M69j35N82Q1m83j79n09QK13K6M73L32n3l90Jp00J42
$$ 426 284 304 -181 -601 -660 -294 175 40 622 703 220 41 -468 -460 -247 -221 252 584 531 141 142 -558 -416
5142d16l3J24N23K23n7j52k32k37j39Q6K32K79L48r8j82j13n37J82R1k4M47K58
$$ -416 -449 -325 198 421 364 212 -20 -257 -396 -310 -78 201 549 451 269 156 -381 -199 -108 -132 315 573
5164E73j33m75p1m33k12L60J14L32M24L5m5p32Rk34K52K0N89K41k15L2n11l22
$$ 573 440 -35 -106 -539 -751 -391 -277 55 479 514 469 -263 -254 -488 -236 -216 373 614 399 431 -80 -402
5186d02R2j1n5N71M48K43n64Pr25J77k35N55P10j00J11l14k53l83l80J24M75O03
$$ -402 -310 -321 -376 195 643 886 322 329 -596 -419 -654 -99 611 511 622 308 55 -328 -708 -584 -109 494
5208D94q4K27m96j79o8m72kL41N03J49L3k09m72k02m27M49L97j4L67N09m72k59
$$ 494 410 637 141 -38 -106 -578 -580 -239 264 413 446 237 -235 -437 -864 -415 -18 -32 335 844 372 113
5230A13l13n07L82J60M36N9k4j61n7m96J0K61J7J53N94J20p54J37p96K11O6N50
$$ 113 -200 -707 -325 -165 271 330 306 145 88 -408 -398 -137 -120 33 627 747 -7 130 -666 -455 -389 161
5252A61J5L55j10L6l51o34L9K84l3M61K84j37Mp01J53p2m05N52L23jM0n8k66n11
$$ 161 176 531 421 457 106 -528 -489 -205 -238 223 507 370 374 -327 -174 -246 -651 -99 224 223 263 205 -61 -572
5276e72J62M7J23K30M68K71m33m41k95j14M9L45M51L35j59k87l22l36P7l90N94
$$ -572 -410 -363 -240 -10 458 729 296 -145 -440 -554 -505 -160 291 626 467 180 -142 -478 -401 -791 -197
5297a97M43J82L1j43p42n7QP8R2O11k3J38p2n47m77p4K65M97R4M18j91J31l38
$$ -197 246 428 459 316 -426 -483 -475 -397 -305 306 283 421 349 -198 -675 -749 -484 13 107 525 334 465 127
5320A27l22n67L97K26K53M09L2k2o43j39m14J54O68j4J35M88k39m53n70j62K13
$$ 127 -195 -762 -365 -139 114 523 555 533 -110 -249 -663 -509 159 145 280 768 529 76 -494 -656 -443
5341d43N74K27jJ51j30n38j15m15L14J98J35M78j65k60p3Q8k05l01M98J88J50
$$ -443 131 358 357 508 378 -160 -275 -690 -376 -178 -43 435 270 10 -63 25 -180 -481 17 205 355
5362C55K02l76Q4n69j30j44N66K82K36L32n63k08l97j82l8N65K86M35j13o19r6
$$ 355 557 181 265 -304 -434 -578 -12 270 506 838 275 67 -330 -512 -550 15 301 736 623 4 -92
5383i2k26j77K47K50L38J92l07R4j01m48m33L85J83N2O37n3l89r1k35k66J19P5
$$ -92 -318 -495 -248 2 340 532 225 319 218 -230 -663 -278 -95 -43 594 541 152 61 -174 -440 -321 -246
5405b46M94N00m41l0n49k05q2J90K09N09l2R7m8k07r45O7K57N96L15K13k70k90
$$ -246 248 748 307 277 -272 -477 -559 -369 -160 349 317 414 366 159 -786 -719 -462 134 449 662 392 102
5427A02j66k65j70K30j46O00K81J78k49o93l23O5K23J87J51J37O26j89k85p83
$$ 102 -64 -329 -499 -269 -415 185 466 644 395 -298 -621 -556 -333 -146 5 142 768 579 294 -489
5447d89J27Rp4N93N4j33K80n66k05l4j49L26K00N36K05l90k40j33l48J32K96L62
$$ -489 -362 -353 -427 166 220 87 367 -199 -404 -438 -587 -261 -61 475 680 290 50 -83 -431 -299 -3 359
5469C59OK25l35m45q2k2J00J40M28j59M01j36l38m77N0k20M75L16Q1K88n69Q9
$$ 359 365 590 255 -190 -272 -294 -194 -54 374 215 616 480 142 -335 -285 -505 -30 286 367 655 86 175
5491A75n63l34M73J18N20PR9m5m88k34N0l63M30M68%m8r3k30l57o7L37k63N00
$$ 175 -388 -722 -249 -131 389 396 495 450 -38 -272 -222 -585 -155 313 313 265 172 -58 -415 -482 -145 -408 92
5514I2J65M58l56l83j29m36J75K89M08L47k84L4m37m32L3k29N92K75p7N26l80
$$ 92 257 715 359 -24 -153 -589 -414 -125 283 630 346 380 -57 -489 -456 -685 -93 182 105 631 251
5535B51l16k09k60j66N96j26R42k51j92n92L3o3L19p8L97N0J56k11l12j04l37
$$ 251 -65 -274 -534 -700 -104 -230 712 461 269 -323 -290 -353 -34 -112 285 335 491 280 -32 -136 -473
5556d73j26L85N71P5j00P2n52l63K55j22L16K30L33Mk61j53n50j6lL28O64P0p8
$$ -473 -599 -214 357 432 332 404 -148 -511 -256 -378 -62 168 501 505 244 91 -459 -475 -478 -150 514 584 506
5579E06m13O2l76l48mM79M74J3n3J41n35k90j94K82L59P8J51L53m25j48n62K6
$$ 506 93 155 -221 -569 -573 -94 380 393 340 481 -54 -344 -538 -256 103 181 332 685 260 112 -450 -424
5601d24n2M45K70K32J23m91k06j76l04k1M42N28p9K76j56m98k22k44M14k12P94
$$ -424 -476 -31 239 471 594 103 -103 -279 -583 -604 -162 366 287 563 407 -91 -313 -557 -143 -355 439
5622D39j68L8M9o00L4l3Q3l3N06J47k44k21R0l47l47K36L22J93K16k55j44K9k56
$$ 439 271 309 358 -242 -208 -241 -158 -191 315 462 218 -3 87 -260 -607 -371 -49 144 360 105 -39 -10 -266
5645b66m89L69K35M09J34M4nm36m39n1M2K27K28M24q9l7m47j14k28K22J99J28
$$ -266 -755 -386 -151 258 392 436 431 -5 -444 -495 -453 -226 2 426 337 300 -147 -261 -489 -267 -68 60
5667F0N66m19J43l58k40l01L90K63K52Q6r4k37om71j32K31O9L02L12J04l73k98
$$ 60 626 207 350 -8 -248 -549 -159 104 356 442 348 111 105 -366 -498 -267 -198 104 416 520 147 -151
5689a51j71j93J48K72K68J83Q8k22l88k46MP8K83O5M13j44J15o66J09o13N54p9
$$ -151 -322 -515 -367 -95 173 356 444 222 -166 -412 -408 -330 -47 18 431 287 402 -264 -155 -768 -214 -293
5711b93N65K68j56k73j85l93MK21J33K09L60l8k49j78n57j39N22n6N12oj12M8
$$ -293 272 540 384 111 -74 -467 -463 -242 -109 100 460 422 173 -5 -562 -701 -179 -235 277 271 159 207
5733B07l58o0k12J81M44m5M41k89l04M4p36L61r4K89L31O4j32K03k61k09m36J7
$$ 207 -151 -211 -423 -242 202 157 598 309 5 49 -687 -326 -420 -131 200 264 132 335 74 -135 -571 -554
5755e54K78M08L78J00m02p5o82K09j26L58M92J59J77o87k45l77j57L71m9N46J66
$$ -554 -276 132 510 610 208 133 -549 -340 -466 -108 384 543 720 33 -212 -589 -746 -375 -424 122 288
5776B88J18j32J51o38l15j60O31L35J14L04m71k61k93m11J55P37n1K37K35k98
$$ 288 406 274 425 -213 -528 -688 -57 278 392 696 225 -36 -329 -740 -585 152 101 338 573 275
5796B75k59l55j91L13L38j61O69p3l11k85m86K83p4J51J73L77j75J24m05k08m9
$$ 275 16 -339 -530 -217 121 -40 629 556 245 -40 -526 -243 -317 -166 7 384 209 333 -72 -280 -329
5817c29j66M24K68P9L40k83p4m49k26Q7L35J20M11r8k09k98l34J94l33M35M41
$$ -329 -495 -71 197 276 616 333 259 -190 -416 -329 6 126 537 439 230 -68 -402 -208 -541 -106 335
5838C35K51j77j49k12m74l07M43K66L43K52k84k01O6n34k13N21k8R4O94l32j43
$$ 335 586 409 260 48 -426 -733 -290 -24 319 571 287 86 152 -382 -595 -74 -102 -8 686 354 211
5859B11m00j4k49k33L06O02K25k9k3m37l62j38J43L90k05N71K5o5j49q16L96M7
$$ 211 -189 -203 -452 -685 -379 223 448 419 396 -41 -403 -541 -398 -8 -213 358 383 318 169 -647 -251 -204
5881b04J49K27K18N9l94l85J67k88K1K63L68M15l2j49m38l06r5K06r0K97O30k92
$$ -204 -55 172 390 449 55 -330 -163 -451 -430 -167 201 616 584 435 -3 -309 -404 -198 -288 9 639 347
5903C47k24q8l58j31J91J49K10K89K41n44k46j46O1k14M85K93q5nJ58k65l37k41
$$ 347 123 35 -323 -454 -263 -114 96 385 626 82 -164 -310 -249 -463 22 315 230 225 383 118 -219 -460
5925d60p1K60m2R33J6m87j43k45k53L7K24M45R0L42l25l56j55k23M6K04J95L24
$$ -460 -531 -271 -313 620 636 149 6 -239 -492 -455 -231 214 304 646 321 -35 -190 -413 -367 -163 32 356
5947C56R2j29k30p51O56m94L07N48q9o8J11j76l64l57L02M17L4M49k04k0k06n41
$$ 356 448 319 89 -662 -6 -500 -193 355 266 198 309 133 -231 -588 -286 131 165 614 410 390 184 -357
5969c57k14K13J0M76L14k62q5k43j92J78j63J92J19N59j55q6m38j24k65J57P8
$$ -357 -571 -358 -348 128 442 180 95 -148 -340 -162 -325 -133 -14 545 390 304 -134 -258 -523 -366 -288
5990b88L23O22l25k29J45k44n37J34K16J50L30j17j45k27j79r3L30L08r4J42K00
$$ -288 35 657 332 103 248 4 -533 -399 -183 -33 297 180 35 -192 -371 -464 -134 174 80 222 422
6011D22j40m44K09n15J37O03j4J40O0l68m1l1k15k36N32j03K79J2q2j17k88j85
$$ 422 282 -162 47 -468 -331 272 258 398 458 90 49 18 -197 -433 99 -4 275 287 205 88 -200 -385
6033c85N1j4P25J11j97l1j94n69J75j87O40p5K15N20q38j09K42n48J61K05L12
$$ -385 -334 -348 377 488 291 260 66 -503 -328 -515 125 50 265 785 -53 -162 80 -468 -307 -102 210
6054B10J39j2l67k76n7NLK91O13j43k53K2l04l57k2J16L18P9K09L20l01l95R5
$$ 210 349 337 -30 -306 -363 -358 -355 -64 549 406 153 175 -129 -486 -508 -392 -74 5 214 534 233 -162 -67
6077f7l18J57J05L96r2J85J23o18k19J39l47M00K90J26K32j49k03l73l73M39O6
$$ -67 -385 -228 -123 273 181 366 489 -129 -348 -209 -556 -156 134 260 492 343 140 -233 -606 -167 -101
6098a01K02L92j50k53K23p72O8Q5j3P14J77k49k05l36K07n27J47K15N0P26k18
$$ -101 101 493 343 90 313 -459 -391 -306 -319 395 572 323 118 -218 -11 -538 -391 -176 -126 600 382
6119C82j49n17j95P1PL10K87K03R3j90k23m57k16P14j99L00M22k86K4n46l14p3
$$ 382 233 -284 -479 -408 -401 -91 196 399 492 302 79 -378 -594 120 -79 221 643 357 381 -165 -479 -552
6141e52K02L13J76J2K71j50k85j13k42r5K37N44K67j3k04m85j26k76L6K98J94
$$ -552 -350 -37 139 151 422 272 -13 -126 -368 -463 -226 318 585 572 368 -117 -243 -519 -483 -185 9
6162IP1M90n71Q1p90M81j91N98j8M40j21j83k64l42Pk31N80pJ96K04j0m30Nl55
$$ 9 80 570 -1 80 -710 -229 -420 178 160 600 479 296 32 -310 -303 -534 46 39 235 439 429 -1 4 -351
6186c51J29r7N47M08k59j30m02Q6j46j09K22N75j64K72l56jk48k26j8r4N74j32
$$ -351 -222 -319 228 636 377 247 -155 -69 -215 -324 -102 473 309 581 225 224 -24 -250 -268 -362 212 80
6208H0J93J5l75M2k54J97j64O57K90mn20k87K1k52Q5R1K55M21l13J86m13J68n12
$$ 80 273 288 -87 -45 -299 -102 -266 391 681 677 157 -130 -109 -361 -276 -185 70 491 178 364 -49 119 -393
6231c93MJ63K93L31k87K84l25O2m43l77O83M12r3Q7j64k86k30P3j83N29o7N86
$$ -393 -389 -226 67 398 111 395 70 132 -311 -688 -5 407 314 401 237 -49 -279 -206 -389 140 73 659
6253F59j75m71Q6p70J80J78L48K07n4N5j01k79j08J11l61M02L75K04k53k6J22
$$ 659 484 13 99 -671 -491 -313 35 242 188 243 142 -137 -245 -134 -495 -93 282 486 233 207 329
6274C29p84r1K04K85L29n5K18k31k16l9l12j39K61M88R7J6n7l59j00o3k07K23
$$ 329 -455 -546 -342 -57 272 217 435 204 -12 -51 -363 -502 -241 247 344 360 303 -56 -156 -219 -426 -203
6296b03K68J52N7o0j97k84j63J90J88K46k77M86j53k20n83K80j70K27L86K39J25
$$ -203 65 217 274 214 17 -267 -430 -240 -52 194 -83 403 250 30 -553 -273 -443 -216 170 409 534
6317E34k78K2o03m1K29j56M30Q3J16Q8m98j23l32J14K43N27L3J30l33k20j20k49
$$ 534 256 278 -325 -366 -137 -293 137 220 336 424 -74 -197 -529 -415 -172 355 388 518 185 -35 -155 -404
6339d04j3J56M34K8O5J14p22L39m86LK22L44K17l8k09k22j89l49L17J67L72K25
$$ -404 -417 -261 173 201 266 380 -342 -3 -489 -486 -264 80 297 259 50 -172 -361 -710 -393 -226 146 371
6361C71k30o0K1l19J38k71L81j01J52L27l84j63k83K55L1P0J10M31j45k1j76j83
$$ 371 141 81 102 -217 -79 -350 31 -70 82 409 25 -138 -421 -166 -135 -65 45 476 331 310 134 -49
6383d9k91k67Q03jJ9m1Q6k28m64m2K87r1L06L69k49n5L3k75j26k92K74M65K10
$$ -49 -340 -607 196 195 214 173 259 31 -433 -475 -188 -279 27 396 147 92 125 -150 -276 -568 -294 171 381
6406C81J98k30l13m02j57o0K37N54Q9m3Q9m22l43J56k4L67P0K46K8j83l26r9J12
$$ 381 579 349 36 -366 -523 -583 -346 208 297 254 343 -79 -422 -266 -290 77 147 393 421 238 -88 -187 -75
6429g5l81K93M60J15J03k73j18l66k64L09Q1L8M36L57m87l28jm63N72j55K90K06
$$ -75 -456 -163 297 412 515 242 124 -242 -506 -197 -116 -78 358 715 228 -100 -101 -564 8 -147 143 349
6451C49k07R2j93j34j79o1K63N36k18K28l12j39l00k74J00M69P7L93k8q8k55m57
$$ 349 142 234 41 -93 -272 -333 -70 466 248 476 164 25 -275 -549 -449 20 97 490 462 374 119 -338
6473c38M50m85R9M60K90k58Q0n13k19J00J28JP23j24j6p8m59q4lO7J83M1L09J
$$ -338 112 -373 -274 186 476 218 298 -215 -434 -334 -206 -205 518 394 378 300 -159 -243 -246 -179 4 45 354 355
6497C55n1n40j12L2J30J94M09k33K62m2l91l09l2L55j65J55L46O1m02%k25j36
$$ 355 304 -236 -348 -316 -186 8 417 184 446 404 13 -296 -328 27 -138 17 363 424 22 22 -203 -339
6519c39n0K64M3j7J88J50j28l90j21k4M86N6N18L9j95o13n9k70K8K83L66J06K52
$$ -339 -389 -125 -82 -99 89 239 111 -279 -400 -424 62 118 636 675 480 -133 -192 -462 -434 -151 215 321 573
6542E73l91m4k12k55p0M6M34K52j62j38J08m90l69M04K62K9O99j51o12r4J60l22
$$ 573 182 138 -74 -329 -399 -353 81 333 171 33 141 -349 -718 -314 -52 -23 676 525 -87 -181 -21 -343
6564c43J69K17Q1K02r3Lj5m15j7o3L11L5K16J69k28p8k79O6p5R4mL64J76l55p3
$$ -343 -174 43 124 326 233 236 221 -194 -211 -274 37 72 288 457 229 151 -128 -62 -137 -43 -47 317 493 138 65
6589F5l62J7k28N04J29ML03l6o8o29Q2J44M8j12M12M7l4m72q4J25l22M72K00J12
$$ 65 -297 -280 -508 -4 125 129 432 396 328 -301 -219 -75 -27 -139 273 320 286 -186 -270 -145 -467 5 205 317
6613C17j36p0l3L3n22J95K4M00k5L51j23k48k33j71p5j8L60L48nj5j46m78r4k96
$$ 317 181 111 78 111 -411 -216 -192 208 183 534 411 163 -70 -241 -316 -334 26 374 369 354 208 -270 -364 -660
6637f60N01L03J45R5Ro61J3pj86M13K02q5j36K25J73n59j58J53K3M65rj10J22
$$ -660 -159 144 289 384 393 -268 -255 -262 -448 -35 167 82 -54 171 344 -215 -373 -220 -197 268 259 149 271
6660B71l73j61K94j45n0K19q5M48n4j8l70j80J94J32K15j95L91k56k02j75m45
$$ 271 -102 -263 31 -114 -164 55 -30 418 364 346 -24 -204 -10 122 337 142 533 277 75 -100 -545
6681e45P3L18L00K35J10l58j78j72mk60P27j69N38N1m54r7j92k46L5k4K33K76
$$ -545 -472 -154 146 381 491 133 -45 -217 -221 -481 246 77 615 666 212 115 -77 -323 -288 -312 -79 197
6703A97J36l47j3J30n54L77k08M24L46k15n9j54m30J57r9N2K88K42M4k45O6l89
$$ 197 333 -14 -27 103 -451 -74 -282 142 488 273 214 60 -370 -213 -312 -260 28 270 314 69 135 -254
6725b54Oj20J78N32l44L24j74k87L1l12K32j91M02M33k96J47n19J59N6m68J82
$$ -254 -248 -368 -190 342 -2 322 148 -139 -108 -420 -188 -379 23 456 160 307 -212 -53 3 -465 -283
6746b83L26L0J72j46j1k68k38J60N22j85M77p2l96j40m29M1K86r2L02J96opk13
$$ -283 43 73 245 99 88 -180 -418 -258 264 79 556 484 88 -52 -481 -440 -154 -246 56 252 246 239 26
6769B6k86j59K72J41j08N25N8j02l05j46J17l87L47J28L61l86o9K39n62j77M15
$$ 26 -260 -419 -147 -6 -114 411 469 367 62 -84 33 -354 -7 121 482 96 27 266 -296 -473 -58
6790e8k07M82L81j08k26j25j70n00L07J96J96k0L26k74j17n26L07q9J62R5K49
$$ -58 -265 217 598 490 264 139 -31 -531 -224 -28 168 148 474 200 83 -443 -136 -225 -63 32 281
6811B81J34l57j46k35m0K59l8N94j13k46P1l0Mm73J37K02J12L16O5j72l88j75
$$ 281 415 58 -88 -323 -363 -104 -142 452 339 93 164 134 138 -335 -198 4 116 432 497 325 -63 -238
6833b38m0j79O17k18L37J42l90L9j17m73M33l33N71N00k22j1k13l62m08J4K32
$$ -238 -278 -457 160 -58 279 421 31 70 -47 -520 -87 -420 151 651 429 418 205 -157 -565 -551 -319
6854c19N55l5L09k88k20j03n3M5q2K14r6M30j16m40M4l10M13j79M91p1J26q1j18
$$ -319 236 201 510 222 2 -101 -154 -109 -191 23 -73 357 241 -199 -155 -465 -52 -231 260 189 315 234 116
6877A16l65J97j46K00J80M1J34M9n18K31l69J03k03L59L9J95r0j34k87k19K92
$$ 116 -249 -52 -198 2 182 223 357 406 -112 119 -250 -147 -350 9 48 243 153 19 -268 -487 -195
6898a95o0K45N52j52j73K6l63k93K83r1J63K65K15m06M8k36J38j02r4O38l9r9
$$ -195 -255 -10 542 390 217 243 -120 -413 -130 -221 -58 207 422 16 64 -172 -34 -136 -230 408 369 270
6920B70J98l70m03j68K09J76J03K68R6j83l17j21o0jL15J85R7j91p2M1k95k20
$$ 270 468 98 -305 -473 -264 -88 15 283 379 196 -121 -242 -302 -303 12 197 294 103 31 72 -223 -443
6942d43J37J50J39J13M34m02k65J47k64k06N90J78l24J93k37n1k49n6M9K02J78
$$ -443 -306 -156 -17 96 530 128 -137 10 -254 -460 130 308 -16 177 -60 -111 -360 -416 -367 -165 13
6963A3L03J66j74k51j34k14k60M41R0J12J0nJ90p90L48M2L3K03K45k86lkm8o3
$$ 13 316 482 308 57 -77 -291 -551 -110 -20 92 102 97 287 -503 -155 -113 -80 123 368 82 79 77 29 -34
6987c4j24lL38J08k1J0p6m68k25O30n7Q9O0J00k15j29J41l28j97N25j07M35k66
$$ -34 -158 -161 177 285 264 274 198 -270 -495 135 78 167 227 327 112 -17 124 -204 -401 124 17 452 186
7010A86J09k05l40j70j54M29J82M63k95J08m13j85K3l24N84l08N28N9k63J73l10
$$ 186 295 90 -250 -420 -574 -145 37 500 205 313 -100 -285 -262 -586 -2 -310 218 277 14 187 -123
7031a23j03p4M90j73J2K37l0K5m84J64j10K15J60P7K41l46Nm10k41J87M05m7J38
$$ -123 -226 -300 190 17 29 266 236 261 -223 -59 -169 46 206 283 524 178 183 -227 -468 -281 124 77 215
7054B15J02m35J43m49o5M75k16J77L21j73J18j08j66j94l77O28J22J58J39l41
$$ 215 317 -118 25 -424 -489 -14 -230 -53 268 95 213 105 -61 -255 -632 -4 118 276 415 74
7074G4j71k6n4O9M7RR1L90m25J83k37k55L3J37K85K09k24l2J06m02r2l7J11O01
$$ 74 -97 -123 -177 -108 -61 -52 39 429 4 187 -50 -305 -272 -135 150 359 135 103 209 -193 -285 -322 -211 390
7098C90k27K93l23j05k56QMk4K16R6M86j18k13k65k27K48j25J46K54K13m35l11
$$ 390 163 456 133 28 -228 -220 -216 -240 -24 72 558 440 227 -38 -265 -17 -142 4 258 471 36 -275
7120b75J33O7j14J36L26L3J80m81J58l76m13K83M39m1P9Q3q2l52j35L55k82N7
$$ -275 -142 -75 -189 -53 273 306 486 5 163 -213 -626 -343 96 55 134 217 135 -217 -352 3 -279 -222
7142b22L89J22qj27l35J16N1j60l6J60K9M07r8k56k74M8K10N4J39r0K22j18j82
$$ -222 167 289 281 154 -181 -65 -14 -174 -210 -50 -21 386 288 32 -242 -194 16 70 209 119 341 223 41
7165D1k10O2k57K7M20J12M5j05k61k3r7n3j59N37K3L88l82k32l20K07j19L58J91
$$ 41 -169 -107 -364 -337 83 195 240 135 -126 -149 -246 -299 -458 79 102 490 108 -124 -444 -237 -356 2 193
7188A93k27K27Q2l19m6j62J14J97n8K37p4L8l26J56j13k83J63P6M14J26j45k84
$$ 193 -34 193 275 -44 -90 -252 -138 59 1 238 164 202 -124 32 -81 -364 -201 -125 289 415 270 -14
7210a4k37K73k52K68J84j41J45n15J07R6r6k3J50K46L9K79M4n40k61J72p0R7k5
$$ -14 -251 22 -230 38 222 81 226 -289 -182 -86 -182 -205 -55 191 230 509 553 13 -248 -76 -146 -49 -74
7233g4J95K29j41l88r1N3jL14QK35j8k05j08J07k65k40M86p6K55N3j10l11J99
$$ -74 121 350 209 -179 -270 -217 -218 96 104 339 321 116 8 115 -150 -390 96 20 275 328 218 -93 106
7256A06n69J88J88L25K40j59jj77k45J82j09J32j20p5N47k99l73L0j18j52N09
$$ 106 -463 -275 -87 238 478 319 318 141 -104 78 -31 101 -19 -94 453 154 -219 -189 -307 -459 50
7277E0K5r1J03L3j73J14j70j14K18J08J25J24l8m35M2R6L7L6Q7J75r3L8n3m77
$$ 50 75 -16 87 120 -53 61 -109 -223 -5 103 228 352 314 -121 -79 17 54 90 177 352 259 297 244 -233
7301b33r6K54P2N8J01K99k24m15L05O6l55Q7j4L37J11m7k53M4n71N2M22K45N1
$$ -233 -329 -75 -3 55 156 455 231 -184 121 187 -168 -81 -95 242 353 306 53 97 -474 -422 0 245 296
7324B96r6j76lk57K73j85K57K74Q6k45L4m07J11p9k02L44L16j3k50K20k70k26
$$ 296 200 24 21 -236 37 -148 109 383 469 224 258 -149 -38 -117 -319 25 341 328 78 298 28 -198
7346a98k54L55J19K02k2j65L30j90m61J66j12K16P7j48J05L72m98k28N9j7K05
$$ -198 -452 -97 22 224 202 37 367 177 -284 -118 -230 -14 63 -85 20 392 -106 -334 -275 -292 -87
7367h7o9L31K13j16l29r2J02j27M9J28K69k73K08k88J22k07N7p6K50K42P0m35
$$ -87 -156 175 388 272 -57 -149 -47 -174 -125 3 272 -1 207 -81 41 -166 -109 -185 65 307 377 -58
7389e8L06k31o01P40j46L6J08M5n7n32O6L12j54mM31j77Rj94J14o2N4k68L56k07
$$ -58 248 17 -584 156 10 46 154 199 142 -390 -324 -12 -166 -170 261 84 93 -101 13 -49 5 -263 93 -114
7413a14K19K29k72J56k80j67J59J44j9L57o03L35p1j80j38J53R3K3L71l42J90
$$ -114 105 334 62 218 -62 -229 -70 74 55 412 -191 144 73 -107 -245 -92 1 24 395 53 243
7434B43l75Lk43Q4K77J23K47O8j19m9m69k8ML77O9m7o0O3l26Q5k68K9J33J04L48
$$ 243 -132 -129 -372 -288 -11 112 359 427 308 259 -210 -238 -234 143 212 165 105 168 -158 -73 -341 -312 -179 -75 273
7459B73j00j07J38l95K71j44o6M81l9j04J41k40k01J31o45K61L36K13q2J4j65
$$ 273 173 66 204 -191 80 -64 -130 351 312 208 349 109 -92 39 -606 -345 -9 204 122 136 -29
7480b9n1j17M0j30M24k21K39Q0k28R1o6k19O5Q7K17o0N2m28q6J51k39L16lJ9J06
$$ -29 -80 -197 -157 -287 137 -84 155 235 7 98 32 -187 -122 -35 182 122 174 -254 -340 -189 -428 -112 -115 -96 10
7505A0l6N5q6K0n31M32K10J53J06n36J52l47L72p4l1J16L05R5k18m95k2Q8J7k7
$$ 10 -26 29 -57 -37 -568 -136 74 227 333 -203 -51 -398 -26 -100 -131 -15 290 385 167 -328 -350 -262 -245 -272
7529b72M71k20M45m63J35l75J2PN1L63K8j33J39r0m7j5p0l7r0K46J78j16n7l08
$$ -272 199 -21 424 -39 96 -279 -267 -260 -209 154 182 49 188 98 51 36 -34 -71 -161 85 263 147 90 -218
7553b18J41n7K29J01j25R5m31K79k47m8n3j44K31M54j09Q8j44k99J97J44j15p6
$$ -218 -77 -134 95 196 71 166 -265 14 -233 -281 -334 -478 -247 207 98 186 42 -257 -60 84 -31 -107
7575a07M15l19j16J04j23p5k1m8L53K6L17l06J11l08j68j95N45j0l8K35j55l86
$$ -107 308 -11 -127 -23 -146 -221 -242 -290 63 89 406 100 211 -97 -265 -460 85 75 37 272 117 -269
7597b69k40J42N17k04J22L16j12Lk55K31m12r3K77O9J51j34O4j94L1j68j36J84
$$ -269 -509 -367 150 -54 68 384 272 275 20 251 -161 -254 23 92 243 109 173 -21 10 -158 -294 -110
7619a10K6L94p7k28J49m59K71k76M60m0k9K91l65O7j37k09K49j55L33l80K86K25
$$ -110 -84 310 233 5 154 -305 -34 -310 150 110 81 372 7 74 -63 -272 -23 -178 155 -225 61 286
7641B86j13n89J67L2K60J67o6J46k3J44m63j28l9q1N26r3k4k37Mo7K80l5r3Q3
$$ 286 173 -416 -249 -217 43 210 144 290 267 411 -52 -180 -219 -300 226 133 109 -128 -124 -191 89 54 -39 44
7665D4J90j39qk08N0jl35M2L45O8R2j20p5j27J48J27J75m21M77j12j82j74J21
$$ 44 234 95 87 -121 -71 -72 -407 -365 -20 48 140 20 -55 -182 -34 93 268 -153 324 212 30 -144 -23
7688b3k49Q8K14j6P0m0K32l40L38o18M23k0j16L41k93K01L2l85j36M25n74M93
$$ -23 -272 -184 30 14 84 44 276 -64 274 -344 79 59 -57 284 -9 192 224 -161 -297 128 -446 47
7710D7J47j9l55m0J30n4K41q9N6J75j50j57K39j39j95J44J36j96K78P9j34j43
$$ 47 194 175 -180 -220 -90 -144 97 8 64 239 89 -68 171 32 -163 -19 117 -79 199 278 144 1
7732AJ44k31L9R6j4n5K32p9p0l6k06K55m9j79K52JM7j87j74Q4m03M52K74Q8jO
$$ 1 145 -86 -47 49 35 -20 212 133 63 27 -179 76 27 -152 100 101 148 -39 -213 -129 -532 -80 194 282 281 287
7758B87l66M20l93k20Q4J64K35J45j35j63j92j13J09M8L36R9j47j18O4j57o2j09
$$ 287 -79 341 -52 -272 -188 -24 211 356 221 58 -134 -247 -138 -90 246 345 198 80 144 -13 -75 -184
7780a84m0N13m04J40J29k99K8j53L1J90J45o2J22j00n1j88j46o0L93q1M38k36
$$ -184 -224 289 -115 25 154 -145 -117 -270 -239 -49 96 34 156 56 5 -183 -329 -389 4 -77 361 125
7802A25k15J56k75N6Mj79M98M0J10k09j79J41j03L6L12J29K3k41j09j44nj60j93
$$ 125 -90 66 -209 -153 -149 -328 170 210 320 111 -68 73 -30 6 318 447 470 229 120 -24 -29 -189 -382
7825c82N36Rk73J83j43J30j23J66j53j95J1M67K66m99k01j7K58l07K85P4k18J37
$$ -382 154 163 -110 73 -70 60 -63 103 -50 -245 -234 233 499 0 -201 -218 40 -267 18 92 -126 11
7847A1J34k60Q2j06j5K26j11Q8K30l20j9j30J55k32j72N39j06p6J37K5k26j29
$$ 11 145 -115 -33 -139 -154 72 -39 49 279 -41 -60 -190 -35 -267 -439 100 -6 -82 55 80 -146 -275
7869b75L38j88J3J65m0J56N1J46l54L9J6k21L26QP3j8j75l0j31K10K8M7J2k75
$$ -275 63 -125 -112 53 13 169 220 366 12 51 67 -154 172 180 253 235 60 30 -101 109 137 184 196 -79
7893g9L9O3j60J10N3J41RN5m80M8K72k16j30L34k2j64L30R7j03q0l45p4M01J02
$$ -79 -40 23 -137 -27 26 167 176 231 -249 -201 71 -145 -275 59 37 -127 203 300 197 117 -228 -302 99 201
7917B01l24M63m48M44m82J18k3r5N3J10K48j74j84l0J52j12j47M35Q1k68m8j8
$$ 201 -123 340 -108 336 -146 -28 -51 -146 -93 17 265 91 -93 -123 29 -83 -230 205 286 18 -30 -48
7939d8j04j38M4J14K57k29L47k22K41l30j86k6J36j20L96J15K1l89j68L51j33
$$ -48 -152 -290 -246 -132 125 -104 243 21 262 -68 -254 -280 -144 -264 132 247 268 -121 -289 62 -71
7960g1J32R6M4K4j0m75Q0L4J14J29j23j0M39k05p26N43q9J4J12j57K16l7j43J30
$$ -71 61 157 201 225 215 -260 -180 -146 -32 97 -26 -36 403 198 -528 15 -74 -60 52 -105 111 74 -69 61
7984F1O5l02J37j0K89k03J92k84J57k75K05m1k14L10j3jnj27OOJ31l32L86M1j71
$$ 61 126 -176 -39 -49 240 37 229 -55 102 -173 32 -9 -223 87 74 73 68 -59 -53 -47 84 -248 138 179 8
8009Hk5J08k84N0K43N8j01q0J89p7q9l22L64j21J29p4J88j55J37l48j91K57k23
$$ 8 -17 91 -193 -143 100 158 57 -23 166 89 0 -322 42 -79 50 -24 164 9 146 -202 -393 -136 -359
8032c59M22j74N56k91j50r4J32k09J11K27j76L29l60N5K81r4l89p7M1M11l05L33
$$ -359 63 -111 445 154 4 -90 42 -167 -56 171 -5 324 -36 19 300 206 -183 -260 -219 192 -113 220
8054B20l70l09N24p5n1j40M52l32K92j86K18l65J12M5k46J47j82Q0M8J00M7j94
$$ 220 -150 -459 65 -10 -61 -201 251 -81 211 25 243 -122 -10 35 -211 -64 -246 -166 -118 -18 29 -165
8076a65K87Lr4N3j43K87j20l77J25J63k38L15m4J48l46NK35m30K98M5lr6J42M6
$$ -165 122 125 31 84 -59 228 108 -269 -144 19 -219 96 52 200 -146 -141 94 -336 -38 7 4 -92 50 96
8100I6j36J80j45j45k32K92J96N8M15l77k09K45m06J26M0J92J04k20q1J42n61
$$ 96 -40 140 -5 -150 -382 -90 106 164 579 202 -7 238 -168 -42 -2 190 294 74 -7 135 -426
8121d26Q01l11L1l3J32k78L9l2K08m08N10k96K45j69o0lk98M71n09K14J06K58
$$ -426 375 64 95 62 194 -84 -45 -77 131 -277 233 -63 182 13 -47 -50 -348 123 -386 -172 -66 192
8143A92l2p7r7q4j24K68j15r9J77K06j28p3j57O0J74j04k9L55r3j17l43j2M32
$$ 192 160 83 -14 -98 -222 46 -69 -168 9 215 87 14 -143 -83 91 -13 -42 313 220 103 -240 -252 180
8166A80k46K97o1J4j31Ll09K01k06J48L0J30K82l41l5J06l24J77L7J61j66J99
$$ 180 -66 231 170 184 53 56 -253 -52 -258 -110 -80 50 332 -9 -44 62 -262 -85 -48 113 -53 146
8188A46n0J36k49
$$ 146 96 232 -17
8191a7
$$ Imaginary data points
##PAGE= N=2
##DATA TABLE= (X++(I..I)), XYDATA
0@%%%%QqQj6J6k4L2m0M8n6P2q8J04j23J47j76K04k37K77l18L67m21M79n46O18
$$ 0 0 0 0 0 8 0 8 -8 8 -16 16 -24 24 -32 40 -48 56 -67 80 -96 108 -129 148 -170 197 -224 255 -291 327
29C27o99P89q87R96j113J245j388J542j718J907k111K339k590K868l177L520l903
$$ 327 -372 417 -470 526 -587 658 -730 812 -906 1001 -1110 1229 -1361 1507 -1670 1850 -2053
46b053M333m824N385o031O797p711Q820j0210J2008j4438J7922k3372L3174n6245
$$ -2053 2280 -2544 2841 -3190 3607 -4104 4716 -5494 6514 -7924 9998 -13374 19800 -36445
60c6445K06344J68038l74897o8353Q6980n8236j62152J28218K25125N5644n3029
$$ -36445 169899 337937 -36960 -105313 -18333 -76569 -238721 -110503 114622 170266 117237
71A17237J5357q4455j85536p0514R6169N8419O1282J50988P5839j48516j44096
$$ 117237 132594 48139 -137397 -207911 -111742 -53323 7959 158947 234786 86270 -57826
82e7826j1054m9345r9493J14753K52899M1519j37114O955N7824j70499k18716
$$ -57826 -68880 -118225 -217718 -102965 149934 191453 54339 61294 119118 -51381 -270097
93b70097P2455K14554O5249J2153Q5883l2238k03425j00127P0841J677n3107J32809
$$ -270097 -197642 16912 82161 94314 180197 147959 -55466 -155593 -84752 -83075 -136182 -3373
105c373K18560m594j69652p6004j7771r1144l5526J28011J33550L7139K8728o500
$$ -3373 215187 210593 40941 -35063 -52834 -143978 -179504 -51493 82057 119196 147924 141424
117A41424j50349j56995K6054Q4541j1547M0264J78257P0043j52903j26025Q132
$$ 141424 -8925 -165920 -139866 -55325 -66872 -26608 151649 221692 68789 -57236 -49104
128d9104n3785j02665J04221K43118N1189j28958l4844L5942j03890j53375K5686
$$ -49104 -102889 -205554 -101333 141785 192974 64016 29172 65114 -38776 -192151 -166465
139a66465J43522Q8417M7793M0146n3405j27258o5709j0927l2321L5583J68347
$$ -166465 -22943 65474 113267 153413 100008 -27250 -92959 -103886 -136207 -100624 67723
150F7723J18260o4790r3217r939n5320j24678m86J47062R0567q25M3504L1135
$$ 67723 185983 121193 27976 18037 -37283 -161961 -162447 -15385 75182 74357 117861 148996
162A48996j27997j71941q230R2270L7618L6581J06338M9673q5861r8319m0420
$$ 148996 20999 -150942 -159172 -66902 -29284 7297 113635 163308 77447 -20872 -61292
173f1292n2494l7448Q6337J45970M9511l2532j8971m6690j16878p4023M8632Q4960
$$ -61292 -113786 -151234 -64897 81073 130584 98052 79081 32391 -84487 -158510 -109878 -24918
185b4918N8471O8242M5928o1711j13048m8628j2439l3716K9676J40885J07119
$$ -24918 33553 101795 147723 86012 -27036 -75664 -88103 -121819 -92143 48742 155861
196A55861l3599p5819l5990o1888q8305O185J10088Q4247K1919K3577M76q9303
$$ 155861 122262 46443 10453 -51435 -139740 -133555 -23467 60780 82699 106276 106752 17449
208A7449j15616l3198L7276N0227P2517Q2415J9169n8880p1652o2040n9326l688
$$ 17449 -98167 -131365 -94089 -43862 28655 111070 130239 71359 -293 -62333 -121659 -125347
220a25347Q6445R8919L4608J153n880o2198j10986n4598M1565O6056N5185O7325
$$ -125347 -38902 60017 94625 95778 89898 27700 -83286 -137884 -96319 -30263 24922 92247
232I2247M1938m8286j00440o3841j8643k389M0097R3018P7341M049m5051o1562
$$ 92247 134185 85899 -14541 -78382 -97025 -99414 -59317 33701 111042 115091 70040 8478
244H478p3513n4557J2611O9235P3755N4932K5264l2457q4184p5842k7736R649
$$ 8478 -65035 -119592 -106981 -37746 36009 90941 116205 83748 -436 -76278 -104014 -94365
256i4365M1795Q0037P6833J2429n0022o3956o0406n0708k379O6438Q7288N1272
$$ -94365 -52570 27467 104300 116729 66707 2751 -57655 -108363 -110742 -44304 42984 94256
268I4256P183k5439o3343q0004m5060J5724N6800O9454N9198K1934l3835p1544
$$ 94256 101439 76000 12657 -67347 -112407 -96683 -39883 29571 88769 110703 76868 5324
280E324p0970m0264Q148N5141P5211N6855J5091l0053o5136p3543m2065J1416
$$ 5324 -65646 -105910 -97762 -42621 32590 89445 104536 74483 9347 -64196 -106261 -94845
292i4845N3810O9666N8399J9762l1995o8801o9386l8091Q029N0581P0754N8572
$$ -94845 -41035 28631 87030 106792 74797 5996 -63390 -101481 -93452 -42871 27883 86455
304H6455J9140l1676o8722o8345l5154Q688M4470O9152O3837J9135l8208o5867
$$ 86455 105595 73919 5197 -63148 -98302 -89614 -45144 24008 87845 106980 68772 2905
316B905n9740l8157j49M9621P6128N5719J1102k8091n8327o9436m2435J1284N0984
$$ 2905 -56835 -94992 -95141 -45520 30608 86327 97429 69338 11011 -58425 -100860 -89576 -38592
329c8592O3412N5166K2532l1109o7593o1454l2886J93M3751P5035N8926P442l2006
$$ -38592 24820 79986 102518 71409 3816 -57638 -90524 -90331 -46580 28455 87381 94823 62817
342F2817n0378o3220m8682O105N8969O4343M2676K0268j7651o5526p2460l0564
$$ 62817 12439 -50781 -99463 -93358 -34389 29954 72630 92898 75247 9721 -62739 -93303
354i3303J3690L8308N9668O2419J9708l7194n9876n2782l8879l265M9935P2045
$$ -93303 -79613 -41305 18363 80782 100490 63296 3420 -49362 -88241 -91506 -41571 30474
366C0474M6688J0435j9536n4373p1583l7531J6680M4454N1013N5121K8133l1353
$$ 30474 77162 87597 68061 13688 -57895 -95426 -78746 -34292 16721 71842 99975 68622
378F8622o9046n3957k5927j952L5586P1125N6992O604k9640m6119n9241m5923
$$ 68622 -424 -54381 -80308 -82260 -46674 24451 81443 88047 58407 12288 -46953 -92876
390i2876Q163N3084N6269M1174K2965j8000o3272o5031k5819Q488L2595N9465
$$ -92876 -84713 -31629 24640 65814 88779 70779 7507 -57524 -83343 -74855 -42260 17205
402A7205O0874J3851l6082n0912m7361l9651m711M8895O6836M0429J0569j5223
$$ 17205 78079 91930 55848 4936 -42425 -82076 -86787 -37892 28944 69373 79942 64719
414F4719n0824o7153l4364J4817L9334M8527N2273K4689l0320o0356m8934k6791
$$ 64719 13895 -53258 -87622 -72805 -33471 15056 67329 92018 61698 1342 -47592 -74383
426g4383l899L5400O5968N0657O579k3551m3464n7957m1593R121M7470N0647L9832
$$ -74383 -78282 -42882 23086 73743 80322 56771 13307 -44650 -86243 -77122 -29652 20995 60827
439F0827K2276j7524n8992n8293k3997O146L0218N4666N4074J4665k9001m7560
$$ 60827 83103 65579 6587 -51706 -75703 -69557 -39339 15327 69401 84066 55065 7505
451G505m8779l6967j72M5026N7730L7935J2864j4262m7457o1252l2321J0647L7258
$$ 7505 -41274 -78241 -78413 -33387 24343 62278 75142 60880 13423 -47829 -80150 -69503 -32245
464c2245M7522M6618K0762k4888n2472m9079k8192j53L4753N6838M5232J1711
$$ -32245 15277 61895 82657 57769 5297 -43782 -71974 -72127 -37374 19464 64696 76407
476G6407k1364m5070n2499l2946N931L6693M8461M3214K0258j9396n2974n3634
$$ 76407 55043 9973 -42526 -75472 -69541 -32848 15613 58827 79085 59689 6715 -46919
488d6919k5260P129L1708M7294M4628J8470k0120m8173n2080k9889N532L6396
$$ -46919 -72179 -65050 -33342 13952 58580 77050 56930 8757 -43323 -73212 -67680 -31284
500c1284M8660L9657J5353j5894m4964n2614l2516M796L7563M9601L9004J3523
$$ -31284 17376 57033 72386 56492 11528 -41086 -73602 -68806 -31243 18358 57362 70885
512G0885j6739m3834n0262l0316L997L3050M7659M3277J7462k1814m8226m5912
$$ 70885 54146 10312 -39950 -70266 -66269 -33219 14440 57717 75179 53365 5139 -40773
524d0773k4127J866K7575M7195M4779J7782j9745m7203m9706k6031Q516L1373
$$ -40773 -64900 -63034 -35459 11736 56515 74297 54552 7349 -42357 -68388 -59872 -28499
536b8499L8106L9264K5320j3772n2448n3439k1505Q919K7237M1405M2924J7127
$$ -28499 9607 48871 74191 60419 7971 -45468 -66973 -58054 -30817 10588 53512 70639
548G0639j9834m1454m3987l1112n45L5049M8294L5532J3239j3686m1426m8987
$$ 70639 50805 9351 -34636 -65748 -66293 -31244 17050 52582 65821 52135 10709 -38278
560c8278k5359M298K4713M2717M8231J9341k8849m7335l2726j9854r010K1653
$$ -38278 -63637 -59339 -34626 8091 56322 75663 46814 -521 -33247 -53101 -62111 -40458
572d0458N1844M5811J0823j8997l8713m7702k8665R007L2196L3332L4347K6119
$$ -40458 11386 57197 68020 49023 10310 -37392 -66057 -57050 -24854 8478 42825 68944
584F8944j1643n0212m7536j8500L113K1362M4032M4315J1205k0653l2281m0106
$$ 68944 57301 7089 -40447 -58947 -55834 -34472 9560 53875 65080 44427 12146 -27960
596b7960l6590k221M0712M5805K5817J1849n557l8236n0183k2812O355J8917L6782
$$ -27960 -64550 -66771 -26059 19746 45563 57412 51855 13619 -36564 -59376 -53021 -34104 2678
609B678N0660K1704l0837m6791k8026j7546j1175K1191N0696L9542Q049j4333
$$ 2678 53338 75042 44205 -2586 -30612 -48158 -59333 -38142 12554 52096 60145 45812
621D5812l2198m6565k9652P830K9007L1322L6599K6948j6586n0107l9134j3315
$$ 45812 13614 -32951 -62603 -54773 -25766 5556 42155 69103 52517 2410 -36724 -50039
633e0039l006J6713M6336M3503M382k0233k2706l4131m1911o954M1153M7089K3322
$$ -50039 -53045 -36332 10004 53507 57889 37656 14950 -19181 -61092 -68046 -26893 20196 43518
646D3518R611m418l5032m7680k3069P079K0251L3671M2559J7702k0899l6540l1713
$$ 43518 53129 48711 13679 -34001 -57070 -49991 -29740 3931 46490 64192 43293 6753 -24960
659b4960k7582q554K9245M8004K9127O965n594l0245m9063k8219J3008K6853K2728
$$ -24960 -52542 -61096 -31851 16153 45280 52245 46651 16406 -32657 -60876 -47868 -21015 1713
672A713L2884L0142j1706m7726l9695j4751j824J6256M3555M0881P138j9638k6147
$$ 1713 34597 64739 53033 5307 -34388 -49139 -50963 -34707 8848 49729 56867 37229 11082
685A1082l3471l2001j820L0368L5469K7364J9043n622l9398m4822j8391M669J7182
$$ 11082 -22389 -54390 -56210 -25842 9627 36991 56034 50412 11014 -33808 -52199 -47530 -30348
698c0348L5154M0669J3242k0956k9955k8112k9093r128K8905M4230K5600P619
$$ -30348 4806 45475 58717 37761 7806 -20306 -49399 -58527 -29622 14608 40208 47827
710D7827j811k6866m8609l0327J0167K9381K6732K8045K1587r503l8792l6525
$$ 47827 46016 19150 -29459 -59786 -49619 -20238 6494 34539 56126 46623 7831 -28694
722b8694j7821r97J6521L5179L6427J5578j2057l3073m0238k3607O804K3870K5689
$$ -28694 -46515 -47512 -30991 4188 40615 56193 44136 11063 -29175 -52782 -45978 -22108 3581
735C581K8003K4293n663m2003m1527j3359N136J2142K8479L9923K0041j7061l5847
$$ 3581 31584 55877 50214 8211 -33316 -46675 -41539 -29397 -918 39005 59046 41985 6138
748F138l1604k0079l591J9836L6917L1744J1297j1757k7665l2789k4366m095J8993
$$ 6138 -25466 -45545 -49136 -29300 7617 39361 50658 38901 11236 -21553 -45919 -50014 -31021
761c1021L6670L5597J2625j6156l0335k9564k0992m740J8226L4579L3370J3396
$$ -31021 5649 41246 53871 37715 7380 -22184 -43176 -47916 -29690 4889 38259 51655
773E1655j0971l0631l4757k1283O58J8705K9382L1557J7991q618l3045l7500k0567
$$ 51655 40684 10053 -24704 -45987 -45329 -26624 2758 34315 52306 43688 10643 -26857 -47424
786d7424M010K0511K6166K7466J8938n150l2498l8215j9674K305J7057K8502L3956
$$ -47424 -43414 -22903 3263 30729 49667 44517 12019 -26196 -45870 -43565 -26508 1994 35950
799C5950J6850j4761l1702k7276j7769p410J4146L5868L5160J1520j4288k8465
$$ 35950 52800 38039 6337 -20939 -38708 -46118 -31972 3896 39056 50576 36288 7823
811G823k8789j9121l621J4039K9586L6915J7365j6661l4436k4685j3758p717R853
$$ 7823 -20966 -40087 -43708 -29669 -83 36832 54197 37536 3100 -21585 -35343 -43060 -33207
824c3207L6067L6275Q613j4177k1762k8163k8334l946K5645L1444K1574J2776
$$ -33207 2860 39135 47748 33571 11809 -16354 -44688 -48634 -22989 8455 30029 42805
836D2805k009k6963l6630j9914Q02J4904K9137L3450J2477j5240k3977k3294k4339
$$ 42805 40796 13833 -22797 -42711 -41909 -27005 2132 35582 48059 32819 8842 -14452 -38791
849c8791j0729K1445L7851K3704O965l235k1788l7116k2780N728J6257J9839L1327
$$ -38791 -49520 -28075 9776 33480 40445 37210 15422 -21694 -44474 -38746 -22489 -2650 28677
862B8677K4248j3390l6696k4548j0066q926P192L6765L4613N686j3145j6397k7890
$$ 28677 52925 39535 2839 -21709 -31775 -40701 -33509 3256 37869 43555 30410 14013 -13877
875a3877k9950k412K5673K6813J9049J7023p94l0414l4983j2798k27P540K8040
$$ -13877 -43827 -46239 -20566 6247 25296 42319 41525 11111 -23872 -36670 -36897 -29357 -1317
888a317L7788J0908j9818j9837j7080k6622j3873K3857L7797J8200L862K682j7441
$$ -1317 36471 47379 27561 7724 -9356 -35978 -49851 -25994 11803 30003 33865 36547 19106
901A9106l9395k4486Q045J7210J6848K8077K2849j0762l3044k2009j2883j1243
$$ 19106 -20289 -44775 -36730 -19520 -2672 25405 48254 37492 4448 -17561 -30444 -41687
913d1687J0424L7414K9043J138p104j1384l0690l1565J750K6000J9883J6548K2356
$$ -41687 -31263 6151 35194 36332 29228 17844 -12846 -44411 -42661 -16661 3222 19770 42126
926D2126J075l4208l4240o973J181J363K4908L8765J1900j8905j9000j6798k5776
$$ 42126 43201 8993 -25247 -32220 -31039 -29676 -4768 33997 45897 26992 7992 -8806 -34582
939c4582j2558K3691L2740J5454Q303N295k0360l9442j9268Q898J1774J4113L0937
$$ -34582 -47140 -23449 9291 24745 33048 38343 17983 -21459 -40727 -31829 -20055 -5942 24995
952B4995K2196j4212k9463j6189j3793j6154J0439L9373K6321j066m950q848k9955
$$ 24995 47191 32979 3516 -12673 -26466 -42620 -32181 7192 33513 32447 27497 18649 -11306
965a1306l0992K887K3590J6462J7296K2882j47l3321k8931o672l002M19K6767
$$ -11306 -42298 -39411 -15821 641 17937 40819 40672 7351 -21580 -28252 -31254 -30835 -4068
978d068L7005Q913j6810j4560j7815k7310r618K4566K7779J1337J1393Q357k1214
$$ -4068 32937 41850 25040 10480 -7335 -34645 -44263 -19697 8082 19419 30812 39169 17955
991A7955l9175j6552Q615Q018J4155L1794K0683j5578k6612j3888j4662j5755
$$ 17955 -21220 -37772 -29157 -21139 -6984 24810 45493 29915 3303 -10585 -25247 -41002
1003d1002J1420L6517K2560K09j649q886l0468k7975L236J9593J4906J9712K2965
$$ -41002 -29582 6935 29495 29704 28055 19169 -11299 -39274 -36038 -16445 -1539 18173 41138
1016D1138l706l2315k4024n564o359J037K7194L3557N931j3099j0861j8594k8508
$$ 41138 37432 5117 -18907 -24471 -30830 -29793 -2599 30958 36889 23790 12929 -5665 -34173
1029c4173q148K3972K5146J1748J1990N750k1365l4534j3478N205N906J5244L0568
$$ -34173 -42321 -18349 6797 18545 30535 36285 14920 -19614 -33092 -27887 -21981 -6737 23831
1042B3831J7252j3202k1274j5158j7979j3894J4313L2963J9206K070L07j0992
$$ 23831 41083 27881 6607 -8551 -26530 -40424 -26111 6852 26058 28128 28435 17443
1054A7443k9887k3104L535J5645J2729K0839K1434m291k7488k2374q845p787M290
$$ 17443 -12444 -35548 -32013 -16368 -3639 17200 38634 34343 6855 -15519 -24364 -32151 -27861
1067b7861K7614K8913M195r578r905j9641k6380m984J9581K1162J3951J4281L600
$$ -27861 -247 28666 32861 23283 13378 -6263 -32643 -37627 -18046 3116 17067 31348 34948
1080C4948k2144l0245j2719K451N450J8209K8083J2973j1928j7143j4669j9027
$$ 34948 12804 -17441 -30160 -27709 -22259 -4050 24033 37006 25078 7935 -6734 -25761
1092b5761j1970J4443K8030J7049O071J770j2858l0060k0590L721J3515J3825
$$ -25761 -37731 -23288 4742 21791 27862 29632 16774 -13286 -33876 -30155 -16640 -2815
1104b815K0161J7737m188k3205k0136j1244q019O170K5287K4699O785n880j2175
$$ -2815 17346 35083 30895 7690 -12446 -23690 -31709 -25539 -252 24447 31232 25352 13177
1117A3177k1851k1938l153J6417J8639J5341J3942Q00j9799k5153j2944k376O218
$$ 13177 -8674 -30612 -33765 -17348 1291 16632 30574 31374 11575 -13578 -26522 -28898 -22680
1130b2680J9274K6073J1508r242j5928j6913j7943p740J2997K3098J6950Q115
$$ -22680 -3406 22667 34175 24933 9005 -7908 -25851 -33591 -20594 2504 19454 27569
1142B7569N91j3844k4909j8928l94J0822J7341K0274J3760m464j8718j9434j4683
$$ 27569 28160 14316 -10593 -29521 -29915 -19093 -1752 18522 32282 27818 9100 -10334 -25017
1155b5017o192R718K2327J9121P996k067j1851k2625k0592k155J4017J7864J6009
$$ -25017 -31209 -21491 836 19957 27953 25886 14035 -8590 -29182 -31337 -17320 544 16553
1168A6553J2576l35j7694k2540j4443k399Q035J8178K1300J0599m250j4366j9964
$$ 16553 29129 28794 11100 -11440 -25883 -28282 -20247 -2069 19231 29830 25580 11214 -8750
1181h750j6928n251J1300K0070J7603J0415j305j5567k2194j5106j731Q615J6204
$$ -8750 -25678 -30929 -19629 441 18044 28459 27154 11587 -10607 -25713 -27444 -18829 -2625
1194b625K0179J2961l740j6841j9860j4624m576J0040J9141J7564R389j453j2762
$$ -2625 17554 30515 26775 9934 -9926 -24550 -29126 -19086 55 17619 27008 25555 12793
1207A2793k1417j7717k974J1796J7568J5881J0813m04j4080k1332j6673l153J0650
$$ 12793 -8624 -26341 -29315 -17519 49 15930 26743 26339 12259 -9073 -25746 -28899 -18249
1220a8249J8196J7167R412j728j2675k0293j6774l697J0628J7022J7169J1208
$$ -18249 -53 17114 26526 24798 12123 -8170 -24944 -28641 -18013 -991 16178 27386
1232B7386j109j5325k1215j4062j475Q897J3909J7747J3235o13j6640k1991j3194
$$ 27386 26277 10952 -10263 -24325 -25800 -16903 -2994 14753 27988 27375 10735 -11256 -24450
1245b4450n58Q382J3859J6850J3112l33j5432k1345j4669j588R416J5591J6249
$$ -24450 -25008 -16626 -2767 14083 27195 26862 11430 -9915 -24584 -26172 -16756 -1165 15084
1258A5084J0380m70j3020j9805j6082l600R896J7128J6889R527k562j2814j8037
$$ 15084 25464 24994 11974 -7831 -23913 -27513 -17617 -489 16400 25927 23365 10551 -7486
1271g486j4643m398P597J6632J8272J0829k525j4781j8567j2887k760P540J4356
$$ -7486 -22129 -26527 -18930 -2298 15974 26803 24278 9497 -9070 -21957 -24717 -17177 -2821
1284b821J6641J2929n28j6059k1152j2059r4P597J2317J5475J3287R46j5444k1314
$$ -2821 13820 26749 26221 10162 -10990 -23049 -23143 -15546 -3229 12246 25533 26479 11035 -10279
1298a0279j3591l89Q701J3643J5343J1209l16j3342j8797j4097k982O959J5698
$$ -10279 -23870 -24259 -15558 -1915 13428 24637 24321 10979 -7818 -21915 -24897 -17938 -2240
1311b240J8191J0119l592j4316j5610j1743n073M999J5728J9296J1252m285j5076
$$ -2240 15951 26070 22478 8162 -7448 -19191 -24264 -19265 -3537 15759 27011 22726 7650
1324G650j6365j0032l910M028J3997J9346J2299l314j4938j7499j1808k364O706
$$ 7650 -8715 -18747 -22657 -18629 -4632 14714 27013 23699 8761 -8738 -20546 -22910 -16204
1337a6204J3716J5557J0470J41j2309j9351j4005k174Q766J4118J4307R925p20
$$ -16204 -2488 13069 23539 23680 11371 -7980 -21985 -24159 -15393 -1275 13032 22957 22237
1350B2237j2255j6473j3789m360P087J5974J6534Q761k812j1942j5063j2735m768
$$ 22237 9982 -6491 -20280 -24640 -17553 -1579 14955 23716 20904 8962 -6101 -18836 -23604
1363b3604N955J4098J7664J1458l223j5191j5641q809l323K836J2665J9446J1300
$$ -23604 -17649 -3551 14113 25571 22348 7157 -8484 -17293 -20616 -17780 -5115 14331 25631
1376B5631l876j3933j4833j1421m709O440J4429J5357R354p67j1404j7096j2821
$$ 25631 21755 7822 -7011 -18432 -23141 -16701 -2272 13085 22439 21672 10268 -6828 -19649
1389a9649k951O790J3713J5425R323k732j1105j3304j3237p349O758J8257J5593
$$ -19649 -22600 -15810 -2097 13328 22651 19919 8814 -4490 -17727 -25076 -18318 -61 15532
1402A5532N243k428p967j4628j5128l983Q099J3324J4106J0214l47j3673j6210
$$ 15532 20775 18347 10380 -4248 -19376 -23359 -15260 -1936 12170 22384 22037 8364 -7846
1415g846r332l318L163J3394J7626R789l865j0791j4204j2876m347Q049J3537
$$ -7846 -17178 -20496 -17333 -3939 13687 23476 19611 8820 -5384 -18260 -22607 -14558 -1021
1428a021J2000R052J763j0854j8013j2039j251N901J0659J6140J0766l724j2380
$$ -1021 10979 20031 21794 10940 -7073 -19112 -20363 -14462 -3803 12337 23103 19379 6999
1441F999j1878j0173p594M913J7119J5031M791j558p021j4482j5095l268Q077
$$ 6999 -4879 -15052 -22646 -17733 -614 14417 19208 17650 10629 -3853 -18948 -22216 -14139
1454a4139J2274J2509J0711p14j2817j4577q913l936K600J3639J6849P571l780
$$ -14139 -1865 10644 21355 20641 7824 -6753 -15666 -19602 -17002 -3363 13486 21057 17277
1467A7277p633j2899j4766n531R814J4620R372P570L009r918j8346j0930M16M349
$$ 17277 9644 -3255 -18021 -23552 -13738 882 10254 17824 20833 10915 -7431 -18361 -17945 -13596
1481a3596R238J5331J1173l170j1967j1347j0418p150N532J5945J3204M913Q2
$$ -13596 -4358 10973 22146 18976 7009 -4338 -14756 -21906 -16374 -429 12775 17688 17770
1494A7770o720j5993j3714r02P039Q900J2614J2137k86j3888j3549p695m206J444
$$ 17770 11050 -4943 -18657 -19559 -12520 -3620 8994 21131 20845 6957 -6592 -14287 -18493 -17049
1508a7049J4436J6830N279m339o488j0694j4324n875Q933J3423R192P810K805
$$ -17049 -2613 14217 19496 15157 8669 -2025 -16349 -22224 -13291 132 9324 17134 19939
1521A9939r764j7547r394l76L281R442J6023R452m527r978r439j0806p745N854
$$ 19939 10175 -7372 -16766 -17142 -13861 -4419 11604 21056 16529 6551 -2888 -13694 -21439 -15585
1535a5585J5817J1377M106J726o296j6046j3461j57P565P539J1498J1567j50j3052
$$ -15585 232 11609 15715 17441 11145 -4901 -18362 -18519 -10954 -3415 8083 19650 19500 6448
1549F448j2255p040m673J008J3779J5577N242l201n901j1305j3949m519Q970J1437
$$ 6448 -5807 -12847 -17520 -16512 -2733 12844 18086 14885 8984 -2321 -16270 -20789 -11819 -382
1563c82Q589Q423K534j0021j5620q355j652K332R461J5828Q717m491q660q954
$$ -382 8207 16630 19164 9143 -6477 -14832 -16484 -14152 -4691 11137 19854 15363 6703 -2251
1577b251j1095p028O217J4488J0210M055J363m961j5473j2147r02O500P829J1363
$$ -2251 -13346 -20374 -14157 331 10541 14596 15959 10998 -4475 -16622 -17524 -11024 -3195 8168
1591H168J0548p78j1564j1409p658m686K912J2611J3112M676r52n652j1886j3399
$$ 8168 18716 17938 6374 -5035 -12693 -17379 -14467 -1856 11256 15932 14980 9328 -2558 -15957
1605a5957k866Q098R657Q263R120K339r947j4752q103j408K627R497J3530P321
$$ -15957 -18823 -10725 -1068 7195 16315 18654 8707 -6045 -14148 -15556 -12929 -3432 10098 17419
1619A7419k914p460q730j1492o458O557J3020R424M631K107o219j4214j0888q33
$$ 17419 14505 7045 -1685 -13177 -19635 -13078 -58 9366 13997 16104 9885 -4329 -15217 -16050
1633a6050M916P392J1659R697j168j0061j0608p745m833L326J1446J2119M983
$$ -16050 -11134 -3742 7917 17614 16446 6385 -4223 -11968 -16801 -13475 -2029 10090 15073
1646A5073l47o145j1631j2231j626O440Q792P888R077K125r305j3162q301j909
$$ 15073 14726 8581 -3050 -15281 -16907 -10467 -1675 6213 15290 17415 8110 -5052 -13353 -15262
1660a5262L017R579J1869P050k156o670r987j0206m853N797J1143Q986N611J406
$$ -15262 -12245 -2666 9203 16253 14097 7427 -2560 -12766 -17619 -11822 -679 8307 13918 15324
1674A5324o878j2424r226k257M007Q295J1215Q654j846q927r640p788l858L178
$$ 15324 8446 -3978 -13204 -15461 -11454 -3159 8056 16710 14864 5937 -3703 -11491 -15349 -12171
1688a2171J0094J0604N990J73o348j1729r817k580N493Q108R102P759Q72q072
$$ -12171 -2077 8527 14517 14690 8342 -3387 -13204 -15784 -10291 -2183 6919 14678 15550 7478
1702G478j1852q002k626L783Q591J0471O585k10o514j0249r927l284M722R017
$$ 7478 -4374 -12376 -15002 -11219 -2628 7843 14428 14218 7704 -2545 -12472 -15756 -11034 -2017
1716b017R797O426M65p428j0826p917l004K838Q593J1008O822n96p443r657q353
$$ -2017 7780 14206 14671 7243 -3583 -11500 -14504 -11666 -3073 7935 14757 14161 6718 -2939 -11292
1731a1292l321K879R239J0258O460q0o929j0686p977l084L673Q064R870P035j44
$$ -11292 -14613 -11734 -2495 7763 14223 14143 7214 -3472 -11449 -14533 -10860 -2796 7074 14109 13965
1746A3965o301j0537q956k932M050Q884R021N849M88n844j0326q756k971L280
$$ 13965 7664 -2873 -11829 -14761 -10711 -1827 7194 13043 13531 7687 -2639 -11395 -14366 -11086
1760a1086Q527R811O390m51n835r554r074l537L867R068Q739O011L97n780j0149
$$ -11086 -2559 7252 13642 13191 7356 -2198 -11272 -14809 -10942 -1874 6865 12876 13273 7493 -2656
1775b656q304k479L041P151R614P501j60p448r060p395l442K248Q617R951N435
$$ -2656 -10960 -13439 -10398 -3247 6367 13868 13708 6260 -2800 -10195 -13637 -11389 -2772 7179 12614
1790A2614N7n459r335q943k565L887P052Q180P368P93o704j0294p060k838K427
$$ 12614 12671 7212 -2123 -11066 -13631 -9744 -2692 5488 12856 13649 6945 -3349 -10409 -13247 -10820
1805a0820P590J0377N599j033n028p773r078m711M448Q993Q050M942J376n385
$$ -10820 -3230 7147 12746 11713 6685 -1088 -10166 -14877 -10429 -1436 6614 11556 12932 7547
1819G547j0179q030j624K496O485R509P641j520p032p278o821m309J941Q623R752
$$ 7547 -2632 -10662 -12286 -9790 -3305 6204 13845 12325 5293 -1985 -8806 -13115 -11174 -2551 7201
1834G201M576R7m423q982r466j905M083O250P253P548J220o726r763o336k840
$$ 7201 11777 11874 7451 -1531 -10997 -12902 -8819 -2569 4684 12232 13452 6726 -3037 -9373 -12213
1849a2213J682P705R931M640q76m296o967r307m403M265Q883O583M771J818n146
$$ -12213 -10531 -2826 7105 11745 10869 6573 -394 -9701 -14104 -9839 -956 5627 10398 12216 7070
1864G070r767o839j978J829N812J0016O838j253o621o723o514m547K230Q212Q483
$$ 7070 -2697 -9536 -11514 -9685 -3873 6143 12981 11728 5107 -1616 -8130 -12677 -10447 -2235 6248
1879F248M348Q87m511q792q525j636L762N360P329P166J150p042q222o034l488
$$ 6248 10596 11483 6972 -1820 -10345 -11981 -8219 -2859 4470 11636 12786 5744 -2478 -8512 -12000
1894a2000J629P794R634L926p59l647o907q896m224M450P533O456N015J765m686
$$ -12000 -10371 -2577 7057 10983 10224 6577 -330 -9226 -13450 -9000 -1467 4989 10004 11769 7083
1909G083r278p057j924J848O163Q950O081j375m913o258p452m401K800Q348O911
$$ 7083 -2195 -9252 -11176 -9328 -3165 5785 11866 10491 5578 -680 -8132 -12533 -9733 -1385 5526
1924E526L923J913l820r018q342j452L515M878O983P069O80o382p650n714l082
$$ 5526 9449 11362 7542 -1476 -9818 -11270 -7755 -2877 4106 11175 11855 5473 -2177 -7891 -10973
1939a0973J199P288Q546M157k18k954p799q140l236M003O576O289N079J780n593
$$ -10973 -9774 -2486 6060 10217 9999 7045 -754 -8894 -12130 -8127 -1551 4738 9817 11597 6004
1954F004q045o053k368J556O034Q147N372q71m292n830p285m165L031P586O322
$$ 6004 -2041 -8094 -10462 -8906 -2872 5275 10647 9776 5484 -346 -7631 -11796 -8765 -1179 5143
1969E143L785J477l474q184p961j681L257N111O614N702J162n326p064o324k987
$$ 5143 8928 10405 6931 -1253 -9214 -10895 -7638 -2527 4087 9789 10951 5625 -1439 -7763 -10750
1984a0750J733O787P280M685K29l716p535p561j763K953N227O137N545K135n544
$$ -10750 -9017 -2230 5050 9735 9964 6248 -1287 -8848 -10611 -7658 -2431 3706 9251 11386 5842
1999E842q161n802j806J539N470P481N302L15m619o505o661k947K383O080O578
$$ 5842 -2319 -8121 -9927 -8388 -2918 4563 9865 10180 5561 -944 -7605 -10552 -8169 -2089 4489
2014D489M463J192l942p507o616k041K141M942P271N526j48m527o282n691l441
$$ 4489 8952 10144 6202 -1305 -7921 -9962 -7821 -2879 4392 9918 9770 5243 -1039 -6730 -10171
2029a0171J484O511O835M603j21l092p082o495k348K559M935O096N524Q84m187
$$ -10171 -8687 -2176 4659 9262 9141 6049 -1033 -7528 -9876 -7317 -2382 3714 9238 10122 5935
2044E935p656n316k397J632M799O983N138P92m319o805n984k389J811N619O318
$$ 5935 -1721 -7037 -9434 -7802 -3003 3980 9118 9910 5591 -1214 -7198 -9587 -7776 -2157 4161
2059D161M422J044m200o326n888k240J213N070O534N649k3m602n885n285k776
$$ 4161 8583 9627 5427 -899 -6787 -9027 -7814 -2744 3790 9439 9416 4814 -1071 -6356 -9132
2074i132J283N535O300M802L14l791o177n513k746J293N372O586M422N63l969
$$ -9132 -7849 -2314 3986 8788 9102 5311 -866 -6379 -9125 -7832 -2460 4126 8548 9111 5142
2089E142o124n737k577J623N493O091M168P36l420n829n949l035J620N446O250
$$ 5142 -982 -6719 -9296 -7673 -2180 3911 8079 8815 5395 -434 -6383 -9418 -7798 -2352 3898
2104C898M332L75l358n898n873k585J666M990O089M412J163l778o321n439k473
$$ 3898 8230 8605 5247 -651 -6524 -9109 -7443 -2453 3636 8048 9211 5433 -888 -6327 -8800
2119h800J570M518O222M959Ll643n826n348k116J297M543O308M015N54k860o125
$$ -8800 -7230 -2712 3510 8469 8472 4829 -997 -6345 -8461 -7164 -2621 3687 7702 8256 5396 -729
2135g29n383k813J416N207O121M085K65l141n693n012k667P50N093O048M503K83
$$ -729 -6112 -8925 -7509 -2302 3819 7904 8169 5028 -665 -5677 -8344 -7594 -2501 3547 8050 8333
2151H333l309n372n636k598J717M649N482M196R89l650n417n216k215J487M179
$$ 8333 5024 -348 -5984 -8582 -6865 -2216 3266 7462 8451 4801 -616 -5832 -8047 -6560 -2381
2166b381N227M515Q25k848n571n491k852J612M921N387L936O19k907n579n447
$$ -2381 2846 7361 8186 5338 -233 -5724 -8576 -6964 -2043 3344 7280 7899 4992 -587 -6034
2181f034k185J112N069M929M396N34l138n211m810k236Q00M039O116M167J10k982
$$ -6034 -8219 -7107 -2038 2891 7287 7821 4683 -528 -5338 -7574 -6774 -2735 3381 7548 7658 4676
2197D676m930m822k832J480L705N879M095P48l137n343n363j711J168M176N094
$$ 4676 -254 -5076 -7908 -6428 -2723 3156 7251 7999 4862 -481 -5844 -7555 -6387 -2211 2883
2212B883L789J103k889n025n163k584J459M340N106L861N55k665m547n412k803
$$ 2883 6672 7775 4886 -139 -5302 -7886 -6427 -2087 3019 6880 7435 4770 223 -5189 -7992
2227g992R30M856N397L796L07k754m683n080k429J236L956N192M350P36l208n315
$$ -7992 -7062 -2206 3191 6987 7294 4540 -143 -5223 -7652 -6416 -2460 2732 7082 7818 4610 -705
2243g05m172k170Q00L542N207M343P03l021n009m723k235J284L580N187L975P10
$$ -705 -4877 -7047 -6247 -2705 2502 6845 7548 4527 -482 -5205 -7440 -6156 -2576 2611 6586 7296
2259G296k498m766n091k264J017M071N174L402P62k963l905m605k951P29M721
$$ 7296 4798 32 -5059 -7323 -6306 -2235 2939 6341 7103 4140 235 -4370 -7321 -6592 -1871
2274a871N121L188O5k104m213m970k766J360M193M583L618Q21k567n023m036k330
$$ -1871 3250 6438 6503 4399 186 -4784 -7550 -6190 -1997 2586 6204 7025 4458 -565 -4601 -6931
2290f931Q70L430N380L680M31k566m065n062k417J321M067M559K971J095k132
$$ -6931 -6061 -2631 2749 6429 6860 4294 229 -4833 -7250 -5929 -1862 2697 5668 6763 4631
2305D631m474m994j973J039L467M824L751J64k400l652m343l036O92M264N033
$$ 4631 157 -4837 -6810 -5771 -2304 2520 6271 6435 4035 383 -3960 -6996 -6304 -2040 2993
2320B993K657O24j538m112n343k471J383L790M135L703J232k880m423l761k579
$$ 2993 5650 6274 4736 624 -4719 -7190 -5807 -2017 2118 5821 7053 4173 -250 -4011 -6590
2335f590M48L912N044K654K18j499l384n308k656J663L947L605K842K087k165
$$ -6590 -6142 -2230 2814 5468 5686 4187 803 -4505 -7161 -5498 -1551 2054 4896 6983 4818
2350D818n026m489j373J000K723M437L993K54k610l359m079l031R02M245M324
$$ 4818 -208 -4697 -6070 -5070 -2347 2090 6083 6337 3727 368 -3711 -6742 -5840 -1595 2729
2365B729J794J466j394m493m839j801J630K659M172L306J415k355m583l566k290
$$ 2729 4523 5989 4595 102 -4737 -6538 -4908 -2249 1923 5229 6644 4289 -294 -3860 -6150
2380f150L42L578M932K529k7q57l408m980k442J437L622K888L187J820k196m508
$$ -6150 -5808 -2230 2702 5231 5204 4347 939 -4041 -6483 -5046 -1424 1464 4651 6471 4275 -233
2396b33l948j213O19K208M628L346N45k344l148m125k576J007L406L833J903J697
$$ -233 -4181 -5394 -4775 -2567 2061 5407 5952 3608 460 -3665 -6241 -5234 -1828 2005 3908 5605
2412E605q19m348m838j294J506K410L100L988R56k475l832l317k188J90L211M791
$$ 5605 4786 438 -4400 -5694 -4188 -1778 1322 5310 6266 3791 -41 -3358 -5546 -5356 -2145 2646
2428B646K200K49j075l171m926k148J535K970L175K897J599k000m520l410p89
$$ 2646 4846 5095 4020 849 -4077 -6225 -4690 -1720 1455 4352 5951 3951 -569 -3979 -4768
2443d768J34J939M739L147K35k075k642m069k619J182L319L139K261J485p46m643
$$ -4768 -4634 -2695 2044 5191 5426 3351 709 -3360 -5979 -4797 -1478 1661 3922 5407 4661 18
2459A8m456r13J272J798L320L807R56k613l100k888k719K91L230M238J723J153
$$ 18 -4438 -5351 -4079 -2281 1039 4846 5802 3189 89 -2799 -5518 -5227 -1997 2241 3964 5117
2475E117j212l579l955k006J366K676K535L363J742k746l606l085j124j2J947
$$ 5117 3905 326 -3629 -5635 -4269 -1593 942 4305 6047 3301 -305 -3390 -4514 -4526 -2579
2490b579M384L027J75j953k596l743k198P94L257K614K360K072j464m505l341
$$ -2579 1805 4832 5007 3054 458 -3285 -5483 -4689 -1432 1182 3542 5614 4150 -355 -3696
2505c696j195J024J743L118L554P18k288k465l259k034k27L060M061J734P15m82
$$ -3696 -4891 -3867 -2124 994 4548 5266 2978 513 -2746 -4780 -5007 -1947 2114 3848 4563 4081
2521D081l314m351j526J228J946K880L257J369k487l121k781j318k75K217L858
$$ 4081 767 -3584 -5110 -3882 -1936 944 4201 5570 3083 -38 -2819 -4137 -4412 -2195 1663
2536A663K652L67j762k347l501k069P88K557K922K424J533j125m326l074p52O61
$$ 1663 4315 4682 2920 573 -2928 -4997 -4209 -1652 1270 3694 5227 4102 -224 -3298 -4050 -3389
2552c389J103L230L314M09j243l149k700k328M10K799K974K265Q92r56l032l423
$$ -3389 -2286 944 4258 4667 3424 275 -2425 -4753 -4343 -1544 1430 3695 4587 3631 599 -2824
2568b824j809Q48J897K845K985J034j969l168k170j562n14K131L610K560N06j479
$$ -2824 -4633 -3785 -1888 957 3942 4976 3007 -161 -2331 -3893 -4407 -2276 1334 3894 4400 2921
2584B921k845k571j863K95K396K303K704J469j385l197l157r61J94J519L420K707
$$ 2921 76 -2495 -4358 -4063 -1667 636 3340 4809 3424 227 -2930 -3891 -3697 -2178 1242 3949
2600C949L40j249k695k644k031M36K422K716K116P34q72k747l072j577M23J809
$$ 3949 4289 3040 345 -2299 -4330 -3894 -1472 1244 3360 4094 3222 475 -2597 -4174 -3751 -1942
2616a942K663K888O65j401k234k579k015j53J755L253K805O17j044k375l273j512
$$ -1942 721 3609 4274 2873 639 -1940 -3955 -4108 -2353 900 3705 4322 3278 903 -2370 -3882
2632c882L93J495K835K648J008j463k851k618j107k28J797K849K588Q68j211k616
$$ -3882 -3489 -1994 841 3489 4497 3034 183 -2435 -3542 -3770 -1973 876 3464 4332 3121 505
2648E05k529j897M26K090K362K147Q99p54l097k463j740N29J759K819K111R36
$$ 505 -2024 -3921 -3495 -1405 957 3104 4003 3249 152 -2311 -4051 -3522 -1763 1056 3167 4103
2664D103j351k245k512j598K19J435K860K300N80j050k249k932j015J6J811K218
$$ 4103 2752 507 -2005 -3603 -3384 -1949 911 3211 3791 2741 492 -2440 -3455 -3439 -1628 590
2680E90K184J143j166k266k429j496mJ693K451K399N03r42k280k653j142p7J967
$$ 590 2774 3917 2751 485 -1944 -3440 -3444 -1751 700 3099 3602 2660 380 -2273 -3415 -3492 -1525
2697a525K327J994L78n27k046k538j719R1J997K444K069O53j175k135k230j538
$$ -1525 802 2796 3174 2647 601 -1937 -3656 -3565 -1568 876 2945 3598 2423 288 -1942 -3480
2713c480K00J526K525K002P86p61k298k649j288J67J586K301J842P31l72k294
$$ -3480 -3280 -1754 771 2773 3559 2798 500 -2149 -3437 -3270 -1684 617 2459 3190 2818 524
2729E24k452j265k1J612K094J901R99p79k168k401j235j84J636K314J987Q77j220
$$ 524 -1928 -3193 -3214 -1602 492 2393 3392 2613 445 -1956 -3191 -3375 -1739 575 2562 3439 2219
2746B219j817j947j759M05J433K070J881P23o52k316k027j105j48J402J887K248
$$ 2219 402 -1545 -3304 -2899 -1466 604 2485 3208 2556 240 -1787 -2892 -3040 -1638 249 2497
2762B497R61r25k265j702j531l82J496K495J950P45j041j875k111j283J72J300
$$ 2497 3458 2533 268 -1434 -2965 -3347 -1851 644 2594 3339 2298 423 -1688 -2971 -2799 -1499
2778a499K196J680P15q01j748k402r27o8J190K160K084O35p74j955j953j431K4
$$ -1499 697 2377 3092 2291 543 -1859 -2786 -2854 -1664 496 2580 3215 2441 486 -1467 -2898 -2874
2795b874J503K009J550N45m27j339k332j660K59J077K210J856R56j477j326k034
$$ -2874 -1371 638 2188 2733 2306 967 -1365 -3025 -2766 -1689 521 2377 3333 1856 530 -1504
2811a504j254oR23K400J595O32q16j439j816j321k17J413J862J737O47n85j886
$$ -1504 -2758 -2764 -1841 559 2154 2786 1970 531 -1285 -2606 -2823 -1410 452 2189 2836 2251 365
2828C65j610j408k72J227K036J935M42m56j613j958j271j23J546J778J400Q75
$$ 365 -1245 -2653 -2925 -1698 338 2273 2715 2259 646 -1312 -2583 -2706 -1160 618 2018 2893
2844B893q08j178k358j135k5R73J992J613O22n13j674j347j314n00J257K027J598
$$ 2893 2085 907 -1451 -2586 -2611 -1638 354 1967 2589 2076 402 -945 -2259 -2759 -1502 525 2123
2861B123M06m70j764j173j354m61J434J656J564M97n5j909j760j247J34J080J775
$$ 2123 2529 2059 295 -878 -2232 -2693 -1259 397 1961 2458 2403 494 -1266 -2513 -2379 -1299 476
2878D76J257N57k90j267j949j342j01J237K080J220M95l58j232k081j336P2J187
$$ 476 1733 2290 2000 733 -1216 -2558 -2659 -1422 658 1878 2373 2015 783 -1298 -2634 -2562 -1375
2895a375J830J272O63n76j322j494r71n22J027J821J280O29m43j290j359j101
$$ -1375 455 1727 2390 1814 492 -1002 -1973 -2495 -1468 353 1633 2262 1819 529 -830 -1931
2911a931n75J190J454J166J208n53j734j647q79L53N59J387J676Q04j97j578j683
$$ -1931 -2506 -1316 138 1304 2512 1959 225 -1422 -2301 -1948 -1389 -2 1674 2478 2281 703 -980
2928i80j506K93O95J887J244N39l88q98j662j541K4Q52J732J352L99q0j294j801
$$ -980 -2486 -2193 -1498 389 1633 2172 1784 886 -776 -2317 -2293 -1441 291 1643 2042 1962 668 -1133
2946a133l65l21K51J775J371P83o96j142j302j275k40J486J010J333M19J67j514
$$ -1133 -1498 -1819 -1568 207 1578 2361 1665 523 -779 -2054 -2294 -808 202 1535 1954 2121 607
2963F07j831p08Q2O65J273J249Q58m86j039j533j065N4Q11J143J755K68l89j082
$$ 607 -1224 -1932 -1850 -1185 88 1337 2195 1709 670 -863 -1928 -1874 -1063 80 1835 2103 1714 632
2981F32j398j299oJ159J062J441K38r2j341j397r70J93M91J165J454O15m39j253
$$ 632 -766 -2065 -2071 -912 150 1591 1829 1737 396 -1001 -1971 -1778 -1287 -122 1332 1947 1508 255
2999B55j084j051M9L72J572J404K83k40j226j184q61k20J019P49J429J001p16
$$ 255 -829 -1880 -1831 -1459 113 1517 1800 1560 334 -850 -1711 -1931 -912 -163 1266 2267 1551
3016A551j154j072j053n37J038J258J375M47l05j036j016j188k65O90J221J133
$$ 1551 397 -675 -1728 -2265 -1227 31 1406 1853 1548 512 -504 -1692 -1957 -1267 -46 1087
3032A087Q69k61j126j373p08m51Q07J327J043P64n95q53j244p37R2L73J245O08
$$ 1087 1956 1695 569 -804 -1512 -1963 -1156 171 1214 1978 1383 530 -714 -1451 -1359 -986 259 867
3050H67R32l55r76j246q22j26O69J030J336L39l48q16j189j024k93J020J229J057
$$ 867 1799 1444 468 -778 -1600 -1726 -1057 -27 1309 1648 1300 484 -705 -1729 -2022 -1002 227 1284
3068A284N24o09n53j431j217R1R91Q34J290N75m01p57j306o39k69O17J059R58
$$ 1284 1808 1199 646 -785 -2002 -1911 -920 -86 1204 1779 1378 621 -685 -1324 -1593 -976 83 1041
3086A041P06l91o82j132q28n00J109Q66R72N28n10r18p76q21j85L55J342O69O82
$$ 1041 1747 1356 674 -458 -1286 -1786 -677 189 1161 1689 1179 261 -515 -1336 -1521 -1166 176 845 1527
3105A527k62j020r84o49L44L29P37J131L70k87m19j314q85j61O92J026J134J35
$$ 1527 1265 245 -739 -1388 -1044 -715 22 1153 1523 1236 817 -497 -1382 -1543 -851 175 1309 1444
3123A444j7q69j339k27m97Q46Q25P99M96k03j090n20o55k82N96O64P77Q20l24
$$ 1444 1427 558 -781 -1008 -1505 -659 166 965 1461 1258 168 -352 -1007 -1289 -693 -29 748 1568 1244
3142A244j068p17n81r6M84Q55O23M22R4r38j014o55o1Q20M91R58N75o67l50j159
$$ 1244 176 -541 -1122 -1218 -734 121 744 1166 1260 322 -692 -1347 -1408 -588 -97 861 1436 769 419 -740
3162g40l43k46O06Q55Q02J86N5q82p42q67k43P45O70R91J17L69p79q05r99J62
$$ -740 -1083 -1329 -723 132 934 1120 1175 293 -449 -1316 -1559 -814 -144 847 964 1333 554 -251 -1250 -1088
3182a088L25O07R94L31k96l89o77j026Q1M95N69P70O10j5r49r26m45k63L89J107
$$ -1088 -763 -156 838 1169 873 484 -193 -1219 -1138 -643 -74 696 1306 1291 342 -584 -1029 -1292 -903 204
3202B04N64K48J93n87n97q89l77N14O72Q19M69j64l45j122p48j02M96Q45P09N68
$$ 204 768 1016 1209 622 25 -864 -1241 -727 -55 764 1233 1069 724 -398 -1146 -1248 -752 93 802 1370
3222A370m09q02n55m87k63M96P65O60M02n09N5j237q50N05L97M83P29M60j96n79
$$ 1370 961 159 -396 -883 -1146 -650 115 775 1177 668 723 -514 -1364 -859 -462 21 750 1210 1014 435
3242D35o35p37q9L27P61O54j1M57r82n43o30k70N26P44P04K89O0o30p39q25K72
$$ 435 -200 -937 -1026 -699 62 716 705 1162 180 -363 -993 -1263 -737 7 711 1000 1060 430 -309 -1134 -862
3263h62M92L88P93K43k2p67n82p16k44R39M15R99j81m64m59n7p76n0M36M58K80
$$ -862 -370 18 811 1054 1032 265 -317 -1033 -1277 -338 77 1076 895 431 -28 -85 -861 -911 -475 -17 263
3284B63O42q7k72p86o69j24M39R32M34j26mk90o48n75mJ52O75N57K98J05o34o23
$$ 263 905 818 546 -240 -909 -1033 -594 338 772 646 642 352 -296 -871 -875 -723 -48 509 807 912 278 -345
3306c45o45j83O97M15L46N43L09j061l04o42M5M52J28N76M69j77k13n88p04N5
$$ -345 -990 -1173 -476 -61 285 828 1137 76 -228 -870 -825 -373 -245 331 800 623 410 -178 -882 -827
3326h27L96M86L88M05J36n89q84l44J92K33L84M87N13k63o26n35l18k09M17Q61
$$ -827 -431 55 443 848 984 395 -489 -833 -641 -408 -24 463 976 713 87 -448 -766 -975 -558 303
3346C03L20K15l58n32m48k60J1O31k30J246k87m6k61o21l20j49K76O11O09O8k59
$$ 303 623 838 480 -52 -500 -760 -749 -118 -348 898 611 565 304 -317 -637 -786 -510 101 710 778 519
3367E19k14o18l80N2K48L67N29J85r2n18m03n51L98j54O18R06k79J61p92o3n71
$$ 519 305 -313 -693 -641 -393 -26 503 688 596 78 -325 -876 -478 -632 -14 892 613 774 -18 -81 -652
3388f52m0N92K06J71L03J73n69l72m07oL01K09M24L53O2n38k92o53M8L87K67K95
$$ -652 -692 -100 106 277 580 753 184 -188 -595 -601 -300 -91 333 686 748 210 -82 -735 -687 -300 -33 262
3410B62O01q15k3O3q85J64J39M13P16m9pl90o12P6J04k89L80M50L48l02r1n33
$$ 262 863 48 25 88 -797 -633 -494 -81 635 586 579 189 -423 -347 -243 -532 -152 298 646 344 253 -280
3432b80k42j51L53J28L29J38M8j36n83j61P0J56J92L51O21m16j91o42k33P5K35
$$ -280 -522 -673 -320 -192 137 275 323 187 -396 -557 -487 -331 -139 212 833 417 226 -416 -649 -574 -339
3453c39N58N6K66J29o36q8m5l79L51K29L34j0J29k28m12n8m79L43N07K10J01j67
$$ -339 219 275 541 670 34 -54 -99 -478 -127 102 436 426 555 327 -85 -143 -622 -279 228 438 539 372
3475C72m60q4j43k38M78J66K70K56l74j6o78j03J91J81M02N4J55J36n49k80k17
$$ 372 -88 -172 -315 -553 -75 91 361 617 243 227 -451 -554 -363 -182 220 274 429 565 16 -264 -481
3496d81k2K05L55j08K50J25k71l63j44k5l0Q28J78%l06k77j76j01K16O4k1N15
$$ -481 -503 -298 57 -51 199 324 53 -310 -454 -479 -509 319 497 497 191 -86 -262 -363 -147 -83 -104 411
3518D11j96o4k93j6l13R6j47M33O30k34O8j94j27l40k71N37J08M0M05m15J29j95
$$ 411 215 151 -142 -158 -471 -375 -522 -89 541 307 375 181 54 -286 -557 -20 88 128 533 118 247 52
3540E2l98j62Q2L77K36J39j01k02k29J90k21K55p1M04j10p2k85N5r5j0J0K71j80
$$ 52 -346 -508 -426 -49 187 326 225 23 -206 -16 -237 18 -53 351 241 169 -116 -61 -156 -166 -156 115 -65
3563f5K51l4j60k31J56l49K42K37J54K58k89Nj35m07J63M15k38L96k59K82k35
$$ -65 186 152 -8 -239 -83 -432 -190 47 201 459 170 175 40 -367 -204 211 -27 369 110 392 157
3584A57l63p4P0J69N4J57P9M3l62J3m4l29N00P0k6R9j51k05k41K27J59j84K01
$$ 157 -206 -280 -210 -41 13 170 249 292 -70 -57 -101 -430 70 140 114 213 62 -143 -384 -157 2 -182 19
3607A9K27j44J03j26l8j00j34J02J75J26N7L8l44P0j59K10m86P57p1j41j8l09
$$ 19 246 102 205 79 41 -59 -193 -91 84 210 267 305 -39 31 -128 82 -404 353 282 141 123 -186
3629a86L17l96QK56K67o1k07mpl65M19l18L5K30K63R4k45j50r7M3o7OR1J78Pj97
$$ -186 131 -265 -257 -1 266 205 -2 -6 -13 -378 41 -277 -242 -12 251 345 100 -50 -147 -104 -171 -165 -74 104 111 -86
3655h6mj93J46rO2J72K57j35K59l05m62L36p2J50j25oK76l10k25l1L27k01P7r3
$$ -86 -90 -283 -137 -146 -84 88 345 210 469 164 -298 38 -34 116 -9 -15 261 -49 -274 -305 22 -179 -102 -195
3679a95J94j31K29K19l19q0O2Q9o3J06l7j30k83L32r1m67N66j86N76l55o2q0M0
$$ -195 -1 -132 97 316 -3 -83 -21 68 5 111 74 -56 -339 -7 -98 -565 1 -185 391 36 -26 -106 -66
3702f6j96K80o4J62J93n79M01k84j6QJ00j96L22q0K70k21J76l36J20O3k51J95
$$ -66 -262 18 -46 116 309 -270 131 -153 -169 -161 -61 -257 65 -15 255 34 210 -126 -6 57 -194 1
3724AR2J0L1l33J35O4m21L66O9k7Q4j31j4N3K75j01M7k66r4M08n07J61L12l64
$$ 1 93 103 134 -199 -64 0 -421 -55 14 -13 71 -60 -74 -21 254 153 200 -66 -160 248 -259 -98 214 -150
3748a50Q5L03j66n0j5p4j66M28k40k69K81j39J63J69k62k57L83J65j71q4J75M9
$$ -150 -65 238 72 22 7 -67 -233 195 -45 -314 -33 -172 -9 160 -102 -359 24 189 18 -66 109 158
3770A58j00m07J97j22P6J23J37J98j46l66J58op5L1J34J89K09j34j02j36k38K61
$$ 158 58 -349 -152 -274 -198 -75 62 260 114 -252 -94 -100 -175 -144 -10 179 388 254 152 16 -222 39
3792C9m6K89k19k03k17K6K43j99K79q4K53Mj37J07k0l83K07J28k34K27J43P8r1
$$ 39 -7 282 63 -140 -357 -331 -88 -287 -8 -92 161 165 28 135 115 -268 -61 67 -167 60 203 281 190
3815A90l57N35o07K90j44L32O1l62L28o22L62j45J41J16p6L71l81j13q4K3M11
$$ 190 -167 368 -239 51 -93 239 300 -62 266 -356 6 -139 2 118 42 413 32 -81 -165 -142 269
3836B69l15R1J98k39J79k10j56j91J56J00K2M08r5l82L67k30k13M40m67L08k0
$$ 269 -46 45 243 4 183 -27 -183 -374 -218 -118 -96 312 217 -165 202 -28 -241 199 -268 40 20
3857B0L13o55K37R3J06j51o1j18M07J22n12O1pJ34r1k81L96M5O1j75Q5Q8j12l31
$$ 20 333 -322 -85 8 114 -37 -98 -216 191 313 -199 -138 -145 -11 -102 -383 13 58 119 -56 29 117 5 -326
3881c26N40J36k01j2k27J41j75j95M05r4j6L03J34k30M1p6k2j91k6LJ80j22K40
$$ -326 214 350 149 137 -90 51 -124 -319 86 -8 -24 279 413 183 224 148 126 -65 -91 -88 92 -30 210
3904B10j25k84L4K1K03J34j09L48m19mj01k1k41L54L48k7oj80J02m34J32j30n6
$$ 210 85 -199 -165 -144 59 193 84 432 13 9 -92 -113 -354 0 348 321 315 135 237 -197 -65 -195 -251
3927b51M26N5Q2k46K01m84k09L45pL11j6O4k15k13q3O2J56J61J78k34j07kM0k22
$$ -251 175 230 312 66 267 -217 -426 -81 -88 223 207 271 56 -157 -240 -178 -22 139 317 83 -24 -26 14 -208
3951b08L3J41j10N78l66K4k23L01k12j5o3PJ60J41k06J75m6k86k17J31L48N1L82
$$ -208 -175 -34 -144 434 68 92 -131 170 -42 -57 -120 -113 47 188 -18 157 111 -175 -392 -261 87 138 520
3974E20o03O7P2n04L58j11L21nj28K57k75q2j98k2J0J43K00qK17O8m51K19l13
$$ 520 -83 -16 56 -448 -90 -201 120 115 -13 244 -31 -113 -311 -333 -323 -180 20 12 229 297 -154 65 -248
3997b48r0L75K45j95M80m50M8o61M31j33J51j23K95R7j55o3j99J22PJ80r7K07
$$ -248 -338 37 282 87 567 117 165 -496 -65 -198 -47 -170 125 222 67 4 -195 -73 -66 114 17 224
4019B24J74m55J47Q4n26K49q7K80M78m77K42o64J68k2J7J06N22K0l93P4j76k78
$$ 224 398 -57 90 174 -352 -103 -190 90 568 91 333 -331 -163 -185 -168 -62 460 480 87 161 -15 -293
4041b93J10J70J44L13p4n49L34k99j00j37J51J89J47Q6K46m57j89k42M4M52m93
$$ -293 -183 -13 131 444 370 -179 155 -144 -244 -381 -230 -41 106 192 438 -19 -208 -450 -406 46 -447
4062d47O28k9J82k73L0k44j25J43N8K08M95m51P5k10l24J4M4M37j24J87j69M8
$$ -447 181 152 334 61 91 -153 -278 -135 -77 131 626 175 250 40 -284 -270 -226 211 87 274 105 153
4084A53l25l7k6j3O0L64n2J67k26j06k16K86k50M07k33L79j25l66o8k42K08L71
$$ 153 -172 -209 -235 -248 -188 176 124 291 65 -41 -257 29 -221 186 -47 332 207 -159 -227 -469 -261 110
4106A10q9J17K98k09k12J65n44K98K58K4k00J26K55k05m40m1K40l29N98j18K21
$$ 110 21 138 436 227 15 180 -364 -66 192 216 16 142 397 192 -248 -289 -49 -378 220 102 323
4127C23l7j03k5m97J19k26N28k2J12K45k17r8n01K56l08M37j7O87k7p75J65l18
$$ 323 286 183 158 -339 -220 -446 82 60 172 417 200 102 -399 -143 -451 -14 -31 656 629 -146 19 -299
4149b99K9J74J1L22j65M48m96j57j32L2N25k21L80%l59P6k96j66k4J09M76L6k82
$$ -299 -270 -96 -85 237 72 520 24 -133 -265 -233 292 71 451 451 92 168 -128 -294 -318 -209 267 303 21
4172B1J67l2l22k93K12L86j71J79J43j58j80j78K4j56M53j84O0L07J28m08k75
$$ 21 188 156 -166 -459 -247 139 -32 147 290 132 -48 -226 -202 -358 95 -89 -29 278 406 -2 -277
4193b77l9J20k0J98K36N2J6k83k32r7k2R6J89M14J56k71k55J83p21K63J09K59
$$ -277 -316 -196 -216 -18 218 270 286 3 -229 -326 -348 -252 -63 351 507 236 -19 164 -557 -294 -185 74
4215G4M0M65k35m52J40k04j13L75p0K60N1j52k31n1qqj38K14J57L07k87k6Ql30
$$ 74 114 579 344 -108 32 -172 -285 90 20 280 331 179 -52 -103 -111 -119 -257 -43 114 421 134 108 116 -214
4239b14m74M27L62J60m2J18j79k81k9l64N41n3L63J19k74j23Ql11j29L03j5K81
$$ -214 -688 -261 101 261 219 337 158 -123 -152 -516 25 -28 335 454 180 57 65 -246 -375 -72 -87 194
4261A94K70n5k53k76Q0m7k63P20j41K3N9j17l96J45m62K16K61K69r5j36O5l20
$$ 194 464 409 156 -120 -40 -87 -350 370 229 252 311 194 -202 -57 -519 -303 -42 227 132 -4 61 -259
4283b59j12L5Q4K47L33l9j09j35j98q7o6K31O4K04J32m34L27j78k55J75k22N1
$$ -259 -371 -336 -252 -5 328 289 180 45 -153 -240 -306 -75 -11 193 325 -109 218 40 -215 -40 -262 -211
4305b11L51M00j37k65n68J58L1l04N26O1K35n7j93j42j07K8j40M11K28j60N6P
$$ -211 140 540 403 138 -430 -272 -241 -545 -19 42 277 220 27 -115 -222 -194 -334 77 305 145 201 208
4327B08m00k31n4K46j49P11K39l83r5l18n3j4j06M38j23M8J28j01k5n47M21L0
$$ 208 -192 -423 -477 -231 -380 331 570 187 92 -226 -279 -293 -399 39 -84 -36 92 -9 -34 -581 -160 -130
4349a30L60Q9l2Q7l74k8j49m79M82J97K3L23Lj98m32P5o9P3Q5R7L86o3k19m9k51
$$ -130 230 319 287 374 0 -28 -177 -656 -174 23 46 369 372 174 -258 -183 -252 -179 -94 3 389 326 107 58 -193
4374a93l41L17K7L01M66m71m96p0Q7L0K43K15J22j6K34k20l41l3j75K08j57L26
$$ -193 -534 -217 -190 111 577 106 -390 -460 -373 -343 -100 115 237 221 455 235 -106 -139 -314 -106 -263 63
4396F3N98n22Q5n31j03r2O7K75L66M11n13N4n90O9j68L38M85j33K90J7m07k10
$$ 63 661 139 224 -307 -410 -502 -435 -160 206 617 104 158 -432 -363 -531 -193 292 159 449 466 59 -151
4418a51l56J07K50n7L56P7L04j70n80O5Qj09L12N62p0n67L10n37JJ04m34N73M22
$$ -151 -507 -400 -150 -207 149 226 530 360 -220 -155 -147 -256 56 618 548 -19 291 -246 -245 -141 -575 -2 420
4441D20j04p7j07k3m67M1J6K79L57L0k9o15K34n34J39j18O84r6M44n0m03rm08
$$ 420 316 239 132 109 -358 -317 -301 -22 335 365 336 -279 -45 -579 -440 -558 126 30 474 424 21 12 -396
4464c96J14P5K13L17J57l95J13m47k03m5J99L02R4J95q8J30o58J08l37R6M11N28
$$ -396 -282 -207 6 323 480 85 198 -249 -452 -497 -298 4 98 293 205 335 -323 -215 -552 -456 -45 483
4486D83K38m57K27n83l57p1L88p9M19K38M2m31K1m55n5O6L84J32K13l0p8l06l70
$$ 483 721 264 491 -92 -449 -520 -132 -211 208 446 488 57 78 -377 -432 -366 18 150 363 333 255 -51 -421
4509d21K29q1O2M90lJ02j62k94k15K29j56R0K76j4K44l42j17J45n01j16M13N72
$$ -421 -192 -273 -211 279 276 378 216 -78 -293 -64 -220 -130 146 132 376 34 -83 62 -439 -555 -142 430
4531D30M5o7l42m98J8L1J87K79M5J28J80n34j08Pj88P3K3P19j76l1r6l23k26L7
$$ 430 475 408 66 -432 -414 -383 -196 83 128 256 436 -98 -206 -199 -387 -314 -291 428 252 221 125 -198 -424 -387
4555c87J17K02M09K04r0k05j27m56j65M24QL05K52l72Q4m67L02n48pO66K74L1
$$ -387 -270 -68 341 545 455 250 123 -333 -498 -74 -66 239 491 119 203 -264 38 -510 -517 149 423 454
4577D54k34K41n67l88j21N84Q4q0M70p0m8o25K3l22L29O43J75j83N4l73l58N6
$$ 454 220 461 -106 -494 -615 -31 53 -27 443 373 325 -300 -277 -599 -270 373 548 365 419 46 -312 -256
4599b56O9k47J97L85j5K33l19P0m58J05k48O43M0J07L6j23k80m06J18O8K30K57
$$ -256 -187 -434 -237 148 133 366 47 117 -341 -236 -484 159 199 306 342 219 -61 -467 -349 -281 -51 206
$$ [...]
8191b75
##END NTUPLES=NMR FID
##END=
