##TITLE=1H_LR-673-R2-HCR3
 D2O, 8 sc, 
 18.12.2019
##JCAMPDX= 6.0         $$ Bruker NMR JCAMP-DX V2.0
##DATA TYPE= NMR FID
##DATA CLASS= NTUPLES
##ORIGIN= UXNMR, Bruker Analytische Messtechnik GmbH
##OWNER= root
$$ XWIN-NMR		Version 3.5
$$ Wed Dec 18 13:48:17 2019 Russian Standard Time (UT+4h)  she@DPX200
##.OBSERVE FREQUENCY= 200.1315
##.OBSERVE NUCLEUS= ^1H
##.DELAY= (6, 6)
##.ACQUISITION MODE= SIMULTANEOUS
##.ACQUISITION SCHEME= undefined
##.AVERAGES= 8
##.DIGITISER RES= 18
##SPECTROMETER/DATA SYSTEM= spect
##.PULSE SEQUENCE= zg30
##.SOLVENT NAME= D2O
##.SHIFT REFERENCE= (INTERNAL, D2O, 0, 15.7039)
##AUDIT TRAIL= $$ (NUMBER, WHEN, WHO, WHERE, WHAT)
$$ ##TITLE= Audit trail, XWIN-NMR		Version 3.5
$$ ##JCAMPDX= 5.01
$$ ##ORIGIN= Bruker BioSpin GmbH
$$ ##OWNER= she
$$ F:/spectra/data/she/nmr/H-F/1/audita.txt
$$ ##AUDIT TRAIL=  $$ (NUMBER, WHEN, WHO, WHERE, WHAT)
(   1,<2019-12-18 13:47:10.65 +0400>,<she>,<DPX200>,
      <created by zg, POWCHK disabled, PULCHK disabled
       configuration hash MD5:
       00 E9 B6 7A A2 85 ED C7 34 08 36 98 17 FE 4E 26
       data hash MD5: 16K
       68 D9 49 6A 2E AD 30 B9 AA FF ED A1 65 1F 3D 2B>)
$$ ##END=
$$ 
$$ hash MD5
$$ B2 EA 16 F1 28 E7 82 98 1A A4 B6 18 A4 18 6C 43
##$RELAX= 
##$RELAX= 
##$RELAX= 
##$RELAX= 
##$RELAX= 
##$RELAX= 
$$ Bruker specific parameters
$$ --------------------------
##$DU= <F:/spectra>
##$EXPNO= 1
##$NAME= <H-F>
##$PROCNO= 1
##$TYPE= <nmr>
##$USER= <she>
##$AMP= (0..31)
100 100 100 100 100 100 100 100 100 100 100 100 100 100 100 100 100 100 
100 100 100 100 100 100 100 100 100 100 100 100 100 100 
##$AQSEQ= 0
##$AQ_mod= 1
##$AUNM= <au_zg>
##$AUTOPOS= <>
##$BF1= 200.13
##$BF2= 200.13
##$BF3= 200.13
##$BF4= 200.13
##$BF5= 200.13
##$BF6= 200.13
##$BF7= 200.13
##$BF8= 200.13
##$BYTORDA= 1
##$CFDGTYP= 0
##$CFRGTYP= 5
##$CHEMSTR= <none>
##$CNST= (0..31)
1 1 145 1 1 1 1 1 1 1 1 1 1 1 1 1 1 1 1 1 1 1 1 1 1 1 1 1 1 1 1 1 
##$CPDPRG= <>
##$CPDPRG1= <>
##$CPDPRG2= <>
##$CPDPRG3= <>
##$CPDPRG4= <mlev>
##$CPDPRG5= <mlev>
##$CPDPRG6= <mlev>
##$CPDPRG7= <mlev>
##$CPDPRG8= <mlev>
##$CPDPRGB= <>
##$CPDPRGT= <>
##$D= (0..31)
0 1.2 0 0 0 0 0 0 0 0.06 0 0.03 0 0 0 0 0.0002 0 0 0 0 0 0 0 0 0 0 0 0 
0 0 0 
##$DATE= 1576662430
##$DBL= (0..7)
120 120 120 120 120 120 120 120 
##$DBP= (0..7)
150 150 150 150 150 150 150 150 
##$DBP07= 0
##$DBPNAM0= <>
##$DBPNAM1= <>
##$DBPNAM2= <>
##$DBPNAM3= <>
##$DBPNAM4= <>
##$DBPNAM5= <>
##$DBPNAM6= <>
##$DBPNAM7= <>
##$DBPOAL= (0..7)
0.5 0.5 0.5 0.5 0.5 0.5 0.5 0.5 
##$DBPOFFS= (0..7)
0 0 0 0 0 0 0 0 
##$DE= 6
##$DECBNUC= <off>
##$DECIM= 24
##$DECNUC= <off>
##$DECSTAT= 4
##$DIGMOD= 1
##$DIGTYP= 9
##$DL= (0..7)
0 120 120 120 120 120 120 120 
##$DP= (0..7)
150 150 150 150 150 150 150 150 
##$DP07= 0
##$DPNAME0= <>
##$DPNAME1= <>
##$DPNAME2= <>
##$DPNAME3= <>
##$DPNAME4= <>
##$DPNAME5= <>
##$DPNAME6= <>
##$DPNAME7= <>
##$DPOAL= (0..7)
0.5 0.5 0.5 0.5 0.5 0.5 0.5 0.5 
##$DPOFFS= (0..7)
0 0 0 0 0 0 0 0 
##$DQDMODE= 0
##$DR= 18
##$DS= 0
##$DSLIST= <SSSSSSSSSSSSSSS>
$$ [...]
##$SUBNAM2= <"">
##$SUBNAM3= <"">
##$SUBNAM4= <"">
##$SUBNAM5= <"">
##$SUBNAM6= <"">
##$SUBNAM7= <"">
##$SUBNAM8= <"">
##$SUBNAM9= <"">
##$SW= 24.9337058887773
##$SWIBOX= (0..15)
0 0 2 0 0 0 0 0 0 0 0 0 0 0 0 0 
##$SW_h= 4990.01996007984
##$TD= 16384
##$TD0= 1
##$TE= 0
##$TE2= 300
##$TE3= 300
##$TEG= 300
##$TL= (0..7)
0 120 120 120 120 120 120 120 
##$TP= (0..7)
150 150 150 150 150 150 150 150 
##$TP07= 0
##$TPNAME0= <>
##$TPNAME1= <>
##$TPNAME2= <>
##$TPNAME3= <>
##$TPNAME4= <>
##$TPNAME5= <>
##$TPNAME6= <>
##$TPNAME7= <>
##$TPOAL= (0..7)
0.5 0.5 0.5 0.5 0.5 0.5 0.5 0.5 
##$TPOFFS= (0..7)
0 0 0 0 0 0 0 0 
##$TUNHIN= 0
##$TUNHOUT= 0
##$TUNXOUT= 0
##$USERA1= <user>
##$USERA2= <user>
##$USERA3= <user>
##$USERA4= <user>
##$USERA5= <user>
##$V9= 5
##$VALIST= <valist>
##$VCLIST= <CCCCCCCCCCCCCCC>
##$VD= 0
##$VDLIST= <DDDDDDDDDDDDDDD>
##$VPLIST= <PPPPPPPPPPPPPPP>
##$VTLIST= <TTTTTTTTTTTTTTT>
##$WBST= 1024
##$WBSW= 4
##$XGAIN= (0..3)
0 0 0 0 
##$XL= 0
##$YL= 0
##$YMAX_a= 635502
##$YMIN_a= -478354
##$ZGOPTNS= <>
##$ZL1= 120
##$ZL2= 120
##$ZL3= 120
##$ZL4= 120
##$ABSF1= 10
##$ABSF2= 0
##$ABSG= 5
##$ABSL= 3
##$ALPHA= 0
##$AQORDER= 0
##$ASSFAC= 0
##$ASSFACI= 0
##$ASSFACX= 0
##$ASSWID= 0
##$AUNMP= <proc_1d>
##$AZFE= 0.1
##$AZFW= 0.1
##$BCFW= 1
##$BC_mod= 2
##$BYTORDP= 1
##$COROFFS= 0
##$CY= 11.3945322036743
##$DATMOD= 1
##$DC= 2
##$DFILT= <>
##$DTYPP= 0
##$F1P= 16.9975609425685
##$F2P= -3.02152046262296
##$FCOR= 0.5
##$FTSIZE= 0
##$FT_mod= 4
##$GAMMA= 1
##$GB= 0.15
##$INTBC= 1
##$INTSCL= 1
##$ISEN= 128
##$LB= 0.24
##$LEV0= 0
##$LPBIN= 0
##$MAXI= 10000
##$MC2= 0
##$MEAN= 0
##$ME_mod= 0
##$MI= 1.114404
##$NCOEF= 0
##$NC_proc= 0
##$NLEV= 6
##$NOISF1= 3.799351
##$NOISF2= 2.8
##$NSP= 1
##$NTH_PI= 0
##$NZP= 0
##$OFFSET= 15.70392
##$PC= 1
##$PHC0= -9788.739
##$PHC1= 10.20081
##$PH_mod= 1
##$PKNL= yes
##$PPARMOD= 0
##$PSCAL= 0
##$PSIGN= 0
##$REVERSE= no
##$SF= 200.130013532006
##$SI= 16384
##$SIGF1= 3
##$SIGF2= 2
##$SINO= 400
##$SIOLD= 16384
##$SREGLST= <1H.CDCl3>
##$SSB= 0
##$STSI= 0
##$STSR= 0
##$SW_p= 3612.71676300578
##$SYMM= 0
##$S_DEV= 0
##$TDeff= 0
##$TDoff= 0
##$TI= <>
##$TILT= no
##$TM1= 0
##$TM2= 0
##$TOPLEV= 0
##$USERP1= <user>
##$USERP2= <user>
##$USERP3= <user>
##$USERP4= <user>
##$USERP5= <user>
##$WDW= 1
##$XDIM= 8192
##$YMAX_p= 0
##$YMIN_p= 0
$$ End of Bruker specific parameters
$$ ---------------------------------
##NTUPLES= NMR FID
##VAR_NAME=  TIME,          FID/REAL,        FID/IMAG
##SYMBOL=    X,             R,               I
##VAR_TYPE=  INDEPENDENT,   DEPENDENT,       DEPENDENT
##VAR_FORM=  AFFN,          ASDF,            ASDF
##VAR_DIM=   8192,          8192,            8192
##UNITS=     SECONDS,       ARBITRARY UNITS, ARBITRARY UNITS
##FACTOR=    0.0002004,     1,               1
##FIRST=     0,             0,               0
##LAST=      1.6414764,     0,               0
##MIN=       0,             -478354,         0
##MAX=       1.6414764,     635502,          0
$$ Real data points
##PAGE= N=1
##DATA TABLE= (X++(R..R)), XYDATA
$$ plain form
0 0 0 0 0 0 -8 8 -6 8 -8 16 -16 23 -32 33 -43 51 -62 78 -89 105 -122 143 -167 192 -222 255 -290 334 -375
29 -375 423 -481 542 -608 678 -759 849 -942 1047 -1165 1290 -1431 1581 -1752 1941 -2150
45 -2150 2382 -2642 2940 -3282 3669 -4128 4675 -5333 6155 -7200 8595 -10553 13515 -18564
59 -18564 29304 -97319 338759 530395 7588 6052 247613 29719 -420674 -332798 -44191
70 -44191 19876 94077 346620 303958 -13738 -151191 -135617 -291902 -302970 66940 335188
81 335188 198158 122671 201039 -35352 -431650 -318818 73383 64030 -85666 204026 478022
92 478022 150757 -285736 -256827 -142320 -226540 -79653 316463 342653 28469 -7200 122267
103 122267 -126023 -449532 -249314 163751 216986 117281 195122 184548 -73682 -245423 -223416
$$ packed form
0@%%%%qJ6j4J4j6K4l2L9n5O5p6R4j13J40j67J94k27K65l10L59m14M77n45O24p09
29c75P98r04J023j150J286j437J608j791J989k212K455k721L012l333L693m091
45b150M532n024N582o222O951p797Q803j0008J1488j3355J5795j9148K4068l2079
59a8564M7868j26623M36078J91636n22807j536K41561k17894m50393Q7876K88607
70d4191O4067P4201K52543m2662l17696j37453J5574j56285j1068L69910K68248
81C35188j37030p5487P8368k36391l96298J12832L92201r353j49696K89692K73996
92D78022l27265m36493K8909J14507q4220J46887L96116K6190l14184l5669J29467
103A22267k48290l23509K00218M13065N3235r9705P7841j0574k58230j71741K2007
$$ plain form
114 -223416 -205431 -86767 241033 373344 106199 -73432 44068 -26685 -348380 -314979
124 -314979 95916 237764 85531 154826 288863 -7964 -400919 -293224 26022 33486
134 33486 -26949 181010 322450 118694 -114016 -163372 -204377 -214840 -19877 181205 159355
145 159355 126602 199767 68569 -275811 -347982 -76407 74060 30746 128846 276555 136233
156 136233 -112161 -136869 -113011 -224645 -170316 158479 321053 145675 14122 40360 -77528
167 -77528 -286349 -222453 31177 121189 104273 186793 198261 -19300 -207904 -178839 -116107
178 -116107 -99389 33776 223217 226761 87916 -5465 -101412 -238149 -210378 7551 124985
189 124985 82364 125866 218378 72944 -206134 -253045 -99980 -31524 -5083 146348 256367
$$ packed form
114b23416J7985J18664L27800J32311k67145j79631J17500p0753l21695L3401
124c14979M10895J41848j52233O9295J34037k96827l92955J07695L19246P464
134C3486o0435K07959J41440k03756k32710m9356m1005j0463J94963K01082k1850
145A59355l2753P3165j31198l44380p2171K71575J50467m3314R8100J47709j40322
156A36233k48394k4708K3858j11634N4329L28795J62574j75378j31553K6238j17888
167g7528k08821O3896K53630R0012j6916Q2520J1468k17561j88604K9065O2732
178a16107J6718J33165J89441L544j38845r3381r5947j36737K7771K17929J17434
189A24985m2621M3502R2512j45434k79078m6911J53065O8456K6441J51431J10019
$$ plain form
200 256367 133460 -50204 -108529 -139185 -189085 -108287 84346 177782 147020 118595 57590
211 57590 -102517 -215633 -161802 -54662 19905 130162 226150 151580 -29852 -116879 -121965
222 -121965 -155037 -131324 34387 181561 168950 98759 52605 -55193 -199044 -200835 -55523
233 -55523 58209 101678 156113 168229 45094 -114410 -166325 -137350 -92544 1641 130963
244 130963 183169 127077 37501 -57888 -159271 -186103 -89701 38223 109186 147464 152506 61617
256 61617 -87878 -163386 -137857 -87093 -16281 101575 186986 146151 30454 -63676 -125797
267 -125797 -161425 -118618 6998 120618 153965 126397 59361 -44613 -140324 -162102 -102753
278 -102753 -3668 96852 157450 139919 54796 -45780 -124447 -157534 -116220 -7270 101802
$$ packed form
200B56367j22907j83664n8325l0656m9900Q0798J92633R3436l0762k8425o1005
211E7590j60107j13116N3831J07140P4567J10257R5988p4570j81432q7027n086
222a21965l3072K3713J65711J47174j2611p0191m6154j07798j43851j791J45312
233e5523J13732M3469N4435J2116j23135j59504n1915K8975M4806R4185J29322
244A30963N2206n6092q9576r5389j01383k6832R6402J27924P0963L8278N042r0889
256F1617j49495p5508K5529N0764P0812J17856Q5411m0835j15697r4130o2121
267a25797l5628M2807J25616J13620L3347k7568o7036j03974r5711k1778N9349
278a02753R9085J00520O0598j7531q5123j00576p8667l3087M1314J08950J09072
$$ plain form
289 101802 148496 129592 64802 -32289 -125973 -158859 -108610 -10452 84698 141401 138824 72472
301 72472 -32427 -124885 -153422 -106145 -14997 74402 134087 142447 79418 -31237 -121817 -143944
313 -143944 -105546 -28970 67477 140691 139935 70014 -22831 -102834 -145414 -119395 -26809 72745
325 72745 128034 132011 83150 -13930 -109130 -141296 -106979 -36924 53029 133692 143329 71431
337 71431 -19669 -86013 -130675 -127858 -44796 69583 127530 119085 80174 7991 -92662 -148508
349 -148508 -111963 -30474 43540 108668 140343 91735 -11855 -90984 -120380 -114977 -57692 47427
361 47427 125192 124089 75995 11874 -73177 -139764 -121124 -35779 41924 94374 129441 104246
373 104246 3488 -92253 -118188 -100733 -61458 22587 116761 135426 76009 5759 -56582 -119550
$$ packed form
289A01802M6694j8904o4790r7091r3684l2886N0249R8158R5150N6703k577o6352
301G2472j04899r2458k8537M7277R1148Q9399N9685Q360o3029j10655r0580k2127
313a43944L8398P6576R6447P3214p56o9921r2845q0003m2580K6019R2586R9554
325G2745N5289L977m8861r7080r5200l2166L4317P0055Q9953Q0663R637p1898
337G1431r1100o6344m4662K817Q3062J14379N7947q445l8911p2183j00653n5846
349a48508L6545Q1489P4014O5128L1675m8608j03590p9129k9396N403N7285J05119
361D7427P7765j103m8094o4121q5051o6587J8640Q5345P7703N2450L5067k5195
373A04246j00758r5741k5935J7455L9275Q4045R4174J8665n9417p0250o2341o2968
$$ plain form
385 -119550 -130238 -54040 44620 96630 111421 97864 25348 -76498 -124743 -102285 -53982 11805
397 11805 95847 135815 87862 6003 -53892 -100900 -124361 -72672 32515 101633 106955 85914
409 85914 36532 -54440 -124202 -111107 -49707 10332 73955 125924 105215 16359 -60829 -94500
421 -94500 -106329 -79159 8337 96991 115944 80604 32025 -35456 -107576 -119845 -59333 13597
433 13597 67134 107672 107269 36290 -55905 -100075 -97339 -70997 -7503 79141 119620 87734 27830
446 27830 -30746 -90056 -116846 -73366 9029 69252 96928 97508 49664 -38725 -101745 -102128 -64485
459 -64485 -9637 60833 111643 97204 32862 -31256 -78441 -104687 -82806 -8645 69128 102043
471 102043 90126 44265 -24900 -86341 -102371 -71089 -14729 52864 104549 100764 39595 -31292
$$ packed form
385a19550j0688P6198R8660N2010J4791j3557p2516j01846m8245K2458M8303O5787
397A1805Q4042L9968m7953q1859n9895m7008k3461N1689J05187O9118N322k1041
409H5914m9382r0972o9762J3095O1400O0039O3623N1969k0709q8856p7188l3671
421i4500j1829K7170Q7496Q8654J8953l5340m8579o7481p2120j2269O0512P2930
433A3597N3537M0538m03p0979r2195m4170K736K6342O3494Q6644M0479l1886n9904
446B7830n8576n9310k6790M3480Q2395O0223K7676N80m7844q8389o3020l83L7643
459f4485N4848P0470N0810j4439o4342o4118m7185k6246K1881P4161P7773L2915
471A02043j1917m5861o9165o1441j6030L1282N6360O7593N1685l785o1169p0887
$$ plain form
483 -31292 -74762 -91842 -79714 -24542 54285 104074 95545 44007 -21252 -76311 -98647 -75321
495 -75321 -17299 47758 92014 94806 52368 -16024 -74959 -98423 -77209 -19507 47068 89429
507 89429 90115 52074 -8915 -67657 -97572 -81712 -24517 46762 91293 88142 47244 -6684 -58259
520 -58259 -92124 -85870 -31614 41801 90917 92047 50171 -9988 -60046 -82502 -76946 -40423 27331
533 27331 92190 100857 49122 -12861 -54108 -79051 -81530 -39254 31576 81533 87396 59280 5775
546 5775 -57073 -92340 -77813 -30563 24998 73403 90652 58942 2032 -46244 -80193 -88815
558 -88815 -44470 35731 82579 73180 47831 21390 -32200 -92054 -94676 -34772 29365 68122
570 68122 83140 62931 6945 -46158 -69749 -74708 -55012 8248 78739 92105 52481 9338
$$ packed form
483c1292m3470j7080J2128N5172P8827M9789q529n1538o5259n5059k2336K3326
495g5321N8022O5057M4256K792m2438o8392n8935k3464K1214N7702O6575M2361
507H9429O86l8041o0989n8742k9915J5860N7195P1279M4531l151m0898n3928n1575
520e8259l3865O254N4256P3415M9116J130m1876o0159n0058k2456N556L6523O7754
533B7331O4859Q667n1735o1983m1247k4943k479M2276P0830M9957N863k8116n3505
546E775o2848l5267J4527M7250N5561M8405J7249l1710n6910m8276l3949q622
558h8815M4345Q0201M6848r399k5349k6441n3590n9854k622N9904O4137L8757
570F8122J5018k0209n5986n3103k3591m959J9696O3260P0491J3366l9624m3143
$$ plain form
582 9338 -30585 -75792 -88580 -42303 20305 57568 77017 73864 22190 -50697 -79798 -63708
594 -63708 -41684 -5523 56501 93340 64858 11376 -26607 -65184 -92765 -57073 23674 68718
606 68718 62572 53313 36838 -20474 -80549 -83582 -42134 2609 48221 83881 70125 15791 -27782
619 -27782 -55408 -80491 -67188 5212 69860 70621 47519 33640 -7867 -72730 -88277 -41086
631 -41086 4601 30972 68988 87441 36745 -40629 -69146 -60559 -50145 -16447 46396 80803
643 80803 60377 25163 -8329 -54655 -84726 -56547 304 38101 62169 76455 44081 -26655
655 -26655 -68002 -61603 -46927 -23627 34431 83737 67379 18307 -9563 -35699 -76311 -74708
667 -74708 -10223 49574 61927 58384 47256 -3330 -65750 -77116 -42737 -11246 20402 62619
$$ packed form
582I338l9923m5207j2788M6277O2608L7263J9449l153n1674p2887k9101J6090
594f3708K2024L6161O2024L6839k8482n3482l7983l8577k7581L5692Q0747M5044
606F8718o146r259j6475n7312o0075l033M1448M4743M5612L5660j3756n4334m3573
619b7782k7626k5083J3303P2400O4648P61k3102j3879m1507o4863j5547M7191
631d1086M5687K6371L8016J8453n0696p7374k8517Q587J0414L3698O2843L4407
643H0803k0426l5214l3492m6326l0071K8179N6851L7797K4068J4286l2374p0736
655b6655m1347O399J4676K3300N8058M9306j6358m9072k7870k6136m0612J603
667g4708O4485N9797J2353l543j1128n0586o2420j1366L4379L1491L1648M2217
$$ plain form
679 62619 75371 36580 -11828 -40684 -65316 -70524 -24631 41354 67507 56992 40467 4795
691 4795 -51382 -76669 -49670 -13061 14374 53411 81249 47349 -17358 -46362 -47577 -57415 -45335
704 -45335 20193 79516 72419 28061 -4728 -32692 -62552 -62146 -23347 19860 50141 66684 52184
717 52184 2995 -43906 -61011 -57394 -34236 17056 65371 65537 32111 5866 -21124 -62309 -75768
730 -75768 -28861 31643 52156 48450 45180 21615 -29744 -67960 -63846 -30738 12857 54831 69027
743 69027 41545 -2 -27741 -45536 -58741 -43679 5528 54154 67523 46657 8855 -30157
755 -30157 -54393 -55543 -35497 843 45599 69668 50352 6724 -28449 -48216 -57500 -40894
767 -40894 5300 47984 57840 43026 20650 -13223 -55790 -72569 -39502 16078 49627 49388 37056
$$ packed form
679F2619J2752l8791m8408k8856k4632n208M5893O5985K6153j0515j6525l5672
691D795n6177k5287K6999L6609K7435L9037K7838l3900o4707k9004j215r838J2080
704d5335O5528N9323p097m4358l2789k7964k9860M06L8799M3207L0281J6543j4500
717E2184m9189m6901j7105L617K3158N1292M8315J66l3426k6245k6990m1185j3459
730g5768M6907O0504K0513l706l270k3565n1359l8216M114L3108M3595M1974J4196
743F9027k7482m1547k7739j7795j3205J5062M9207M8626J3369k0866l7802l9012
755c0157k4236j150K0046L6340M4756K4069j9316m3628l5173j9767r284J6606
767d0894M6194M2684R856j4814k2376l3873m2567j6779L3067N5580L3549k39j2332
$$ plain form
780 37056 22700 -6104 -48814 -72063 -45862 10163 48320 52114 40443 23153 -9228 -48796
792 -48796 -65332 -42461 1359 40253 57608 48198 18940 -15934 -44432 -56028 -41508 -5661
804 -5661 32120 54659 54887 28042 -17113 -53155 -55367 -32662 -5459 24049 52152 55781 26711
817 26711 -12296 -42261 -57805 -46880 -5432 37653 48973 39554 29302 4369 -41511 -69245
829 -69245 -46120 696 31940 45205 46014 28725 -4081 -34725 -53819 -52096 -16222 34525 55303
842 55303 40645 24109 5799 -32750 -64543 -46907 -1944 22420 34187 52894 45604 -5837
854 -5837 -49998 -48674 -30818 -19675 9163 50176 58089 28359 -3084 -28645 -53424 -51431 -10737
867 -10737 26336 35173 41024 43842 10478 -42100 -57872 -34461 -14204 5820 42138 59634 30444
$$ packed form
780C7056j4356k8804m2710k3249K6201N6025L8157L794j1671j7290l2381l9568
792d8796j6536K2871M3820L8894J7355r410k9258l4874k8498j1596J4520L5847
804e661L7781K2539K28k6845m5155l6042k212K2705K7203K9508K8103L629k9070
817B6711l9007k9965j5544J0925M1448M3085J1320r419j0252k4933m5880k7734
829f9245K3125M6816L1244J3265Q09j7289l2806l0644j9094J723L5874N0747K0778
842E5303j4658j6536j8310l8549l1793J7636M4963K4364J1767J8707p290n1441
854e837m4161J324J7856J1143K8838M1013P913k9730l1443k5561k4779J993M0694
867a0737L7073Q837N851K818l3364n2578j5772K3411K0257K0024L6318J7496k9190
$$ plain form
880 30444 -6541 -21635 -39279 -56591 -29774 26485 49052 35411 29569 19070 -24461 -61376
892 -61376 -45174 -9129 7868 27491 55210 46339 -2321 -33976 -35777 -40308 -34630 7776 49231
905 49231 46178 25488 14486 -13759 -55190 -54034 -11386 14904 20255 42065 53950 12603 -38246
918 -38246 -43489 -29832 -29619 -8873 41356 59156 28185 1872 -8322 -36234 -58529 -29176 17786
931 17786 30914 31727 43051 26175 -25937 -51796 -34077 -19755 -11547 25921 60448 40149 -1710
944 -1710 -13986 -23253 -50163 -43978 9131 42354 31899 27358 29934 -5143 -52868 -49955 -15116
957 -15116 -590 12849 46748 53071 9895 -25421 -26177 -33223 -43185 -10345 39727 45811 24111
970 24111 18982 5680 -38722 -58605 -24455 8521 13627 29629 52888 27945 -24287 -39099
$$ packed form
880C0444l6985j5094j7644j7312K6817N6259K2567j3641n842j0499m3531l6915
892f1376J6202L6045J6997J9623K7719q871m8660l1655j801m531N678M2406M1455
905D9231l053k0690j1002k8245m1431J156M2648K6290N351K1810J1885m1347n0849
918c8246n243J3657K13K0746N0229J7800l0971k6313j0194k7912k2295K9353M6962
931A7786J3128Q13J1324j6876n2112k5859J7719J4322Q208L7468L4527k0299m1859
944a710j2276r267k6910O185N3109L3223j0455m541K576l5077m7725K913L4839
957a5116J4526J3439L3899O323m3176l5316p56p046r962L2840N0072O084k1700
970B4111n129j3302m4402j9883L4150L2976N106J6002K3259k4943n2232j4812
$$ plain form
982 -39099 -26740 -29353 -22211 22636 54243 34450 8579 1884 -20645 -54782 -41901 5971 26821
995 26821 24244 36484 36014 -6845 -43714 -35907 -20476 -18320 7476 48828 47781 10559 -7898
1008 -7898 -14102 -39509 -50059 -9239 32721 32777 25430 30391 9306 -36336 -48109 -21732 -6983
1021 -6983 686 31809 53394 25869 -13256 -22784 -28078 -41471 -23189 23172 41996 26948 20000
1034 20000 14055 -21306 -50895 -33832 -2379 6648 19608 45667 38593 -5631 -32649 -28215 -29134
1047 -29134 -26909 7922 44028 38018 14069 6090 -8919 -40478 -44936 -11279 15169 21098 33147
1060 33147 39149 8420 -31627 -37234 -24097 -19854 -2623 33335 45661 20636 -895 -8202 -27837
1073 -27837 -45588 -24142 15230 29232 27281 30795 18134 -21112 -43859 -29447 -11371 -2567
$$ packed form
982c9099J2359k613P142M4847L1607j9793k5871o695k2529l4137J2881M7872K0850
995B6821k577J2240m70m2859l6869P807J5431K156K5796M1352j047l7222j8457
1008g898o204k5407j0550M0820M1960N6p347M961k1085m5642j1773K6377J4749
1021f983P669L1123K1585k7525l9125r528n294j3393J8282M6361J8824j5048o948
1034B0000n945l5361k9589J7063L1453R027J2960K6059p074m4224k7018M434r19
1047b9134K225L4831L6106o010k3949p979j5009l1559m458L3657K6448N929J2049
1060C3147O002l0729m0047n607J3137M243J7231L5958J2326k5025k1531p307j9635
1073b7837j7751K1446L9372J4002j951L514j2661l9246k2747J4412J8076Q804
$$ plain form
1085 -2567 20252 43659 32538 403 -15538 -22220 -35508 -31576 3907 33213 32697 24278 15788
1098 15788 -10108 -39382 -37003 -12982 2297 14671 35001 38283 9540 -18908 -25741 -28368 -29482
1111 -29482 -6527 29108 39531 24105 10277 -4555 -29411 -40637 -21020 5439 17507 26750
1123 26750 34038 19203 -12596 -30899 -30058 -23641 -8358 20564 39201 29706 8745 -6249 -22945
1136 -22945 -36440 -27237 487 19487 26258 29913 21708 -6643 -30912 -32162 -21309 -8696 12750
1149 12750 36279 35687 11324 -10125 -19956 -28532 -29124 -9088 18078 30975 28636 18426 -1602
1162 -1602 -25367 -34445 -24070 -7021 11064 29781 34894 17325 -7315 -21546 -27373 -27330 -12388
1175 -12388 13891 30559 28977 18407 2470 -20474 -35590 -28192 -6065 12945 24974 30290
$$ packed form
1085b567K2819K3407j1121l2135j5941o682j3288L932L5483K9306n16q419q490
1098A5788k5896k9274K379K4021J5279J2374K0330L282k8743k8448o833k627j114
1111b9482K2955L5635J0423j5426j3828j4832k4856j1226J9617K6459J2068R243
1123B6750P288j4835l1799j8303Q41O417J5283K8922J8637r495k0961j4994j6696
1136b2945j3495R203K7724J9000O771L655q205k8351k4269j250J0853J2613K1446
1149A2750K3529n92k4363k1449r831q576n92K0036K7166J2897k339j0210k0028
1162a602k3765r078J0375J7049J8085J8717N113j7569k4640j4231n827M3J4942
1175a2388K6279J6668j582j0570j5937k2944j5116P398K2127J9010J2029N316
$$ plain form
1187 30290 21119 -1215 -20760 -28467 -25912 -13700 8835 29657 31777 17723 12 -16281 -28427
1200 -28427 -29362 -13640 9296 27286 31179 20063 -477 -17617 -25150 -25086 -16821 3286 27095
1213 27095 34820 20367 -1031 -16415 -25161 -26925 -15688 6036 24733 29726 20939 4736 -13863
1226 -13863 -28051 -28811 -14918 5928 23093 28411 21123 6533 -11525 -27445 -30674 -16363 7124
1239 7124 23667 26471 18920 7351 -8695 -24542 -30441 -19256 3585 24172 30104 20228 3973
1252 3973 -10448 -21432 -26573 -20588 -1173 21552 31470 22771 4590 -11240 -21529 -25182 -19646
1265 -19646 -2323 19016 29912 23508 7407 -9502 -22293 -27104 -18923 615 18309 24928 21475
1278 21475 11817 -4361 -23314 -31699 -20408 3132 19936 23115 18465 11408 -1277 -20123 -31757
$$ packed form
1187C0290r171k2334j9545p707K555J2212K2535K0822K120j4054j7711j6293j2146
1200b8427r35J5722K2936J7990L893j1116k0540j7140p533O4Q265K0107K3809
1213B7095P725j4453k1398j5384q746j764J1237K1724J8697M993q787j6203j8599
1226a3863j4188p60J3893K0846J7165N318p288j4590j8058j5920l229J4311K3487
1239G124J6543K804p551j1569j6046j5847n899J1185K2841K0587N932r876j6255
1252C973j4421j0984n141N985J9415K2725R918q699j8181j5830j0289l653N536
1265a9646J7323K1339J0896o404j6101j6909j2791m811Q181J9538J7694O619l453
1278B1475r658j6178j8953q385J1291K3540J6804L179m650p057j2685j8846j1634
$$ plain form
1291 -31757 -22731 482 19560 24806 19331 10826 -2690 -18252 -28177 -22536 -3741 16372 26763
1304 26763 23345 9662 -5459 -17832 -24405 -20796 -6553 12356 25642 25896 13092 -5033 -19741
1317 -19741 -25341 -19273 -4268 11685 21950 23116 14934 -39 -18138 -28034 -21945 -2982 13882
1330 13882 20238 19650 15461 3237 -16005 -29439 -24065 -3861 14592 21149 18944 13726 3233
1343 3233 -13554 -27252 -24462 -7069 11744 21290 21785 15026 920 -15524 -24347 -20265 -8297
1356 -8297 6698 20023 25069 16930 -428 -15781 -22465 -20260 -9262 6189 18310 23111 18135
1369 18135 3363 -15360 -25569 -20084 -6586 5722 15767 22373 18550 3867 -12381 -22947
1381 -22947 -22810 -10997 7598 19367 20151 14660 6401 -8526 -23740 -24532 -9392 6807 15918 20234
$$ packed form
1291c1757R026K3213J9078N246n475q505j3516j5562r925N641J8795K0113J0391
1304B6763l418j3683j5121j2373o573L609J4243J8909J3286K54j2804j8125j4708
1317a9741n600O068J5005J5953J0265J166q182j4973j8099r896O089J8963J6864
1330A3882O356n88m189j2224j9242j3434N374K0204J8453O557k205n218j0493
1343C233j6787j3698K790J7393J8813R546M95o759j4106j6444q823M082J1968
1356h297J4995J3325N046q139j7358j5353o684K205J0998J5451J2121M801m976
1369A8135j4772j8723j0209N485J3498J2308J0045O606l823j4683j6248j0566
1381b2947J37J1813J8595J1769P84n491q259j4927j5214p92J5140J6199R111M316
$$ plain form
1395 20234 18582 5812 -11629 -21300 -20288 -12336 1519 16983 23555 17212 4717 -8939 -20551
1408 -20551 -22265 -11109 3961 13176 19462 20865 8995 -12027 -22468 -18239 -10167 -2067 12146
1421 12146 24467 20197 4213 -8646 -16340 -21566 -15549 1461 15928 19008 16465 9967 -5013
1434 -5013 -20446 -22122 -11878 -230 10881 21322 20704 6389 -7813 -15206 -19247 -17188 -2434
1447 -2434 15367 20569 15035 9227 -1015 -17783 -24476 -13305 1195 8865 16712 21886 11495
1460 11495 -7880 -17404 -16537 -14337 -6794 10399 22588 17480 6804 -1588 -12578 -22670 -17939
1473 -17939 -594 10881 15341 18870 13889 -3874 -18244 -17441 -11823 -7375 5322 21633 21304 6811
1487 6811 -3409 -8904 -18799 -20865 -4958 12619 16825 14328 13117 2705 -16027 -22174 -13189 -3514
$$ packed form
1395B0234j652j2770j7441r671J012P952J3855J5464O572o343j2495j3656j1612
1408b0551j714J1156J5070R215O286J403j1870k1022j0441M229Q072Q100J4213
1421A2146J2321m270j5984j2859p694n226O017J7010J4467L080k543o498j4980
1434e013j5433j676J0244J1648J1111J0441o18j4315j4202p393m041K059J4754
1447b434J7801N202n534n808j0242j6768o693J1171J4500P670P847N174j0391
1460A1495j9375r524Q67K200P543J7193J2189n108j0676q392j0990j0092M731
1473a7939J7345J1475M460L529m981j7763j4370Q03N618M448J2697J6311l29j4493
1487F811j0220n495r895k066J5907J7577M206k497j211j0412j8732o147Q985R675
$$ plain form
1501 -3514 3524 15500 22275 12208 -3289 -10861 -15602 -19727 -9658 10514 18909 14153 9649 4994
1515 4994 -10756 -23089 -16351 -2263 4009 10792 20684 17114 -1721 -14470 -14082 -13957 -12166 2914
1529 2914 19870 19112 8245 1993 -5544 -18896 -20373 -5714 7188 10694 15438 17409 4185 -13488
1543 -13488 -17718 -12400 -9261 -917 15602 21327 10358 12 -4642 -13535 -21014 -11094 7112 13688
1557 13688 12451 14558 8726 -9271 -20314 -14449 -5833 -1266 9429 20969 16162 76 -8015
1570 -8015 -11067 -16401 -14171 2190 15060 14596 11107 8057 -3633 -18574 -18337 -6288 942 6842
1584 6842 16925 18328 3745 -9585 -11933 -12651 -14352 -3545 14031 18369 10053 4446 -747 -13429
1598 -13429 -20208 -10874 2723 8349 12810 16915 8604 -7787 -14909 -12118 -9873 -5688 8872 19270
$$ packed form
1501c514P038J1976O775j0067j5497p572m741m125J0069K0172Q395m756m504m655
1515D994j5750j2333O738J4088O272O783R892l570j8835j2749L88J25J791J5080
1529B914J6956p58j0867o252p537j3352j477J4659J2902L506M744J971j3224j7673
1543a3488m230N318L139Q344J6519N725j0969j0346m654q893p479R920J8206O576
1557A3688j237K107n832j7997j1043N865Q616M567J0695J1540m807j6086q091
1570h015l052n334K230J6361J2870m64l489l050j1690j4941K37J2049P230N900
1584F842J0083J403j4583j3330k348p18j701J0807J7576M338q316n607n193j2682
1598a3429o779R334J3597N626M461M105q311j6391p122K791K245M185J4560J0398
$$ plain form
1612 19270 14162 3329 -2163 -9384 -18381 -14498 913 10576 11241 13242 11396 -2478 -15787 -14775
1626 -14775 -8185 -3944 4883 16370 17075 5350 -3706 -8016 -14309 -16308 -3647 11624 14512 10922
1640 10922 7923 1427 -11639 -17140 -10688 -2845 4139 13238 17580 8673 -4055 -9747 -11823 -13942
1654 -13942 -6920 7495 15726 12654 7075 1690 -8742 -16859 -12874 -2190 4766 9838 14953 12124
1668 12124 -627 -11317 -13458 -11666 -6667 4485 14207 13395 6726 1389 -5613 -14477 -15268 -4864
1682 -4864 5865 10672 12329 11131 2526 -8948 -14050 -12193 -6418 2582 12589 15104 8254 283
1696 283 -5348 -11593 -14472 -7733 3798 10940 12699 10630 3807 -7605 -14593 -11758 -5701 1373 8914
1711 8914 14173 11304 2154 -6065 -11565 -12867 -7785 1670 10305 12767 10476 4503 -5403 -13171 -13148
$$ packed form
1612A9270n108j0833n492p221q997L883J5411R663O65K001j846j3874j3309J012
1626a4775O590M241Q827J1487P05j1725r056m310o293j999J2661J5271K888l590
1640A0922k999o496j3066n501O452P843O984R099M342q907j2728n692k076k119
1654a3942P022J4415Q231l072n579n385j0432q117L985J0684O956N072N115k829
1668A2124j2751j0690k141J792M999J1152R722q12o669n337p002q864p91J0404
1682d864J0729M807J657j198q605j1474n102J857N775R000J0007K515o850p971
1696B83n631o245k879O739J1531P142J759k069o823j1412o988K835O057P074P541
1711H914N259k869r150q219n500j302N082R455Q635K462k291n973r906p768K3
$$ plain form
1726 -13148 -6541 2171 8661 12284 10803 3935 -4663 -10992 -12941 -9223 525 9735 12944 10122 3843
1741 3843 -3891 -11134 -13450 -8333 808 8555 11945 10400 4457 -3467 -10675 -12883 -9019 -295 7892
1756 7892 12223 11061 5249 -3748 -10849 -12118 -7710 -1075 6248 11258 11785 5595 -3056 -9946 -12044
1771 -12044 -9050 -1496 6854 11598 10734 6028 -2117 -10061 -12306 -8172 -1501 5320 10813 11842 6307
1786 6307 -2704 -8479 -11378 -10140 -3273 7094 12052 9858 5265 -161 -7380 -12864 -10130 -1591 5425
1801 5425 9438 11007 7699 -1148 -8666 -10924 -8914 -4105 4213 11279 10727 5890 28 -6518 -11541
1816 -11541 -10509 -2631 4657 8564 10452 8937 375 -8992 -11428 -7917 -4080 1949 10265 12280 6749
1831 6749 -661 -5785 -9804 -11013 -5184 4379 8984 9242 7831 2646 -6581 -12213 -9260 -3744 1733
$$ packed form
1726a3148O607Q712O490L623j481o868q598o329j949L718R748R210L209k822o279
1741C843p734p243k316N117R141P747L390j545n943p924p208k208L864Q724Q187
1756G892M331j162n812q997p101j269M408O635P323N010N27o190q651o890k098
1771a2044K994P554Q350M744q64m706q145p944k245M134O671O821N493J029n535
1786F307r011n775k899J238O867J0367M958k194m593n426p219n484K734Q539P016
1801E425M013J569l308q847p518k258K010M809Q318P066n52m837n862o546n023
1816a1541J032P878P288L907J888j515q562r367k436L511L837O029Q316K015n531
1831F749p410n124m019j209N829R563M605K58j411n185r227n632K953N516N477
$$ plain form
1846 1733 7607 12057 8124 -253 -5756 -8422 -10276 -6898 2521 10002 9808 6564 3010 -4278 -11427
1861 -11427 -10813 -3449 2277 5841 10304 10240 1635 -6833 -8848 -8042 -6899 -440 8889 11443 6641 2251
1877 2251 -3012 -9080 -11367 -5641 2383 6440 9136 9684 3891 -5296 -9472 -7846 -6081 -1981 6945
1892 6945 12037 8179 1045 -2986 -6786 -10713 -8158 977 7316 8305 7962 5430 -2868 -10170 -9415 -4551
1908 -4551 -786 4356 10277 9948 2849 -3917 -6582 -8955 -8281 -1324 7523 9698 6823 4385 -813
1923 -813 -7854 -10515 -6506 -823 4217 9367 10168 3904 -3444 -6436 -7162 -8310 -3849 5811 10815 7936
1939 7936 2884 -581 -5765 -10596 -8126 -893 4090 7348 8959 6325 -1461 -7391 -8211 -6824 -3545
1954 -3545 3593 9433 8814 4075 -39 -4811 -9950 -9199 -1964 5406 6896 7180 6278 1153 -6175 -9104
$$ packed form
1846A733N874M450l933q377n503k666j854L378R419P481j94l244l554p288p149
1861a1427O14P364N726L564M463o4q605q468k015Q06J143O459R329K554m802m390
1877B251n263o068k287N726Q024M057K696N48n793r187m176J626J765M100Q926
1892F945N092l858p134m031l800l927K555R135O339R89l43k532q298p302P55M864
1908d551L765N142N921l29p099o766k665k373O74O957Q847K175k875k438n198
1923h13p041k661M009N683N040N150Q01o264p348k992p26j148M461R660N004k879
1939G936n052l465n184m831K470P233M983L258J611k634p786n930q20J387L279
1954c545P138N840o19m739m114m772n139P51P235P370J490K84r02n125p328k929
$$ plain form
1970 -9104 -7274 -3377 2534 8904 9576 4318 -971 -3930 -7560 -9531 -4912 3916 8956 7625 4881
1985 4881 1390 -4528 -8934 -7780 -3460 1682 6980 9403 6825 -142 -5242 -7459 -7770 -4746 2489
2000 2489 7590 7583 5539 2410 -3671 -9888 -9280 -2863 3076 5761 7087 7091 2851 -4091 -8315 -8144 -4225
2017 -4225 1979 6554 7825 5259 1985 -2114 -7604 -9077 -5206 1914 6707 7649 6423 2524 -3679
2032 -3679 -7622 -7812 -4528 -75 5045 8624 6808 2136 -3056 -6918 -7962 -5026 705 5589 7061
2047 7061 6958 3812 -2352 -8350 -8586 -4333 861 4359 6895 6970 3795 -1697 -6941 -8548 -5328 756
2063 756 5331 6806 6356 4015 -1409 -6696 -8324 -5602 -241 4259 6986 6973 3342 -1559 -6179 -7322
2079 -7322 -5773 -1158 4071 7785 7267 3767 -1896 -6058 -7431 -5330 -1357 3573 6847 7455 4516
$$ packed form
1970i104J830L897N911O370O72n258n289k959l630j971M619Q828N040j331k744
1985D881l491n918m406J154M320N142N298K423k578o967n100k217l11L024P235
2000B489N101pk044l129o081o217O08O417N939K685J326Mm240o942m224J71L919
2017d225O204M575J271k566l274m099n490j473L871P120M793R42j226l899o203
2032c679l943j90L284M453N120L579j816m672n192l862j044K936N731M884J472
2047G061j03l146o164n998k36M253N194L498K536P5l175n492n244j607L220O084
2063G56M575J475m50k341n424n287j628K722N361M500K727j3l631m901m620j143
2079g322J549M615N229L714n18l500n663m162j373K101L973M930L274O08k939
$$ plain form
2094 4516 -821 -6009 -7983 -5684 -1235 3186 6360 7249 4539 -560 -5881 -7636 -5866 -1543 3311
2109 3311 6106 7052 4817 -294 -4895 -7827 -6338 -2021 3153 6507 6849 4508 -118 -4918 -6999
2124 -6999 -5791 -2324 1882 5971 7496 5034 -30 -4852 -6813 -6154 -2926 2085 6261 7363 4780
2139 4780 520 -4483 -6989 -6049 -3080 1782 5438 7423 5472 844 -4238 -6729 -6471 -3501 1515
2154 1515 5942 6725 4992 939 -3545 -6067 -6828 -3445 1299 5277 6988 5760 1558 -3592 -6403
2169 -6403 -6184 -3458 892 5084 7195 5151 1180 -2984 -6019 -6448 -3974 856 5152 6584 5813 2363
2185 2363 -2709 -6413 -6586 -3828 398 4662 6475 5687 1811 -2321 -5682 -6776 -4807 92 4692
2200 4692 6967 5513 2497 -1948 -5890 -6434 -4543 -204 4275 6554 5923 2303 -2286 -5393 -6342 -5009
$$ packed form
2094D516n337n188j974K299M449M421L174Q89k710n099n321j755J770M323M854
2109C311K795R46k235n111m601k932J489M317N174L354L42k341m626m800k081
2124f999J208L467M206M089J525k462n064m822j961O59L228N011M176J102k583
2139D780m260n003k506R40K969M862L656J985j951m628n082k491K58K970N016
2154A515M427P83j733m053m484k522p61L383M744L978J711j228m202n150k811
2169f403K19K726M350M192K111k044l971m164l035m29K474M830M296J432p71l450
2185B363n072l704j73K758M226M264J813p88l876m132l361j094J969M899M600
2200D692K275j454l016m445l942n44J891M339M479K279o31l620m589l107r49J333
$$ plain form
2216 -5009 -380 4105 6695 6098 2814 -1715 -5595 -6800 -4710 -407 3248 5929 6374 3045 -1244
2231 -1244 -5058 -6389 -4737 -911 3217 6010 5956 3342 -999 -4826 -6413 -5065 -1188 3005 5868
2246 5868 6131 3329 -747 -4671 -6180 -5223 -1836 2980 6002 6058 3755 -832 -4424 -6364 -5112 -1818
2262 -1818 2277 5487 6374 3977 -365 -4028 -5842 -5437 -2417 2662 5749 5998 3881 54 -3683 -6206
2278 -6206 -5401 -2162 1930 5269 5980 4359 61 -4005 -5626 -5241 -3016 1318 5763 6474 4109 394
2294 394 -3156 -6008 -6015 -2816 1846 4912 5839 4612 881 -3612 -5782 -5271 -3026 638 4968 6769
2310 6769 3973 633 -2415 -5119 -6493 -3596 1900 5093 5496 3978 1610 -2425 -5832 -5805 -3293 301
2326 301 4444 6719 5014 440 -2621 -3967 -5755 -4430 365 4940 5713 3985 1821 -1924 -5596
$$ packed form
2216e009M629M485K590n97l284m529l880j205K090M303L655K681M45l329m289
2231a244l814j331J652L826M128K793n4k614m341l827j587J348L877M193K863
2246E868K63k802m076l924j509R57L387M816L022N6k303m587l592j940J252L294
2262a818M095L210Q87k397m342l663j814M05L020N079L087K49k117l827l737k523
2278f206Q05L239M092L339P11j621m298m066j621L85K225M334M445P11k365l715
2294C94l550k852pL199M662L066R27j227l731m493k170N11K245L664M330J801
2310F769k796l340l048k704j374K897N496L193M03j518k368m035l407K7K512L594
2326C01M143K275j705m574l061j346j788J325M795M575P73j728k164l745l672
$$ plain form
2341 -5596 -6024 -2855 314 3148 5766 5728 1560 -2814 -5021 -5147 -4264 -515 4535 5929 3980 2063
2357 2063 -760 -4626 -6976 -3994 1008 3845 4720 5445 2921 -1680 -4756 -5378 -4231 -1455 3721 6576
2373 6576 4737 1023 -883 -2957 -5823 -5479 -467 4373 4952 4793 3151 -1147 -5176 -5590 -3383 -1184
2389 -1184 1875 5823 6373 1988 -1417 -3419 -5160 -5477 -1235 3822 4817 3779 3433 823 -4554 -6994
2405 -6994 -3837 -289 1949 4468 5569 3686 -1065 -3689 -4533 -5342 -2392 3338 6182 3919 2215
2420 2215 1054 -2586 -6502 -5400 -603 2547 3761 5300 4039 -399 -4060 -4255 -4021 -2879 1299
2435 1299 5863 5946 2360 12 -2148 -5425 -6068 -1593 2773 3605 4328 4628 1423 -4155 -6018 -3795
2451 -3795 -1487 354 4062 5862 3779 364 -2297 -4788 -6187 -2704 2659 4367 3161 3474 2705
$$ packed form
2341e596m28L169L169K834K618l8m168m374k207j26Q83L749N050J394j949j917
2357B063k823l866k350K982N002K837Q75P25k524m601l076o22J147K776N176K855
2373F576j839l714j906k074k866L44N012M840N79j59j642m298m029m14K207K199
2389a184L059L948N50m385l405k002j741l17M242N057R95j038l46k610n377k440
2405f994L157L548K238K519J101j883m751k624q44q09K950N730K844k263j704
2420B215j161l640l916J102M797L150J214J539j261m438l661j95K34J142M178
2435A299M564Q3l586k348k160l277o43M475M366Q32P23L00l205n578j863K223
2451c795K308J841L708J800k083l415k661k491j399L483N363J708j206L13p69
$$ plain form
2466 2705 -2093 -6574 -5362 -1322 736 3202 5700 4674 98 -2816 -3712 -4977 -4311 957 5135
2481 5135 4847 2741 1420 -1354 -5178 -5709 -1972 767 2396 4979 5723 1524 -3511 -4616 -3914 -2932
2497 -2932 -747 3908 5754 3398 1474 -674 -4056 -6359 -2746 1661 2921 3392 4763 3298 -1992
2512 -1992 -5609 -4604 -2706 -440 2948 5501 4220 1029 -1113 -3128 -5662 -4427 479 4155 4160 3329
2528 3329 3222 -856 -4776 -5241 -2476 -652 1601 5366 5808 1665 -1942 -3691 -4076 -4223 -1358 2975
2544 2975 4771 3957 2645 -539 -4338 -5876 -2953 148 1556 3630 5100 3465 -1375 -4358 -3929
2559 -3929 -3725 -1658 2445 4902 4240 1983 319 -2763 -5881 -4361 -236 2190 3182 4510 3554 -375
2575 -375 -3897 -4528 -3317 -1720 1179 4828 5292 2107 -414 -2815 -4375 -4568 -1561 2301 3504 4386
$$ packed form
2466B705m798m481J212M040K058K466K498j026m576k914q96j265O66N268M178
2481E135k88k106j321k774l824n31L737K739J629K583P44m199n035j105P02R82
2497b932K185M655J846k356j924k148l382k303L613M407J260M71J371j465n290
2512a992l617J005J898K266L388K553j281l191k142k015k534J235M906L676Nq31
2528C329j07m078l920m65K765J824K253L765M42m143l607j749l85j47K865M333
2544B975J796q14j312l184l799j538K923L101J408K074J470j635m840k983M29
2559c929K04K067M103K457o62k257j664l082l118J520M125K426R92J328r56l929
2575c75l522o31J211J597K899L649M64l185k521k401j560j93L007L862J203Q82
$$ plain form
2591 4386 3538 371 -3587 -4867 -3169 -1285 539 3752 5091 3470 -84 -2542 -4126 -4153 -2091 1696
2607 1696 3874 3775 3313 1273 -2756 -5018 -4121 -1396 1022 3409 4479 3848 225 -3034 -3743 -3884 -2606
2624 -2606 903 4109 4366 2904 749 -1802 -4425 -4558 -1933 1171 2872 4243 4023 1091 -2689 -4215
2640 -4215 -3719 -2459 -176 3494 4741 3350 885 -1667 -3873 -4785 -2735 816 2993 3964 3610 1534
2656 1534 -1713 -4481 -4078 -2176 111 3097 4320 3660 1134 -1562 -3632 -4457 -2568 67 3205 4070
2672 4070 3491 1767 -1179 -3730 -4086 -2590 -434 2311 4152 3957 1733 -1255 -3336 -4180 -2955 -461
2688 -461 2700 4186 3829 1730 -843 -3243 -4422 -3004 -531 2270 4036 3993 1806 -904 -3439 -4074
2704 -4074 -2864 -761 2283 4074 4085 2220 -352 -3078 -4189 -3236 -844 2072 3650 4095 2701 -597
$$ packed form
2591D386q48l167l958j280J698J884J824L213J339j621l554k458j584k7K062L787
2607A696K178r9m62k040m029k262Q97K725K418K387J070o31l623l259p09j41J278
2624b606L509L206K57j462k155k551k623j33K625L104J701J371k20k932l780j526
2640d215M96J260K283L670J247j391k465k552k206r12K050L551K177R71l54k076
2656A534l247k768M03J902K287K986J223o60k526k696k070q25J889K635L138Q65
2672D070n79j724k946k551l56J496K156K745J841j95k224k988k081q44J225K494
2688d61L161J486l57k099k573k400j179J418K473K801J766m3k187k710k535o35
2704d074J210K103L044J791J1j865k572k726j111R53K392K916J578M45j394l298
$$ plain form
2720 -597 -3353 -4159 -3313 -994 1679 3536 3788 2245 -149 -3160 -4417 -3142 -966 1787 3401 3723
2736 3723 2510 -292 -2961 -3958 -3672 -1039 1446 3918 3973 2279 -70 -2417 -3629 -3456 -1271 1351
2752 1351 3350 4045 2969 67 -2808 -3637 -3276 -1428 1226 3427 3831 2848 386 -2444 -4042 -3262
2768 -3262 -1447 965 3112 3941 2765 353 -2387 -3773 -3460 -1722 867 2783 4055 2322 501
2783 501 -1966 -3254 -3799 -1794 998 3288 4324 2911 490 -2058 -3489 -3346 -2043 215 2885 4383
2799 4383 3009 186 -2186 -3126 -3231 -2194 505 2957 3642 3085 942 -1770 -3777 -3698 -1665 303
2815 303 2503 3567 3005 942 -1719 -3121 -3402 -2610 -37 2569 3467 2964 909 -936 -3113 -3765 -2406
2832 -2406 377 2947 3680 3106 975 -996 -2585 -3292 -2395 -728 2331 4075 3179 934 -1598 -2585
$$ packed form
2720e97k756q06Q46K319K673J857K52j543k394l011j257J275K176K753J614L22
2736C723j213k802k669r97K86K633K485K472N5j694k349k347j212J73K185K622
2752A351J999O95j076k902k875q29L61J848K654K201M04r83k462k830j598P80
2768c262J815K412K147Q29j176k412k740j386L13J738K589J916J272j733j821
2783E01k467j288n45K005K792K290J036j413k421k548j431J43J303K258K670J498
2799D383j374k823k372r40j05J037K699K452O85n57k143k712k007P9K033J968
2815C03K200J064n62k063k661j402k81P92K573K606Q98n03k055j845k177o52J359
2832b406K783K570P33n74k131j971j589p07Q97J667L059J744q96k245k532r87
$$ plain form
2848 -2585 -3106 -2793 -474 1837 3594 3231 1204 -730 -2938 -3466 -2441 -311 1927 3284 3328 2058
2864 2058 -375 -2786 -3814 -2801 -363 2163 3268 2959 1694 -12 -2360 -3668 -2945 -417 2275
2879 2275 3327 2956 1588 -389 -2325 -3310 -3175 -1169 1588 3435 3522 1705 -427 -2021 -3093 -2823
2895 -2823 -994 1452 3059 3188 1941 -197 -2550 -3447 -2850 -755 1723 2739 3051 2216 181 -2241
2911 -2241 -3291 -3048 -1014 1612 2764 2750 2293 430 -1384 -3356 -3432 -1036 1623 2704 2885 2251 321
2928 321 -1643 -3116 -3265 -1491 396 2748 3214 1939 -159 -1650 -2763 -3294 -1475 984 2479 3271
2944 3271 2545 644 -1768 -3427 -2720 -1382 214 2290 3101 2654 657 -1796 -3249 -2981 -1272 404
2960 404 2559 3005 2225 1157 -1374 -3396 -3605 -1374 918 1985 2756 2422 711 -1588 -2819 -2979 -1908
$$ packed form
2848b585n21L13K319K311J757l63k027j934k208n28J025K130K238J357M4j270
2864B058k433k411j028J013K438K526J105l09j265j706k348j308P23K528K692
2879B275J052l71j368j977j936r85J35K006K757J847Q7j817k132j594j072K70
2895b823J829K446J607J29j247k138k353q97N97K095K478J016L12q35k035k422
2911b241j050K43K034K626J152j4m57j863j814j972p6K396K659J081J81o34j930
2928C21j964j473j49J774J887K352M66j275k098j491j113n31J819K459J495P92
2944C271p26j901k412j659P07J338J596K076Q11m47j997k453j453K68J709J676
2960D04K155M46p80j068k531k022k09K231K292J067P71l34j711k299j231j60J071
$$ plain form
2977 -1908 161 2629 3060 2339 900 -729 -2911 -3212 -2035 263 2147 2767 3071 897 -1555 -2783
2993 -2783 -2483 -1581 -151 1751 3217 2706 725 -1140 -2764 -3087 -1896 89 1887 2600 2468 1421
3009 1421 -890 -2574 -3042 -1611 0 1620 2747 2802 902 -831 -1965 -2909 -2241 -350 2304 2982
3025 2982 2400 1472 -299 -2389 -3076 -1868 -522 1522 2692 2768 1437 -874 -2168 -2833 -2361 -787 1528
3042 1528 3039 3001 1367 -741 -2316 -3355 -2203 -254 1746 2498 2913 1938 -526 -2108 -2621 -2196 -873
3059 -873 1043 2929 2654 1040 -352 -1776 -2725 -2632 -739 1485 2425 2366 1445 39 -2018 -3003 -2181 -663
3077 -663 1003 2621 3197 1712 -379 -1454 -2611 -2495 -1316 1264 2578 2213 1657 47 -1484 -2950
3093 -2950 -2444 -1216 820 2283 2817 1538 14 -1911 -2439 -2472 -1441 1112 2723 2534 1419 46
$$ packed form
2977a908K069K468M31p21j439j629k182l01J177K298J884O20L04k174k452j228
2993b783L00R02J430J902J466n11j981j865j624l23J191J985J798P13j32j047
3009A421k311j684m68J431J611J620J127N5j900j733j134r44O68J891K654O78
3025B982n82r28j771k090o87J208J346K044J170P6j331k311j294o65M72J574K315
3042A528J511l8j634k108j575j039J152J949K000P52M15r75k464j582n13M25J323
3059h73J916J886k75j614j392j424r49R3J893K224R40n9r21j406k057r85Q22J518
3077f63J666J618N76j485k091j075j157J16J179K580J314l65n56j610j531j466
3093b950N06J228K036J463N34j279j524j925n28l3J031K553J611j89j115j373
$$ plain form
3109 46 -1314 -2540 -2917 -872 895 1945 2558 2082 141 -1609 -2392 -2187 -1192 372 2115 2597 1775
3126 1775 242 -928 -2691 -3032 -1333 682 1771 2313 2145 942 -1330 -2731 -2395 -1076 645 1992
3142 1992 2629 1744 435 -1012 -2117 -2580 -1586 674 2225 2528 1625 648 -820 -2714 -2664 -1321 132
3159 132 1720 2334 2053 709 -1267 -2433 -2588 -1820 180 1685 2775 2115 623 -763 -2282 -2547 -1093
3176 -1093 71 1499 2267 2474 1029 -585 -2575 -2686 -1799 -63 2026 2001 2168 829 -564 -2168 -2477
3193 -2477 -2056 -54 1531 2166 1909 1214 -208 -1986 -2606 -2077 -315 1452 2300 1940 927 -241 -1875
3210 -1875 -2194 -2000 -446 1049 2290 2469 1081 -325 -2066 -2312 -1697 -556 1086 2136 2336 1244
3226 1244 -79 -1958 -2594 -1844 -57 1056 1645 2276 1622 -31 -1940 -2660 -1656 -393 1154 2253
$$ packed form
3109D6j360j226l77K045J767J050O13m76j941j750p83K05R95J564J743M82q22
3126A775j533j170j763l41J699K015J089N42j68j203k272j401L36J319J721J347
3142A992O37q85j309j447j105m63R94K260J551L03r03r77j468j894N0J343J453
3159A32J588O14k81j344j976j166j55P68K000J505J090o60j492j386j519k65J454
3176a093J164J428P68K07j445j614j990j11Q87J736K089k5J67j339j393j604l09
3193b477M21K002J585O35k57o95j422j778o20N29J762J767Q48l60j013j168j634
3210a875l19J94J554J495J241J79j388j406j741k46O15J141J642J050K00j092
3226A244j323j879o36P50J787J113N89O31o54j653j909p20J004J263J547J099
$$ plain form
3242 2253 2117 1071 87 -1478 -2260 -2033 -630 1028 1896 2401 1602 -175 -1705 -2160 -1761 -837 788
3259 788 2275 2251 1245 -334 -1422 -2049 -1974 -1274 497 1783 2281 1795 -186 -1743 -2492 -1809 -318 333
3277 333 1521 2356 1647 301 -1405 -2132 -2071 -1019 1020 1692 1808 1400 387 -1336 -2605 -2311 -555
3294 -555 808 1449 2232 1793 302 -1306 -2247 -1816 -1092 280 1827 2237 1175 425 -742 -2068 -2084 -971
3312 -971 493 1451 2231 1870 522 -1356 -2108 -1459 -846 -291 1533 2180 1752 301 -714 -1607 -2170 -1350
3330 -1350 780 1556 1640 1892 844 -629 -2349 -1751 -780 8 1149 1915 1532 425 -738 -1588 -2259 -1588
3348 -1588 67 1660 2055 1654 823 -477 -2079 -2312 -1034 -56 718 2149 2340 869 -783 -1534 -1636
3365 -1636 -1507 -285 1227 2323 1524 749 -405 -1705 -2175 -1346 161 877 1638 1853 1127 -711 -1881
$$ packed form
3242B253j36j046r84j565p82K27J403J658Q68N05p99j777j530m55L99R24J625
3259G88J487k4j006j579j088o27P5P00J771J286M98m86j981j557p49O83J491O51
3277C33J188Q35p09j346j706p27O1J052K039O72J16m08j013j723j269K94J756
3294e55J363O41P83m39j491j608r41M31P24J372J547M10j062p50j167j326j6J113
3312i71J464R58P80l61j348j878p52O49O13N55J824O47m28j451j015q93n63Q20
3330a350K130P76Q4K52j048j473j720N98R71P88J141P66l83j107j163q50o71O71
3348a588J655J593L95m01q31j300j602k33J278R78P74J431J91j471j652p51j02
3365a636J29J222J512J096p99p75j154j300m70Q29J507P16P61K15p26j838j170
$$ plain form
3382 -1881 -1669 -1275 -646 956 1860 1879 881 -289 -1337 -2342 -1524 -332 1456 1686 1792 1101 -391 -1722
3400 -1722 -2031 -1486 -699 793 2078 1604 919 -189 -1099 -1956 -1674 -565 957 1758 1754 1122 -11 -1541
3418 -1541 -2279 -1210 -135 445 1603 2147 1018 -474 -1519 -1651 -1584 -956 984 1838 1670 984 174 -1175
3436 -1175 -2237 -1766 -691 465 1355 2101 1477 -249 -1435 -1660 -1435 -1060 569 1680 1923 1027 -196
3453 -196 -1041 -1777 -2063 -507 909 1542 1575 1687 172 -1382 -1856 -1399 -801 389 1665 1851 1279 179
3471 179 -972 -1416 -1984 -1209 510 1497 1726 1376 555 -901 -2118 -1642 -801 191 987 2109 1409 199
3489 199 -1094 -1738 -1631 -1328 119 1343 1664 1502 647 -642 -1813 -1859 -635 307 1400 1698 1667 386
3507 386 -1062 -1585 -1663 -1256 101 1510 2149 1626 91 -498 -1448 -1524 -1074 109 1159 1666 1761 322 -577
$$ packed form
3382a881K12L94O29J602R04J9r98j170j048j005Q18J192J788K30J06o91j492j331
3400a722l09N45P87J492J285m74o85j108r10q57K82J109J522Q01mo32j133j530
3418a541p38J069J075N80J158N44j129j492j045j32O7O28J940Q54j68o86q10j349
3436a175j062M71J075J156Q90P46o24j726j186k25K25L75J629J111K43q96j223
3453a96q45p36k86J556J416O33L3J12j515j554m74M57N98J190J276J86n72j100
3471A79j151m44n68P75J719R87K29l50q21j456j217M76Q41R92P96J122p00j210
3489A99j293o44J07L03J447J224L21j62q55j289j171m6J224R42J093K98l1j281
3507C86j448n23p8M07J357J409O39n23j535n89r50p6M50J183J050N07R5j439q99
$$ plain form
3526 -577 -1646 -1496 -1174 -127 871 1956 1614 105 -628 -1391 -1639 -1061 16 1232 1444 1593 972 -329
3544 -329 -1368 -1504 -894 22 898 1767 1719 477 -758 -1172 -1620 -1498 75 1185 1438 1194 649 -354
3562 -354 -1379 -1776 -1262 -141 827 1691 1445 608 -622 -1227 -1508 -1222 -201 618 1696 1599 688 -136 -900
3581 -900 -1782 -1607 -414 820 1654 1506 992 -59 -1265 -1490 -1343 -506 766 1529 1467 888 -223 -1006
3599 -1006 -1696 -1760 -311 722 1314 1533 786 -284 -634 -1430 -1499 -463 421 1736 1707 929 -315 -793 -1356
3618 -1356 -1353 -635 397 1296 1406 730 14 -1060 -1763 -1369 -815 407 1233 1611 1244 188 -914 -1651 -1557
3637 -1557 -598 535 1333 1786 1059 201 -798 -1616 -1489 -868 768 1158 1623 1185 602 -548 -1464 -1424 -1020
3656 -1020 494 1154 1388 843 436 -675 -1233 -1522 -966 490 861 1324 991 165 -708 -1241 -1545 -638 27
$$ packed form
3526e77j069J50L22J047R98J085l42j509p33p63k48N78J077J216K12J49o21j301
3544c29j039j36O10R16Q76Q69m8j242j235m14m48J22J573J110K53k44n45j003
3562c54j025l97N14J121R68Q64k46q37j230o05k81K86J021Q19J078r7r11q24p64
3581i00q82J75J193J234Q34j48n14j051j206k25J47Q37J272P63o2n79j111p83
3599a006o90o4J449J033N92K19p47j070l50p96o9J036Q84J315k9p78j244m78n63
3618a356LP18J032Q99J10o76p16j074p03L94N54J222Q26L78l67j056j102p37R4
3637a557R59J133P98M53p27q58r99q18J27O21J636L90M65m38n83j150r16M0M04
3656a020J514O60K34n45m07j111n58k89N56J456L71M63l33q26q73n33l04R07O65
$$ plain form
3675 27 885 1393 1259 175 -560 -1590 -1486 -793 465 984 1285 1241 393 -381 -1401 -1354 -758 412 1016
3694 1016 1529 1079 620 -839 -1421 -1514 -863 43 1013 1377 1170 784 -316 -1540 -1632 -719 196 959 1380
3713 1380 1109 55 -386 -1280 -1597 -895 -65 899 1482 1447 454 -308 -1432 -1512 -681 -333 932 1298 1265 701
3733 701 -216 -1063 -1446 -1137 -240 495 1290 1347 716 -293 -1152 -1434 -1145 179 604 1685 1094 802 -389
3752 -389 -1041 -1316 -1113 -149 614 1348 1107 601 36 -752 -1125 -1435 -310 742 1240 1282 690 -205 -1132 -1398
3772 -1398 -997 -227 328 1197 1257 989 44 -1262 -1153 -1032 -483 502 1102 1504 701 -29 -783 -1334 -1099 -458
3792 -458 480 1024 1390 971 63 -878 -991 -1007 -466 424 1090 1072 780 231 -802 -953 -1170 -673 336 1185
3812 1185 1377 752 -25 -811 -1228 -1039 -720 312 945 1524 865 80 -558 -791 -1401 -615 382 924 1107
$$ packed form
3675B7Q58N08j34j084p35j030J04O93J258N19L01m4q48p74j020M7N96J170O04
3694A016N13m50m59j459n82r3O51R06R70L64k07l86j100j224r2R13R15P63M21
3713A380k71j054m41q94l17P02Q30R64N83l5r93p62j124q0Q31L48J265L66l3n64
3733G01r17q47l83L09Q97P35P95N7o31j009q59k82K89J324M25J081n91k92j191
3752c89o52k75K03R64P63P34k41n06n65p88l73l10J125J052M98M2n92q95r27k66
3772a398M01P70N55Q69O0k68r45j306J09J21N49R85O00M02q03p30p54n51K35O41
3792d58R38N44L66m19r08r41j13j6N41Q90O66j8k92n49j033j51k17M97J009Q49
3812A185J92o25p77p86m17J89L19J032O33N79o59p85o38k33o10P86R97N42J83
$$ plain form
3831 1107 609 252 -828 -1130 -1287 -353 307 738 1222 861 -61 -457 -1248 -925 -559 81 935 1146 594
3850 594 228 -542 -1296 -1621 -840 184 493 1365 1025 402 -716 -1013 -1127 -446 -213 907 1544 846 341
3869 341 -473 -1231 -1217 -959 9 731 871 956 392 -493 -1229 -1163 -578 -107 764 1502 786 158 -255 -1173 -979
3890 -979 -612 91 645 1319 1184 483 -435 -877 -1320 -891 21 597 1016 862 648 -546 -943 -556 -682 -265
3910 -265 960 1138 832 627 17 -722 -1315 -803 -42 753 815 923 485 -223 -751 -996 -639 -134 733 1181
3930 1181 1280 333 -124 -263 -1343 -1077 -211 934 1122 813 620 -133 -949 -761 -624 -17 146 1072 993 589
3950 589 -365 -730 -832 -867 -198 330 1145 865 822 33 -686 -1324 -521 -214 43 757 1222 689 -274 -945 -826
3971 -826 -806 -480 380 1048 955 424 93 -688 -1133 -1036 -339 293 804 895 500 -16 -782 -761 -860 -530 146 927
$$ packed form
3831A107m98l57j080l02j57R34O60M31M84l61r22l96p91L23L66O40Q54K11n52
3850E94l66p70p54l25P81J024L09Q72l40o23j118k97j14O81K33J120O37o98n05
3869C41q14p58J4K58R68P22J40Q5n64q85p36O6N85M71Q71P38p16o28m13r18J94
3890i79L67P03N54O74j35p01r18m42m43M29R12N76M19j54k14j194l97L87j26M17
3910b65J225J78l06k05o10p39n93N12P61P95O2J08m38p08n28k45L57N05Q67M48
3930A181R9r47m57j39j080K66Q66J145J88l09j93p53q16J88J37O07J63R26p9m04
3950E89r54l65j02l5O69N28Q15k80m3p89p19o38Q03L07K57P14M65n33r63o71J19
3971h26K0L26Q60O68r3n31l31p81m45R7O97O32N11R1l95n16p66K1r9L30O76P81
$$ plain form
3993 927 1327 815 136 -658 -880 -1053 -285 388 669 937 847 128 -791 -1034 -1099 -177 348 724 1078 563 168
4014 168 -373 -1061 -937 -250 124 755 998 823 114 -471 -978 -1094 -220 138 811 1008 841 28 -469 -685
4034 -685 -1074 -850 133 594 895 913 512 -497 -841 -996 -584 488 138 803 967 376 -497 -710 -859 -571
4054 -571 -227 561 861 1065 381 -351 -651 -728 -389 306 616 795 668 536 -197 -446 -746 -241 277 515
4074 515 1304 1111 246 -117 -804 -952 -535 -28 806 1069 850 383 -148 -627 -908 -468 -417 332 1350 962
4094 962 615 -278 -542 -515 -708 -165 501 764 564 484 -29 -674 -1033 -497 101 372 780 1192 181 1
4114 1 -821 -560 -969 -70 181 527 1187 178 -49 -530 -529 -719 227 326 942 789 458 -132 -505 -923 -886 -176
4136 -176 316 571 897 318 -38 -710 -574 -672 -153 176 742 845 395 128 -628 -630 -799 -404 337 901 881
$$ packed form
3993I27M00n12o79p94k22j73P68O73K81K68r0p19r19k43o5R22N25L76L54n15l95
4014A68n41o88J24O87L74O31K43j75p09n85n07j16Q74L58O73J97j67q13m97k16
4034f85l89K24R83M61L01J8m01j009l44j55M12J072l50O65J64n91q73k13j49K88
4054e71L44P88L00K04o84p32l00p7L39O95L10J79j27j32p33k49l00N05N18K38
4074E15P89j93q65l63o87j48M17N07Q34K63k19m67n31m79k81M40N1P49J018l88
4094I62l47q93k64K7j93N43O66K63k00q0n13o45l59N36N98K71M08M12j011j80
4114Aq22K61m09Q99K51L46O60j009k27m81Jj90R46R9O16j53l31n90l73m18L7P10
4136a76M92K55L26n79l56o72J36r8N19L29N66J03m50k67p56kj69L95P41N64k0
$$ plain form
4157 881 306 -67 -426 -774 -779 -353 97 833 876 662 247 -431 -709 -913 -53 531 696 936 594 233 -227
4178 -227 -714 -664 -293 39 788 824 550 0 -658 -777 -862 -308 89 579 733 466 178 -182 -891 -949 -335
4199 -335 295 636 812 503 154 3 -876 -764 -455 146 378 941 674 148 -225 -620 -506 -401 226 752
4219 752 742 178 61 -124 -720 -535 -225 139 239 663 673 281 -424 -796 -768 -347 212 542 664 487 -68
4240 -68 103 -489 -726 -714 77 557 680 756 268 -453 -451 -475 -290 -276 508 655 615 484 -10 -453 -755 -720 30
4263 30 509 365 485 706 -41 -539 -446 -589 85 574 935 860 274 -318 -529 -708 -526 -204 522 496 635
4284 635 375 -138 -693 -657 -636 -31 277 829 657 182 -106 -398 -445 -560 -358 262 852 897 463 70 -129
4305 -129 -648 -677 -184 337 524 756 193 -85 -538 -671 -470 -121 261 567 522 146 -345 -264 -388 -441 -224
$$ packed form
4157H81n75l73l59l48nM26M50P36M3k14m15o78k78k04Q60N84J65K40l42l61m60
4178b27m87N0L71L32P49L6k74n50o58j19q5N54L97M90J54k67k88l60p09n8O14
4199c35O30L41J76l09l49j51q79J12L09O01K32N63k67n26l73l95J14J05O27N26
4219G52j0n64j17j85n96J85L10L64J00M24J0l92p05l72K8M21N59L30J22j77n55
4240f8J71n92k37J2P91M80J23P6m88p21Kk4J85J4P84J47m0j31m94m43l02L5P50
4263C0M79j44J20K21p47m98R3j43O74M89L61p5n86n92k11j79J82L22P26k6J39
4284F35k60n13n55L6K1O05L08N52j72m75k88k92m7j15K02O20N90M5m34l93j99
4305a29n19k9M93N21J87K32n63k78m53j33K01L49L82L06m5l76m91Q1j24n3K17
$$ plain form
4326 -224 -40 629 530 402 70 -654 -558 -944 -326 20 506 454 377 32 -492 -593 -551 -377 179 657 454 428
4348 428 526 -309 -630 -330 -223 120 260 535 583 -95 -139 -532 -660 -271 173 476 706 526 -10 -435 -499
4369 -499 -515 -63 358 143 596 514 -195 -296 -243 -386 -360 -112 34 605 260 13 -344 -723 -566 -596 101 486
4391 486 320 461 250 -150 -615 -462 -564 492 364 605 301 -47 -77 -601 -500 -329 86 194 530 399
4411 399 105 -331 -733 -536 -457 21 246 497 430 503 84 -356 -614 -449 206 447 859 123 269 -428 -474
4432 -474 -826 -428 90 267 431 201 470 -41 -506 -527 177 -275 201 474 364 152 21 -300 -789 -465
4452 -465 -422 199 487 278 47 125 -407 -451 -736 -73 356 564 198 -137 99 -256 -788 -397 -9 465 178
4473 178 652 416 -151 -461 -600 -534 -122 176 406 606 201 62 -465 -393 -403 -307 -58 652 328 298 -171 -502
$$ packed form
4326b24J84O69r9j28l32p24R6l86O18L46M86n2p7l45n24j01M2J74N56M78k03k6
4348D28R8q35l21L00J07L43J40K75M8o78m4l93j28L89M44L03K30j80n36m25o4
4369d99j6M52M21k15M53q2p09j01N3j43K6K48J46N71l45k47l57l79J57l0O97L85
4391D86j66J41k11m00m65J53j02J056j28K41l04l48l0n24J01J71M15J08L36j31
4411C99k94m36m02J97P9M78K25K51o7P3m19m40k58J65O55K41M12p36J46o97m6
4432d74l52L98N18J77J64k30K69n11m65k1P04m52M76K73j10k12j31l21m89L24
4452d65M3O21K88k09k31P8n32m4k85O63M29K08l66l35K36l55n32L91L88M74k87
4473A78M74k36n67l10j39O6M12K98K30K00m05j39n27P2j0R6K49P10l24l0m69l31
$$ plain form
4495 -502 -285 -720 -237 84 473 667 175 -19 -258 -350 -324 -208 238 393 498 184 64 -95 -475 -529 -282
4516 -282 -8 250 268 396 128 -530 -354 -617 -101 352 353 611 349 162 -232 -521 -132 -225 135 373 455 475
4538 475 -92 -295 -490 -660 -52 148 544 823 193 234 -156 -98 -416 -226 -44 188 358 520 239 -145 -490
4559 -490 -585 24 -35 447 699 429 -124 -413 -215 -347 -295 -107 283 528 293 71 -409 -291 -190 -502 123
4580 123 205 332 219 374 -316 -531 -570 -337 -45 184 271 30 332 -165 -435 -377 -134 -249 238 632 366
4601 366 -69 142 -282 -419 -346 17 314 517 376 324 -162 -313 -351 -5 -144 278 496 100 305 -538 -377
4622 -377 -386 -306 28 347 365 214 53 18 -574 -686 -100 -181 48 388 296 -54 188 -464 -553 -282 -77 274 671
4645 671 732 56 -87 -466 -431 -385 -88 132 640 607 384 -97 -207 -454 -394 16 81 247 446 311 5 -494
$$ packed form
4495e02K17m35M83L21L89J94m92j94k39r2K6J16M46J55J05l14j20j59l80n4K47
4516b82K74K58J8J28k68o58J76k63N16M53JK58k62j87l94k89L89r3L60K38Q2K0
4538D75n67k03j95j70O08K00L96K79o30M1l90N8l18J90J82K32J70J62k81l84l45
4559d90r5O09n9M82K52k70n53k89J98j32N2J88L90K45k35k22m80J18J01l12O25
4580A23Q2J27j13J55o90k15l9K33K92K29Q7k41L02m97k70N8K43j15M87L94k66
4601C66m35K11m24j37P3L63K97K03j41n2m86j51l8L46j39M22K18l96K05q43J61
4622c77rQ0L34L19J8j51j61l5n92j12N86q1K29L40r2l50K42o52q9K71K05L51L97
4645F71O1o76j43l79L5M6K97K20N08l3k23m81j10k47O0M10O5J66J99j35l06m99
$$ plain form
4667 -494 -526 -266 42 442 140 387 -151 -373 137 -619 -244 -17 8 339 444 105 -95 -298 -344 -423 -400 -177
4689 -177 170 409 180 222 -20 -591 -341 -196 244 290 312 456 336 215 -401 -307 -136 -10 251 391 409 -229
4711 -229 -172 -261 -463 -108 -34 192 582 102 13 -189 -388 -104 -248 -100 80 359 307 -132 -194 -227 -448 -278
4733 -278 240 313 515 458 124 74 -273 -491 -427 67 271 447 321 459 34 -150 -46 -226 145 201 482 548
4755 548 -84 51 -410 -477 -151 84 315 380 281 140 -170 -443 -519 -60 203 213 374 384 -15 -427 -205 -416
4777 -416 -376 -72 60 620 294 106 -160 -419 -46 -193 44 182 473 208 183 -81 -264 -548 -160 326 267
4798 267 402 170 137 40 -295 -197 32 -203 324 173 350 227 -81 -385 -554 -453 -88 -226 274 316 163
4819 163 -76 45 -330 -374 -263 221 3 244 -6 -203 -462 -508 -237 -146 229 211 148 391 71 -374 -265 -301
$$ packed form
4667d94l2K60L08M00l02K47n38k22N10p56L75K27K5L31J05l39k00k03m6p9K3K23
4689a77L47K39k29M2k42n71K50J45M40M6K2J44j20j21o16R4J71J26K61J40J8o38
4711b29N7q9k02L55P4K26L90m80q9k02j99K84j44J48J80K79n2m39o2l3k21J70
4733b78N18P3K02n7l34n0l47k18O4M94K04J76j26J38m25j84J04j80L71N6K81O6
4755E48o32J35m61o7L26K35K31O5r9j41l10k73p6M59K63J0J61J0l99m12K22k11
4777d16M0L04J32N60l26j88k66k59L73j47K37J38K91k65k5k64j83k84L88M86n9
4798B67J35k32l3r7l35R8K29k35N27j51J77j23l08l04j69J01L65j38N00M2j53
4819A63k39J21l75m4J11M84k18K41k50j97k59m6K71R1L75j8o3K43l20m45J09l6
$$ plain form
4841 -301 -107 213 309 104 402 207 -333 -514 7 91 292 236 -224 -68 63 -70 -59 -561 -133 19 491
4862 491 167 60 -125 -99 -232 -71 -75 424 251 154 341 304 172 -395 -361 -31 6 419 368 89 311 -73 -107
4885 -107 -361 -321 38 44 276 290 2 -285 -216 -112 -314 17 -9 451 189 146 -27 -366 -271 -404 -96 272 258
4908 258 513 206 -322 -595 -393 -391 -255 109 103 178 -94 94 -102 -288 -114 -157 185 -29 409 460 -101 -421
4930 -421 -380 -77 205 132 129 282 251 78 -216 -308 -5 133 289 386 186 -53 -76 -470 -282 -588 -104 326 402
4953 402 171 -43 161 -363 -140 -235 -34 -167 348 -37 290 410 -109 -284 -516 25 228 358 -60 133
4973 133 -242 5 -210 -345 57 -165 259 285 248 22 -247 -157 6 -72 139 193 204 74 19 -7 -225 21 -91
4996 -91 310 226 194 211 133 -269 -97 -20 -173 238 150 298 203 -85 -211 -171 -116 97 -146 214 283 255 -44 -264
$$ packed form
4841c01J94L20R6k05K98j95n40j81N21Q4K01n6m60J56J31j33J1n02M28J52M72
4862D91l24j07j85K6j33J61mM99j73r7J87l7j32n67L4L30L7M13n1k79K22l84l4
4885a07k54M0L59OK32J4k88k87O9J04k02L31k6M60k62m3j73l39R5j33L08L68j4
4908B58K55l07n28k73K02KJ36L64oP5k72J88j96j86J74m3L42k14M38N1n61l20
4930d21M1L03K82p3lJ53l1j73k94r2L03J38J56R7k00k39k3l94J88l06M84M30P6
4953D02k31k14K04n24K23r5K01j33N15l85L27J20n19j75k32N41K03J30m18J93
4973A33l75K47k15j35M02k22M24K6l7k26k69R0J63p8K11N4J1j30n5k6k18K46j12
4996i1M01q4l2J7p8m02J72P7j53M11q8J48r5k88j26M0N5K13k43L60O9k8k99k20
$$ plain form
5020 -264 -285 -141 -277 3 261 586 451 -186 -127 -439 -277 -220 181 218 369 -103 58 -464 -288 -233 110 38
5042 38 374 302 341 138 -78 -253 -150 -274 73 -16 -43 148 73 -290 -147 -155 -247 131 -228 285 49 -50 -212
5065 -212 -139 28 -21 96 159 263 142 27 -47 -486 -234 152 399 332 108 93 -140 361 -188 -353 -318 3
5087 3 203 319 128 -73 146 -111 -190 149 66 57 282 318 175 61 184 -69 -126 -69 262 378 349 44 147
5110 147 -167 -391 -185 -113 275 185 231 -332 105 -339 -375 19 22 184 -82 296 -185 -2 -161 -324 -57 49
5132 49 66 290 187 234 -21 -209 -217 -353 -89 491 197 299 324 -87 -156 -27 -473 -124 100 222 45 27 263
5155 263 -290 -124 -211 73 114 190 280 -6 -78 -170 -346 -553 -39 -171 8 414 -99 -223 136 -218 -393 80
5177 80 254 152 17 98 -71 -42 -139 -131 -153 -99 31 213 138 16 -226 -201 146 -300 -2 415 52 68 -7 -241
$$ packed form
5020b64k1J44j36K80K58L25j35o37N9l12J62N7M01L7J51m72J61n22J76N5L43p2
5042C8L36p2L9k03k16j75J03j24L47q9k7J91p5l63J43qr2L78l59N13k36r9j62
5065b12P3J67m9J17O3J04j21j15p4m39K52L86K47o7k24j5k33N01n49j65L5L21
5087CK00J16j91k01K19k57p9L39q3rK25L6j43j14J23k53n7N7L31J16k9l05J03
5110A47l14k24K06P2L88r0M6n63M37m44l6L94LJ62k66L78m81J83j59j63K67J06
5132D9J7K24j03M7k55j88qj36K64N80k94J02K5m11o9J29m46L49K24J22j77j8K36
5155B63n53J66q7K84M1P6R0k86p2r2j76k07N14j32J79M06n13j24L59l54j75M73
5177H0J74j02j35Q1j69K9r7Qk2N4J30J82p5j22k42K5L47m46K98M17l63J6p5k34
$$ plain form
5201 -241 -2 -91 71 69 112 109 100 -78 0 -85 -209 -297 -142 210 224 39 54 -199 -120 -367 -71 171 87 77 226
5226 226 -290 -333 -429 -208 -56 104 58 -10 58 -220 -105 -164 141 -92 -159 129 459 279 103 -26 -222 -163 72
5249 72 -161 25 25 114 365 78 20 -253 -285 -468 -63 21 369 225 -131 -59 -166 303 -339 213 19 104 213
5272 213 -5 -160 -126 228 -40 378 -40 303 -239 36 110 -453 158 -50 113 481 164 312 59 -112 -19
5293 -19 10 -64 -43 358 111 197 187 -435 -20 173 -265 232 345 21 -168 -70 -8 -641 -182 31 -65 232 353
5316 353 -48 -129 -135 -188 -5 -102 57 14 -98 136 -110 -17 -207 -91 201 -41 -123 -97 205 101 -461 -307 -10
5339 -10 -43 168 260 167 -86 -132 127 248 -15 -8 242 232 124 54 -7 -197 9 -49 -83 -279 216 -122 261 79
5363 79 -72 -458 -248 -161 60 225 162 60 291 -15 -290 -249 -167 54 -232 185 195 89 66 222 -243 -156 43
$$ packed form
5201b41K39q9J62kM3lrj78P8q5j24q8J55L52J4j85J5k53P9k47K96K42q4j0J49
5226B26n16m3r6K21J52J60m6o8O8k78J15n9L05k33o7K88L30j80j76j29j96N9K35
5249G2k33J86%Q9K51k87n8k73l2j83M05Q4L48j44l56P2j07M69o42N52j94Q5J09
5272B13k18j55L4L54k68M18m18L43n42K75P4n63O11k08J63L68l17J48k53j71R3
5293a9K9p4K1M01k47Q6j0o22M15J93m38M97J13l24j89R8O2o33M59K13r6K97J21
5316C53m01q1on3J83r7J59m3j12K34k46R3j90J16K92k42q2K6L02j04n62J54K97
5339a0l3K11R2r3k53m6K59J21k63PK50j0j08p0o1j90K06n8l4j96M95l38L83j82
5363G9j51l86K10Q7K21J65o3j02K31l06k75M1Q2K21k86M17J0j06k3J56m65Q7J99
$$ plain form
5386 43 83 164 187 -125 -5 -454 -280 33 -116 -62 -125 199 -171 44 -128 -78 58 -165 -163 255 -81 -3 -235
5409 -235 -253 46 -250 82 73 -62 186 242 -154 -80 -115 -35 -20 -96 229 294 148 -140 10 -331 -251 -19 333 -44
5433 -44 35 262 208 -85 36 -286 245 -372 284 199 -56 -367 -75 0 -144 55 244 -87 96 183 75 -23
5455 -23 -378 -63 -308 18 135 241 -70 166 112 -43 -353 137 -32 334 160 184 56 -76 -35 -311 12
5476 12 -117 320 154 148 115 98 -232 -92 -85 -91 333 -220 -10 46 -10 -189 -133 124 87 -34 159 188 -36 -153 -63
5501 -63 15 34 191 78 288 -42 -91 -61 -144 -285 -76 151 -60 202 198 -203 -316 -91 12 -170 -271 -180 141
5524 141 -140 170 -108 -93 -88 -241 101 91 -190 98 28 -63 25 -172 -415 262 -38 456 97 -11 -117 -378
5546 -378 -166 179 -99 124 -8 236 155 -145 -61 39 -49 86 -20 195 394 -64 -29 37 -249 -111 38 277
$$ packed form
5386D3M0Q1K3l12J20m49J74L13j49N4o3L24l70K15j72N0J36k23KM18l36P8k32
5409b35j8K99k96L32rj35K48N6l96P4l5Q0J5p6L25O5j46k88J50l41Q0K32L52l77
5433d4P9K27n4k93J21l22N31o17O56q5k55l11K92P5j44J99J89l31J83Q7j08r8
5455b3l55L15k45L26J17J06l11K36n4j55l10M90j69L66j74K4j28j32M1k76L23
5476A2j29M37j66ol3j7l30J40PoM24n53K10N6n6j79N6K57l7j21J93K9k24j17R0
5501f3P8J9J57j13K10l30m9L0q3j41K09K27k11K62mm01j13K25J03j82j01R1L21
5524A41k81L10k78J5Nj53L42j0k81K88p0r1Q8j97k43O77l00M94l59j08j06k61
5546c78K12L45k78K23j32K44q1l00Q4J00q8J35j06K15J99m58L5O6k86J38J49K39
$$ plain form
5568 277 338 129 -67 -287 128 -202 -22 -61 216 270 12 18 255 -61 60 26 -179 92 343 124 84 158 -117
5591 -117 17 -281 252 58 99 -87 -173 7 -200 -29 22 -22 241 39 108 60 -245 95 -134 -149 44 116 219
5614 219 386 313 -6 -265 12 -185 -180 93 94 -316 -213 39 -178 -262 -197 224 -76 223 111 -31 126 -25
5636 -25 -179 -179 -136 -162 -83 139 349 -41 -160 -192 76 -18 -216 -15 326 276 -152 59 -138 -164 -27 90 113 127
5660 127 -320 -123 187 -340 148 -195 -131 70 -9 187 8 86 -31 43 -435 152 121 148 137 23 87 -370 -328
5683 -328 42 210 28 224 26 -10 212 3 -170 46 -119 240 190 158 -86 73 -67 355 172 15 -122
5704 -122 280 0 23 -135 -31 166 -31 51 -249 276 49 -108 29 63 -32 -133 -184 -75 170 184 176 -89 198
5727 198 -163 -57 1 -122 127 244 72 0 -202 -12 40 -107 -65 62 246 -142 -264 -122 13 -58 100 199
$$ packed form
5568B77O1k09j96k20M15l30J80l9K77N4k58OK37l16J21l4k05K71K51k19m0P4k75
5591a17J34k98N33j94M1j86q6J80k07J71N1m4K63k02O9m8l05L40k29j5J93P2J03
5614B19J67p3l19k59K77j97NK73Jm10J03K52k17q4O5M21l00K99j12j42J57j51
5636b5j54%M3k6P9K22K10l90j19l2K68r4j98K01L41n0m28K11j97k6J37J17K3J4
5660A27m47J97L10n27M88l43O4K01p9J96j79P8j17P4m78N87l1K7j1j14O4m57M2
5683c28L70J68j82J96j98l6K22k09j73K16j65L59n0l2k44J59j40M22j83j57j37
5704a22M02k80K3j58J04J97j97Q2l00N25k27j57J37L4r5j01n1J09K45J4qk65K87
5727A98l61J06N8j23K49J17j72p2k02J90N2j47M2J27J84l88j22J42J35p1J58R9
$$ plain form
5749 199 -194 -131 23 172 -248 115 -71 115 -39 283 143 -28 268 135 -37 -133 -27 95 116 72 -79
5770 -79 248 39 -314 -328 -65 223 166 36 84 17 88 257 108 -177 94 -141 170 -131 98 -155 100 -60
5792 -60 -68 116 129 -136 -125 -104 122 226 -66 -486 127 -45 115 216 -99 -339 39 -374 -438 226 29 -217
5814 -217 31 -107 -146 -299 -85 116 27 305 143 -48 -88 124 58 -82 -124 -40 275 -5 -142 -111 160 -342
5836 -342 -278 -160 -24 120 -78 -96 158 100 110 172 198 -125 109 54 -9 226 -69 -50 -161 -23 -81 -35 306 -131
5860 -131 193 12 -134 50 -86 54 25 116 172 38 -63 -268 -124 68 83 86 -16 127 214 -478 -34 -9 -285
5883 -285 255 2 70 87 135 151 -59 -233 40 454 90 -65 80 275 -156 180 -158 -35 146 -63 276
5904 276 -161 108 -103 -237 -14 64 236 184 244 -60 378 -205 -39 -28 181 38 -194 -123 74 -33 72 141
$$ packed form
5749A99l93O3J54J49m20L63j86J86j54L22j40j71K96j33j72r6J06J22K1m4j51
5770g9L27k09l53j4K63K88n7j30M8o7P1J69j49k85K71k35L11l01K29k53K55j60
5792f0qJ84J3k65J1K1K26J04k92m20O13j72J60J01l15k40L78m13o4O64j97k46
5814b17K48j38l9j53K14K01q9K78j62j91m0K12o6j40m2Q4L15k80j37L1K71n02
5836c42O4J18J36J44j98j8K54n8J0O2K6l23K34n5o3K35k95J9j11J38n8M6L41m37
5860a31L24j81j46J84j36J40k9R1N6j34j01k05J44J92J5Lj02J43Q7o92M44K5k76
5883b85N40k53O8J7M8J6k10j74K73M14l64j55J45J95m31L36l38J23J81k09L39
5904B76m37K69k11j34K23P8J72n2O0l04M38n83J66J1K09j43k32P1J97j07J05O9
$$ plain form
5926 141 -60 -79 27 3 -167 333 24 -225 -94 -218 -91 -296 -174 -419 -118 -44 -79 318 -585 -121 181
5947 181 189 47 9 144 -118 -16 -136 -40 90 8 194 158 142 71 -63 -98 -112 71 -103 86 204 215 243 -259
5971 -259 -81 -235 248 83 96 43 13 143 0 213 -242 74 153 104 -275 19 68 68 -113 -5 -76 174 254
5994 254 34 178 -323 -345 148 96 37 36 135 245 202 -101 -36 -198 -296 -45 26 236 -43 186 2 -37 -178 -85
6018 -85 176 -159 162 -21 169 13 193 -150 -185 -75 -156 165 55 48 147 185 -235 231 -34 127 57 249 36
6041 36 224 86 -281 76 -108 193 -13 -191 50 -248 63 229 -27 203 -122 -40 271 -59 23 -140 -141 278
6063 278 -65 -254 -73 5 -39 42 -123 -95 233 -284 -66 27 -36 185 183 49 -89 -205 5 -43 16 254 231 10
6087 10 6 -197 -62 236 154 -57 45 -158 -188 80 28 -175 143 -35 -50 137 248 -83 -11 -21 -293 -112 -252
$$ packed form
5926A41k01j9J06k4j70N00l09k49J31j24J27k05J22k45L01P4l5L97r03M64L02
5947A81Qj42l8J35k62J02j20R6J30q2J86l6j6p1j34l5j4J83j74J89J18J1K8n02
5971b59J78j54M83j65J3n3l0J30j43K13m55L16P9m9l79K94M9%j81J08p1K50Q0
5994B54k20J44n01k2M93n2n9jR9J10m3l03O5j62r8K51P1K10k79K29j84l9j41R3
6018h5K61l35L21j83J90j56J80l43l5J10q1L21j10pR9L8m20M66k65J61p0J92k13
6041C6J88j38l67L57j84L01k06j78K41k98L11J66k56K30l25Q2L11l30Q2j63jM19
6063B78l43j89J81P8m4Q1j65K8L28n17K18R3o3K21kj34j38j16K10m8N9K38k3k21
6087A0mk03J35K98q2k11J02k03l0K68n2k03L18j78j5J87J11l31P2j0k72J81j40
$$ plain form
6110 -252 -47 417 27 -197 186 -169 106 -329 -44 -189 141 293 3 350 175 248 -241 -128 -165 133 177
6131 177 264 -241 -135 -38 -403 -48 123 -92 64 -54 76 5 -38 100 -235 5 1 -8 -110 -32 -133 -289 -70
6154 -70 -220 -34 19 -45 -56 146 -132 -32 167 -191 -126 -96 50 91 -101 -256 -193 -191 -108 260 -191 50 172 308
6178 308 -174 -118 15 30 160 52 -104 -66 142 -243 -113 79 -56 -27 229 -63 -63 41 11 34 -104 -89 -101
6201 -101 416 -51 92 48 -431 -296 -316 11 -115 -193 -115 183 -78 -121 -34 217 23 141 -252 -201 -24 -45 44
6224 44 -58 -340 -192 -159 442 94 168 359 -38 192 -147 -329 -319 -206 184 -193 -25 48 -299 154 -2 74
6246 74 6 310 149 177 -83 -128 -59 125 -87 137 -8 -71 91 -219 -4 -186 -26 173 66 -68 106 9
6268 9 -325 -116 -276 -215 154 87 21 367 59 -8 -36 304 43 -205 20 14 28 -2 99 -123 109 -313 -116 22
$$ packed form
6110b52K05M64l90k24L83l55K75m35K85j45L30J52k90L47j75P3m89J13l7K98M4
6131A77Q7n05J06R7l65L55J71k15J56j18J30p1m3J38l35K40mrj02P8j01j56K19
6154g0j50J86N3o4j1K02k78J00J99l58O5L0J46M1j92j55O3KQ3L68m51K41J22J36
6178C08m82N6J33J5J30j08j56L8K08l85J30J92j35K9K56k92%J04l0K3j38J5j2
6201a01N17m67J43m4m79J35k0L27j26p8P8K98k61m3Q7K51j94J18l93N1J77k1Q9
6224D4j02k82J48L3O01l48P4J91l97K30l39j82J0J13L90l77J68P3l47M53j56P6
6246G4o8L04j61K8k60m5O9J84k12K24j45o3J62l10K15j82J60J99j07j34J74r7
6268Il34K09j60O1L69o7o6L46l08o7k8L40k61k48K25oJ4l0J01k22K32m22J97J38
$$ plain form
6292 22 221 315 22 141 -48 -186 7 -120 -113 -53 -228 244 205 197 -214 -74 -270 83 -28 119 122 88 349 -165
6316 -165 -210 -134 -354 92 124 74 -171 -19 -536 148 -29 -232 -164 2 175 -50 -216 418 123 -211 -118 207
6338 207 111 52 -54 206 -93 8 97 173 16 -104 7 -95 -177 -70 -180 -296 -75 325 -175 103 -109 -59
6360 -59 167 -13 -429 27 -115 49 19 -29 -9 -194 -182 -46 -164 10 363 -73 309 243 224 115 177 -3 100
6383 100 61 213 -59 36 -210 -171 109 -66 2 58 212 49 -282 -64 -22 131 -100 -100 -115 64 201 -19 -212
6406 -212 -7 -141 -72 229 -46 91 143 195 73 197 -4 -79 -132 249 246 14 186 -210 -114 122 -49 4 79
6429 79 -84 16 -106 160 -337 -334 112 134 203 247 122 110 41 -29 251 14 97 188 127 70 251 -106 -205 -92 -138
6454 -138 -236 0 187 -10 194 -258 -383 -261 65 291 168 -28 -37 23 263 -135 117 -299 -305 327 53 -236
$$ packed form
6292B2J99R4k93J19j89j38J93j27PO0j75M72l9qm11J40j96L53j11J47Ll4K61n14
6316a65m5P6k20M46L2n0k45J52n17O84j77k03O8J66J73k25j66O34k95l34R3L25
6338B07r6n9j06K60k99J01Q9P6j57j20J11j02q2J07j10j16K21M00n00K78k12N0
6360e9K26j80m16M56j42J64l0m8K0j85J2J36j18J74L53m36L82o6j9j09O2j80J03
6383A00l9J52k72R5k46L9K80j75O8N6J54j63l31K18M2J53k31%j5J79J37k20j93
6406b12K05j34O9L01k75J37N2N2j22J24k01p5n3L81lk32J72l96R6K36j71N3P5
6429G9j63J00j22K66m97LM46K2O9M4j25j2o9p0K80k37Q3R1o1n7J81l57r9J13m6
6454a38r8K36J87j97K04m52j25J22L26K26j23j96rO0K40l98K52m16oO32k74k89
$$ plain form
6476 -236 -232 112 -46 -152 -177 -78 -126 304 -25 235 3 -60 -250 148 -28 -180 208 -31 -168 -38 72 -159
6498 -159 -289 132 -10 87 154 -115 -289 296 157 340 -227 -1 -48 -87 -124 -97 -8 28 67 94 27 -233 57 332
6522 332 -165 -6 -100 -267 45 -41 98 209 340 -251 110 31 -51 43 -162 -18 19 -108 -235 100 265 -40
6544 -40 -47 -173 -25 -67 2 -200 13 -112 144 106 84 117 58 339 292 -58 -67 -99 132 128 -155 138 210 -172 -182 -129
6570 -129 169 -33 -67 46 277 -60 62 36 67 -249 -32 -61 -184 59 151 117 -163 -41 -186 -193 123 292 -28
6593 -28 266 -10 141 -116 -367 50 295 241 113 -197 103 -105 88 244 -1 -71 -181 62 -313 -58 18
6614 18 -67 2 -300 342 227 -144 -58 -49 33 58 -100 60 393 74 -173 119 32 54 -64 -227 3 12 -39 22 128
6639 128 176 -201 298 37 -153 163 23 195 218 54 40 59 216 -175 -197 65 53 149 -114 -35 129 93 -252
$$ packed form
6476b36ML44j58j06k5R9m8M30l29K60k32o3j90L98j76j52L88k39j37J30J10k31
6498a59j30M21j42R7O7k69j74N85j39J83n67K26m7l9l7K7Q9L6L9K7o7k60K90K75
6522C32m97J59r4j67L12q6J39J11J31n91L61p9q2R4k05J44L7j27j27L35J65l05
6544d0pj26J48m2O9k02K13j25K56l8k2L3n9K81m7l50rl2K31mk83K93P2l82j0N3
6570a29K98k02l4J13K31l37J22k6L1l16K17k9j23K43R2l4k80J22j45pL16J69l20
6593b8K94k76J51k57k51M17K45n4j28l10L00k08J93J56k45p0j10K43l75K55P6
6614A8q5O9l02O42j15l71Q6RQ2K5j58J60L33l19k47K92q7K2j18j63K30Rn1O1J06
6639A28M8l77M99k61j90L16j40J72K3j64j4J9J57l91k2K62j2R6k63P9J64l6l45
$$ plain form
6662 -252 -65 181 148 -64 289 16 -109 -71 -109 -360 -68 -188 273 -80 -75 -140 -142 -286 -220 27 -3 196 -78
6685 -78 195 64 168 -44 -183 21 73 157 -91 83 79 -162 -137 60 60 13 -51 102 340 -563 -79 -218 48
6708 48 48 285 -113 114 215 106 15 -150 -159 -98 -95 -83 -80 290 -120 7 -264 44 25 -98 261 -129 112 -167
6732 -167 -40 158 99 34 -41 57 202 93 275 83 -237 -202 -73 249 -358 62 -82 -120 -254 -62 91 48
6754 48 -68 245 55 -293 -380 10 -369 -46 -49 41 256 -66 77 -70 -169 -231 16 73 23 -209 -158 79 -226
6777 -226 -22 33 73 -61 303 481 -14 -434 -121 -108 56 -15 77 -208 -3 148 -43 19 -287 23 -48 103
6799 103 63 -188 98 227 -7 -287 -217 170 187 -1 118 351 -27 -176 -339 -263 -142 -149 -138 114 129 409 -29
6822 -29 -8 -130 65 -126 -16 95 -108 -87 -91 -474 -283 -147 229 238 -53 112 -271 -128 -177 90 35 83 175 -185
$$ packed form
6662b52J87K46l3k12L53k73j25L8l8k51K92j20M61l53No5kj44O6K47l0J99k74
6685g8K73j31J04k12j39K04N2Q4k48J74mk41K5J97%m7o4J53K38r03M84j39K66
6708D8%K37l98K27J01j09r1j65rO1LJ2LL70m10J27k71L08j9j23L59l90K41k79
6732a67J27J98n9o5p5R8J45j09J82j92l20L5J29L22o07M20j44l8j34J92J53m3
6754D8j16L13j90l48q7L90l79L23lR0K15l22J43j47r9o2K47N7n0k32N1K37l05
6777b26K04N5M0j34L64J78m95m20L13J3J64p1R2k85K05J51j91O2l06L10p1J51
6799A03m0k51K86J29k34k80P0L87J7j88J19K33l78j49j63P6J21pJ1K52J5K80m38
6822b9K1j22J95j91J10J11k03K1ml83J91J36L76Rk91J65l83J43m9K67n5M8R2l60
$$ plain form
6846 -185 257 -336 -57 -182 174 56 120 171 350 151 -50 -96 -223 -92 112 -244 100 378 -142 -78 -160 -205
6868 -205 -340 -58 -58 -155 59 143 -39 64 -68 162 -56 -8 198 -115 -158 -343 89 -20 126 57 134 260 100
6891 100 -97 166 -225 218 -187 -363 -75 -234 128 -36 83 -229 74 -100 -56 -39 -64 -24 239 111 -124
6912 -124 154 -59 5 126 -63 2 -11 -21 -177 -12 -164 119 -29 -37 -203 -122 36 -129 -213 134 93 -204 257
6935 257 277 -85 -101 -124 104 -69 46 -110 149 -120 -126 -285 -329 8 -149 -116 -106 117 143 -57 -81 -271 -112
6958 -112 219 -4 46 -134 -152 393 -91 196 0 -67 -16 270 -171 -138 38 -65 -200 -121 -92 -16 16 192 101
6981 101 36 -148 -14 40 -159 -22 36 141 289 -52 43 -61 -13 96 -31 219 48 -128 53 -107 -57 -196
7003 -196 15 48 -35 38 111 86 -258 238 -174 -204 76 -13 182 -45 -5 -107 -80 9 -71 168 111 23 38 234 -245
$$ packed form
6846a85M42n93K79j25L56j18O4N1J79j99k01m6j27J31K04l56L44K78n20O4q2m5
6868b05j35K82%r7K14Q4j82J03j32K30k18M8K06l13m3j85M32j09J46o9P7J26j60
6891A00j97K63l91M43m05j76K88j59L62j64J19l12L03j74M4J7k5M0K63j28k35
6912a24K78k13O4J21j89O5j3j0j56J65j52K83j48qj66Q1J58j65q4L47m1k97M61
6935B57K0l62j6k3K28j73J15j56K59k69oj59m4L37j57L3J0K23K6k00k4j90J59
6958a12L31k23N0j80j8N45m84K87j96o7N1K86m41L3J76j03j35P9K9P6L2J76r1
6981A01o5j84J34N4j99J37N8J05J48l41R5j04M8J09j27K50j71j76J81j60N0j39
7003a96K11L3q3P3P3k5l44M96m12l0K80q9J95k27M0j02K7Q9q0K39n7q8J5J96m79
$$ plain form
7028 -245 170 -59 -78 -156 -73 121 238 115 264 80 235 155 84 -343 -154 -112 -189 135 54 -8 -154 151 -188
7051 -188 -223 148 48 71 -79 62 -35 -35 147 283 28 239 219 -193 -222 -64 -149 76 20 28 102 244 107 131
7075 131 167 -51 -284 -147 177 48 -79 141 2 -20 -47 -54 -65 67 53 69 163 -141 19 69 102 214 -19 108
7099 108 56 76 -169 -91 61 -97 0 -42 368 -24 -217 -67 -73 65 -175 -115 232 66 229 -86 81 -388 -307
7122 -307 -5 -88 -162 346 -96 88 -233 -14 114 -134 52 169 126 -246 -107 -194 -180 186 -208 -45 -314 232
7144 232 92 98 -36 -165 23 15 -30 -112 145 -5 -46 170 -208 -26 -135 -169 198 295 -6 114 54 -246 52
7167 52 -3 145 5 -69 106 -77 -121 231 -225 -96 106 14 226 382 155 201 75 -76 -202 132 -153 94
7189 94 -5 -12 104 -93 -133 -233 -118 275 115 461 195 104 -84 -121 39 -100 267 -120 -36 337 -182 134 -113
$$ packed form
7028b45M15k29j9p8Q3J94J17j23J49j84J55q0p1m27J89M2p7L24q1o2j46L05l39
7051a88l5L71j00K3j50J41r7%J82J36k55K11k0m12k9J58q5K25n6QP4J42j37K4
7075A31L6k18k33J37L24j29j27K20j39k2k7pj1J32j4J6R4l04J60N0L3J12k33J27
7099A08n2K0k45P8J52j58R7m2M10l92j93J50oJ38k40O0L47j66J63l15J67m69Q1
7122c07L02q3p4N08m42J84l21K19J28k48J86J17m3l72J39q7J4L66l94J63k69N46
7144B32j40Oj34j29J88qm5q2K57j50m1K16l78J82j09l4L67R7l01J20o0l00K98
7167E2n5J48j40p4J75j83m4L52m56J29K02r2K12J56k27M6j26j51j26L34k85K47
7189I4r9pJ16j97m0j00J15L93j60L46k66r1j88l7J60j39L67l87Q4L73n19L16k47
$$ plain form
7212 -113 64 19 2 -201 -60 -106 134 72 24 -202 -39 -16 -39 16 519 357 100 -52 -194 -142 126 299 278
7235 278 -3 -196 101 97 149 133 -94 78 69 -239 -154 131 -17 -78 101 -48 103 -298 224 68 248 -58 -97
7258 -97 -51 116 303 -51 -282 -272 135 -121 31 110 -65 -90 -41 -20 234 74 -265 -47 -61 -23 40 10 -189 -62
7282 -62 302 24 22 -350 205 44 336 -206 -97 -91 -14 90 -15 -109 -77 100 233 -106 -42 34 -221 -42 251
7305 251 144 69 119 102 -166 -99 -97 16 131 50 11 150 -40 -314 45 -106 41 -145 -14 348 284 26 -62
7328 -62 29 -2 6 30 -38 -127 29 233 105 -2 -78 152 -20 20 13 -139 134 252 -46 57 -5 175 262 -187 -313
7353 -313 -18 -59 -9 266 -107 -66 86 -43 -116 363 -34 218 26 -173 -322 -4 193 183 273 224 119 -77
7375 -77 -80 471 -52 97 42 318 32 -42 -76 74 -119 -116 202 366 -220 102 -339 -184 -3 39 -279 127 -91
$$ packed form
7212a13J77m5j7k03J41m6K40o2m8k26J63K3k3N5N03j62k57j52j42N2K68J73k1
7235B78k81j93K97mN2j6k27J72rl08Q5K85j48o1J79j49J51m01N22j56J80l06l9
7258i7M6J67J87l54k31J0M07k56J52P9j75k5M9K1K54j60l39K18j4L8O3l0j99J27
7282f2L64k78kl72N55j61K92n42J09OP7J04j05r4L2J77J33l39O4P6k55J79K93
7305B51j07p5N0j7k68O7KJ13J15q1l9J39j90k74L59j51J47j86J31L62o4k58q8
7328f2R1l1QK4o8q9J56K04j28j07p6K30j72M0pj52K73J18k98J03o2J80Q7m49j26
7353c13K95m1N0K75l73M1J52j29p3M79l97K52j92j99j49L18J97j0R0m9j05j96
7375g7lN51n23J49n5K76k86p4l4J50j93LL18J64n86L22m41J55J81M2l18M06k18
$$ plain form
7398 -91 180 233 -167 22 -207 -90 -98 -70 -75 -67 -121 43 -138 45 217 28 -101 -19 -61 -96 64 -135 -37 -15 123
7423 123 -144 260 -36 156 -393 -102 260 1 -163 -119 278 -129 -38 35 169 -141 -4 -147 18 64 -45
7444 -45 180 -128 100 -110 45 33 52 191 -194 -121 232 345 -126 -180 -95 -40 64 232 -220 26 174 -206
7466 -206 -181 -155 -76 235 143 140 -160 -6 244 -52 185 -7 -167 44 -84 -26 22 -114 271 -102 23 112 55
7489 55 56 163 46 -319 136 -235 -35 -119 -308 138 92 6 444 -131 48 16 88 241 244 -35 -103 132 109 -268
7513 -268 -32 -13 110 58 -94 281 -51 -67 37 45 -142 135 -6 -265 184 -216 218 -263 148 88 -285 249
7535 249 -23 -127 -107 28 -89 72 169 -75 72 -98 -86 154 1 17 468 37 -172 -299 68 -250 81
7556 81 -13 -238 132 39 35 -209 -262 -17 -44 25 -232 -170 -87 103 -208 -16 -97 -70 -138 -145 74 -140 203 50 -86
$$ packed form
7398i1K71N3m00J89k29J17qK8nQn4J64j81J83J72j89j29Q2m2l5J60j99R8K2J38
7423A23k67M04k96J92n49K91L62k59j64M4L97m07R1P3J34l10J37j43J65M6j09
7444d5K25l08K28k10J55j2J9J39l85P3L53J13m71n4Q5N5J04J68m52K46J48l80
7466b06K5K6P9L11r2ll00J54K50k96K37j92j60K11j28N8M8j36L85l73J25Q9n7
7489E5JJ07j17l65M55l71K00q4j89M46m6q6M38n75J79l2P2J53Lk79o8K35k3l77
7513b68K36J9J23n2j52L75l32j6J04Qj87K77j41k59M49m00M34m81M11o0l73N34
7535B49k72j04K0J35j17J61R7k44J47j70J2K40j53J6M51m31k09j27L67l18L31
7556H1r4k25L70r3mk44n3K45k7O9k57O2Q3J90l11J92q1K7o8pK19k14L43j53j36
$$ plain form
7581 -86 -96 -289 -40 120 3 348 -250 -51 26 -5 -11 -193 316 -93 -221 231 -160 14 -37 -181 -294 -435
7603 -435 127 44 3 27 -150 -10 29 -68 -277 -119 -58 14 257 48 170 133 -132 199 -67 227 -135 -124 142
7626 142 -308 254 -125 80 -55 -174 27 238 68 36 -48 -74 -30 -193 105 184 24 -276 -69 -39 -351 -188
7648 -188 -118 85 -263 -29 0 -15 -13 -52 198 80 8 83 85 0 -186 197 220 45 197 -103 234 -161 169 -54
7672 -54 176 -169 -267 -54 218 179 245 -71 -80 -156 -78 254 -258 147 407 -149 -115 71 -11 91 173 176 0 -80 -6
7697 -6 -105 -84 -212 -81 -175 -18 -118 209 38 273 -81 -162 -104 -288 -109 103 49 125 -340 -253 -163 35 208 14
7721 14 58 -107 -157 -79 53 47 226 101 -172 -41 -60 152 54 -3 113 93 34 -49 -223 100 206 21 -162 402
7745 402 150 53 164 147 68 134 240 -113 9 -11 -33 35 231 -215 -97 31 92 -13 -176 -101 142 178 49
$$ packed form
7581h6j0j93K49J60j17L45n98J99P7l1oj82N09m09j28M52l91J74n1j44j13j41
7603d35N62q3m1K4j77J40L9r7k09J58O1P2K43k09J22l7k65L31k66K94l62J1K66
7626A42m50N62l79K05j35j19K01K11j70l2q4k6M4j63K98P9j60l00K07L0l12J63
7648a88P0K03l48K34K9j5Kl9K50j18p2P5Kq5j86L83K3j75J52l00L37l95L30k23
7672e4K30l45r8K13K72l9O6l16rp6P8L32n12M05K60n56L4J86q2J02Q2Lj76q0P4
7697fr9K1j28J31r4J57j00L27j71K35l54q1N8j84J79K12n4P6m65Q7R0J98J73j94
7721A4M4j65n0P8J32oJ79j25k73J31j9K12r8n7J16k0n9q3j74L23J06j85j83N64
7745D02k52r7J11j7p9O6J06l53J22k0k2O8J96m46J18J28O1j05j63P5K43L6j29
$$ plain form
7768 49 38 383 237 226 -60 174 -213 63 256 -184 -220 -32 26 -325 -46 -57 177 480 288 -32 -53 217
7790 217 -304 45 162 57 -81 -14 177 179 -26 90 96 80 -20 -65 -123 -221 203 -113 107 -231 -424 193 138
7813 138 83 -3 -189 29 -90 43 -30 -126 -125 -191 -205 161 -22 -168 156 -169 -33 56 24 49 244 -60 -89 252
7837 252 15 10 -276 33 57 7 -154 7 -25 -160 290 16 213 -184 22 -65 212 123 -7 16 -76 100 23
7860 23 17 -9 431 53 -154 107 -169 84 -231 -135 -178 -122 -114 234 -18 155 93 87 156 94 52 -62 -174 159 -90
7885 -90 -116 19 -143 -21 105 -79 -34 60 -223 142 97 -285 67 2 50 189 136 28 182 350 345 74 -206
7908 -206 213 -84 272 124 -86 145 10 -53 -200 -1 -390 84 -14 29 22 207 -330 -216 -10 -1 59 107 -127
7931 -127 206 55 -51 -101 -23 0 -141 -44 17 252 84 73 59 -190 -213 64 -194 -14 308 2 -5 -256 -67
$$ packed form
7768D9j1L45j46j1k86K34l87K76J93m40l6J88N8l51K79j1K34L03j92l20k1K70
7790B17n21L49J17j05j38O7J91Kk05J16Oj6j00m5n8r8M24l16K20l38j93O17n5
7813A38n5q6j86K18j19J33p3r6Jo6j4L66j83j46L24l25J36Q9l2K5J95l04k9L41
7837B52k37nk86L09K4n0j61J61l2j35M50k74J97l97K06q7K77q9j30K3r2J76p7
7860B3ok6M40l78k07K61k76K53l15R6m3N6QL48k52J73o2oO9o2m2j14j12L33k49
7885i0k6J35j62J22J26j84M5R4k83L65m5l82L52o5M8J39n3j08J54J68nk71k80
7908b06M19k97L56j48k10K31j35o3j47J99l89M74r8M3pJ85n37J14K06RO0M8k34
7931a27L33j51j06n0P8K3j41R7O1K35j68j1j4k49k3K77k58J80L22l06pk51J89
$$ plain form
7954 -67 48 340 199 -135 4 -56 33 -263 -51 6 -15 53 -50 119 -191 -143 -70 -22 -24 290 298 -188 -43 -103 100
7979 100 3 215 -36 -157 279 153 343 163 -80 -69 48 27 -102 34 1 196 10 -120 -11 281 195 -97
8001 -97 -141 43 -19 48 234 -37 -70 4 -104 210 -180 -117 -39 16 17 -56 204 -355 266 243 123 69 46 64 -24 94
8027 94 186 -92 -300 181 -12 -151 -231 8 -186 53 -108 183 114 192 135 -86 -69 30 111 160 -146 -52 52 -111
8051 -111 156 108 -76 53 -38 62 240 98 64 -156 -4 239 88 -14 121 110 -86 19 561 86 -51
8072 -51 -20 108 295 100 230 -125 279 215 55 276 1 280 151 104 8 40 -37 -33 -126 -48 121 -42 21 21 -75
8097 -75 -24 81 -110 124 151 -58 -3 70 0 -240 -186 18 118 -71 -13 1 99 238 15 106 -442 241 123 -231
8121 -231 6 -302 166 76 75 202 239 74 -100 -126 -27 -160 67 -17 -341 -88 87 107 216 -27 -13 263 -53
$$ packed form
7954f7J15K92j41l34J39o0Q9k96K12N7k1O8j03J69l10M8P3M8kL14Qm86J45o0K03
7979A00r7K12k51j21M36j26J90j80k43J1J17k1j29J36l3J95j86j30J09K92q6k92
8001i7m4J84o2O7J86k71l3P4j08L14l90O3P8N5Jp3K60n59O21k3j20n4k3J8q8J18
8027I4R2k78k08M81j93j39q0K39j94K39j61K91o9P8n7k21J7R9Q1M9l06R4J04j63
8051a11K67m8j84J29r1J00J78j42l4k20J52K43j51j02J35j1j96J05N42m75j37
8072e1L1J28J87j95J30l55M04o4j60K21k75K79j29m7r6L2p7Mr3P8J69j63O3%r6
8097g5N1J05j91K34K7k09N5P3p0k40N4K04J00j89N8J4R8J39k23R1n48O83j18l54
8121b31K37l08M68r0jJ27L7j65j74k6R9j33K27q4l24K53J75K0J09k43J4K76l16
$$ plain form
8144 -53 81 -263 37 196 57 55 7 -242 10 14 109 -93 -65 425 2 31 -74 -70 -10 75 -73 155 68 282 67
8169 67 -174 -240 -6 -55 -147 271 -114 296 119 13 -140 -180 139 169 173 56 -77 -44 -109 -235 63 45
$$ packed form
8144e3J34l44L00J59j39km8k49K52MR5k02K8M90m23K9j05MO0Q5j48K28q7K14k15
8169F7k41o6K34m9r2M18l85M10j77j06j53m0L19L0Mj17j33L3o5j26K98j8
8191D5
$$ Imaginary data points
##PAGE= N=2
##DATA TABLE= (X++(I..I)), XYDATA
$$ plain form
0 0 0 0 0 -8 8 -8 8 -16 24 -24 32 -40 49 -64 76 -88 112 -130 153 -181 210 -248 286 -326 377 -431 492
27 492 -560 631 -717 806 -904 1012 -1132 1264 -1406 1563 -1739 1925 -2136 2364 -2615 2899
43 2899 -3209 3553 -3944 4385 -4888 5463 -6136 6936 -7892 9078 -10574 12544 -15266
56 -15266 19273 -25802 38229 -70363 323681 635502 -142111 -232020 34382 -69975 -436508
67 -436508 -210640 205517 267187 164760 245506 110555 -234323 -331802 -149884 -119863 -57849
78 -57849 259419 425770 136310 -95627 -58490 -174455 -409108 -183488 274176 267728 12568
89 12568 143934 301229 -73307 -478354 -299830 21739 36084 109437 369296 279654 -133117
100 -133117 -221945 -36011 -145372 -335640 -48930 377787 325937 48020 8026 -8117 -219238
$$ packed form
0@%%%qJ6j6J6k4M0m8N6p2Q9j13J40j64K00k42K83l34L91m58N34o12P03q08R23
27D92j052J191j348J523j710J916k144K396k670K969l302L664m061M500m979N514
43B899o108O762p497Q329r273J0351j1599J3072j4828J6970j9652K3118k7810
56a5266L4539m5075O4031j08592L94044L11821p77613q9909K66402j04357l66533
67d36508K25868M16157O1670j02427Q0746j34951l44878r7479J81918L0021O2014
78e7849L17268J66351k89460k31937L7137j15965k34653K25620M57664o448k55160
89A2568J31366J57295l74536m05047J78524L21569J4345P3353K59859q9642m12771
100a33117q8828J85934j09361j90268K86710M26717n1850k77917l9994j6143k11121
$$ plain form
111 -219238 -303892 -125621 31381 136521 316563 302084 -50777 -266904 -110020 -56833
121 -56833 -244982 -139582 281211 363606 68182 -15772 66587 -162224 -431560 -191998 223421
132 223421 223319 54887 142382 199493 -62645 -291958 -222337 -97108 -24520 146708 279519
143 279519 159660 286 -6410 -99273 -320853 -262501 101307 265328 132120 94380 149675
154 149675 -20752 -259145 -212419 -53605 -49903 17479 269938 317593 24020 -176520 -117639
165 -117639 -121902 -216276 -77607 203674 244758 103792 65292 29468 -163293 -277614 -133731
176 -133731 36697 78625 144833 230543 131759 -83463 -175057 -168405 -170104 -63851 161331
187 161331 235231 102206 35217 57728 -78572 -283766 -219815 38971 144952 113175 156085
$$ packed form
111b19238q4654J78271J57002J05140J80042j4479l52861k16127J56884N3187
121e6833j88149J05400M20793Q2395k95424q3954Q2359k28811k69336K39562M15419
132B23421j02j68432Q7495N7111k62138k29313O9621J25229P2588J71228J32811
143B79519j19859j59374o696r2863k21580N8352L63808J64021j33208l7740N5295
154A49675j70427k38393M6726J58814L702O7382K52459M7655k93573k00540N8881
165a17639m263r4374J38669K81281M1084j40966l8500l5824j92761j14321J43883
176a33731J70428M1928O6208Q5710r8784k15222r1594O652j699J06253K25182
187A61331P3900j33025o6989K2511j36300k05194O3951K58786J05981l1777M2910
$$ plain form
198 156085 167803 -16816 -205238 -189826 -99053 -56003 45834 199533 208297 69036 -35395
209 -35395 -91600 -177624 -192903 -48281 108024 151598 157849 142895 6266 -174291 -199930
220 -199930 -100629 -38534 19833 151731 220238 108274 -42219 -100050 -140940 -182268 -95144
231 -95144 94180 185032 141028 90142 34250 -95420 -203558 -160977 -34838 55679 121377
242 121377 173160 133432 1984 -109404 -152296 -154416 -90108 51051 162932 160785 97866
253 97866 27190 -76994 -178227 -167386 -51279 51726 107995 153642 145816 30757 -109449
264 -109449 -161110 -132542 -76943 14893 129951 178321 117885 12884 -76031 -139732 -154401
275 -154401 -88758 27206 121946 157347 125538 33288 -77916 -145079 -143728 -86836 10765 115989
$$ packed form
198A56085J1718j84619j88422J5412R0773M3050J01837J53699Q764j39261j04431
209c5395n6205q6024j5279J44622J56305M3574O251j4954j36629j80557k5639
220a99930R9301O2095N8367J31898O8507j11964j50493n7831m0890m1328Q7124
231i5144J89324R0852m4004n0886n5892j29670j08138M2581J26139R0517O5698
242A21377N1783l9728j31448j11388m2892k120O4308J41159J11881k147o2919
253I7866p0676j04184j01233J0841J16107J03005N6269M5647p826j15059j40206
264a09449n1661K8568N5599R1836J15058M8370o0436j05001q8915o3701j4669
275a54401O5643J15964R4740L5401l1809r2250j11204o7163J351N6892R7601J05224
$$ plain form
287 115989 165050 123112 27400 -65674 -130978 -148817 -95038 13074 112316 151413 121816 42414
299 42414 -55994 -134321 -151817 -93792 11237 105298 143745 120234 51099 -46435 -133380 -153283
311 -153283 -90306 8751 91949 138423 130582 55073 -52674 -126575 -138220 -95957 -10065 91443
323 91443 146884 123096 49261 -37771 -115717 -147155 -99298 -2268 81812 129288 131111 66365
335 66365 -44035 -122776 -128947 -91186 -26133 70475 146259 132074 46545 -34882 -95014 -136014
347 -136014 -114650 -16347 84896 124422 114853 72009 -17714 -113753 -139936 -90633 -20178 54991
359 54991 126113 136692 62887 -32297 -91617 -121784 -112730 -33862 73654 125076 109689 68870
371 68870 -879 -97110 -144648 -98107 -15231 48417 103591 133361 82370 -24262 -96756 -111813
$$ packed form
287A15989M9061m1938r5712r3074o5304j7839N3779J08112R9242L9097k9597p9402
299D2414r8408p8327j7496N8025J05029R4061L8447k3511o9135r7534q6945j9903
311a53283O2977R9057Q3198M6474p841p5509j07747p3901j1645M2263Q5892J01508
323I1443N5441k3788p3835q7032p7946l1438M7857R7030Q4080M7476J823o4746
335F6365j10400p8741o171L7761O5053R6608P5784j4185q5529q1427o0132m1000
347a36014K1364R8303J01243L9526r569m2844q9723r6039k6183M9303P0455P5169
359E4991P1122J0579p3805r5184n9320l0167R054P8868J07516N1422j5387m0819
371F8870o9749r6231m7538M6541Q2876O3648N5174K9770n0991j06632p2494j5057
$$ plain form
383 -111813 -100349 -49480 51037 128109 119403 60622 -1747 -73337 -131645 -112718 -26477 51896
395 51896 95656 118327 89641 -5035 -93785 -114119 -90989 -50226 28757 116582 130092 65175
407 65175 -7220 -62115 -112401 -118289 -43944 50531 96361 103733 86650 17895 -80239 -124082
419 -124082 -93016 -39402 19045 91566 130038 83057 -4899 -65244 -97870 -107796 -60163 33748
431 33748 99915 104294 76630 25423 -57809 -120674 -105948 -39664 22691 76444 115270 93815
443 93815 10253 -66386 -96600 -96045 -62905 14992 93014 110721 74119 21665 -42161 -104707
455 -104707 -113190 -52512 24202 75122 101535 91129 26790 -57105 -99030 -91918 -57769 1792
467 1792 75458 114046 86354 20036 -45049 -91211 -101827 -60701 9919 69981 99550 90552
$$ packed form
383a11813J1464N0869J00517P7072q706n8781o2369p1590n8308J8927Q6241P8373
395E1896M3760K2671k8686r4676q8750k0334K3130M0763P8983Q7825J3510o4917
407F5175p2395n4895n0286n888P4345R4475M5830P372j7083o8755r8134m3843
419a24082L1066N3614N8447P2521L8472m6981q7956o0345l2626r926M7633R3911
431C3748O6167M379k7664n1207q3232o2865J4726O6284O2355N3753L8826k1455
443I3815q3562p6639l0214N55L3140P7897P8022J7707l6602n2454o3826o2546
455a04707q483O0678P6714N0920K6413j0406o4339q3895m1925P112L4149N9561
467A792P3666L8588k7692o6318o5085m6162j0616M1126P0620O0062K9569q998
$$ plain form
479 90552 34404 -47301 -98826 -92569 -52486 -1283 57676 103341 95674 32454 -43203 -90376
491 -90376 -95873 -61376 996 63918 96582 85718 36648 -31615 -85799 -98715 -64998 -2040
503 -2040 61275 96212 85634 35104 -28961 -78717 -94226 -68803 -9610 57214 97905 89295
515 89295 34888 -31212 -75338 -86870 -67606 -17615 48992 96670 92817 40176 -28189 -78089
527 -78089 -88671 -60386 -13074 38418 84023 97817 53136 -28082 -82831 -84543 -57906 -19496
539 -19496 35838 87112 91615 45230 -15938 -65146 -90935 -74911 -16609 46018 80810 82424
551 82424 50088 -10876 -67238 -84465 -67052 -29177 31809 91208 93867 36752 -19928 -47388
563 -47388 -70877 -83218 -40550 40776 90527 82298 45281 -3786 -58900 -85225 -64308 -24010
$$ packed form
479I0552n6148q1705n1525O257M0083N1203N8959M5665p667o3220p5657m7173
491i0376n497L4497O2372O2922L2664j0864m9070o8263n4184j2916L3717O2958
503b040O3315L4937j0578n0530o4065m9756j5509K5423N9193O6824M0691q610
515H9295n4407o6100m4126j1532J9264M9991O6607M7678l853n2641o8365m9900
527g8089j0582K8285M7312N1492M5605J3794m4681q1218n4749j712K6637L8410
539a9496N5334N1274M503m6385o1168m9208k5789J6024N8302O2627L4792J614
551H2424l2336o0964n6362j7227J7413L7875O0986N9399K659n7115n6680k7460
563d7388k3489j2341M2668Q1326M9751q229l7017m9067n5114k6325K0917M0298
$$ plain form
575 -24010 17859 67849 97200 61691 -13141 -60999 -71632 -69098 -39687 26314 80281 79816 48205
588 48205 9420 -45772 -91654 -77069 -18143 27748 53023 78336 70071 6922 -58071 -74623
600 -74623 -65162 -45691 11685 82546 92128 40001 -4366 -28657 -64020 -85069 -45031 25104
612 25104 65227 74147 62166 15038 -48552 -76045 -62104 -40118 -911 64350 96824 54497
624 54497 -6439 -32413 -53325 -79063 -55234 19552 66913 63542 54536 34901 -28648 -89974
636 -89974 -79544 -25074 12823 41728 75383 70507 14013 -39243 -58611 -65869 -54026 481
648 481 61044 74001 53662 27180 -19140 -75526 -82505 -33633 11754 36443 66614 76087 25155
661 25155 -41620 -60666 -52741 -50514 -20538 49187 87927 59055 14120 -15774 -52719 -82241
$$ packed form
575b4010M1869M9990K9351l5509p4832m7858j0633K534K9411O6001N3967m65l1611
588D8205l8785n5192m5882J4585N8926M5891K5275K5313q265o3149o4993j6552
600g4623R461J9471N7376P0861R582n2127m4367k4291l5363k1049M0038P0135
612B5104M0123Q920j1981m7128o3590k7493J3941K1986L9207O5261L2474m2327
624E4497o0936k5974k0912k5738K3829P4786M7361l371r006j9635o3549o1326
636h9974J0430N4470L7897K8905L3655m876n6494n3256j9368p258J1843N4507
648D81O0563J2957k0339k6482m6320n6386o979M8872M5387K4689L0171R473n0932
661B5155o6775j9046P925K227K9976O9725L8740k8872m4935k9894l6945k9522
$$ plain form
673 -82241 -53991 10682 48215 56391 59383 38126 -20070 -64348 -63702 -44731 -17341 34683 80761
686 80761 69568 18897 -19796 -46321 -70361 -58701 -2355 45025 55176 56509 45668 -7640
698 -7640 -68332 -71594 -33783 -10092 13220 62228 86148 38788 -30136 -57213 -54528 -47700 -19505
711 -19505 30912 62939 59393 36609 -1286 -49335 -72154 -51434 -12635 23693 58804 73040
723 73040 37735 -18706 -46192 -50078 -53649 -34112 26361 74505 62751 22246 -4283 -28400
735 -28400 -60346 -64764 -25231 27357 59044 65804 42427 -7725 -49895 -56556 -42004 -23699 8166
748 8166 51368 71505 46200 -2806 -43238 -60722 -51635 -20935 16153 46705 62863 49835
760 49835 4120 -44578 -60861 -47211 -23819 9322 48944 66347 42159 119 -30283 -49025
$$ packed form
673h2241K8250O4673L7533Q176K992k1257n8196m4278O46J8971K7390N2024M6078
686H0761j1193n0671l8693k6525k4040J1660N6346M7380J0151J333j0841n3308
698g640o0692l262L7811K3691K3312M9008K3920m7360o8924k7077K685O828K8195
711a9505N0417L2027l546k2784l7895m8049k2819K0720L8799L6328L5111J4236
723G3040l5305n6441k7486l886l571J9537O0473M8144j1754m0505k6529k4117
735b8400l1946m418L9533N2588L1687O760k3377n0152m2170o661J4552J8305L1865
748H166M3202K0137k5305m9006m0432j7484R087L0700L7088L0552J6158j3028
760D9835m5715m8698j6283J3650K3392L3141L9622J7403k4188m2040l0402j8742
$$ plain form
772 -49025 -58807 -39764 13336 61878 66027 32215 -3349 -24187 -41314 -55231 -43756 5105
784 5105 57854 68538 37243 -36 -24555 -44226 -55991 -38953 6145 48691 62831 44588
796 44588 8235 -28935 -50925 -51465 -31582 3520 39722 57698 46899 16861 -21599 -54881
808 -54881 -60705 -30901 12129 38923 48278 45615 21824 -20165 -52338 -54543 -34953 -1701 39677
821 39677 62265 44468 7696 -16585 -34849 -55506 -49999 -2494 47415 58695 39683 13831
833 13831 -14167 -41468 -50984 -38360 -10063 30568 62350 53362 11157 -21419 -33698 -47552
845 -47552 -48675 -8862 42133 52917 35980 23915 1058 -44382 -66636 -35455 7440 24761
857 24761 37763 52476 33698 -14588 -45609 -46970 -39309 -14323 30570 56304 40373 16447
$$ packed form
772d9025r782J9043N3100M8542M149l3812l5564k0838j7127j3917J1475M8861
784E105N2749J0684l1295l7279k4519j9671j1765J7038M5098M2546J4140j8243
796D4588l6353l7170k1990n40J9883L5102L6202J7976j0799l0038l8460l3282
808e4881n824K9804M3030K6794R355k663k3791m1989l2173k205J9590L3252M1378
821C9677K2588j7797l6772k4281j8264k0657N507M7505M9909J1280j9012k5852
833A3831k7998k7301r516J2624K8297M0631L1782q988m2205l2576j2279j3854
845d7552j123L9813N0995J0784j6937j2065k2857m5440k2254L1181M2895J7321
857B4761J3002J4713j8778m8286l1021j361P661K4986M4893K5734j5931k3926
$$ plain form
869 16447 1795 -29144 -61782 -48576 199 30184 37223 45744 36808 -8282 -46239 -44331 -31131
882 -31131 -21867 12644 57823 57322 14694 -11345 -20932 -44959 -55073 -15391 33257 41993 35421
895 35421 34569 8438 -40989 -57689 -31648 -8745 6958 39157 59348 30295 -11899 -26902
907 -26902 -36642 -50096 -26390 27638 49564 32612 24918 17301 -25206 -62833 -43414 -2421 11612
920 11612 24811 52342 45626 -5341 -38664 -34192 -34201 -31988 7937 51987 46692 18903 7903 -11775
934 -11775 -50433 -54502 -11465 19583 24278 39006 48510 9430 -39630 -42679 -25688 -26004 -7590
947 -7590 42379 59374 23782 -4983 -8648 -31363 -57010 -30797 21132 36373 29772 36613 23498
960 23498 -25758 -53739 -33015 -12767 -6983 22379 57211 41054 -3660 -19919 -23479 -44030
$$ packed form
869A6447j4652l0939l2638J3206M8775K9985P039Q521q936m5090l7957J908J3200
882c1131R264L4511M5179n01m2628k6039r587k4027j0114L9682M8648Q736o572
895C5421q52k6131m9427j6700K6041K2903J5703L2199K0191k9053m2194j5003
907b6902r740j3454K3706N4028K1926j6952p694p617m2507l7627J9419M0993J4033
920A1612J3199K7531o716n0967l3323M472rK213L9925M4050n295k7789j1000j9678
934a1775l8658m069M3037L1048M695J4728R504l9080m9060l049J6991l16J8414
947g590M9969J6995l5592k8765l665k2715k5647K6213N1929J5241o601O841j3115
960B3498m9256k7981K0724K0248N784K9362L4832j6157m4714j6259l560k0551
$$ plain form
972 -44030 -41317 7996 44895 34366 23542 24040 -6703 -52276 -48900 -10380 5655 11617 40808
985 40808 51351 11074 -27709 -29154 -30048 -38623 -10439 39983 49087 22275 10345 934 -34410
998 -34410 -54855 -24511 10917 17440 27987 46901 26327 -23168 -39728 -26845 -26629 -19521 23195
1011 23195 55616 34509 2442 -4670 -19877 -48207 -39308 5529 28272 24887 32770 33415 -5367
1024 -5367 -44562 -38932 -18402 -11486 9781 45594 46089 8828 -13092 -17409 -34984 -43338 -8941
1037 -8941 30872 33116 24354 27291 7843 -36164 -49646 -22707 -1191 6928 30977 48828 22978
1050 22978 -16318 -25794 -24660 -34485 -21839 20053 42142 29559 17405 8717 -21528 -49090 -34791
1063 -34791 -526 13925 22831 39682 32727 -6185 -31864 -27495 -24733 -23528 6059 41567 39851
$$ packed form
972d4030K713M9313L6899j0529j0824M98l0743m5573L376L8520J6035N962K9191
985D0808J0543m0277l8783j445q94q575K8184N0422R104k6812j1930r411l5344
998c4410k0445L0344L5428O523J0547J8914k0574m9495j6560J2883K16P108M2716
1011B3195L2421k1107l2067p112j5207k8330Q899M4837K2743l385P883O45l8782
1024e367l9195N630K0530O916K1267L5813M95l7261k1920m317j7575q354L4397
1037h941L9813K244q762K937j9448m4007j3482K6939K1516Q119K4049J7851k5850
1050B2978l9296r476J134r825J2646M1892K2089j2583j2154q688l0245k7562J4299
1063c4791L4265J4451Q906J6851o955l8912k5679M369K762J205K9587L5508j716
$$ plain form
1076 39851 15102 1832 -12546 -38876 -42953 -9402 19957 24320 28682 32295 7395 -29416 -36748
1089 -36748 -22675 -15731 -1902 30365 45534 23943 -3120 -15863 -29548 -39504 -19429 15815
1101 15815 30102 26150 26092 14106 -19303 -40284 -29483 -11059 373 20263 42032 33019 -249
1114 -249 -20654 -26317 -31560 -24714 5786 32376 31878 20579 11141 -9085 -34692 -36939 -15628 4557
1128 4557 19851 34379 33966 8026 -20142 -28778 -27814 -22365 -1576 26546 35305 23295 8768
1141 8768 -6541 -28768 -38070 -20505 5180 19512 29196 32864 15364 -16799 -33156 -27527 -16789
1154 -16789 -4789 16809 35091 30535 9986 -9586 -24872 -33878 -24719 -40 20647 29007 28805
1167 28805 16589 -9248 -30642 -30736 -18249 -4441 13534 31451 31920 12699 -8402 -22114 -30918
$$ packed form
1076C9851k4749j3270j4378k6330m077L3551K9359M363M362L613k4900l6811p332
1089c6748J4073O944J3829L2267J5169k1591k7063j2743j3685r956K0075L5244
1101A5815J4287l952n8j1986l3409k0981J0801J8424J1432J9890K1769r013l3268
1114b49k0405n663n243O846L0500K6590m98j1299r438k0226k5607k247K1311K0185
1128D557J5294J4528m13k5940k8168q636R64N449K0789K8122Q759j2010j4527
1141H768j5309k2227r302J7565K5685J4332R684L668j7500l2163j6357N629J0738
1154a6789J2000K1598J8282m556k0549j9572j5286r006R159K4679K0687Q360k02
1167B8805j2216k5837k1394r4J2487J3808J7975J7917M69j9221k1101j3712q804
$$ plain form
1180 -30918 -27766 -5736 20618 31342 26207 14067 -3780 -23987 -32272 -22154 -4715 12555
1192 12555 27998 32629 17407 -7761 -24498 -28160 -23056 -8979 12573 29811 30697 17177 -4996
1205 -4996 -23703 -29478 -21274 -6835 8793 24057 32424 22326 -4112 -25689 -29501 -21062 -8146
1218 -8146 9030 26092 30797 18364 -1841 -19658 -28333 -25301 -11279 10209 26563 29736 17884
1231 17884 -859 -17428 -26776 -26336 -13597 8818 27686 30672 16783 -1947 -15836 -23699 -25120
1244 -25120 -15234 5132 25479 32520 20538 -1415 -18965 -24909 -21968 -12250 2641 20774 31180
1257 31180 23539 1939 -18816 -26515 -22492 -11447 2667 19230 29353 23590 4248 -16375 -26146
1270 -26146 -24378 -13868 3521 21397 28255 19752 3793 -11127 -21945 -27035 -19066 2792 24559
$$ packed form
1180c0918L152K2030K6354J0724n135j2140j7847k0207q285J0118J7439J7270
1192A2555J5443M631j5222k5168j6737l662N104J4077K1552J7238Q86j3520k2173
1205d996j8707n775Q204J4439J5628J5264Q367j0098k6438k1577l812Q439J2916
1218h146J7176J7062M705j2433k0205j7817q675L032J4022K1488J6354L173j1852
1231A7884j8743j6569r348M40J2739K2415J8868K986j3889j8730j3889p863j421
1244b5120R886K0366K0347P041j1982k1953j7550n944K941R718J4891J8133J0406
1257C1180p641k1600k0755p699M023J1045J4114J6563J0123n763j9342k0623r771
1270b6146J768J0510J7389J7876O858q503j5959j4920j0818n090P969K1858K1767
$$ plain form
1283 24559 30087 17681 1152 -9741 -18670 -25277 -20797 -800 23100 31071 19843 2131 -10712
1296 -10712 -19224 -23586 -18594 -1762 18490 28848 23413 6039 -11856 -22538 -22999 -15144 -1369
1309 -1369 14796 26119 24205 9979 -9138 -23142 -25563 -16654 -56 16168 24331 21378 9290
1322 9290 -6194 -19312 -25942 -20322 -2424 18251 26447 19678 6759 -4392 -15470 -24751 -23015
1335 -23015 -4977 17981 27921 20420 6236 -5537 -15028 -22123 -22023 -7064 14720 26848 22233
1348 22233 8966 -4947 -17046 -24491 -19299 -4304 12092 21623 22400 13678 -2758 -19099 -24952
1361 -24952 -18143 -4181 10821 20845 21898 13462 -643 -15913 -25647 -21567 -4603 12724 20516
1374 20516 19533 13001 728 -14799 -23898 -20291 -7532 9240 22557 23283 11485 -2570 -12387
$$ packed form
1283B4559N528j2406j6529j0893q929o607M480J9997K3900P971j1228j7712j2843
1296a0712q512m362M992J6832K0252J0358n435j7374j7895j0682m61P855J3775
1309a369J6165J1323j914j4226j9117j4004k421Q909J6598J6224Q163k953j2088
1322I290j5484j3118o630N620J7898K0675Q196o769j2919j1151j1078r281J736
1335b3015J8038K2958R940p501j4184j1773r491p095J00J4959K1784J2128m615
1348B2233j3267j3913j2099p445N192J4995J6396R531P77q722j6436j6341n853
1361b4952O809J3962J5002J0024J053q436j4105j5270r734M080J6964J7327P792
1374B0516r83o532j2273j5527r099L607J2759J6772J3317P26j1798j4055r817
$$ plain form
1387 -12387 -20006 -22136 -10963 10000 22753 20938 11740 1082 -12416 -22920 -20588 -7521 6728
1400 6728 17707 23170 16713 702 -14447 -20861 -19719 -10009 6915 19083 20405 13506 4483 -9774
$$ packed form
1387a2387p619k130J1173K0963J2753j815r198j0658j3498j0504K332J3067J4249
1400F728J0979N463o457j6011j5149o414J142R710J6924J2168J322o899r023j4257
$$ [...]
8191B99
##END NTUPLES=NMR FID
##END=
