##TITLE=1H_LR-673-R2-HCR2
 D2O, 8 sc, 
 18.12.2019
##JCAMPDX= 6.0         $$ Bruker NMR JCAMP-DX V2.0
##DATA TYPE= NMR FID
##DATA CLASS= NTUPLES
##ORIGIN= UXNMR, Bruker Analytische Messtechnik GmbH
##OWNER= root
$$ XWIN-NMR		Version 3.5
$$ Wed Dec 18 13:55:16 2019 Russian Standard Time (UT+4h)  she@DPX200
##.OBSERVE FREQUENCY= 200.1315
##.OBSERVE NUCLEUS= ^1H
##.DELAY= (6, 6)
##.ACQUISITION MODE= SIMULTANEOUS
##.ACQUISITION SCHEME= undefined
##.AVERAGES= 8
##.DIGITISER RES= 18
##SPECTROMETER/DATA SYSTEM= spect
##.PULSE SEQUENCE= zg30
##.SOLVENT NAME= D2O
##.SHIFT REFERENCE= (INTERNAL, D2O, 0, 15.7039)
##AUDIT TRAIL= $$ (NUMBER, WHEN, WHO, WHERE, WHAT)
$$ ##TITLE= Audit trail, XWIN-NMR		Version 3.5
$$ ##JCAMPDX= 5.01
$$ ##ORIGIN= Bruker BioSpin GmbH
$$ ##OWNER= she
$$ F:/spectra/data/she/nmr/H-F/1/audita.txt
$$ ##AUDIT TRAIL=  $$ (NUMBER, WHEN, WHO, WHERE, WHAT)
(   1,<2019-12-18 13:54:17.00 +0400>,<she>,<DPX200>,
      <created by zg, POWCHK disabled, PULCHK disabled
       configuration hash MD5:
       00 E9 B6 7A A2 85 ED C7 34 08 36 98 17 FE 4E 26
       data hash MD5: 16K
       5C 5D 7E 72 84 1D 3F 5E 63 03 EA 0D D1 DC 9C B9>)
$$ ##END=
$$ 
$$ hash MD5
$$ 0F BD 8E 91 BA 5E 50 93 F2 F4 37 3B 51 9B 60 1C
##$RELAX= 
##$RELAX= 
##$RELAX= 
##$RELAX= 
##$RELAX= 
##$RELAX= 
$$ Bruker specific parameters
$$ --------------------------
##$DU= <F:/spectra>
##$EXPNO= 1
##$NAME= <H-F>
##$PROCNO= 1
##$TYPE= <nmr>
##$USER= <she>
##$AMP= (0..31)
100 100 100 100 100 100 100 100 100 100 100 100 100 100 100 100 100 100 
100 100 100 100 100 100 100 100 100 100 100 100 100 100 
##$AQSEQ= 0
##$AQ_mod= 1
##$AUNM= <au_zg>
##$AUTOPOS= <>
##$BF1= 200.13
##$BF2= 200.13
##$BF3= 200.13
##$BF4= 200.13
##$BF5= 200.13
##$BF6= 200.13
##$BF7= 200.13
##$BF8= 200.13
##$BYTORDA= 1
##$CFDGTYP= 0
##$CFRGTYP= 5
##$CHEMSTR= <none>
##$CNST= (0..31)
1 1 145 1 1 1 1 1 1 1 1 1 1 1 1 1 1 1 1 1 1 1 1 1 1 1 1 1 1 1 1 1 
##$CPDPRG= <>
##$CPDPRG1= <>
##$CPDPRG2= <>
##$CPDPRG3= <>
##$CPDPRG4= <mlev>
##$CPDPRG5= <mlev>
##$CPDPRG6= <mlev>
##$CPDPRG7= <mlev>
##$CPDPRG8= <mlev>
##$CPDPRGB= <>
##$CPDPRGT= <>
##$D= (0..31)
0 1.2 0 0 0 0 0 0 0 0.06 0 0.03 0 0 0 0 0.0002 0 0 0 0 0 0 0 0 0 0 0 0 
0 0 0 
##$DATE= 1576662856
##$DBL= (0..7)
120 120 120 120 120 120 120 120 
##$DBP= (0..7)
150 150 150 150 150 150 150 150 
##$DBP07= 0
##$DBPNAM0= <>
##$DBPNAM1= <>
##$DBPNAM2= <>
##$DBPNAM3= <>
##$DBPNAM4= <>
##$DBPNAM5= <>
##$DBPNAM6= <>
##$DBPNAM7= <>
##$DBPOAL= (0..7)
0.5 0.5 0.5 0.5 0.5 0.5 0.5 0.5 
##$DBPOFFS= (0..7)
0 0 0 0 0 0 0 0 
##$DE= 6
##$DECBNUC= <off>
##$DECIM= 24
##$DECNUC= <off>
##$DECSTAT= 4
##$DIGMOD= 1
##$DIGTYP= 9
##$DL= (0..7)
0 120 120 120 120 120 120 120 
##$DP= (0..7)
150 150 150 150 150 150 150 150 
##$DP07= 0
##$DPNAME0= <>
##$DPNAME1= <>
##$DPNAME2= <>
##$DPNAME3= <>
##$DPNAME4= <>
##$DPNAME5= <>
##$DPNAME6= <>
##$DPNAME7= <>
##$DPOAL= (0..7)
0.5 0.5 0.5 0.5 0.5 0.5 0.5 0.5 
##$DPOFFS= (0..7)
0 0 0 0 0 0 0 0 
##$DQDMODE= 0
##$DR= 18
##$DS= 0
##$DSLIST= <SSSSSSSSSSSSSSS>
$$ [...]
##$SUBNAM2= <"">
##$SUBNAM3= <"">
##$SUBNAM4= <"">
##$SUBNAM5= <"">
##$SUBNAM6= <"">
##$SUBNAM7= <"">
##$SUBNAM8= <"">
##$SUBNAM9= <"">
##$SW= 24.9337058887773
##$SWIBOX= (0..15)
0 0 2 0 0 0 0 0 0 0 0 0 0 0 0 0 
##$SW_h= 4990.01996007984
##$TD= 16384
##$TD0= 1
##$TE= 0
##$TE2= 300
##$TE3= 300
##$TEG= 300
##$TL= (0..7)
0 120 120 120 120 120 120 120 
##$TP= (0..7)
150 150 150 150 150 150 150 150 
##$TP07= 0
##$TPNAME0= <>
##$TPNAME1= <>
##$TPNAME2= <>
##$TPNAME3= <>
##$TPNAME4= <>
##$TPNAME5= <>
##$TPNAME6= <>
##$TPNAME7= <>
##$TPOAL= (0..7)
0.5 0.5 0.5 0.5 0.5 0.5 0.5 0.5 
##$TPOFFS= (0..7)
0 0 0 0 0 0 0 0 
##$TUNHIN= 0
##$TUNHOUT= 0
##$TUNXOUT= 0
##$USERA1= <user>
##$USERA2= <user>
##$USERA3= <user>
##$USERA4= <user>
##$USERA5= <user>
##$V9= 5
##$VALIST= <valist>
##$VCLIST= <CCCCCCCCCCCCCCC>
##$VD= 0
##$VDLIST= <DDDDDDDDDDDDDDD>
##$VPLIST= <PPPPPPPPPPPPPPP>
##$VTLIST= <TTTTTTTTTTTTTTT>
##$WBST= 1024
##$WBSW= 4
##$XGAIN= (0..3)
0 0 0 0 
##$XL= 0
##$YL= 0
##$YMAX_a= 359501
##$YMIN_a= -249603
##$ZGOPTNS= <>
##$ZL1= 120
##$ZL2= 120
##$ZL3= 120
##$ZL4= 120
##$ABSF1= 10
##$ABSF2= 0
##$ABSG= 5
##$ABSL= 3
##$ALPHA= 0
##$AQORDER= 0
##$ASSFAC= 0
##$ASSFACI= 0
##$ASSFACX= 0
##$ASSWID= 0
##$AUNMP= <proc_1d>
##$AZFE= 0.1
##$AZFW= 0.1
##$BCFW= 1
##$BC_mod= 2
##$BYTORDP= 1
##$COROFFS= 0
##$CY= 11.3945322036743
##$DATMOD= 1
##$DC= 2
##$DFILT= <>
##$DTYPP= 0
##$F1P= 16.9975609425685
##$F2P= -3.02152046262296
##$FCOR= 0.5
##$FTSIZE= 0
##$FT_mod= 4
##$GAMMA= 1
##$GB= 0.15
##$INTBC= 1
##$INTSCL= 1
##$ISEN= 128
##$LB= 0.24
##$LEV0= 0
##$LPBIN= 0
##$MAXI= 10000
##$MC2= 0
##$MEAN= 0
##$ME_mod= 0
##$MI= 1.114404
##$NCOEF= 0
##$NC_proc= 0
##$NLEV= 6
##$NOISF1= 3.799351
##$NOISF2= 2.8
##$NSP= 1
##$NTH_PI= 0
##$NZP= 0
##$OFFSET= 15.70392
##$PC= 1
##$PHC0= -9785.714
##$PHC1= 7.40081
##$PH_mod= 1
##$PKNL= yes
##$PPARMOD= 0
##$PSCAL= 0
##$PSIGN= 0
##$REVERSE= no
##$SF= 200.130013532006
##$SI= 16384
##$SIGF1= 3
##$SIGF2= 2
##$SINO= 400
##$SIOLD= 16384
##$SREGLST= <1H.CDCl3>
##$SSB= 0
##$STSI= 0
##$STSR= 0
##$SW_p= 3612.71676300578
##$SYMM= 0
##$S_DEV= 0
##$TDeff= 0
##$TDoff= 0
##$TI= <>
##$TILT= no
##$TM1= 0
##$TM2= 0
##$TOPLEV= 0
##$USERP1= <user>
##$USERP2= <user>
##$USERP3= <user>
##$USERP4= <user>
##$USERP5= <user>
##$WDW= 1
##$XDIM= 8192
##$YMAX_p= 0
##$YMIN_p= 0
$$ End of Bruker specific parameters
$$ ---------------------------------
##NTUPLES= NMR FID
##VAR_NAME=  TIME,          FID/REAL,        FID/IMAG
##SYMBOL=    X,             R,               I
##VAR_TYPE=  INDEPENDENT,   DEPENDENT,       DEPENDENT
##VAR_FORM=  AFFN,          ASDF,            ASDF
##VAR_DIM=   8192,          8192,            8192
##UNITS=     SECONDS,       ARBITRARY UNITS, ARBITRARY UNITS
##FACTOR=    0.0002004,     1,               1
##FIRST=     0,             0,               0
##LAST=      1.6414764,     0,               0
##MIN=       0,             -249603,         0
##MAX=       1.6414764,     359501,          0
$$ Real data points
##PAGE= N=1
##DATA TABLE= (X++(R..R)), XYDATA
$$ [...]
2924a724M251L120P29k468m284m205j823J049L821M187L146N22k382m684l762
2939d507j893J163L734M000L257M27k865l985l886j631J190L215M924K560J95
2954E898k350l740m204j982J166L735M078K697Q50k480m133l772k048J309K993
2969a983M558K847P70k916l768l931j756Q63L509M561K711L44k445m089m127j032
2985e884J039L460L616L252N34k525m197l424j502N42L501M235K738K43k136l921
3001d29l371k220Q41L502M624K183O65k498m041l625j302O69L371M582K585K15
3017E751k476l731l252j976O58L497M034K784L21k268l934l813j695J388K784
3032a928M389L218J78k882l838l090j661N57L748M041K682n8k057l712l962j508
$$ y = [-1724, 2527, 5647, 6376, 3908, -376, -4581, -6404, -5355, -1534, 2653, 5799, 6321, 3939, -745, -4507, -6400, -5237, -1503, 2497, 5754, 6181, 3316, -669, -4555, -6186, -4996, -1781, 3143, 5703, 5898, 3548, -192, -4396, -6378, -5212, -1477, 2601, 5298, 6148, 3668, -465, -4237, -6285, -4976, -1983, 2575, 5422, 6192, 3276, -492, -4423, -6179, -5316, -1807, 2754, 5465, 5809, 3364, -725, -4852, -5884, -4845, -1385, 2231, 5483, 6017, 3492, -705, -4129, -5631, -5089, -1588, 2647, 5385, 5628, 3492, -429, -3800, -6020, -5179, -1677, 2947, 5130, 5795, 3297, -744, -4369, -5671, -5002, -1631, 2951, 5536, 5751, 3275, -456, -3708, -5684, -5026, -1529, 2505, 5289, 5610, 3342, -592, -4405, -6100, -4712, -1928, 2461, 5679, 5857, 2975, -863, -3953, -5614, -5057, -1309, 2732, 5414, 5356, 3299, -413, -4375, -5883]
3048e883J446L339L416L007M58k350l962l560j468Q43L381L899K638j22k288l166
3064c72l558j739J025L465L670K574J46k163l889l096j396N49L252L961K680M50
3080E559k821l135l486j497Q37K973M214K476L19k161m110l245j035R85K515M130
3096B518K701j19j948l815l231j684J243L074M117K076L00k446l560l065j518
3111e357J034L085L898K223N3k186l154l041j597n8L734M101K621l43k590l130
3127g07k979j536Q94L096L526K984M2k397l738k996j296J138K639L706K752L01
3143E429k449l358l494j322J065K860L723K127J86j657l545l436j697J466L165
3158i37L599K100k63j995k985l088j363O99K753L989K507n13k102l157k429j676
$$ y = [-5883, -4437, -1098, 2318, 5325, 5783, 3433, -529, -4089, -5557, -4714, -1333, 2566, 5204, 5082, 2794, -372, -3930, -5669, -4644, -1179, 2491, 5065, 5211, 3048, -841, -3937, -5333, -4784, -1532, 2429, 5109, 5559, 2738, -397, -3883, -5380, -4543, -1570, 2644, 5120, 5439, 3278, -832, -4077, -5112, -4127, -1612, 2518, 5219, 5100, 3152, -663, -3894, -5578, -4335, -1261, 2856, 4932, 5232, 2786, -774, -3839, -5357, -4323, -1238, 2660, 4883, 4936, 2750, -404, -3445, -5042, -5100, -1366, 2735, 5356, 5013, 2423, -707, -3686, -5222, -4328, -1232, 2294, 5278, 5320, 2923, -815, -3811, -5107, -3969, -1330, 2376, 5128, 5429, 2980, -378, -3872, -5194, -4129, -1269, 2454, 4581, 4767, 3110, -435, -3871, -5568, -4102, -937, 2662, 4762, 4499, 2504, -481, -3569, -4932, -4233, -1480, 2509, 5016, 4503, 2401, -756, -3185, -4861]
3174d861O33K695L845K685k73k314l034k887j198O62L013L591K212J73k099l697
3190h54k922j259J117K837L558K442j14k417l104k955j427R73L003L654K099j47
3206D484k003k889l164j685Q94L323L679J938R6k240l264k423j268L63K691L898
3222B430K232Q8k109l381k904j042Q57K446L575K294J09k119l354k885j102R48
3238c917L098L241J960J90k013k853l171j475J160L002L503J577Q5j769k770l547
3254c699j168R55K762L637K174j56j915l266k593j361O88K709L717K314m02k034
3270B362l264k633j387J218K968K689K136L78j919l470k772q57J001K426L344
3285B220K003L44k192l213k900j020J367K644L339J413M00j814l113l072j189
$$ y = [-4861, -4228, -1533, 2312, 4997, 4724, 2410, -624, -3511, -4709, -4047, -1034, 2557, 4769, 4942, 2843, -854, -3776, -5035, -3918, -1081, 2477, 4919, 4805, 2388, -716, -3671, -5098, -4125, -1122, 2532, 4631, 4484, 2481, -408, -3572, -5257, -4363, -1040, 2639, 4577, 4673, 2433, -831, -3254, -4522, -4159, -1468, 2430, 4662, 4750, 2641, -740, -3644, -4686, -3829, -1383, 2192, 4486, 4595, 2476, -878, -3763, -4865, -3917, -819, 2422, 4382, 4572, 2559, -294, -3465, -4940, -3780, -778, 2725, 4302, 4387, 2618, -152, -3699, -4867, -3912, -1150, 2487, 4661, 4505, 2590, -676, -3269, -4630, -3942, -1233, 2484, 4798, 4396, 2362, -902, -3535, -4922, -3704, -736, 1953, 4089, 4467, 2548, -922, -3694, -4551, -3550, -1124, 2220, 4223, 4567, 2375, -838, -3738, -4758, -3391, -747, 2592, 4005, 4405, 2591, -522, -3594, -4783]
3300d783J506K315K989K331j08j871l288k555r96R67K590L193J934J63k072k883
3316e68k956j082J209K442K866K286J51j806l136k447j448J225K167L455J858
3331D216K35k143l354k567r41J025K632L094J709L61j857l062k857r50J075K386
3347i98K879K326J85k224l097k130j147Q89K245K973K284M5k315k889k163j158
3363d295J092K487K555K016L50k104l128k203r24J023K163K836K117N7k094k780
3379h32k508o81Q09K631K768J933O1k014l018k626k73L84K371L019K055K47k358
3396A968k807k220r68N58K621L075J812k76j482l088k546o02P00K434K487K551
3412D217p8k222k665k213q12M63K444K722K355k45k212k249k773j045J120K478
$$ y = [-4783, -3277, -962, 2027, 4358, 4250, 2379, -909, -3464, -4460, -3493, -903, 2290, 4224, 4387, 2315, -568, -3524, -4606, -3397, -955, 1911, 4197, 4348, 2542, -594, -3041, -4489, -3264, -1097, 2358, 4216, 4451, 2308, -1046, -3613, -4554, -3529, -897, 2197, 3906, 4267, 2410, -652, -3509, -4459, -3384, -998, 1881, 4207, 4392, 2168, -929, -3059, -4206, -3317, -1072, 1901, 4185, 4230, 1915, -974, -3137, -4295, -3203, -716, 1839, 3855, 4205, 2101, -1027, -3230, -4154, -3131, -968, 1868, 3985, 4042, 1948, -832, -3340, -4021, -3212, -581, 2187, 4120, 4181, 2167, -851, -3477, -3750, -3366, -995, 2024, 4079, 4326, 1968, -839, -3059, -4027, -3469, -848, 2227, 4039, 3763, 2281, -807, -3353, -3955, -3255, -821, 1666, 4217, 4139, 1917, -748, -2961, -3773, -3310, -866, 1856, 4211, 3966, 1754, -495, -3268, -4313, -3193, -715]
3428g15K852J453J5j768k531k370r34R27K319K659J917n9j704k640k475j015R38
3445c131K240L085J696J19j948k899k341p29R08K401K619J528O8j709k994j801
3461b888p92J003K049K643J725k04j452k542k779p30J196K237K368J543L61j992
3477A746k433k212q10O92J967K857K065l28j859k362k224r21P79K428K494J539
3493C418K28j469l124k035p95J171J791K598J726Rj485k985j701j184P99K343
3509f95K446K033l78j267k702k389q09J010K013K807J343K22j669l103j704q78
3525c720J019J995K479J864n78j565k079k215r93R28K301K370J621j9j397l018
3541a007j708q42O24K628K093J734m13j266k622k134p96J152K032K266J361L49
$$ y = [-715, 2137, 3590, 3605, 1837, -694, -3064, -3998, -3071, -752, 1907, 3824, 3765, 2061, -579, -3054, -4069, -3131, -891, 2194, 3890, 4009, 2061, -838, -3179, -3908, -3000, -599, 2020, 3548, 3616, 1907, -1087, -2888, -3680, -2677, -628, 2015, 3740, 3536, 2084, -458, -3237, -3967, -2771, -534, 1834, 3377, 3738, 1746, -687, -2899, -3709, -3017, -1050, 1807, 3872, 3544, 1685, -677, -2901, -3822, -3043, -615, 1879, 3418, 3646, 2177, -947, -2982, -3777, -2606, -815, 1783, 3509, 3518, 2033, -952, -2653, -3837, -3038, -695, 1751, 3784, 3406, 2139, -563, -2952, -3761, -2751, -738, 2069, 3412, 3634, 1965, -1138, -2842, -3720, -2701, -706, 1773, 3637, 3059, 1494, -585, -2800, -3793, -2865, -564, 1806, 3427, 3408, 2011, -1007, -2715, -3557, -2933, -305, 1788, 3522, 3109, 1843, -779, -2913, -3709, -2557, -525, 1741, 3102, 3451]
3557C451j718k356k299n56N71K622J951J891j64j435k857j757o78N89J983K760
3573A998J362j20j436k764j728j001J072K072K296J707j49j370k753j631r57P89
3589b613K236K042J639j02j651k165k161n14Q54J781K426J675l02j412k546j790
3605b603o44N79K528J842J275L41j410k659j932r40J013K273K291J212J61j856
3621A471k059j930o12J70K382K136J706j66j867j673k167p66O67K063K484J229
3637C068j09j823j739j781p16P19J853K388J291k04j512k118j747j077J003K039
3653d65K047J538l48j320k130j823o73J095J603K239J368k76j571k062j570o50
3669b998O70J697K417J263j54j462k031k041n51P87J877K286J428j49j476k354
$$ y = [3451, 1733, -623, -2922, -3478, -2907, -285, 1666, 3557, 3393, 1958, -899, -2656, -3334, -2745, -762, 1998, 3360, 3240, 1804, -960, -2688, -3689, -2617, -545, 1751, 3458, 3309, 1939, -814, -2445, -3402, -2613, -377, 1665, 3304, 3202, 1551, -614, -2775, -3289, -2435, -654, 1772, 3447, 3145, 1733, -813, -2603, -3247, -2668, -140, 1702, 2977, 3318, 1908, -751, -2683, -3623, -2610, -337, 1954, 3166, 3327, 1471, -588, -2518, -3130, -2960, -578, 1558, 3264, 3098, 1231, -442, -2609, -3375, -2708, -645, 1839, 3068, 2959, 1136, -603, -2384, -3100, -2381, -528, 1860, 3151, 2947, 1435, -683, -2430, -3507, -2504, -465, 1582, 3120, 2772, 1452, -678, -2501, -3174, -2079, -476, 1763, 3131, 2855, 1284, -778, -2348, -2998, -2328, -631, 1786, 3049, 2895, 1433, -598, -2639, -3190, -2403, -526, 1760, 3188, 3039, 1563, -791]
3685g91j637n37M77J957K228J058L0j568j832j886o40Q32J888J834J717q0j630
3702A420k051j933n33P30J984K058J312O6j647j991k012p89R62K007K076J205
3718B864J24j487k204j742p18J020J710K033J446l22j440k003j922l28O90K024
3734b55K111Q77j2j328j831j985q95J203J760K189J115m1j437k197j724p06J175
3751a981J532K081Q86J54j223k360j457n56P01J736K244J041N9j517j928j901
3767b489n14P40J900J687J601m88j380j441j855n59M97K074J910R36rj108k079
3784e77j782p30J001J828J817J174Kj584j868j684m18Q10J851J659J273l41j223
3801A208j788k012m50Q50J927J989J071q2j198k326j406n23J063J364J797R67
$$ y = [-791, -2428, -2965, -2488, -531, 1697, 2755, 2785, 1217, -615, -2501, -3141, -2309, -421, 1413, 3130, 3050, 1420, -631, -2564, -3097, -2367, -383, 1675, 2987, 3053, 1406, -585, -2597, -3386, -2424, -417, 1659, 2864, 2988, 1501, -703, -2445, -3163, -2143, -433, 1600, 3046, 2724, 1284, -719, -2641, -2969, -2279, -255, 1856, 2733, 2721, 1393, -438, -2423, -3318, -2115, -355, 1834, 2949, 2908, 1471, -726, -2450, -3156, -1981, -449, 1632, 2518, 2672, 1449, -911, -2368, -2924, -2223, -487, 1757, 2798, 2857, 1340, -588, -2489, -3003, -2263, -363, 1324, 2925, 2437, 1057, -384, -2239, -2798, -2301, -227, 1683, 2619, 2610, 1502, -577, -2359, -3089, -2088, -260, 1557, 2731, 2733, 1149, -719, -2403, -2821, -2011, -160, 1499, 2772, 2431, 1208, -580, -2592, -3042, -2192, -265, 1724, 2795, 2713, 1515, -811, -2217, -2740, -1677, -313, 1484, 2451]
3817B451J9j156j949j495q05Q90J604K046J056p1j320k010j852j9O66J539J790
3834A384J217J47j274k262j414l41R02J266J892J090J61j604j979j438m96Q60
3850a889J822J636Q35K43j472j397k018o35R05J519K079R68l44r96j972j213o33
3867b562Q85J392J762J182l68j247k042j076m41N29J539J836J477l50j237k045
3883g66j472k43Q54J598J360J291j67j303j857j618l38P67J552J953J005K7j566
3900A077j715j532l65N92J451J933J356o75p76j727j804o46J096J094K152J089
3916B600M2j509k121j098n34P92J387J911J031J12j666j327j629m02O59J512J525
3933A285R70Rj074j934j369l52M59J744J640Q31J53j146j637j713k82O97J382
$$ y = [2451, 2470, 1314, -635, -2130, -2935, -2045, -441, 1605, 2661, 2590, 1270, -740, -2592, -2611, -1945, -406, 1384, 2601, 2748, 1474, -788, -2202, -2543, -1641, -375, 1517, 2607, 2768, 1164, -815, -2253, -2749, -1889, -67, 1569, 2404, 2647, 1175, -222, -2240, -2875, -1970, -451, 1628, 2596, 2252, 1256, -716, -1929, -2562, -1677, -285, 1477, 2659, 2291, 1044, -998, -2074, -2515, -1986, -447, 1389, 2866, 2516, 1279, -766, -2238, -2481, -1627, -29, 1331, 2622, 2455, 1152, -705, -2323, -2661, -1894, -342, 1611, 2616, 2643, 1077, -638, -2170, -2535, -1943, -492, 1441, 2797, 2122, 1346, -381, -2185, -2831, -1735, -641, 1511, 2600, 2642, 1133, -988, -2086, -2620, -1828, -441, 1470, 2501, 2613, 947, -380, -2009, -2411, -1752, -240, 1285, 2255, 2264, 1190, -744, -2113, -2465, -2006, -262, 1378, 2209, 2362, 1216, -421, -2134, -2416, -1719, -337]
3950c37J454J450k98j139k011j129n39M72J812J762J274m53j337j681j394k41
3966b335O93J486J563R12K83j732j590j220o23Q57J547J475J270j63j174k057
3982h08j326j95R15R42J974P35J80j355j601j512k50N52J580J367J402m79j178
3999I43j503j420o33J294P53J864J196m69j096j754j103l60O05J476J663R46j29
4016B273j380j481j605j80O78J503J570Q82k53q16j912j124o18P43J766J273R83
4033B302l49p97k019j257k88N40J808J354Q92l9j175j531j531l59O51J633J471
4050A306J236l45r64j437j726n77R47J194J835J212o11r88k076r92m03N73J806
4067a0J486Q56o05p18j776j112m52O82J764J321R14l23p63j792j702J22L86J492
$$ y = [-337, 1117, 2567, 2269, 1130, -881, -2010, -2549, -2077, -265, 1497, 2771, 2318, 981, -700, -2094, -2335, -1642, -156, 1407, 2319, 2602, 870, -720, -1940, -2563, -1706, -159, 1316, 2586, 2423, 1249, -808, -2134, -2329, -1414, -472, 1502, 2237, 2417, 1062, -539, -2051, -2301, -1749, -169, 1198, 2600, 2121, 943, -560, -1980, -2613, -1319, -566, 1298, 2494, 2025, 929, -825, -1928, -2288, -1683, -207, 1456, 2402, 2273, 893, -588, -2193, -2373, -1695, -192, 1378, 2260, 2007, 1191, -721, -1845, -2463, -1720, 46, 1319, 2302, 1953, 1156, -863, -2120, -2408, -1868, -60, 1294, 2186, 2147, 972, -559, -2090, -2449, -1798, -165, 1306, 2542, 2197, 1233, -204, -1930, -2507, -1560, -366, 1469, 2681, 2070, 1082, -994, -1986, -2389, -1816, -10, 1476, 2332, 1727, 1009, -767, -1879, -2331, -1649, 115, 1436, 2350, 2027, 1264, -528, -2230, -2108, -1722, -230]
4085b30J704J025n64j130j650j158k02N94J277J672R33k67q13j891j277j13O15
4102a475J529J010J022q0p68j753j502k8M16J402J243J028N9j168j641j209k53
4119b168O51J530J374Q99j91j365j428j004m73P49J132J439J278o52o66k033j120
4136b048l27P63J560J449Q17k35j059j622j455J12M97J441J487P86j85j234j519
4153g72r76l24N32J482J449M42K30j220j618j061j6P1J812J200P62o9j148j422
4171f46j201l12O45J822R67P64m0j132j565j294L0M62J330J671Q06l82j064j560
4189f99j207k93O23J719J382Q39o73j159j155j193k95O53J067J717R30%j432j395
4207e71j276k48O96J047J338J195j59r41j582j376j65P31J212J508O02l45r07
$$ y = [-230, 1474, 2499, 1935, 805, -845, -2003, -2205, -1611, -334, 1338, 2271, 2004, 1191, -700, -1977, -2090, -1475, 54, 1064, 2086, 2006, 1238, -515, -2017, -2045, -1629, -227, 1016, 2044, 2103, 935, -706, -1915, -2168, -1517, 13, 1387, 2286, 2095, 730, -698, -1702, -2175, -1426, -294, 1145, 2423, 1771, 1105, -928, -2048, -2375, -1612, -52, 1397, 2214, 1979, 920, -702, -2157, -2045, -1548, -107, 1380, 2166, 1981, 747, -772, -1748, -2072, -1540, -58, 1391, 1833, 2063, 843, -775, -1836, -1852, -1781, 31, 1231, 1993, 1924, 776, -646, -1847, -2159, -1514, 308, 1275, 2039, 1999, 867, -698, -1992, -1962, -1500, -170, 1501, 2307, 1925, 861, -699, -1906, -2199, -1576, 143, 1525, 2364, 1691, 532, -623, -1816, -2111, -1458, -391, 1326, 2256, 2256, 824, -571, -1847, -2095, -1399, -352, 986, 2181, 2022, 1081, -501, -1877, -2042, -1311, -99, 1409, 2011, 1666, 759]
4224G59j349j248m62N41J798J100P90Q9j301j279j269k14Q89J041J238J001r9
4241B025j344j221j061n13N86J388J316Q16k26j206j233j105n13J125R21J780
4257A535L51j87r83j176j289l44Q37J021J678O27j33j242r76j600r1N04J152J462
4275A146Q38m11p99j362r88n32P38J336J448O26k36q40j569r46l32P25J248R04
4293I94R72l24p10j422j121l45N32J427J091Q02k27o18j764r92j29O44J365J087
4311A262P09j93j152j323j044m59J186P62J486N65j3j262j093j116j28O89O20
4328e04J720Q31m16j061j182j543NP20J309J332P49k45j114j360q57k83O44J206
4346d9J127O16j24n59j490j276l06P33J409J156N84j41j174r88j035l21M60J171
$$ y = [759, -590, -1838, -2300, -1759, 39, 1139, 1929, 2018, 717, -562, -1831, -2045, -1156, -115, 1123, 2124, 2025, 681, -540, -1601, -2114, -1528, -140, 1176, 1992, 1766, 560, -673, -1778, -2291, -1166, -245, 1535, 1886, 1699, 716, -460, -1749, -2093, -1256, -235, 1443, 2070, 1937, 695, -281, -1881, -1972, -1468, -316, 1146, 1984, 1573, 774, -588, -1576, -2108, -1370, -34, 1414, 2040, 1804, 964, -605, -1551, -1883, -1158, 90, 994, 1966, 1642, 932, -490, -1611, -1956, -1424, 3, 1094, 1896, 1669, 1051, -713, -1705, -1834, -1190, 175, 1262, 1971, 1778, 626, -697, -1741, -2200, -1014, -252, 1234, 1799, 1786, 524, -569, -1685, -1813, -1124, -504, 1216, 2047, 1631, 570, -612, -2155, -2150, -1430, -121, 1211, 1960, 1715, 601, -759, -1616, -1899, -1255, -49, 1078, 1694, 1570, 1011, -479, -1755, -2061, -1328, 81, 1237, 1821, 1680, 506, -482, -1517, -1838, -1378, -207]
4364b07J371N01k3j111j191r48m14J131R90J082P68n01r01j339q52j84K85J732
4382A89J020P76o0j283j152j127k52M96J279J239P44k75r87j220q41m32O88J212
4400A4J059R45n18p75j461q10m95L84J486J316R14m44q31j423n27r79J123Q54
4418a68J253Q22k21r25j328j117O2O84Q38J217P71k19q59j415p36m27P10Q96J169
4437A007P81nj149j381r76l8L86J368J121O60k91j005r44j163l71R83J211P98
4455I92Q64kj194j569n93j97L83J185J272Q37l53j282o66q32n94M89J368R49R35
4474A992l98q90j669m90l45P27R96J009P92k40p31j656n84l08P77J038J274M17
4492A711k17j000r94r48l87P62J262Q88J018n58j215q60r19j33L17J118J442M61
$$ y = [-207, 1164, 1665, 1642, 531, -660, -1608, -2022, -891, 99, 1181, 1949, 1448, 547, -792, -1644, -1828, -1543, 189, 1209, 1985, 1925, 642, -510, -1637, -1889, -1393, -114, 1125, 1869, 1594, 607, -613, -1454, -1886, -1198, 14, 1073, 2018, 1500, 725, -736, -1546, -2041, -1657, -171, 1145, 2059, 1615, 784, -639, -1166, -2145, -1022, -168, 1085, 1907, 1686, 761, -567, -1684, -1622, -938, -100, 1117, 1888, 1669, 810, -605, -1341, -1768, -1058, -162, 1007, 1788, 1783, 634, -747, -1723, -1761, -1375, -7, 1114, 1774, 1483, 478, -466, -1629, -2000, -1017, 194, 992, 1856, 1854, 660, -909, -1502, -1699, -1316, -131, 1141, 1978, 1625, 343, -323, -1155, -1749, -1260, 108, 1057, 1992, 1594, 704, -965, -1455, -1800, -1073, -77, 932, 1724, 1484, 753, -903, -1487, -1795, -1018, 20, 1294, 1711, 1494, 494, -500, -1448, -1835, -1073, 189, 1077, 2095, 1537, 322, -538, -1457, -1590, -1273, -155, 1287, 1748]
4510A748n19n32j133q86l89O42R87J199O71k87j186j080p37k84Q19P18J052Q60
4528A663q6j050q01j478J23P15R16R42P73J80j580j003m43o09M04J406J041N13
4546A626j57q92j047j240q1Q08P78J228O49m17p82j097o65m16P25J017Q17R01
4564A755m2r59j525n28k62N36P70J447M44r9o23j350q84k62M90J194J215J60l8
4583A439q48j305o11k92O00J016R48M79P2j056r93r58k04Q44R86P21O87j12j006
4602D07q57j078m89R87Q51J312K18m1o33j236p55k96P02J086P67O08m5r76j019
4621d87o86m30M21J006J434M55n62o62j057q59l00Q74P88J058M41K9q02j202j040
4640a581P6M70P67J123P20k05q34j413m71j9L12J120Q58Q26k37j091j103p93K54
$$ y = [1748, 1229, 697, -436, -1322, -1711, -1069, -82, 1117, 1788, 1501, 315, -765, -1502, -1786, -967, -249, 803, 1663, 1577, 527, -274, -1752, -1629, -914, 2, 944, 1717, 1897, 317, -686, -1129, -1738, -1334, 72, 1113, 1626, 1469, 577, -470, -1710, -1791, -983, -205, 1023, 1672, 1255, 473, -624, -1289, -1705, -980, 37, 854, 1755, 1713, 754, -771, -1299, -1561, -1025, -255, 1192, 1636, 1537, 914, -436, -1320, -1582, -1092, 102, 1317, 1477, 1439, 591, -714, -1325, -1617, -1017, -1, 947, 1426, 1498, 442, -551, -1509, -1713, -869, 117, 838, 1525, 1413, 407, -450, -1528, -2017, -1030, -179, 1133, 1351, 1310, 677, -559, -1314, -1610, -908, 178, 945, 1553, 1508, 532, -487, -1173, -1603, -1182, -176, 1258, 1713, 1151, 489, -568, -1427, -1727, -853, -65, 993, 1434, 1463, 661, -541, -1581, -1505, -1035, -268, 855, 1575, 1370, 536, -877, -1348, -1367, -1055, 65, 923, 1749, 1512, 421, -682, -1475, -1221]
4659a221J62P45J112M66J0o51j095p26m28N41J159P92O97k35q47j038p04k45O87
4678h19R39R98L34m7r03r79p37k39N60R41J098M55j71q53j503n39J38M06J035
4697A14Q21N79j91j252r35l83k37L79R92J163K68J4o53j254p00j7M02R80J188
4716A278k14k7p02q34r18j45N56J017J123M29n39n48q53q97l38M17J355P74R47
4735A881m76j157o95r23j74M24J066Q03N38J78j035p83q72n9L84R95P56P99m47
4754A203p30p73r43l05N65J143Q58O80m76q07j190n31j92N36R76R06P50n08o47
4773E15q74r36j23L19J116J236J06l06q19p65q59KN90J203N70N57n51n01j291
4792h11n61O2L69R83Q45M06l37m12j016r82J28N03Q02J045N51m18o05j125p52
$$ y = [-1221, -1059, -314, 798, 1264, 1274, 623, -472, -1198, -1626, -1085, 74, 866, 1563, 1328, 481, -557, -1261, -1506, -819, 120, 1118, 1452, 1405, 502, -477, -1214, -1453, -893, 48, 1146, 1601, 1430, 577, -926, -1465, -1327, -921, 114, 935, 1514, 1323, 71, -864, -1247, -1484, -1105, -113, 1050, 1318, 1332, 679, -575, -1275, -1292, -890, 90, 1278, 1064, 1037, 335, -499, -1417, -1562, -1006, 11, 1134, 1563, 1024, 476, -377, -1274, -1612, -1195, 160, 934, 1881, 1405, 248, -447, -1370, -1544, -1120, -54, 749, 1287, 1465, 430, -353, -1225, -1284, -900, 95, 851, 1650, 1203, 473, -300, -1243, -1548, -983, 160, 1018, 1698, 1222, 415, -775, -1306, -1498, -962, 14, 920, 1670, 1162, 515, -359, -1295, -1418, -1099, 17, 1253, 1359, 1053, 234, -531, -1390, -1388, -798, 405, 975, 1532, 981, 480, -811, -1372, -1310, -941, 42, 887, 1293, 956, 544, -472, -1454, -1326, -823, -21, 1024, 1575, 1157, 552, -573, -1325]
4811a325l4L48J182N59Q99n32n73j039q40r9Q13O86Q51N66l99n47j225l55k13
4830a277L48R82Q51L49nr25j113l00NM40M65J101M47m3r72p93p55l6M94J136P73
4851A172j16L83j119o88p29k60M85R19J138L02m07o99p95r94M6L55J066Q43O06
4870A508k94q20j032n95j04N89R21O68O89k20o96j185o71J23L43P65R20J44J13
4889A166o96j180l61j73O55R33M44P43m18o16j018o99q0M54R16Q83K81N1j033
4908B52j010m21n18J175O43P26P39n19p68q34m90l74O89R93R76P1n8r37r58m89
4928a112j48N41R74R98J22l50q48o81q56j58N46Q91J223M26m13o96j223l19k65
4947a348M31J112Q22L02k09o77p83r12r3N79R19J150p0k73o03r90o97K0P08N56
$$ y = [-1325, -1359, -1011, 171, 730, 1629, 1097, 524, -515, -1355, -1454, -641, 45, 896, 1462, 1063, 516, -709, -1064, -1277, -929, 53, 904, 1253, 1248, 323, -790, -1090, -1085, -645, -180, 921, 1368, 1325, 353, -440, -1195, -1231, -737, 399, 1172, 1056, 1439, 320, -368, -1097, -1357, -872, 47, 1185, 1487, 1080, 381, -414, -1408, -1362, -1007, 59, 902, 1508, 1214, 394, -638, -1233, -1337, -748, 173, 841, 1530, 1310, 614, -571, -1242, -1119, -776, -11, 909, 1053, 1166, 470, -710, -1071, -1244, -589, 344, 788, 1531, 1113, 497, -521, -1220, -1300, -846, 70, 953, 1234, 1285, 252, -758, -1179, -1697, -522, 121, 847, 1586, 1067, 299, -535, -1025, -1399, -710, 283, 1259, 1330, 1272, 335, -623, -1112, -1260, -719, 255, 1253, 1375, 1025, 177, -504, -1360, -1518, -972, -81, 1142, 1568, 1155, 459, -764, -1083, -1348, -917, 195, 1017, 1319, 1110, 433, -350, -1262, -1355, -776, 143, 1293, 1223, 950, 347, -643, -1340, -1320, -612, -56]
4967e6J200p7R2r26o50p68J32l3J015P78N28j08o34j105o35J59j12J070R72L56
4987A198P6r13n40j153J38N71N91J104m5j61o40p69o80k5L78Q27R38L43l15m77
5007D46r46l68pL92N81R93l4k25n80j023j68j78N28R94O23J13l48l87q65n24j48
5028a131K50Q10J083K98j27r69q23n73M53R7O72P89M65m20p10p68o77P0M15R70
5048A74L81Q13k26j056n14o65j45P76O81Q36L49k33r60o38p50o5L51J280O52L01
5068A342l28r06p02l94R6k4J389L59M46k96q11j033J7j09J56Q65R79J65k19n09
5088D83j091n69J27N22R11P79p6j44m64j291l31k76O30R47P28K95r4q91j010m27
5108a242J11M98O36Q02N04o17o41m54o77L63L89J88R33M99p24k69p41p40J10N83
$$ y = [-56, 1144, 1067, 1159, 233, -417, -1185, -1053, -1086, -71, 707, 1235, 1127, 493, -612, -1247, -1088, -1200, -130, 842, 1198, 1274, 361, -179, -1332, -1194, -623, -32, 1072, 1027, 866, 226, -543, -1223, -1248, -870, -43, 895, 1238, 923, 446, -500, -868, -875, -483, 98, 1091, 1057, 832, 252, -771, -939, -1117, -589, 405, 1028, 1141, 793, 406, -459, -983, -1131, -881, -71, 1012, 1310, 1183, 214, -609, -1182, -729, -632, 40, 829, 1294, 874, 164, -604, -1281, -1211, -796, 174, 555, 1368, 1142, 86, -428, -1093, -1238, -462, 219, 1055, 1404, 1171, 211, -427, -1177, -1242, -891, 389, 1041, 1342, 1014, 108, -594, -988, -892, -916, 473, 832, 1278, 982, 171, -862, -845, -954, -798, 67, 1046, 1211, 992, 483, -608, -1177, -1050, -528, 383, 1162, 1086, 942, 478, -813, -1144, -1420, -790, 157, 885, 1180, 1086, 195, -815, -1242, -1131, -633, 3, 805, 1309, 692, 51, -403, -1080, -717, -328, -140, 793, 1292, 568, 299, -442, -1182, -1072, -489]
5128d89O00N55N08k79o59q41q96N51L57O96P97L01k90n19r82n48N1M84O38Q01
5148H36M0O1o48q85n27P4O38O50Q09K78l89q84p13m51p7O27N79R11N06m35n93
5169D07j158k96J08K00R93L89N35j20q42n24p65q9L90Q66O72O41m03p21p13o47
5189a077MM69R70M10Q1J31o15j415r1k56P57R16O32K39j61r15m44j011M00L50
5209f26J221L68M68l31q46q91n02j13O34Q07N44M48l40o41o59p18k15Q70P10O50
5229H38L43l24n81p22q22M06K27R82P71j09k64n79o80n49j00P79Q37M14N31n08
5249H90q02o14m55j27L87J020N08P36p68o91n13o76lP96M81O08K27k89o23n50
5269d58n54l29P13Q63M51N99n62n48o21o69P3M68R66K48P14n55q79o15l56KN84
$$ y = [-489, 111, 666, 1174, 895, 236, -605, -1501, -950, -593, 103, 900, 1201, 911, 392, -590, -1138, -1087, -603, 35, 836, 876, 937, 289, -596, -1123, -1049, -411, 239, 1048, 1326, 937, 53, -660, -1111, -1188, -561, 18, 929, 1435, 1000, 407, -751, -1047, -939, -739, 254, 643, 1178, 1058, 216, -308, -1073, -1162, -772, 94, 766, 1407, 1004, 283, -430, -1077, -1073, -604, 366, 776, 857, 988, 373, -1042, -1133, -1389, -632, 284, 916, 1155, 994, 79, -365, -1376, -976, -626, 595, 963, 1431, 1100, 254, -637, -1139, -1252, -618, 189, 733, 1181, 841, 200, -459, -1177, -1392, -522, 188, 838, 1181, 857, 276, -446, -1268, -862, -635, 347, 1118, 1009, 745, 166, -514, -1063, -1163, -384, 453, 867, 1398, 890, 88, -526, -981, -1108, -721, 299, 807, 1543, 775, 84, -429, -1105, -1108, -312, 169, 777, 1004, 715, 92, -458, -1012, -1341, -628, 235, 686, 1285, 723, 175, -446, -1115, -1042, -574, 392, 640, 1354, 799, -80, -695, -1051, -1049, -465]
5290d65O72O53M03n38k76j123m01P7O71O27P65Q2j25o56j143r1j89L76P05P51
5310G75K56j90p00r28k69j61R58P90K7N51k82p49o39j60k97O94N10P33K44k66
5330H97p93m13r20K82K24J111N09m1J15j199k72o29J1P82O34O14Q8k64o06p32
5350f02r41M94M09Q57R86k27n9r06n88o67L3O88O91Q67M6n63k14p39o38j4P07
5371c80O36N69K89j61r13p79l18p4Q20P84N20J53k24j046n07m28L32J97P33O14
5391H17K23j49p18p77l62l56P49N78P68J17k9n36j058j58p0O21N94O29L69l97
5411H55n46q03q08mR27M56R65j43M1r98q18q7L04K07O12R36j51L9r59n01o32j21
5433a229P65N62O37M58n24m86j009m05k7O82N82J134J80n87p34o47m97J18N26
$$ y = [-465, 207, 860, 1263, 725, 449, -674, -1075, -998, -327, 300, 1065, 1147, 1022, 366, -777, -868, -1057, -681, 24, 775, 1031, 841, 141, -787, -1056, -1217, -259, 531, 558, 1109, 827, 78, -561, -721, -1018, -324, 186, 919, 1163, 897, 104, -309, -1229, -947, -723, 388, 897, 856, 971, -228, -500, -1129, -1118, -336, 298, 912, 1000, 736, 130, -602, -1543, -1049, -640, 217, 1203, 976, 917, 11, -577, -1244, -1211, -523, 168, 1035, 1081, 518, 304, -435, -1073, -1087, -380, 256, 825, 1114, 953, 40, -739, -1057, -1131, -311, 473, 993, 1146, 922, -124, -631, -1059, -727, -530, 203, 817, 1040, 891, 173, -604, -966, -1322, -573, 5, 773, 890, 861, 325, -733, -891, -961, -340, 254, 883, 1252, 855, 309, -494, -1302, -1306, -379, 77, 1042, 899, 940, -58, -876, -963, -659, -452, 160, 1096, 945, 984, 25, -476, -1108, -1229, -464, 98, 735, 1193, 669, 183, -826, -1231, -1258, -576, 6, 1140, 1320, 733, -1, -648, -1145, -1027, -501]
5452e01R28N21j55j33j70j061o57L70N27P37M15j72K88o90n97o95j01O83M99R70
5472A006L45n80p22m80o26J38N35O82N30L13m43l92j128J3j85M77N55R44j98j83
5492F01o82m68l74L11J96O64M33M84m74n30q64p90P50J03R40O51P3j19r02p31
5512g28j34q4Q32P11N8M03n90k94n64p57J04O53M10N34P19n61p81m68l86K45L55
5533c23O69N20K22k28r60n74o27K84L65J029J47L10J44j135o28k97L33O32N37
5552D20M47K8j87o50p93j92K01K51O84M88K65l27l22r51l45M5N34Q40K30M35k81
5573H20o54o64m98J18O27O78O64p9j27o93r01n30N00J87J153L97l9k34p81o76
5593g32l20J84O31O62J46N74m74q97j98l70J05K56R64K89J49j66p34p18m01N4
$$ y = [-501, 427, 948, 793, 660, 490, -571, -1228, -858, -331, 406, 821, 649, 937, 247, -350, -1045, -1146, -463, 36, 1006, 1351, 771, 49, -431, -1057, -919, -384, 298, 828, 1141, 698, 306, -822, -809, -994, -517, 38, 982, 784, 601, -81, -549, -923, -612, -416, 248, 681, 1165, 691, 161, -703, -1493, -743, -640, 300, 951, 1024, 905, 3, -728, -862, -946, -114, 597, 655, 1058, 468, 174, -390, -1147, -1043, -390, 20, 554, 1273, 712, -69, -537, -923, -678, -323, 346, 866, 1088, 860, -100, -674, -1301, -1017, -652, 377, 524, 834, 978, -157, -785, -1082, -749, -117, 420, 867, 895, 708, 58, -735, -927, -726, -475, 209, 697, 962, 635, 313, -638, -983, -938, -404, 436, 666, 1101, 820, 166, -498, -996, -878, -251, 427, 1091, 1012, 885, 192, -709, -1239, -739, -552, 601, 998, 959, 725, -56, -732, -1052, -868, -237, 425, 571, 1145, 671, -226, -424, -794, -689, -433, 531, 820, 969, 803, 69, -649, -1050, -996]
5613i96P57O46N87K90q02p12k59l97j70O98P21N39N98p14q92n41l09J91L62M01
5633bQ99k18J41o90q75j90L54N46L40O60R7l84o35r27Q4k5J97R60N20L24n38p62
5655a24p80P5j04P32M53N25K65n47l33j041j83K20M23P40N45K9k41r73l19n31
5675a169L19L76M78Q80M10m65m27j090k97K8O41P02M82L46o88k17j106n4K41K79
5695c31P93N60l36M8q14m42o40M16O08P39L39m1n09n37l89n28M73L40M48O86n9
5716H24l42p11k11n44p0R28L34Q42m26r7p15l91k40J66M26M84Q05p0m78o70o78
5737h34J74J62K79R24K58J26k81r68m76m88L35P31M28N77K45o36j077m86k29N75
5757f61K82Q18M29j8j30n21j085k06J84P40R61k49M09k49p33m53n63J01O55O50
$$ y = [-996, -239, 407, 994, 1284, 482, -230, -489, -886, -1056, -358, 363, 902, 1500, 786, -106, -647, -956, -765, -403, -2, 897, 679, 820, 130, -745, -935, -581, -35, 305, 965, 1062, 678, 43, -884, -800, -825, -628, 332, 852, 1176, 638, -124, -904, -829, -933, -201, 252, 777, 1042, 495, 162, -879, -1062, -842, -419, 321, 866, 895, 654, -319, -638, -1169, -850, -474, 4, 884, 1294, 829, 402, -688, -985, -957, -316, 386, 868, 1214, 526, 309, -797, -851, -610, -331, 462, 1022, 686, 734, -80, -522, -1162, -746, -138, 601, 940, 899, 390, -147, -536, -1064, -591, -251, 197, 883, 824, 482, -229, -440, -984, -1054, -126, 208, 1050, 624, 527, -188, -579, -819, -653, -227, 257, 1062, 992, 514, -156, -834, -660, -498, -219, 705, 963, 1089, 808, -160, -636, -1124, -789, -58, 370, 947, 1192, 556, -521, -1007, -1236, -661, -379, 439, 868, 850, 720, 199, -886, -1092, -908, -168, 793, 544, 953, 704, -29, -482, -1045, -944, -289, 361]
5777C61L85L37l93n47n88l14j9O68M48M67J12l62l88p41n51L62P01P22J03K18
5797I81m88n31m97Mm70N46P35N67k42p1n48r43jK61M65O97K55M03o92p83j80m91
5819a023K40N65P41J18J30l70p58l50k1j66P53M61O90r6o04l68p42l30M20L91
5839c19P71L26K44o06m41n72k73M6N34P68J53R0k71p55l20j66M3N01M49L43N6
5860F01J41r14n07j14J56L01R27L37k03k76p54l56j76r4O99M72M47L17p54l11
5880f1o62k31K58J56Q33O94j56j85q07n14l03M09P06L28N28k50l20n16m05k20
5900g18J78M22L93P15j86j26o61p56k73L47O79M96K26J40n60m43n03R5Q0P8P76
5921C99M17J94m93o47o25k22J74P07J50Q31m5k61q28o48o1m7O13J040R9j38j95
$$ y = [361, 746, 1083, 690, 143, -445, -759, -778, -110, 338, 805, 917, 555, 167, -574, -1125, -763, -62, 660, 763, 981, 493, -38, -535, -531, -1001, -455, 280, 847, 605, 534, -14, -957, -958, -697, -232, 465, 720, 1123, 431, -352, -532, -1023, -783, -218, 523, 641, 771, 401, -357, -707, -728, -894, -141, 320, 1010, 914, 310, -58, -800, -1130, -710, -319, 452, 778, 1022, 416, -25, -597, -870, -824, -290, 478, 631, 721, 450, -305, -625, -791, -748, -247, 202, 545, 601, 742, -172, -679, -793, -637, -336, 591, 928, 725, 449, -305, -661, -837, -931, -232, 240, 687, 1004, 250, -61, -723, -954, -696, -540, 293, 987, 831, 646, -161, -675, -978, -569, 137, 465, 993, 743, 423, -93, -498, -718, -540, -118, 275, 990, 804, 678, 17, -739, -1012, -665, 14, 510, 736, 876, 316, -127, -630, -535, -455, -377, 399, 816, 1010, 517, -130, -755, -977, -803, -96, 54, 885, 840, 579, -249, -897, -958, -1005, -392, 648, 747, 609, 414]
5942D14o22m22l93L71O46M23M63j15m34k05n52m54k7R14L66K90K25q4j180j42
5962e18m30K10P72M31K03K38n98m07r48M34j72P62M70L29qk36p80m72kK69L84
5983f9P52K71O1l96o25p63n7M10J79M27N27K26l59p28m40k63K47N26M99M08J22
6004I55o65m41o37J11K25L22N22N21l00k59q24j89j21j2P48K87M98M2m03o56m17
6025f93l29N71K77N00J14M10n51n51m60J21j03N78N06M74l4p50k95n18p3L70J59
6046b77O83N03j12m19n37n47j69P33o5M62M18J54o01n31n55k62N61M69N56K99
6066G63R0p51j72n17M8j79P65K37O14k17k86k51j032K83j40N28N51L37K99o93
6086B77o48l76K9J20O03L43N50j14m38m66m85j47k6P19N45L14J74p07n40o32L47
$$ y = [414, -208, -630, -1023, -652, -6, 417, 880, 765, 331, 126, -426, -880, -907, 7, 373, 663, 888, 804, -376, -518, -948, -738, 34, 465, 668, 906, 308, -99, -1047, -613, -785, -23, 447, 776, 768, 532, -248, -720, -722, -453, -69, 683, 954, 1015, 619, -6, -769, -826, -416, -237, 190, 717, 943, 584, -144, -584, -847, -600, -74, 425, 833, 955, 290, -151, -788, -677, -452, -130, 392, 913, 613, 354, -470, -659, -780, -792, -44, 243, 741, 783, 380, -276, -693, -1022, -451, -174, 326, 440, 850, 299, -252, -712, -591, -694, -116, 390, 864, 830, 80, -215, -733, -806, -436, -277, 406, 909, 797, 378, -159, -706, -875, -142, -207, 255, 673, 827, 226, -305, -860, -1122, -561, -92, 464, 763, 853, 102, -70, -587, -539, -718, 47, 284, 898, 681, 395, 144, -888, -605, -745, -217, 334, 671, 970, 277, -371, -747, -718, -598, 5, 348, 898, 784, 346, -120, -605, -752, -778, -59, 486, 800, 974, 267, -273, -905, -558]
6107e58l41Q55M48J57J38l51k64q11m4J45L80Q81J50K94p09n50p67K05J96P56
6127B10K59J80L39n78q96j51j02L00L93M15M52Rm07n00o20P0NP30M65K21J78p49
6149B23n72j89k8j81N01P73O08m24o10k74n29O9K96M38M52N44l55l57m07o41n
6170f68k5J055j60O29k5o96j58k88o29L46M63M80P53k13p38m83k08k69L42O10
6190A18M96n2K24m75n23n75k32M12N96P12k80L74n19m84o08n3L23N11M06K76j28
6211E19l94k20o75j32L35M31P18L26j60l73o63m65j51M10L90L21N19M4n53n18
6231b91k13m53M65N96N41j0K41o91l46n82o3L32N54N27K49k23o24k01n63k13K42
6252g26Q31K10L71J76k81r15n55K00J55N20Q30j56P2j49q93m53J67J6P18M61K3
$$ y = [-558, -899, -44, 404, 561, 699, 348, 84, -727, -771, -626, -246, 635, 785, 1079, 370, -180, -947, -742, -546, 210, 469, 649, 988, 410, -486, -637, -739, -439, -46, 369, 821, 830, 423, -77, -697, -627, -622, 108, 573, 794, 972, 223, -349, -538, -566, -747, -246, 527, 1135, 711, 101, -173, -702, -633, -337, 101, 553, 1097, 742, 385, -22, -663, -668, -693, 362, 202, 831, 806, 110, -48, -336, -965, -619, -156, 324, 1077, 864, 126, -357, -565, -834, -492, 118, 614, 562, 786, 311, -212, -787, -1019, -607, -11, 701, 421, 795, 276, -208, -816, -869, -546, -35, 371, 647, 519, 125, -95, -770, -902, -567, -136, 582, 908, 748, 375, -288, -753, -904, -494, -104, 217, 736, 780, 227, -291, -504, -957, -492, 104, 645, 635, 876, 185, -161, -743, -806, -474, 80, 607, 856, 633, 9, -192, -755, -968, -726, 105, 315, 686, 862, 581, -334, -889, -689, -534, -14, 816, 660, 732, 583, -310, -763, -596, -580, 138, 599, 622]
6273F22K36q17m24m11P4J5N38P77K87l62k41m95m62l11N1R64O16M82k25n31n19
6294a36o64p0M51N78N26J98j51l53o18p04O9M79L89P27JJ43n58p05l34n8J36N35
6316a19N37L73j12l70n78n11J26J58L31Q45J18n2m85p70j73l30N54P79L28J41
6336G90j1o31m03m34J3L44J75O10M16p2k68p21o33PL07K50R23K89m47l35o02m68
6358i01J73K90Q20K99J84o5n83q38k63K02p4Q73P37K2j92k29p54l68k71M55M21
6379f2O58L14j23o57l79m00J09M6O73N23J07k7n18n86m51L3O7L81R17K44K4o02
6401B91p35m42l0M18M88O43J42K9o91n48j53j8P8O64O11J88l02j20r10k13j58
6422g68M47M53M47M38m77l91j99p03j40N83K77L51L92J09n99o54l46N4J82N11
$$ y = [622, 858, 41, -383, -794, -720, -705, -167, 610, 897, 535, 294, -201, -663, -974, -923, 41, 657, 1139, 914, 383, -136, -800, -870, -419, 159, 685, 883, 732, 379, -239, -943, -874, -395, -6, 721, 722, 865, 307, -398, -732, -790, -654, -119, 418, 791, 679, 309, -269, -780, -654, -496, -165, 680, 798, 746, 261, -509, -682, -1012, -458, 321, 649, 790, 779, 148, -255, -689, -676, -332, -157, 453, 869, 797, 529, -192, -825, -818, -511, -261, 662, 951, 504, 169, -433, -901, -728, -438, 382, 681, 865, 800, 217, -621, -884, -682, -756, 117, 854, 876, 684, 455, -299, -667, -938, -483, -62, 596, 910, 787, 130, -249, -649, -540, -494, 179, 702, 809, 782, 264, -322, -773, -740, -673, -292, 625, 869, 893, 291, -444, -886, -916, -498, -10, 633, 775, 804, 113, -435, -588, -606, -528, 136, 747, 935, 633, 513, -397, -610, -768, -321, 132, 579, 1017, 540, 149, -50, -753, -893, -310, -33, 318, 710, 819, 220, -434, -780, -726, -544, -33]
6442c3P39r4K93o73q27r7M30p5M16L14L28P1o19o14k88l9K43L73R91j35O8m04
6464C68o58k61l28O77L03P66q7j29o00m16m47K09O5M73Q41k93j68j76o19r7kJ12
6486d67M97N95K24m42R2p95n22P5J30N76M90K59p9m09m38r0m90K54R02M07K9k7
6508G71p63n92k05N4M20M82L43J45q5l95o71l97m7O63L75M38L01m13m42l29m09
6529g56R3K39N37N02K13k41j75n83k31n97M54P03L21M08k09m30m32l65j69L06
6549d12L85O19J05K33o31p28l00jJ64N90O28o5q5l92l88p56l9P27M29K34K26J8
6571E61n39m54l61J2M97L76K86M22l98ko45k98j43K62K56Q57J73k58l73n15n82
6592h66L25J01L82P85L02k52n00o49n39M12K95M23N9Q53m08p15m63k74l06O07
$$ y = [-33, 706, 612, 905, 232, -595, -692, -262, -337, 79, 393, 721, 792, 173, -441, -729, -768, -525, -152, 839, 704, 772, 368, -290, -551, -879, -202, 101, 867, 780, 651, 51, -365, -812, -603, -538, -65, 776, 483, 315, 139, -480, -577, -579, -467, 30, 625, 849, 407, 499, -296, -818, -743, -613, -37, 453, 712, 633, 224, -214, -304, -794, -540, 362, 769, 798, 771, 8, -584, -789, -735, -315, 167, 510, 655, 570, 175, -496, -893, -940, -277, 98, 536, 837, 424, -18, -347, -756, -663, -424, 113, 615, 828, 587, 412, -171, -402, -999, -545, 158, 479, 887, 678, 248, -184, -549, -718, -412, -27, 592, 697, 930, 299, -429, -729, -730, -566, 24, 652, 587, 502, 110, -278, -1034, -1073, -346, 83, 317, 543, 561, 22, -432, -793, -781, -284, 92, 378, 800, 402, 400, -245, -543, -686, -424, -168, 689, 862, 604, 231, -284, -866, -541, -440, -58, 727, 1029, 777, 277, -372, -911, -499, -204, 219, 278, 1131, 723, 8, -455, -729, -1035, -428]
6612d28N28M10J67K78j204j81m20L66l7O81O50J81m83k81n45o53K36L97J9R01
6632E82L86n62k92p93%j84M04P05L87K0J60n11j041j1K7K12P17L46o1o9k50m92
6654c20m54M5L3R03N08J61r7o16n08l72l24P47N91J46L05j20l11p99l08K13K90
6675b87M32P47J3l63p40j19k98L5L96M70K45K03K2m07q24l43J63K52M10N07P0
6696E84Jm55o57l39J20L49L72N11J3P0l12o95j90J98N1L63M85K29k85lj051o1
6718g02n1L07P98J52L68k57l96p62r6j3J88O38M03J76k83k65l80k45l37L82M40
6739F5N58K32n35l33n07j52N2K03M20N41K50j46l70r22p5K10J53N45J88K38j19
6760D96m40l13j75k26K52O23M29J39q8m89p38l46Q3L35M88N69J19l24k65n33k90
$$ y = [-428, 100, 510, 677, 955, -249, -430, -850, -484, -521, 160, 810, 991, 508, 227, -318, -971, -735, -338, -319, 582, 968, 406, 114, -679, -679, -863, -459, 246, 633, 653, 813, 302, -739, -750, -723, -511, 206, 552, 491, 422, 172, -320, -774, -729, -696, 207, 715, 876, 779, 163, -345, -717, -1041, -294, 297, 443, 748, 628, 317, -482, -790, -577, -287, 145, 892, 905, 542, -198, -317, -615, -580, -184, 286, 531, 734, 756, 349, -475, -818, -655, -403, 7, 514, 584, 585, 130, -527, -866, -746, -397, -25, 486, 499, 569, 257, -438, -628, -430, -379, -16, 469, 698, 413, 410, -641, -702, -753, -446, 352, 504, 872, 615, 219, -543, -639, -652, -464, 174, 577, 753, 470, 205, -175, -420, -757, -375, 65, 623, 855, 320, -13, -520, -672, -620, -417, 3, 544, 794, 648, 278, -644, -719, -509, -356, 189, 377, 615, 496, 56, -257, -432, -658, -406, 217, 646, 785, 697, 208, -530, -876, -793, -458, 30, 599, 718, 394, 129, -404, -694]
6781f94k99O97O37O50q8p47k4o02k53M03l95Q62M36M71q55m2m51l26Q3L16P36
6802E15j50N55l06o06o52j18N6M05L45M70K17j79l64j66o11k32K08P16M39L16
6822H58r9l91r45l25L34J22N49M50J68m42j47n78k69jL43L06Q15k24K19p67j73
6843a97m80j53M83N19L57L37n87j93p23O5k19J48P21O04J19m98n6j014q5L23L10
6864b19K81L71K06r4o20k58m14n5N78N8P52k34K0l0q45l07L4J96Q51M29M78o14
6886E64k30o94p06L40M26O52L03Qm7o78m56j21q9O01K86L30R4k11m51k62l38k22
6908i01M09M77O56J72l48o49k75m36J94L76M45M00J22k69m51j38l17l8K12L42
6928a7N82M47o76l04l98m82K27L80N77J78K08k70n10k31o52L96N47M1M01L84n27
$$ y = [-694, -993, -296, 341, 991, 903, 156, 132, -470, -723, -320, -715, 147, 583, 1054, 199, 157, -294, -620, -537, -221, 515, 365, 920, 614, 8, -644, -762, -706, -301, 44, 514, 731, 552, 188, 22, -589, -821, -613, 103, 542, 858, 759, 368, -577, -902, -568, -446, 103, 553, 721, 279, 132, -446, -715, -716, -373, -67, 748, 524, 743, -24, -197, -677, -830, -347, 172, 529, 866, 279, 86, -637, -572, -791, -643, 78, 682, 801, 303, 247, -767, -852, -529, -219, 62, 433, 639, 545, -75, -333, -747, -802, -224, -166, 586, 352, 372, 342, -503, -810, -776, -580, 271, 700, 1178, 564, 334, -360, -1066, -726, -300, 352, 655, 663, 616, -62, -518, -639, -728, -127, 159, 489, 583, 372, -79, -341, -679, -901, -492, -15, 641, 813, 465, -184, -459, -895, -701, -325, 120, 520, 642, 373, -78, -216, -533, -571, -359, -17, 565, 1012, 336, 32, -366, -848, -621, -241, 336, 514, 722, 452, -58, -289, -941, -545, 2, 43, 444, 828, 301]
6949C01p4m78k50m06N68O27K33K87k27o51m98k30K57M99K70N09Kl45l62m36o4
6970d68k8K16N65L08J43j89n29n62l40M24L89N90J25L24r88j19l77j75J76J65
6990c50N39M21M21n00n86k78k75p6L60L89O09O8k08n53m92M2l18L56R17O0j09
7011D37ll11m10l12l97O72M55L92j5l9j67p83K14m72N26L46O18j82O4o56o78k45
7033i46K71L83O97L38Rl00m67n36l65K59N44K57N34j35R5m94p29L1j35M69P76
7054E56j57L74k88n00j85m70J96K57O05j12M65k24n59l36l0n78M47R18L80m1k51
7075D67n36k16n01K41M60R4M11K18j82j14q66k02k0M58O20M71j54l21k62l65l46
7096f45K09M21K01N41l27J84n51n59j23q6L01O59L30L17m81m48n77R4j76M30O65
$$ y = [301, 227, -251, -501, -907, -339, 288, 521, 808, 581, -70, -568, -798, -541, -42, 228, 737, 739, 394, 32, -404, -468, -496, -280, 285, 593, 736, 547, 18, -544, -884, -460, -71, 519, 644, 968, -20, -139, -516, -691, -515, -350, 189, 610, 1031, 531, -55, -333, -608, -684, -324, 65, 674, 742, 534, -19, -511, -469, -787, -431, 486, 546, 437, 434, 123, -287, -599, -996, -324, 131, 523, 508, 469, 302, -481, -267, -739, -213, 133, 751, 569, 633, -23, -701, -946, -675, -292, 405, 743, 752, 452, -15, -551, -916, -657, -113, 144, 678, 543, 638, 144, -585, -554, -689, -220, 556, 399, 773, 485, -15, -200, -670, -474, -217, 388, 276, 741, 517, -42, -378, -408, -986, -539, 379, 759, 718, 467, -69, -285, -786, -545, -85, 9, 420, 638, 456, 342, -524, -726, -746, -288, 332, 803, 649, 328, 66, -299, -645, -436, -15, 186, 727, 400, 584, 33, -526, -649, -735, -434, 225, 555, 872, 391, -57, -634, -540, -716, -286, 379]
7117C79L50l2k91m08l77j98J55J60N10L53J93j46p16l33n76M77L08N45J46M08
7137I07l84m03n44j42J11K26O31L36o2j61l31n96j56J4N90J80L15K52j8m33o87
7158c55l26M58J22K83M62N5m84k07o09L7J34m9N30N28M3j39k68n08o78N00J25
7179c46O38O08j72j35l58n49j84p9M13O76Q2P4l08k72l39k56L12Q3N41j21L74
7200F82k5o63j97l19PM05L61j15K37L7p18K9o48M55L38M72K82J51q7p54j99o35
7222i04M84K49N46K03O4j30j95r43p4n3N91J98L72L48k91k58n92j96J27L61K92
7243A99K51M01m48l91n02o9k66O13M82K42J26k68j25q46n0O5M70K41M53O7j51
7264D94o39k94k38N9O41L52M58l72n2n79k01j49j07N27N55L05k60jl71o51m1k55
$$ y = [379, 729, 697, 406, -2, -379, -577, -422, -262, 248, 601, 794, 648, -68, -401, -977, -500, -192, 353, 499, 907, 523, 120, -424, -566, -455, -229, 402, 738, 676, 515, 184, -412, -568, -554, 36, 216, 531, 783, 765, 332, -355, -681, -223, -101, 182, 644, 699, 215, 8, -601, -564, -430, -479, 51, 579, 622, 483, 215, -293, -971, -471, -346, 292, 900, 728, 593, 235, -314, -498, -577, -164, 512, 594, 668, 360, 88, -251, -507, -195, -112, 429, 308, 682, 657, -6, -203, -522, -515, -110, 251, 136, 373, 410, -308, -279, -927, -472, -134, 338, 620, 771, 684, -70, -269, -904, -420, -171, 375, 578, 642, 512, 317, -626, -700, -753, -162, 36, 408, 756, 465, 207, -385, -581, -454, -93, 199, 450, 851, 403, 12, -490, -559, -825, -212, 270, 512, 638, 370, 245, -601, -651, -586, -116, 125, 578, 645, 494, -145, -439, -677, -618, 23, 375, 833, 461, 409, -170, -371, -520, -627, -100, 455, 760, 500, 499, 128, -523, -564, -819]
7286h19M92M20L55K31l19m67j99m93M80O7M10N32J7j4p19k69m42K47K31M26J84
7307C51K84k47k31l93o18K37K44P20O25l91l07n1o21l6J10O1L81N12J89j84n68
7328F7p52m6N04j87O48P51n80J99p22j48l87P7M38O99J87j32o4q33k18J32m9J55
7350b61L89M38K80j75n56o37jj15L85M24O29m29O8o88r6l22L5L94O34K74K8j82
7372E16m47k90n55L70J37O29L60k22J67o38m76L7j63O36M29k5L11n87l0q28j96
7393h65K72K03L46N17K98n29j04m86o06K50L97N39R9J84M5q56o2n08J88M21M23
7414A66M54L2l04l84m19q7J04Q3M25K15J35J45n06n60j33L5N85M77R2L4k64k03
7436A22o94q7J94J91M77K61m6o6n59j29l17R4L21L40L98J95lp24m26k04K35J01
$$ y = [-819, -327, 93, 448, 679, 360, -107, -306, -799, -319, -252, 158, 690, 707, 693, -26, -295, -737, -490, -259, 167, 351, 635, 388, 157, -236, -854, -617, -373, 347, 972, 581, 274, 223, -398, -434, -324, -263, 118, 630, 819, 635, 67, -685, -731, -227, -414, 234, 985, 405, 604, -118, -266, -653, -576, -138, 561, 748, 616, 552, -281, -499, -367, -416, -261, 128, 566, 846, 671, 115, -522, -523, -638, -253, 171, 800, 371, 439, -249, -345, -667, -632, -238, 396, 670, 698, 516, 69, -221, -776, -406, -269, 360, 720, 498, 665, 27, -449, -412, -575, 61, 490, 465, 776, 189, 159, -669, -865, -593, -390, -44, 473, 771, 242, 138, -348, -954, -704, -307, 232, 331, 515, 560, -296, -358, -866, -678, -257, 166, 620, 652, 348, -36, -455, -542, -438, -355, 70, 285, 420, 565, 59, -501, -634, -599, -14, 463, 555, 589, 325, 122, -572, -659, -465, -274, 203, 464, 418, 352, -207, -336, -653, -559, -238, 102, 500, 695, 692, -32, -458, -662, -427, -326]
7458c26N58O48k29j40n79j74m99M9M58L80N09M7k72l91m53l20K25K95M79J63J81
7479F09k96j41n71k1j10N11L61M51j59K8o91Nm20o7j65Q34M56R3k06p10n1n46
7501h06L71J50O15P2K51j40l25q59J21j45M55O20L09m7m88j91l45l10q7M26P02
7522C49J32K7k5m89m36j25KL10L42O11k5L0n61o22r0J05L29L75L40l6o2n08l93
7545d20m56K40O16L1K83J3L84p43po17L58J02L73O18k59K8n45l61r7j51Q46N2
7567B88L16mj72l21q64j40K36P54J97L87j18l72p0m27k46q8N40K61K43J45k28
7588C17k26n82K17l34L02Q02j1J09k91j53o75j59L60M16Q8O48j90j88p75r4j28
7609e47J62L52K83L59J96m57n44k3k75j98M70K17L05K66k03n41m70J47l9L0P67
$$ y = [-326, 232, 880, 651, 511, -68, -242, -741, -692, -234, 146, 655, 702, 430, 39, -414, -734, -509, -214, 265, 428, 609, 313, 172, -399, -420, -530, -19, 342, 793, 634, 662, -29, -24, -444, -511, -676, 158, 614, 707, 501, -209, -260, -806, -435, -285, 330, 402, 653, 513, 188, -671, -550, -695, -240, 380, 689, 642, 154, -37, -382, -692, -779, -353, 349, 481, 508, 483, -6, -442, -567, -565, -255, 87, 698, 673, 703, 142, -480, -570, -465, -136, 239, 579, 543, 481, -27, -420, -876, -636, -20, 11, 294, 307, 691, -52, -59, -676, -318, -216, 157, 775, 516, 544, -1, -362, -459, -610, 236, 288, 604, 600, 428, 107, -757, -897, -661, 93, 290, 677, 559, 187, 117, -310, -556, -644, -104, 157, 400, 545, 317, 91, -491, -274, -608, -306, 496, 485, 594, 303, 150, -525, -684, -324, 92, 180, 828, 638, 450, -325, -419, -547, -385, -33, 250, 609, 805, 348, -196, -219, -494, -692, -222, -5, 300, 566, 363, -178, -648, -501, -540, -510, 257]
7630B57L33j38q7o24j45j29K31K63K15K46K30o07j74k28l78L49M33J81L57O2k29
7651D18k13m68l41M06J10N32K6J54k40n00m01m5J26N18J53NM61l73n44j90o3q1
7673e50K83J71P28n5l17l84j58k57l7L96L75J33J86j31l01n95K0J45K20J90O90
7694G52p8m64l13j04m10QN82M18J37L60m83p47P7l52K41j2O12K84L39k15m54m30
7716b52m5j99M59J12M98K88n75l33k27m71J84L45L92L64O5m15k52k55k59k01L40
7737d37P84M5j34K29q19k2m82K25N22M52M30k16k17n49k08m07N16k9P52O2M7m2
7759E02n57l38j5r4K68K32O19k42K1m29k54l78M30j76P06J65J78j57m69k93k57
7780e38K67M58QP10m21k14l9m70k61J09J94O32J50j55k6k89m48l04K26J66L66
$$ y = [257, 590, 452, 365, -259, -404, -533, -302, -39, 176, 422, 652, 45, -129, -357, -735, -386, 47, 228, 585, 647, 418, 205, -263, -604, -198, -88, 444, 470, 624, 384, -116, -517, -562, -436, 82, 235, 240, 701, 328, -216, -406, -469, -550, -267, -96, 632, 577, 260, -124, -282, -539, -576, -180, 195, 328, 514, 383, 82, -513, -493, -348, -128, 62, 752, 674, 210, -103, -207, -617, -609, -27, 391, 528, 888, 405, -342, -265, -617, -376, -388, 224, 508, 847, 632, 178, -252, -297, -496, -37, 75, 573, 861, 286, -47, -274, -745, -561, -216, 176, 540, 605, 190, -62, -317, -576, -777, -437, 347, 392, 258, 487, -332, -354, -836, -611, -89, 363, 793, 577, 360, -189, -397, -804, -288, -317, 435, 497, 544, 502, -55, -393, -408, -502, -234, -2, 617, 375, 396, -33, -287, -665, -235, -411, 295, 460, 638, 481, 12, -281, -538, -271, 187, 195, 905, 484, 270, 231, -239, -500, -391, -197, 435, 585, 430, 404, 115, -333, -637, -411, -245, 121]
7801A21N80l0l66m31p08J56L81L57J11L50O9l54j09o05o6P8L97L36K19OP3q15
7823b50J1l18J86N0O04L3J28k81Ml58m37N0K97L66M35L63k80o23m73O6j48M14
7845a61L18n1O74n84l76j45k83L14P9N00P1J60l78j65j6l56K21k26M04M12J01
7866E13k70m43l26m9K03M66K05M57m03l39Q4o80k69O8P42J05O72O1m15k79n91
7887d88j36J50L87M86n1J58J89p42k99m22J98M73J58M65M27l31r19L9n33K25L95
7908a71P76m8K17l81j35r34L09j91K05O33J97J65k85k24p96J91p1K87J88P35j25
7929E42m79m7k04o83M35M63J62M84j43J65p27o22j90M30K62M66J96m7j9l87j07
7950e0l62j38K20O82L85m2j02m59o35k07o1L49Q24J69m0m27j31m91j87M22Q2K20
$$ y = [121, 701, 671, 305, -126, -834, -678, -297, 60, 171, 521, 590, 236, 127, -478, -544, -466, -69, 267, 486, 492, 565, -250, -239, -557, -371, -321, 283, 316, 444, 163, 167, -191, -628, -578, -281, 85, 520, 883, 603, -20, -493, -427, -575, -161, 157, 106, 780, 196, -180, -325, -608, -294, -215, 285, 356, 516, 138, -27, -43, -399, -178, -404, 0, 412, 513, 243, -200, -526, -575, -372, 94, 299, 756, 353, 14, 98, -582, -851, -783, -41, 64, 736, 797, 382, 103, -488, -624, -474, -87, 399, 348, 506, 695, -47, -346, -768, -570, -97, 61, 526, 953, 622, -297, -258, -791, -566, -171, 605, 557, 774, 393, 258, -676, -367, -558, -353, 280, 477, 642, 357, 133, -663, -472, -543, -256, -68, 667, 542, 63, 16, -188, -871, -436, 27, 189, 673, 530, 695, -32, -654, -844, -414, -152, 314, 510, 463, 444, 57, -50, -412, -550, -330, 352, 737, 695, 593, 134, -501, -708, -769, -420, 404, 573, 533, 106, -25, -516, -703, -281, -199, 21]
7972B1M67n1l9m32l69k04N8O11K56l8J91n64K32m42n25K14N78M12NK48k73k86
7994G0n25P0j83J75R52p5J56j40m64m12k64L08K82J78K90K05K4p81j55j80K41
8015b28M4L58K58K06l03o43k72k43O7N51N71K77j50j39k95m88l49J27N34N29J41
8036E53Q7l24k33l81j79K4R4O03L27j31k93J83o04j49QK79K23L14M85n70k28m57
8058c69j82K74O7K98N12m56M77q55o0l83K11K44L34M29K69n41k76j87j90l9M0
8079c83N25K50j80L8k8q16J9L76j08O52R0J62k63k50j91o64M24L40J81M13p1m8
8101D68m23m25k38K12K82O39k9q6K8l12m01k76P3K70K61N22o3j42m84k53o8K90
8123a55j00P5Q66l69K8m87k28k97K35L45L71K85Mk77k7m94k86m1K62N49M25L9
$$ y = [21, 488, 437, 398, -34, -403, -607, -549, 62, 318, 280, 471, -93, 139, -303, -828, -614, -36, 376, 381, 629, 356, 70, -455, -385, -568, -393, 559, 484, 640, 500, 36, -376, -640, -332, -50, 128, 418, 623, 647, -134, -289, -469, -228, -184, 174, 432, 638, 335, -308, -580, -823, -756, -205, 366, 643, 493, 354, 59, -429, -778, -651, -117, 412, 553, 640, 316, 83, -298, -477, -453, -359, 244, 571, 440, 147, 330, -274, -423, -415, -136, 87, 401, 886, 316, 88, -369, -551, -277, -210, 88, 600, 144, 621, -234, -294, -677, -466, -222, 112, 541, 810, 269, -7, -194, -384, -423, -383, 142, 392, 212, 250, 222, -594, -575, -199, -307, 345, 435, 597, 334, 84, -107, -771, -347, -7, 174, 587, 516, 468, 45, -380, -618, -406, -124, 515, 486, 400, 428, 116, -285, -561, -488, -218, 43, 565, 502, 360, -124, -377, -445, -155, -255, -180, 686, 317, 345, -142, -370, -667, -432, -87, 284, 569, 573, 296, 269, -225, -511, -552, -290, 259, 684, 723]
8145G23m87j04n40j35M9N40J21K49o5Mk22m47j31n6K25M97L69J14j92n38l50j94
8167e70K35K26M50J57J65n15l36j59J28j05k46P18K95J03l65j41o31k04J47O09
8187c9J64N53k88O5
$$ y = [723, 236, 132, -408, -543, -494, 46, 167, 416, 351, 355, 133, -314, -445, -501, -276, 221, 590, 704, 512, -26, -376, -570, -335, -109, 341, 498, 663, 148, -188, -347, -219, -324, -570, 148, 443, 546, 181, 40, -591, -795, -648, -39, 125, 678, 390, 455]
8191D55
$$ Imaginary data points
##PAGE= N=2
##DATA TABLE= (X++(I..I)), XYDATA
0@%%%%QqQj6J7k5L2m0N1n9P3q9J07j31J55j82K14k49K90l34L84m40N02n74O49
29C43p33Q28r29J041j165J305j455J618j802J999k214K452k715L008l329L687
45A939m090M542n057N644o325P129q088R257j0718J2609j5170J8844k4599L4969
59B0886n9414K17514J80515m23833q0420J42378r783j92123O7009K11424Q9444
70A63597l6877p622j01745j57071k3731J05055J6569J2607J39017J01069j18677
81I2191j32971j2357m7159r9440R8747K31613M0554j23842N420N7269j41493j95595
93b27063M2504J73368Q2080M1420N0285p4987j54759k0191N5667p4810o4990J79936
105H460K21803m8759j81615m1908J7568p6440m8252Q8142J05701N3150N1320j4209
$$ y = [0, 0, 0, 0, 0, 8, 0, 8, -8, 9, -16, 16, -24, 27, -32, 41, -48, 59, -72, 83, -99, 115, -134, 156, -178, 206, -234, 268, -306, 343, -390, 438, -491, 550, -615, 690, -765, 853, -949, 1050, -1164, 1288, -1427, 1581, -1748, 1939, -2151, 2391, -2666, 2978, -3347, 3782, -4306, 4951, -5767, 6842, -8328, 10516, -14083, 20886, -38528, 178986, 359501, -64332, -144752, -2374, -12157, -204280, -137271, 74153, 163597, 126720, 119098, 17353, -139718, -163449, -58394, -41825, -29218, 109799, 210868, 92191, -40780, -53137, -100296, -199736, -100989, 130624, 171178, 47336, 52756, 110025, -31468, -227063, -184559, -11191, 70889, 112309, 162594, 87607, -67152, -87343, -31676, -106486, -171476, 8460, 230263, 181504, -111, -42019, -24451, -100891, -149143, -61001, 44700, 97850, 149170, 134961]
117A34961j48659j25448L0530N0807j8403O0285J56707L3730j19656p0330j4527
128c0003r6844o4374J45795J81026k2116q6809M1635K3462j46664j33096N2350
139a35638J19491O5753N6602L0695p1308r6087j8195k0739o9181L2944J70549
150F4886R7256o4685o2039m194o9639j06865J9008J09565N3184K5881O9193m61
162A31090j42215j18257K4454N0663J324N0321J09186L2459p0806o9353n2480
173e3614o8848r151J02626J00704J1870p256J1561n0315j12473n5117L6986N4693
185c8334N8052P7007L0727o0695p8037l7614l9928l4475N4749J21772O2408k3484
197I2148l3522l9442p9046o0817K5958O7036M9428N2010M9322k8373j03103p4817
$$ y = [134961, -13698, -139146, -108616, -57809, -76212, -15927, 140780, 174510, 54854, -15476, -30003, -126847, -191221, -45426, 135600, 113484, 26675, 68310, 91772, -54892, -187988, -135638, -16147, 49606, 106208, 136903, 65595, -30492, -48687, -69426, -138607, -105663, 64886, 162142, 97457, 35418, 31224, -38415, -145280, -126272, -16707, 36477, 62358, 131551, 131090, -11125, -129382, -104928, -54265, -52941, -2620, 106566, 139025, 68219, -1134, -53614, -122462, -131613, -28987, 71717, 83587, 76331, 87892, 37577, -74896, -130013, -93027, -38334, 19718, 96725, 127452, 66757, -11280, -48894, -88822, -123297, -68548, 53224, 115632, 92148, 58626, 19184, -59862, -120679, -94721, -27685, 21743, 73753, 123075, 94702, -8401, -83218]
209h3218p198J2615K6086P0564P4598J3222l7326n3333p0141o0253J2222P3305
221b8857O1988L4924L1824p256q2821r2104j9630K7603L0190N4994P9408K7956
233A18219n4094p0400m3852l5632j5415M8418Q8441N4735K271k5194n1431p2830
245e6764m4623J5534M8465N4552N7274L2530l1522p4988o0925k6557p56L6816
257e0964P5663O3603P970l5081n0614n9923m7336M004N5379O4381M6077K1233
269I4392j8947o4430p0820l1333J1816L7711N8090N9765K3398l1868o2666n7688
281e2580l4764J936M3192O4159N2797J7569k3911n8205o5324l6079R456M2727
293c9027N8498N4028K1456k7002o0138n8505l4174J696M0519O4259N3508J4927
$$ y = [-83218, -90416, -77801, -51715, 18849, 93447, 106669, 69343, 16010, -54131, -114384, -102162, -28857, 33131, 68055, 99879, 92623, 9802, -82302, -101932, -74329, -44139, 10855, 90263, 118219, 64125, -6275, -50127, -85759, -101174, -52756, 35685, 90420, 92691, 67497, 16066, -56764, -101387, -85853, -37388, 17164, 74438, 106968, 75446, 458, -60467, -87024, -87780, -50964, 24699, 88302, 96272, 61191, 10577, -49346, -96682, -92678, -37299, 27082, 73159, 94392, 75445, 11015, -59805, -91138, -79322, -41611, 16479, 76244, 99642, 67774, 5108, -52580, -87344, -85408, -42216, 21943, 74740, 92309, 68398, 10193, -55131, -91210, -81754, -39027, 19471, 73499, 94955, 67953, 7815, -50690, -84864, -83168, -42649, 21610, 75118, 90045]
305I0045k6274n3433n8140l7419K792M1820O0687N1322J7555k5061n5389n7555
317d9050l5128K828L9814O1372N2006J6827k5003n3186n7691l6624L041M1858
329c8936N9439M8399J7240k2121n2127n8473l6217M534M1017N6705M6893J7669
341H4022k0348n2630n9394l4826O479M0090N3977M7498K0469k1435n4372n7395
353d7865l2143M144L7463N6156M9270J6392k2424m9617n5047l6042L417M0802
365c5494N4559M4224J7364j9766n0238n5987l2463L963L5500N5228M9286J5568
377H1744k4744m8049n0821l4252r93L9785N7332M3796J4287j8653m7192n6610
389d4370l2806O964L6776M8151M4910K1435k0956n2245n2187k8726K649L4021
$$ y = [90045, 63771, 10338, -47802, -85221, -82429, -40609, 20078, 71400, 88955, 63894, 8505, -49050, -84178, -81350, -41536, 19836, 71842, 88669, 63666, 10480, -47211, -83835, -80794, -38936, 20503, 68902, 86142, 64021, 11894, -46579, -82796, -78262, -37245, 19460, 66353, 84022, 63674, 11044, -48350, -83176, -76697, -36607, 17370, 64868, 85337, 63902, 9530, -47865, -80008, -75864, -38401, 17755, 67025, 83417, 60993, 11376, -43671, -79713, -76296, -35494, 19065, 63289, 80653, 60887, 10649, -45338, -77801, -73838, -38338, 16890, 66176, 81744, 57000, 8951, -41870, -76122, -77115, -37330, 20002, 63798, 78085, 59432, 12240, -44370, -77176, -70212, -33436, 14715, 59625, 81060, 60104, 7859, -44328, -73054, -70405, -36384]
401c6384N3139M4915J4643j9567m5517n3664l5284O038L9997M8828M0369J9116
413G6629j7267m9539n3293k8517L641L2311N1628M6539J3644k2750m3280m6450
425c6704l4592k76L7775N2551L9218J3841j6097m4744n3134l0075N318L3609M7446
438A4136M4576J7017k2778m6695m4789k8930j131L3062N2889M1392J1953j7838
450E2864m1186n0062l1858N941L4252M4317L9506J8992j7796m7274m8585k5718
462f6607K968K9857M8033M2771J3405j9061m1158m8087l1962L591L7144M6133
474A7027L4986J4157j3055m0527m9923k9774L274L2675M6852L9518J2262j9032
486D8440l8971m3018l0599j036L2572M8726L9229J1620j8289m0953m4157k6768
$$ y = [-36384, 16755, 61670, 76313, 56746, 11229, -42435, -77719, -71681, -31684, 17144, 57513, 76629, 59362, 9823, -43470, -71987, -68346, -36035, 15593, 62132, 75776, 53026, 9746, -36704, -71296, -71572, -33797, 18754, 57972, 71813, 55716, 10972, -42162, -72237, -66919, -33310, 14136, 58712, 75729, 52951, 6256, -38533, -67463, -68594, -35532, 17357, 58749, 70702, 52864, 11678, -38384, -70242, -64301, -30049, 14268, 53774, 72766, 54970, 7696, -40889, -66607, -63639, -33782, 14251, 57022, 70427, 51366, 10208, -37879, -69841, -66250, -29106, 17027, 52013, 66170, 53115, 12588, -37335, -67109, -63835, -31160, 15692, 55210, 67472, 48440, 9469, -33549, -64148, -65184, -32612, 16114, 55343, 66963, 48674, 7721, -36436, -63204]
498f3204K560K8282M3473M1632J7663j9379m5492m4228k2651M513K6519L9791
510I479L9458K0237j6674m4861m6490k3691N611K8528M1111L7167J4796j6014
522D8657l8799m4044k9679J904L3599M4968L4136J0556j5137l6380m1510k7854
534e9583r61K6621M6310M3048J1626k5468l8795l2266k2525p298K3146M8330M3433
547E5618J0289k2781l9169l7918k1761K197K2866L7811M1060J9651j9806m5622
559B435l8992j7492P33K1423M1031L9980J3036j7734l3957m0145k9959Q6L2051
572b7504M3820L2475R497j6103l4566l6650k4044m203K3077M7565M2043N519k6181
585C4745l0527k6951k7089j1405K5594M9769L8218O907j9499l4360l3992k0562
$$ y = [-63204, -60644, -32362, 11111, 52743, 70406, 51027, 5535, -38693, -61344, -56831, -30312, 9479, 48937, 69174, 52500, 7639, -38851, -62542, -56931, -28403, 12708, 49875, 64671, 48657, 9858, -34186, -63865, -61961, -28362, 16606, 50742, 61298, 46161, 9781, -31729, -59583, -60544, -33923, 12387, 55435, 67061, 41593, 2798, -29468, -51993, -59291, -36145, 12185, 55618, 65907, 43126, 3957, -33961, -55722, -53525, -30659, 7152, 48212, 67863, 48057, 2435, -36557, -54049, -53316, -31893, 9138, 49118, 62154, 44420, 10463, -29682, -59641, -59555, -27504, 16316, 48791, 58288, 42185, 7619, -29031, -53075, -57278, -34201, 13364, 55407, 60926, 34745, 4218, -22733, -49822, -61227, -35633, 14136, 52354, 59261, 39762, 5402, -28590, -49152]
597d9152l532J7614M0813M6246J4292k6898l8817k7404k1643q736K4506M9268
609A6557L3555J827j4225k4213l8649l3110J375L2447L7619K8484J3394j2233
621D2828l4808l5574k1815n547K1108M6459L9072J880k1041k1392k7842l5989
633e2661j0479L3591M8859K7671M147j2117k9275l7492k3536J202K0531L7164
645G605L8839J2159k2535l2174k5854k3086j1341K2170M8080L4877J909j6409
657C4240k3441l2539k8883l393K6255L8864L1171J1354j3613l0996l3807k5134
669d9922m785K6173M3905L0525K330j4049k1585l3313l2265k238L1332L8515K4302
682C8925Q256p626k7371l6213k5660j907K4156L9469L1711N418j5628k2722k8512
$$ y = [-49152, -52684, -35070, 5743, 51989, 66281, 39383, 566, -26838, -48481, -57217, -32711, 16557, 50112, 51939, 37714, 13501, -25148, -58258, -56883, -24436, 13183, 41667, 55061, 42828, 8020, -27554, -49369, -54916, -33808, 12651, 51723, 53603, 32562, 11170, -16672, -52661, -63140, -29549, 19310, 46981, 51128, 39011, 9736, -27756, -51292, -50090, -29559, 7605, 46444, 58603, 36068, 3894, -21960, -45046, -56387, -34217, 13863, 48740, 50649, 34240, 10799, -21740, -50623, -54016, -27761, 11103, 42274, 53628, 40015, 9019, -24788, -49922, -54707, -28534, 15371, 45896, 48226, 34177, 12592, -20721, -52986, -55224, -23892, 14623, 38925, 47181, 39555, 12184, -24029, -49689, -51596, -27440, 12029, 43740, 49158, 33530, 10808, -17704]
695a7704l0178q577K7836M3432K8015O141j1321k8077l5441k2666J735K0510L2772
708F477L3401J4574j7811l3102k7034j8107p182J8383L9984L2982N114j3544k1850
721A2285l2011l0355j488K9916L4623K0752J0143k149k4997m0660k9041K865K7600
734b2517L4848K5755P768j1410k3704l0331k6734n175K5863L8435K6154M987r262
747C4677k2827l2076k5722p67K2388L1264K8201J4638j0297l2281l3164j6611
759d2577J605J4394K8112L3778J8134j2408l5045l3263j6988K117J8915K9215
771E989K8236J2468q899k7601l2893k2718K57K2676L1675K4647R347p601k2820
784A2763l2203k5286k003K2119L3033K7195R706j0110k5433k9839k1987l507J8275
$$ y = [-17704, -47882, -56459, -28623, 14809, 42824, 48965, 37644, 9567, -25874, -48540, -46805, -26295, 6477, 39878, 54452, 36641, 3539, -23495, -41602, -48784, -30401, 9583, 42565, 47679, 34135, 12285, -19726, -50081, -51569, -21653, 12970, 33722, 43865, 41716, 16719, -23941, -52982, -50117, -22517, 12331, 38086, 45854, 34444, 10740, -19591, -46325, -51500, -25637, 12798, 38952, 43939, 34677, 11850, -20226, -45948, -46715, -24327, 6937, 35138, 49776, 39479, 7198, -25966, -42577, -40972, -26578, 1534, 35312, 53446, 41038, 5993, -27270, -44258, -42141, -23226, 5989, 34225, 46693, 37794, 10193, -22700, -45418, -45161, -22485, 9190, 33837, 43184, 35583, 12763, -19440, -44726, -46729, -24610, 8423, 35618, 45324, 35214, 9781, -20058, -42045, -45552, -27277]
797b7277L3323L1203J1254j3009k9614k9277j7204P2J6377K7689K8867J5645r649
810C8400l1380l2337j5773L577J5317K4254K8085J7612q095l1282l2682j6929
822d1233J510J5628K7583K9222J4165j0998k7793k8257j9371m355J7309L3907
834G317K9582O994j3562k1911k5390k1914n380J9220L2752K6198Q979r487k4661
847H737k8639j8459j599J4586K7694L0141J3765j1984k7133k5924j8458n036J6345
860b5964L1790K7088Q713q097k1703l1240k3188J687K1513K4978K2077J4999n604
873C7049k8663l0515j4922m16J2800K7268L0311J1071j3025k2315k4378k1742
885c7477n356J9126L0440K3131R302m765k2212l2099j9234P52J6185K4851K7397
$$ y = [-27277, 6046, 37249, 48503, 35494, 5880, -23397, -40601, -40529, -24152, 3537, 32404, 48049, 38400, 7020, -25317, -41090, -37513, -22196, 2058, 30143, 47755, 39660, 8378, -24304, -41233, -39723, -24095, 3488, 32710, 46875, 35877, 8084, -20173, -39544, -43899, -26590, 7317, 36899, 43893, 30331, 8420, -16970, -38884, -44264, -25044, 7708, 33906, 42885, 33398, 8737, -19902, -38361, -39960, -25374, 2320, 32461, 46226, 34242, 7109, -18815, -37273, -42309, -25964, 5826, 32914, 41627, 33530, 11827, -19413, -42601, -40914, -19401, 5577, 27654, 42653, 37049, 8386, -22129, -37051, -37467, -24667, 2601, 32912, 43983, 30958, 8643, -15735, -37477, -42833, -23707, 6733, 29864, 39166, 34401, 12189, -19910, -39144, -38392, -22207, 2644, 30041]
898C0041J3509j0968k5557k4386j8261n469J6798L1344K4381O480o438j8890k9714
911a7130k2924J519J9036K2758K2255J6657o385k8135k8120j4070j722J1166K7806
924B711K8159R702r811k0411k6539k2825l62K0848K3895J8815J4970j580k7862
937I710l2706j3607M204J0222K1898K9548J3586j3442k2793k0407j9393p807J7800
950b3187L1029K0186O764k514j8817l2107j9887M285J5169J8956K5763J8236j0727
963C3149k9649k1289j1615o623R007L0705K8370N517j0486j5630k5843k3231o2
976c7680K0216K0907J8730J5801k287k7537k8828j1362K12P562K3837L0260J0088
989C9919j2727j8994k0298k2344n581J9853K7444J6986R251j28k0899l1623j6463
$$ y = [30041, 43550, 32582, 7025, -17361, -35622, -41091, -24293, 7051, 31432, 37912, 31474, 12584, -17130, -40054, -38535, -19499, 3259, 25514, 42171, 35786, 7651, -20469, -34539, -36261, -25095, 2711, 30870, 40572, 30761, 10350, -16189, -39014, -39376, -18528, 5367, 24182, 39152, 37572, 9710, -22996, -36603, -32399, -22177, -279, 29269, 42855, 29413, 6620, -13787, -33180, -40987, -23187, 7842, 28028, 34792, 32278, 13461, -18646, -38533, -34248, -19079, -123, 25640, 43876, 33149, 3500, -17789, -29404, -36027, -27020, 3685, 32055, 37572, 27086, 11456, -14387, -37618, -37680, -17464, 3443, 22173, 37974, 35687, 8150, -20678, -32040, -31828, -24266, -429, 29831, 39919, 27192, 8198, -12100, -34444, -40025, -20172, 7272, 24258, 33509, 33381, 12482, -19141, -35604]
1002c5604M103J1105J9118K7353J5095j2548k3840j8233j5136r101J2886L0837
1014F035K1821M905m130j5031k8550k1756J958J7464J8534K1115J6577o658k6513
1027E771k2775j1275m948Q145K7007K7041O086r204j4353k2781k3514k665K0222
1040a7243K2531J5074J2956L57k3332k9146j3265J822R084J9915K6941J2427j1008
1053B7113j9610j9044j9029o642J6578K7337J7366O391j338j5858k8085j9235
1065c4056K027J3751J8170K2684J5099q181k3046k0272j3565o845J0793K7517
1077D076K2394N157n730j4079k3753k1246j147J7210J9517J8146J4064l093k3149
1090H367k4792j2368j458Q724K2036K3912R669p496j6316k1249k0256m050J7057
$$ y = [-35604, -31501, -20396, -1278, 26075, 41170, 28622, 4782, -13451, -28587, -37688, -24802, 6035, 27856, 32761, 28631, 13600, -14950, -36706, -34748, -17284, 1250, 22365, 38942, 32284, 5771, -17004, -28279, -33227, -25082, 1925, 28966, 35052, 25848, 11495, -11286, -34800, -37465, -17243, 5288, 20362, 33318, 33675, 10343, -18803, -32068, -30246, -21162, -1247, 25694, 38121, 27113, 7503, -11541, -30570, -37212, -20634, 6703, 24069, 30460, 29122, 13264, -14821, -34056, -32029, -18278, -108, 22576, 37675, 29494, 6448, -13824, -27389, -34234, -23441, 4076, 26470, 31627, 25897, 11818, -11935, -33181, -34328, -17118, 2399, 20545, 34609, 31516, 8367, -16425, -28793, -30251, -21527, 509, 24421, 34090, 26594, 10278, -10971, -31227, -35277, -18220]
1103a8220K2924J6665R455j140j8292k6826j6007J280J1274J8916K2122J2143
1115C4294o803j9073k0081j6557n853J3256K5002J9492O442l791j4900k3292j8576
1128c0440j541J3498J9522K0145J2265n061k0389k1393j3702m024R851K3203K1822
1141B3756Q006o447j5248k0552j8664l614J4190K1113J8064J0166k527j7874k3906
1154a3537j5654p36J1613J9610K0051R720m801j6248k1079j7862l871J4253K2115
1167C574J7658P907k832j5188k2288j7977k312J3198K0335J8912R590m855j6468
1180I254k0329j6077m599J1187K3163K0147P379n909j4841j9465j6595m453J1727
1193a9411K1021J9845Q934n018j6169k0339j6047l519J2283K0307J8543Q533l461
$$ y = [-18220, 4704, 21369, 30824, 29684, 11392, -15434, -31441, -30161, -18887, 29, 22151, 34294, 27491, 8418, -11663, -28220, -34073, -20817, 4185, 23677, 30119, 26328, 11428, -11864, -30440, -31981, -18483, 1039, 21184, 33449, 28388, 7999, -13394, -27096, -31120, -21269, 1934, 23756, 31762, 25315, 10067, -10485, -29149, -32763, -18573, 2540, 20604, 30770, 28243, 10369, -13537, -29191, -29927, -18314, 1296, 21347, 31067, 26266, 10018, -11061, -28923, -32794, -18541, 3574, 21232, 29139, 26307, 11119, -11169, -29146, -31458, -18260, 2075, 20987, 30577, 25722, 9254, -11075, -27152, -31751, -20564, 2599, 22746, 30125, 24216, 9375, -10090, -26685, -31138, -19411, 1610, 21455, 30389, 25371, 9202, -11137, -27184, -30703, -18420, 1887, 20430, 28963, 25502]
1206B5502j4576k1981j8060k037J4949J9648J5475Q540j302j4181k3203j8217
1218b9443j408J4151K0548J5571P318k403j2098k1286j9004l962J4013K2020J6620
1231B0637O364l141j3022j9991j7859l291J1386K0833J8044Q825l808j5771k0028
1244a0822j5163k867J1208J8393J8167R844l030j5411k2501j5222j62J1838J6946
1257A218J5523J0066J8j4765k3644j7400J86J4198J7428J3867Q309P95j2932k2915
1271a0048j8879q76J4613J8338J4740Q310j818j3973k0085j6299k428J0563J9080
1284A238J8039Q675m500j5334j8219j3973k659R090J6740J8029J2319l058j8355
1297H032k1600j1003P96P884J3355J8153J4436l002j8668k1635j1819m11R758
$$ y = [25502, 10926, -11055, -29115, -31152, -16203, 3445, 18920, 27460, 26158, 11977, -11226, -29443, -30851, -16700, 3848, 19419, 26737, 24334, 12236, -9050, -28054, -32016, -18003, 4017, 20637, 27001, 23860, 10838, -9153, -27012, -30303, -18917, 1916, 19960, 28785, 24977, 9206, -10822, -25985, -28852, -17644, 749, 18916, 28760, 25730, 10319, -12182, -27404, -27566, -15728, 1218, 16741, 26807, 26825, 12060, -11584, -28984, -28798, -14600, 2828, 16695, 25004, 25799, 12867, -10048, -28927, -29803, -15190, 3148, 17888, 26198, 24380, 10407, -9678, -25977, -28405, -17842, 1238, 19277, 27952, 23452, 8118, -10101, -24074, -26733, -17643, -903, 17126, 29445, 26387, 8032, -13568, -24571, -23775, -15891, -2536, 15617, 30053, 27051, 8383, -13252, -25071, -25482, -15724]
1310a5724J6049J6505R459j574j4198k0306j6784j085J2534J7593J4321Q419j465
1323B3744j4027j8880j4874l065R248J8149J9057Q598o218j4522j5709j2659n691
1336b6849P430J9333J9278R458n663j6000j8152j1057j670O900J4561J9294J2366
1349B9229m797j7728j8494j0619j357P290J5179J7949J0022l162j4537j8481j4066
1362b3572l133J0041J7685J6666P720m276j2233j6457j4637n841R366K0973J8202
1375B0504M750o447j0581j4504j5302n984R367J9775J7198O450m753j2809j5947
1388h283j2500l626O423J6533J9064R660n300j5017j5093j3064m545Q375J8106
1401G33J6530P184k412j2007j8920j5060j780J1427J5521J4035Q657j605j3611
$$ y = [-15724, 325, 16830, 26289, 24715, 10517, -9789, -26573, -27658, -15124, 2469, 16790, 25209, 23744, 9717, -9163, -24037, -27102, -17854, 295, 19352, 27950, 21732, 7210, -8499, -21158, -26849, -19419, -86, 19192, 28650, 22987, 6987, -11165, -22222, -23892, -16992, -2431, 16863, 29229, 24432, 6704, -11790, -22409, -23766, -16476, -1297, 16652, 26674, 23512, 8975, -9506, -23572, -26705, -16664, 1021, 17687, 25407, 21131, 8898, -7559, -22196, -28037, -18671, 2302, 20504, 25254, 18807, 8226, -6278, -21580, -27564, -18197, 1578, 18776, 25226, 20473, 7664, -8283, -20783, -24409, -17986, -1453, 17611, 27271, 21971, 6954, -8139, -21203, -25748, -17373, 733, 17263, 24447, 22035, 10028, -8892, -23952, -25732, -14305, 1216, 15251, 23908, 22303, 8692]
1414H692j7539j2796l116Q192J7151J7254O165n190j0100j3697j5831o744R761
1427a7798J9916J5828N205l190j0725j6576j4747l020R011J5891J6542R029m105
1440B1261j4216j5782j2008l555P821J6952J5751P249l183j1189j6862j4475k048
1453b4284J0454J4503J3234Q907l02j2662j8790j3004j698Q375J5253J5768P529
1466B3283k913j1706j5475j4461l668R714J6113J4757P557k618j2408j6962j1805
1479b0592j526O484J4707J6612Q462m698j2547j4010j1781n166Q077J6586J4989
1492A5597O366j517j0692j7724j4046q87R445J2745J3970J0465j877j4244j6605
1505i004j0510l026O193J6408J6398O421m694r916j4858j3662m147J0425J5105
$$ y = [8692, -8847, -21643, -24759, -16567, 584, 17838, 24003, 18813, 8713, -4984, -20815, -27559, -17798, 2118, 17946, 23151, 19961, 9236, -7340, -22087, -25107, -16096, -205, 16337, 25366, 21261, 7045, -8737, -20745, -24300, -16479, 473, 16224, 23473, 20290, 9101, -7761, -22236, -24284, -13830, 673, 13907, 22814, 22512, 9850, -8940, -21944, -23642, -15267, -14, 15754, 23283, 20370, 8664, -6811, -21272, -24940, -15226, 887, 15644, 23201, 20583, 8175, -8787, -20592, -22118, -15634, -927, 15685, 24147, 19449, 6902, -7108, -18889, -24055, -15978, 608, 15597, 21963, 20446, 9754, -7970, -22016, -22903, -13458, -713, 13257, 23722, 21845, 7601, -9004, -19514, -22540, -16347, 61, 16459, 22880, 18186, 8270, -6588, -20250, -24397, -13972, 1133]
1518A133J2019Q053K25j2453j8126j0715p06N508J2345J7158J0325m888j4141
1531E737j3019j1002m342O399J6579J4599O361j499j0464j6938j3501q12Q724
1544a3178J2679J3358R220j824j3150j4628j0315l690N652J5383J5611O305l380
1557A8043r489j4261j3626l824Q792J4924J2885Q203j625j2747j5551r569k935
1570b0780N248J3738J6502Q291m425j1675j3487j1524l755P955J4059J2334P531
1583B0012k6j0965j7047j1254j105O811J1946J4539Q903k744j1755j3555j1118
1596a7358n273P331J6566J3542M395k290q052j4469j3369l050Q683J3659J2661
1609A2976P916k243j1911j3940r566l047M387J3671J6000P025l599j0509j2599
$$ y = [1133, 13152, 21205, 21430, 8977, -9149, -19864, -20570, -15062, -2717, 14441, 24766, 19878, 5737, -7282, -18284, -22626, -16227, 352, 14951, 21312, 19813, 9349, -7589, -21090, -21902, -13178, -499, 12859, 22079, 20255, 7105, -7523, -17838, -21528, -15876, -493, 15118, 21423, 18043, 8554, -5707, -19333, -23157, -14365, 559, 13444, 21647, 20022, 7275, -8276, -17845, -20780, -15532, -1794, 14708, 22999, 18574, 6899, -6588, -18112, -21867, -13912, 147, 12481, 20012, 19986, 9021, -8026, -19280, -20385, -13574, -1628, 12911, 21814, 19070, 7315, -6240, -17358, -22631, -15300, 1266, 14808, 19203, 16913, 8861, -5608, -18977, -22027, -13344, 315, 12976, 20892, 18649, 6738, -7202, -16768, -19815, -15428, -1757, 14243, 21268, 17669, 7160, -5439]
1622e439j2264l683P964J3398J1941P954k75j0839j6454j1036r19P161J1765J2662
1636A1936Q319j689j0982j3904j1820k980P723J4113J2298N454r53r135j4085
1649e705j2645k749P676J3321J2170P390j642j0491j3765j0411l205N974J3421
1662f61J3560O670j969j0100j4052j0896j777O424J1952J1813Q476m48j1235j5333
1676g576j0270r91O752J1149J1977P975p93j0218j4521j1138j786P167J2238J1464
1690A1429O708k40r536j4958j1184j407P300J1548J1838P454j522j0533j3374
1703f477r656l095O121J2169J2988P402k513j0134j2985j0206k240O000J1950
1716f76J1821P659j103j0303j4462r296j485N870J0551J2121Q291j114j1014j3933
$$ y = [-5439, -17703, -21386, -13422, -24, 11917, 19871, 19596, 8757, -7697, -18733, -19652, -12491, -726, 11936, 20255, 18566, 7584, -6320, -18140, -21120, -13397, 716, 13014, 18468, 17515, 8380, -5705, -18350, -21099, -13423, -102, 12068, 19458, 17816, 7325, -6440, -16851, -20056, -14082, -661, 12899, 19569, 17600, 7500, -6552, -17448, -19225, -12801, -849, 10964, 19440, 18992, 7757, -7576, -17846, -18837, -12085, -936, 11041, 19016, 18223, 8005, -6516, -17654, -19440, -12273, -35, 11429, 18137, 17897, 8361, -6597, -17781, -19188, -11888, -340, 11498, 18952, 17430, 6897, -6477, -16133, -19228, -13107, -938, 12050, 19452, 16939, 6805, -6180, -16386, -18626, -12626, -676, 11145, 18804, 17701, 7398, -7064, -16360, -17845, -11975, -1424, 10697, 18988, 17874, 6860, -7073]
1730g073r483j347O195J0776J1728P447q90r767j3942j0365j837O800J1127J1282
1744A0651P286o23j0147j3585j0055j495O015J0896J1932P498j835r616j3045
1757f123r379k484N562J1809J2186O322j784q890j3073r985j755N729J0978J1430
1771A0543P791j495j0274j2901q963j696M743J1038J2358O718j794r503j2580
1784f015r418k289O154J0869J0940P199l74r737j3435r468j243N463J0200J1157
1798A0003P583j454r765j1956r430k800O106J1507J1157N748j239p976j2677j0587
1812a5780j602O750R936J0907P140j611r403j2146q303k984M868J1114J2303N963
1826A7152k310q421j1362r748k313N774J0463J0650O685k17r630j3175q329r71
$$ y = [-7073, -16556, -17903, -11708, -932, 10796, 18243, 17353, 7586, -6356, -16721, -18558, -11758, -631, 10651, 17937, 17314, 7167, -6418, -16473, -17968, -11953, -1057, 10875, 18373, 16538, 6922, -6123, -15502, -17986, -12424, -615, 11571, 17893, 16109, 7219, -5854, -15839, -17594, -11865, -887, 10543, 18334, 16839, 6565, -6336, -15299, -16995, -12252, -1214, 11144, 17862, 16068, 6565, -6015, -15433, -17722, -11568, -699, 10241, 17440, 17066, 7329, -6106, -15574, -16817, -11354, -1154, 10003, 17586, 16132, 6367, -5589, -15019, -17819, -11713, -206, 10951, 16699, 15460, 7484, -5193, -15780, -17382, -10632, -696, 10211, 17351, 15740, 6337, -5809, -14112, -17096, -12228, -1114, 11189, 17152, 14842, 6421, -4941, -14689, -17002, -11228, -765, 9885, 16570, 16353, 6723, -6452, -14781, -15752]
1840a5752M856R269J1431P764j799r685j1400q749k794N435J1059J0420N795p96
1854A5054p282j2993j0190j467O568J0098R892O543j246q814j1339q689k721M695
1868a1891J1591J1219N134k345p320j0229j0158l340O135J1112J0150O144r64
1881A5238r022j1937q063j331L860R071J1961P457k276r212j0828q607k346N824
1895a0211R776R809N684L70q012j2664r624p91N882Q988R600O541o14q099j0931
1910d296r135l830N801J2218J0333L579j877o141j0009j0354l411O111J0886J0150
1924A0025N365j353q447j0746p400k269L189R788J2136O259k709q166j0250q592
1938a3170k164M889J0070Q856O407K14p816j2843r075m40N798Q427R146O772q48
$$ y = [-15752, -10896, -1627, 9804, 17568, 15769, 6084, -5316, -14065, -16859, -11424, -365, 10055, 15850, 15054, 7772, -5221, -15411, -16878, -10310, -212, 9680, 16223, 14977, 6163, -5176, -13865, -16586, -11891, -300, 10919, 16053, 13708, 6388, -3841, -13999, -17339, -11204, -92, 10058, 16202, 15238, 6216, -5721, -13784, -15115, -11255, -2184, 9777, 17234, 14958, 5746, -5082, -13689, -16035, -10211, -435, 9374, 15058, 15428, 7416, -5248, -14872, -15663, -9781, -793, 8807, 15348, 14734, 6635, -4296, -13431, -17261, -11460, 758, 11091, 14670, 12793, 6652, -3357, -13711, -17122, -11011, -125, 10025, 15390, 14037, 5590, -5156, -12556, -14825, -11636, -1848, 10288, 16547, 13838, 5672, -4578, -13170, -15334, -10445, -375, 8481, 14888, 15102, 7286, -5557, -14632, -15072, -9274, -847, 8299, 15071, 14223]
1953A4223q085j0480q820k990N441J1408R518L374j095n719r870j0131l324N875
1967a0675J0621R544N333j975p086r707p884l362M062J0077J1218N256k714p440
1981E268r518q337k429N078R481Q837N726N2p361j1916q428j018N400Q336Q872
1996H043N937l30o631j0997r618k228O286J0047Q009M543q3o182j0801q749k756
2011a5510N634R633R152N340j857p006r082q144k658M121R689R784M763j093p058
2026E708r317q791j964N107Q218Q971N962j77p593j1118p856r91N042P653Q664
2041G518O229m63o830j0727q644j446N230R169Q446M350k1o343j0108q924j952
2056a4516N200R063Q064N506k63p303r573p713k070L619Q464R667O158j699p785
$$ y = [14223, 6138, -4342, -13162, -16152, -10711, 697, 10215, 13589, 12494, 6775, -3095, -13226, -16550, -10675, -54, 9490, 14823, 12848, 5762, -3945, -11829, -15191, -11129, -1052, 10166, 15422, 12708, 5268, -4250, -12587, -15016, -9938, -457, 8380, 14106, 14158, 6797, -5119, -13547, -14565, -9165, -829, 8043, 13980, 13650, 7019, -3978, -13596, -15824, -9538, 509, 8518, 13061, 12978, 6796, -4005, -12754, -15510, -9876, -243, 8909, 14249, 12392, 5386, -3696, -11840, -14498, -10377, -688, 9096, 13859, 12766, 5708, -3609, -12400, -14364, -9257, -1039, 7932, 13894, 13717, 6124, -4994, -12850, -13841, -8799, -1146, 7518, 13747, 13284, 6454, -4273, -12917, -14363, -9133, 36, 8482, 12832, 12811, 6468, -3640, -12564, -14516, -9316, -253, 7811, 13317, 13054, 5751, -3822, -11535, -13605, -9986, -1522, 8145, 14303, 12604, 4819]
2071D819r336o896k262L674Q594R113N856m55p246j0179p580j830M991P824Q379
2086G466N450k95o895r372p568j954L968Q200Q697N289p20o479r317q020k141
2101a3691L751R049R038M861j169o397r049p321k819L915Q460R449M986j055o692
2116E316r260p195j907M112P959Q401N514n76o914r312o906k043L524P605R646
2131G964N234j472o955p934p667k376L683Q892Q557M263o40n457r396p615k295
2146a3214M636P987Q516M436q66o337q682o529k450L102Q471Q775M549j353n335
2161E706q649p653k542M370Q058P626N099j78o389r137p039j593L467P573Q422
2176G141N391o55o930q381o651k296M413O858P830N345o12o031q729p016j863
$$ y = [4819, -4517, -11413, -13675, -10001, -1407, 7706, 13562, 13107, 5861, -4318, -11898, -13728, -8737, -913, 7466, 12916, 12621, 5726, -3646, -11214, -13168, -9200, -1000, 7697, 12986, 12266, 5787, -3530, -11550, -13691, -9940, -891, 8147, 13008, 11839, 5442, -3607, -10928, -13747, -9832, -1372, 8077, 13063, 12008, 5316, -3944, -11139, -13046, -8934, -975, 7426, 12940, 12364, 5450, -3862, -10768, -12811, -9287, -1682, 7964, 13198, 11726, 4771, -3163, -10830, -13206, -9523, -631, 7926, 12189, 11549, 6092, -3304, -10919, -13214, -8578, -591, 7925, 12361, 11495, 5158, -3524, -10053, -12503, -9401, -930, 7845, 12394, 11041, 5706, -2943, -10596, -13138, -8768, -710, 6916, 12015, 11837, 5448, -3689, -10728, -12321, -8854, -1281, 7141, 12532, 11877, 4947, -3434, -10085, -12381, -7968, -1110, 6720, 12065, 11453, 5422, -3307, -10323, -12186]
2191a2186L573P450P993N022m16n862q723p517j986M024P558Q042M747o49n554
2206E516q808o802j682L311O983Q454N554j149p177p784n749k095K776P105Q434
2221F887M838p50n784q601p003j157L432O368P439O027L95o612r485o430n92L101
2237g927O334Q239M897q95n481p699o869k840L710P911P268M389o92n437q107
2252c199o220k077K708O886Q756N053j330o646p032n297k717J961P209Q415N357
2267A1827n45o579q031n967j195K763N730P773N647q4o782q379n482j781L484
2282g601O719P082M379k98m782q167o932k240M148O853O912M957m55n532p819
2297b776n990k246K106P133R035M474k067n845o056n837l247K671P395P808M670
$$ y = [-12186, -8613, -1163, 6830, 11852, 11436, 5574, -3149, -10666, -12652, -8628, -1070, 6972, 11719, 11070, 5516, -3292, -10094, -11776, -8465, -1482, 6972, 12526, 11377, 4200, -3584, -9333, -11428, -8652, -1547, 6887, 11725, 10975, 5191, -3410, -10413, -11570, -8138, -1770, 5669, 11696, 12091, 5479, -4006, -10436, -11028, -7927, -1593, 6646, 11543, 10648, 5167, -2532, -9401, -12241, -8531, -620, 6648, 11037, 10345, 4908, -3199, -9419, -11496, -8788, -1902, 6854, 11907, 10577, 3931, -3101, -8398, -11115, -9154, -1945, 6470, 11827, 11282, 4703, -3328, -9295, -10490, -7727, -1997, 5776, 11423, 11339, 4557, -3822, -9304, -11085, -7601, -882, 6200, 10579, 10281, 5499, -2668, -9600, -11840, -7692, -839, 6073, 11030, 10575, 5043, -2776, -8766, -11012, -8906, -1773, 7262, 11736, 9669, 3824, -2232, -8069, -11316, -8645, -1250, 6558, 11228]
2312A1228o23o009q218n239q71J879N662P646O229p14o615p979m621k246K409
2327h082O829P568L922k70m281q053p129j989M212O421O744L986O23n736p430
2342b665n829k588K390P282Q382M122k242m910o260n512k927K227P363P241N005
2357A1079j256n667p155n127j277J722N291Q091N819j240o633o589n181k199K475
2372g847O730O873M032K6m722p944o130j451L288N830O442M943j22n596o721n548
2388g917k251J849P493P683L209j462m209n846o704k411K742O786O705M384m73
2403I578n380p350m479j459R35N886Q459M737j713n719o012m938k925K836O567
2418i77O625L592L67m726p553n984j249L287N366O297N121m10n709o799m886k264
$$ y = [11228, 10605, 4596, -3622, -8861, -9732, -7853, -2191, 5455, 11684, 10970, 4355, -3624, -8245, -10491, -8082, -1253, 6315, 10237, 9967, 5686, -2367, -9496, -11485, -7273, -852, 5892, 9878, 10501, 4765, -2665, -8494, -11082, -8692, -1410, 6972, 11094, 8852, 3942, -2318, -7830, -10757, -8530, -1167, 6074, 11079, 9823, 4156, -2999, -8126, -9403, -7681, -2390, 5701, 11520, 10280, 3647, -2942, -8123, -10322, -7847, -1117, 5756, 9788, 9814, 5092, -2852, -8982, -10433, -7145, -1315, 5127, 10070, 9948, 4352, -2369, -7917, -10168, -8319, -826, 6857, 10066, 8604, 4395, -1451, -8155, -10566, -7824, -1038, 5667, 10051, 9578, 4198, -3152, -7631, -9090, -8155, -2269, 6190, 10927, 9214, 3495, -2517, -7455, -10380, -7544, -977, 5648, 9240, 9607, 4881, -2672, -8656, -9905, -6618, -1252, 5045, 10166, 9756, 4047, -2752, -7638, -9902]
2434i902K196O667O989L226q33l681o269o921k078L659O244N770M373N6n166o758
2450b428n198j796J724O096P547M281j737m664n966n221k776K692O569O174L472
2465H769O70m866p320n610q83K587M954O478M785l79n133o272n200k440K804O491
2481e65O087L138j49l619o780o719j415L723N268N728M277P4m890o464m994k087
2497i387K069N907P152L262j115l644n986n885k103L506N493N438M071K63m492
2512D549p387n352n31K347M882O472M490o72m621o067n603k173K839O259N364
2527D796L171N60l720p249n593r94L234M689N220M405N75m968o743m451j452K095
2543f425N285O399L239j58l659o754n740j500L128N342N182L979N18m391o800
$$ y = [-9902, -7706, -1039, 5950, 9176, 8343, 4662, -1607, -8528, -10606, -6947, -703, 5067, 9440, 9496, 4330, -2428, -7626, -9422, -7698, -1602, 5945, 10226, 8489, 3825, -2141, -7362, -10138, -7446, -877, 5297, 8769, 9439, 4573, -2747, -8357, -9240, -6653, -1699, 4779, 9564, 9185, 4052, -2220, -7420, -9860, -7056, -565, 5522, 8660, 8511, 4892, -1888, -8607, -10022, -6299, -1031, 4697, 8974, 9048, 4158, -2306, -7300, -9387, -7318, -1411, 5741, 9003, 7888, 4244, -1742, -7627, -9730, -6224, -731, 4707, 8778, 9041, 4549, -2838, -8190, -8721, -6374, -1492, 4980, 9470, 8798, 4177, -1890, -7493, -9666, -6827, -568, 4796, 7967, 8527, 4807, -2442, -8035, -9029, -5795, -1106, 4114, 8519, 9094, 4126, -2617, -7068, -8520, -6425, -1140, 5259, 8498, 8340, 4681, -2073, -7813, -9313, -6185, -843, 4339, 8318, 8836, 4445, -2355]
2558b355n143q37K231M642N979M544p27m689n676n113j612K585N671N022L548
2573H070N77m448o640m991r49K426M362N717M608K8n020o243m548j201K278M843
2589a131N632L400J69m015o669m867o75K711M638N113M171L61m729o671m272j212
2605h046J971N128N682L436n95l742n671m795j857K071N129N931L181K88m473
2620C638n862m413j319J804M677O163L898p19m486n768m026j736K343M532N772
2635D498L857k85m064o432m562j598L192M501N342L436M9m005o117m286j721J964
2651f231N226N433L464m66l576n938m273j453J632N406N153L728o24m119n234
2666a872m167j700J620M681N954L699o04l946n892l902j472J944M492N271L474
$$ y = [-2355, -7498, -8335, -6104, -1462, 4517, 9061, 8334, 3645, -2031, -7144, -8756, -6171, -500, 4522, 8070, 8647, 4199, -2441, -7432, -8381, -5955, -1593, 4124, 8732, 8760, 3740, -2503, -7051, -8252, -5974, -1131, 4501, 7901, 8070, 4055, -2614, -7481, -8156, -5445, -807, 4306, 8477, 8838, 4109, -2562, -6834, -8046, -6075, -947, 4735, 8171, 7576, 3834, -1837, -6632, -8489, -6418, -1289, 4642, 7823, 8111, 3638, -2224, -6637, -7956, -6152, -1475, 4688, 8586, 7867, 3381, -2387, -6413, -8149, -5806, -1274, 4498, 8355, 8070, 4006, -2426, -6988, -8586, -5394, -893, 4449, 7885, 7934, 3929, -2188, -6474, -8195, -6231, -1005, 4428, 7892, 7426, 3850, -2088, -6361, -7814, -6182, -776, 4377, 8105, 7481, 3362, -1872, -6039, -7739, -6119, -1438, 4516, 8215, 7611, 3665, -2227, -6129, -7601, -5657, -1165, 4106, 7580]
2681G580P1l841o018m555r75K231M572N196K972K97l667n714m585j664K051N419
2697f30N194L017o14l519m833n017j498K082M996N383L010p38l557n272m136j531
2713g663J873M611N692L341m17m227n678l659j341J961M374N107L600j63l919
2728C492n494m181j493K223M750M817K987J78l889n168m435j799K585M917M749
2743D239K860k24l686m870m319j522J819M584N730K981o89l719m791m164j518
2758g289K019M512M836L195k82l713n267m036r84J822L885M858L441J08l971n128
2774a994m018j161J784M778M718K950j67l510m898m445j368J945M632N047K573
2789F866m76l026n243l782j240J522M378N050L080l97l692m921l854j363J691
$$ y = [7580, 7651, 3810, -2208, -6763, -7738, -5507, -935, 4261, 7233, 7530, 3863, -1851, -6436, -8100, -6049, -630, 4564, 7581, 6967, 3448, -1385, -6402, -7900, -5818, -822, 4561, 7571, 6833, 3276, -1996, -6132, -7663, -5790, -1179, 4513, 7854, 7437, 3210, -2468, -6127, -7468, -5507, -1133, 3974, 7574, 7411, 3492, -2002, -6183, -7676, -5453, -703, 4114, 7101, 7279, 3390, -1778, -6213, -8012, -5427, -510, 4239, 7099, 6875, 3189, -1681, -6000, -7522, -5703, -1119, 4611, 7592, 6903, 3184, -1607, -5771, -7289, -5270, -758, 4078, 7273, 6991, 3278, -1989, -6025, -7009, -5187, -1302, 3556, 6997, 7105, 3134, -1994, -6012, -7173, -5389, -611, 4107, 7057, 6890, 3380, -1518, -5963, -7331, -5386, -754, 4293, 6866, 6390, 3364, -1879, -5661, -6901, -5379, -1001, 4049, 7129, 6732, 3040, -1881, -5735, -7098, -5407]
2804e407M389N074L084k84l958m899l868j239J830M325M801K910l87l042m843
2819a514m295j398K124M616M360K818n94l039m898l848j175J558L862N345K979
2834F901r74l036m625l454j803J672M556M881K793n49l375m491m103r11J638L931
2850i49M907K681j30l558m616l775r68J406L711M993L048n04l496m562l477j326
2866f615J634M042N005K448o28l159m302l787j498J781M549M848K007k81l294
2881B750m285l772j054J599M241M430K856p47l599l925l622j580J851M348M385
2896C876K868j095k931m231l906j143J660M650M360K282j72l674m274l644j539
2911f913J979M255M679K585n92l278m588l267j449J639M502M494K217p03k816
$$ y = [-5407, -1018, 4056, 7140, 6856, 2898, -2001, -5869, -7108, -5278, -953, 3848, 6758, 6371, 3329, -1514, -5809, -7207, -5083, -467, 3893, 6711, 6117, 3078, -1820, -5668, -6843, -5285, -1423, 3922, 6901, 5927, 2891, -1734, -5188, -6991, -5319, -763, 4118, 6911, 6362, 2987, -1504, -5607, -6518, -4880, -949, 3958, 6639, 6509, 2951, -1665, -5440, -6408, -5002, -1291, 3702, 6750, 6246, 2750, -1812, -5289, -6615, -4981, -939, 4066, 6514, 5886, 2727, -1575, -5362, -6860, -5079, -530, 4318, 6325, 6044, 2750, -1535, -5307, -6361, -4762, -521, 3909, 6765, 6018, 2419, -1506, -5128, -6708, -4857, -509, 3876, 6744, 5649, 2718, -1513, -5419, -6562, -4902, -252, 4108, 6390, 6218, 2544, -1730, -5374, -6913, -4934, -679, 4000, 6585, 5993, 2715, -1873, -5140, -6589, -4950, -448, 4046, 6263, 5560, 2744]
2926B744m196l925j165J869L970M506K331k85l169m226l556j521J876M465M070
2941C788K446l18k982m546l800r56J989M235L821K620q1l719m254l166j255J566
2957d612M048M235K375n45k709m229l556j473K209L786L984K517K1l474m636l228
2973e287n87J851L289M307K631p75k919m089l795r77J974M036L717K320j54k590
2989B952m294l945p46J639L928L956K183k45k984m175l147p16J492L658M216J962
3005E734k98k873m044l419j097J989L240M004K641n81k945m053l235q34J759L787
3021b25L758K121k90k857m252k847j215J972L426L596K506j31l175m142k989o88
3037e432J189L734M011K310p27k735l690l426j189J857L876L681K051k59k777
$$ y = [2744, -1452, -5377, -6542, -4673, -703, 3803, 6134, 5849, 2680, -1546, -5102, -6623, -4747, -282, 3788, 6234, 5916, 2934, -1612, -5412, -6368, -4379, -144, 3677, 6297, 6216, 2497, -1757, -4923, -6178, -4612, -564, 3671, 6046, 5501, 2792, -1437, -4993, -6466, -4257, -471, 3513, 6030, 6051, 2577, -2059, -5287, -5874, -4023, -734, 3573, 6204, 5429, 2510, -1579, -5374, -6351, -4377, -341, 3376, 5696, 5542, 2952, -1342, -5287, -6033, -4394, -466, 3490, 5673, 5428, 2444, -1731, -4878, -5594, -4102, -444, 3772, 5734, 5436, 2563, -1481, -4900, -5997, -4008, -768, 3236, 5877, 5296, 2351, -1702, -4937, -5771, -4012, -225, 3533, 5654, 5364, 2507, -1745, -4592, -5807, -3835, -409, 3187, 5693, 5562, 2387, -1755, -4744, -5432, -4243, -509, 3502, 5812, 5085, 2350, -1340, -4766, -5955, -4098, -222, 3459, 5510, 5251, 2474]
3052B474l892l583n07J472L457L868K193j90l235l702k938q10J130L790L914K403
3068E844p48k446m122l098j050J975L239L587K337Q1l262m242k809o46J587L245
3084e28L869K229m09k909l988k735j270K092L739L182J620J23k446m019l316m90
3100e256J526L357L753J510k09k520l759k655j023J273L547L958J966q11k642
3115B015l867k343q63J245L397L620K411n00l510l585k725j89J392L287L215J919
3131D919k3k618m350k774n35K141K778L313K055j64k282m072k837j019K259K904
3147c05L547J957p05k610l254k713r43J382L337L548K028n18l129l550j934q41
3163d703J540K642L730J759l73k681l889k316n37J415K747L508K595n24l071l779
$$ y = [2474, -1418, -5001, -5508, -4036, -579, 3289, 5482, 5292, 2057, -1645, -4583, -5393, -4263, -473, 3441, 5844, 5096, 2650, -1472, -4570, -5620, -3645, -406, 3181, 5518, 5599, 2337, -1905, -4714, -5360, -3773, -528, 3341, 5570, 5161, 2252, -1736, -4471, -5741, -3649, 90, 3272, 4892, 5015, 2569, -1450, -4766, -5256, -3730, -373, 3380, 4890, 4681, 2161, -1598, -4253, -5276, -4003, -456, 3502, 5468, 4657, 2015, -1852, -4195, -5058, -3813, -416, 3204, 5615, 5115, 1605, -1980, -4705, -4894, -3502, -215, 3000, 4919, 4896, 2278, -2072, -4846, -5381, -3240, -462, 2851, 4906, 4742, 2460, -1612, -4449, -5468, -3209, -305, 3242, 5199, 4494, 1884, -1370, -4083, -5026, -3644, -307, 3241, 5269, 4751, 1622, -1928, -3862, -4703, -3163, -521, 3209, 4968, 4595, 1914, -1975, -4291, -4828, -3413, -666, 2842, 5437, 4913, 1842, -1937]
3179a937k597l67J591L084L218J884j06k449m137k351j085J778L436L258J741
3194D961l41k724l171k993j063J672L593L035J958m45k881k772k814q05J261L304
3210b25L243K174o98k629l543k595n16J365L004L201K057j37l101l512k142p54
3226d808J605L153L103J237r3k181l351l012p06J815L164K906J831m21k419l370
3242a547k490n26J096L206L477J651p94k171l437k437r68J426L423K963J749l72
3258D249k426l269k737m12J196L002L478J573o74k186l163k752n84J337L321K839
3274B792J578k84k022l466k617m91J641K709L260J240l48k570l091k348q45J830
3290c032K862L414J320o30k276k708k931p99J907L007K713J289o0k262l095k698
$$ y = [-1937, -4534, -4901, -3310, -226, 2992, 4876, 4770, 2321, -1816, -4167, -5252, -3474, -38, 3220, 4961, 4620, 1896, -1275, -4268, -5331, -3659, -66, 2969, 4927, 4482, 1601, -1171, -3985, -4790, -3529, -225, 3018, 5192, 4494, 1865, -1678, -4273, -4789, -3424, -420, 2781, 4838, 4701, 1600, -1912, -4054, -4808, -3203, -50, 3053, 4290, 4197, 2016, -1335, -4347, -5053, -3238, -74, 2832, 4663, 4242, 1823, -1547, -4037, -4563, -3467, -261, 3216, 4867, 4073, 1902, -1535, -3972, -4940, -3514, -91, 2872, 4621, 4249, 1823, -1446, -4183, -4595, -3399, -397, 3081, 4654, 3980, 1794, -1369, -4121, -4705, -3368, -47, 2792, 4370, 4086, 2064, -1402, -4019, -4510, -2869, -160, 3100, 4340, 3992, 1422, -1669, -4017, -4862, -3032, -170, 3244, 4564, 3934, 1658, -1050, -3981, -4780, -2873, 134, 2847, 4136, 4076, 1814, -1281, -3979]
3306c979n62J435K817K956J798m25k517k805k574o64J693K911K720J507p19j418
3322B174l715k412r14K022K658K628J617j7k223l563k034p20J637K692K968J602
3338D400m57k419k860k739m50J832K795K463J498p2k460k917k445l08J403K606
3354a30K740J850o23k418k654k571n37J634K974K457J255l16j836l105k501m21
3370d202J652K420K834J593n95j995l297j996m85J260K839K914J053o74j813l120
3386a612k117l74J314L173K117J650j62k422l166k417L24R50K628K710J811n14
3402C893k224l210j712o53J357K424K736J581j112j349l212k378q5J220K985K196
3418B457J609n36k185l032j648p22J418K710K356J580o21j934k720j904o06J465
$$ y = [-3979, -4541, -3106, -289, 2667, 4465, 4040, 1523, -1282, -3856, -4520, -2827, 84, 2804, 4311, 3592, 2174, -1541, -3953, -4867, -2845, -187, 2441, 4058, 4041, 1818, -1745, -3779, -4499, -2862, -170, 2798, 4400, 3943, 1524, -1336, -4075, -4525, -2693, 102, 2565, 4063, 3991, 1531, -1386, -3831, -4139, -2736, -130, 2610, 4460, 3837, 1419, -1235, -3806, -4343, -2709, 265, 2722, 3977, 3661, 1825, -1280, -3781, -4202, -2550, -130, 2704, 4297, 3702, 1707, -1590, -3586, -4071, -2811, 28, 2942, 3995, 3321, 1508, -1612, -3729, -4103, -2789, 384, 2501, 4151, 3989, 1567, -1599, -4016, -3692, -2742, -114, 2596, 4407, 3893, 1669, -1541, -3253, -3906, -2549, -125, 2611, 4192, 3080, 1731, -1481, -3859, -3944, -2724, 261, 2457, 4066, 3530, 1345, -1687, -3335, -4057, -2639, 71, 2427, 4007, 3386, 1452, -1268, -3172, -3778, -2313]
3434b313K455K171J473N0k655k951j762n19J505K303K606J611p56j991k790j993
3450c556l18J508K621K025J478l46k317k666j857l72J188K714K839R60n81k175
3466A145k457k063l70J204K613K494J167k25k263k306k350m41J112K829K107J436
3482C632j89k097k729j819m65P04L042K432J368q71j654k450k174k23R71K440
3498h2K724R30l99j678l012j511j033J476K416K533J631o37k318k025k256n62
3514c803J267K693K619Q47l72k211k172k248k56J296K463K075J628j047j377k296
3530h94k353m27J661K091K337J378p23k092k042k125m85J302K176K473J271l67
3546C181k300k015j949n33J377K429K369R37n52j932k229j815o71J431K241K279
$$ y = [-2313, 142, 2313, 3786, 3836, 1181, -1770, -3532, -4051, -2546, -243, 2363, 3974, 3218, 1227, -1563, -3556, -3874, -2366, 255, 2280, 3758, 3412, 1095, -1571, -3428, -3800, -2612, 102, 2941, 3901, 3320, 1145, -1312, -3375, -3745, -2541, 72, 2566, 3733, 3508, 1245, -1061, -3411, -3852, -2740, 89, 2196, 3632, 3443, 1346, -1383, -3202, -3667, -2963, 79, 2511, 3879, 3008, 1354, -1096, -3270, -3493, -2522, -82, 2642, 3572, 3173, 1495, -1517, -3028, -4061, -2585, -169, 2364, 3995, 3358, 1040, -985, -3241, -3803, -2536, 157, 2776, 3623, 3251, 1040, -1132, -3380, -3636, -2340, 123, 2198, 3826, 2779, 1402, -894, -3247, -3674, -2013, 78, 2415, 3793, 3070, 978, -1064, -3189, -3674, -2372, -196, 2277, 3548, 3181, 881, -1134, -3083, -3616, -2239, 190, 2559, 3496, 2944, 1012, -1217, -3032, -3703, -2272, -31, 2248]
3562B248J215j48k312k566j624k78J172K344K024J127j82k028j969j900m94J011
3578b360K460K098J130m67j529k682j618n57J228K525J775J162j46j672k616j826
3594c095k54J033K380K206J065l52j831k432j597l10R64K500K225Q88l00j765
3610A325k486j877l96J452K205K050J120k89k116k125j641l58R86K142K345R82
3626C319o71j524k469j525n56J340K178K216O17m2j977k159j564l79J057K322
3642A83J973Q75p8j883k351j385l90J148J786K091J253k97j966k239j547k29R03
3659b153K150K462O16m39j576k128j659m75J307K400J604J336n38j904k493j229
3675b719m69J020K080K039J296l95j920k215j403k56J171J935J808J406n81j817
$$ y = [2248, 3463, 3315, 1003, -1563, -3187, -3465, -2293, 51, 2075, 3202, 3020, 992, -977, -2877, -3371, -2360, 100, 2198, 3328, 2861, 1332, -1350, -2968, -3525, -2297, 228, 2003, 3165, 3019, 1347, -1269, -3095, -3349, -2316, 64, 2270, 3335, 2983, 1152, -1280, -2877, -3187, -2223, 277, 2502, 3390, 3090, 1325, -1161, -3038, -3434, -1982, 223, 2273, 3393, 3104, 988, -1137, -2778, -3136, -2150, -8, 2337, 3319, 2648, 1124, -1345, -2870, -3426, -2086, 92, 2308, 2925, 2883, 906, -1253, -2817, -3196, -2139, 183, 2156, 3031, 2953, 1070, -1281, -2666, -3056, -1908, -122, 1969, 3222, 2925, 959, -1280, -2827, -3056, -2153, -3, 2459, 3075, 2636, 1060, -1068, -2727, -3202, -1895, 505, 2109, 3445, 2907, 1003, -1490, -2719, -3188, -2168, -88, 1951, 3247, 2852, 932, -1283, -2686, -2942, -1771, 164, 1972, 3378, 2797, 980]
3691I80k302j512J4Q56K223J949J047q70j351k225j402l20R94J920J680J486n92
3708B575j751k136j648l5R41K131K105J020m00j854k011j673l25P92K468K136
3724B335P04k06k159j776j664k83J024J947K205J103n03j946j895j574k34J195
3740a727J790K045J185o86j763j846j534l65R61K109K004O60k84j403k231j358
3756b443l25J028K017J952R35r05j383j962j330n63J134K019J724J114o27j667
3772G18j996j282l01R03J948K085O73k45j494k244j615k8J262J719J899P85n65
3789B222j529j736j566k91Q77K307J659R91m50j699j818j422m94J339K128J426
3805A944J038p41j508j914j393n15J286J789J747J446j025j439j751j368l47J286
$$ y = [980, -1322, -2834, -2820, -1964, 259, 2208, 3255, 2385, 1034, -1191, -2593, -2913, -1919, 1, 1681, 3167, 2575, 824, -1312, -2960, -2995, -2054, 77, 2182, 3202, 2802, 948, -1063, -2736, -3061, -2269, 199, 2335, 3039, 2833, 674, -1102, -2766, -3049, -2025, -78, 2127, 3230, 2727, 781, -1114, -2688, -2922, -1727, 63, 2108, 3293, 2607, 844, -1002, -2536, -2901, -1940, 169, 2173, 2833, 2549, 1146, -1085, -2443, -2768, -1740, 277, 2229, 3164, 2259, 876, -1086, -2416, -2979, -1845, 174, 1898, 3012, 2385, 718, -1278, -2560, -2861, -1958, -10, 2075, 2748, 2503, 1009, -1235, -2850, -2878, -1616, 103, 2002, 2787, 2222, 693, -1043, -2609, -2900, -2023, 284, 1943, 2934, 2484, 785, -1033, -2455, -2949, -1610, 518, 1944, 2982, 2241, 733, -1181, -2574, -3089, -1803, -14, 1733, 3179, 2154, 715, -1036, -2404, -2751, -1465]
3821a465J857J577J031l47j879j998j186l06J189J410K016Q67l33j236k646j213
3837b662k76J196K165J277J012l32j527j840j810M2J029K104J535P80n60j398
3853G35j719j517k69J136J545K008J053n81j722j803j357l32J353J651J472J050
3869B703l41j764j885j275JJ215J490J824P60k15j590k141j140o26J315J928J516
3886A775Q37o98j043j966j245m76J249J964J316N85k07j307j676j324l75R43J905
3903B57J741P90p17j677j511j238m37J428J426J640J152p26j470j789j370K67
3919b234Q78J198J852J174n37j684j487j494j46R33J726J490J066p18j137k040
3935a160j289j54J059J501J812O60n35j222j678j137m39R05J729J756P50p43q92
$$ y = [-1465, 392, 1969, 3000, 2653, 774, -1224, -2410, -2716, -1527, -117, 1899, 2766, 2433, 1197, -1449, -2662, -2938, -1742, 423, 1700, 2712, 2380, 853, -987, -2797, -2755, -1726, 378, 1913, 2693, 2133, 735, -984, -2501, -2770, -1634, -89, 1919, 2972, 2391, 669, -1134, -2491, -2823, -1470, 181, 1653, 2703, 2362, 598, -1287, -2562, -2561, -1346, 144, 1968, 2728, 2513, 923, -1218, -2358, -2984, -1669, 259, 1775, 2612, 1914, 871, -1095, -2340, -2816, -1567, 397, 1713, 2298, 2091, 784, -892, -2216, -2591, -1648, 257, 1998, 2788, 2071, 394, -1117, -2355, -2792, -1364, 62, 1702, 2854, 2128, 658, -1131, -2501, -2234, -1356, -158, 1694, 2868, 2331, 647, -840, -2334, -2480, -1547, 179, 1669, 2735, 2017, 880, -1160, -2449, -2603, -1544, -43, 1769, 2429, 1894, 672, -1006, -2143, -2582, -1677, 52, 1808, 2558, 1815, 923]
3952I23j704j634l6J236J521J308R31n64j274j773j555Q6J141J480J527J171o33
3969B151j492j472j572q7Q80J641J699O28k76j526j408j476j95J158J616J168
3985A437J025p88j001j956j146R0O85J976J301Q45o34j051j962r65m82R11J849
4002A34J462J035o34j106j953j075k35R48J698J090J163q61j134j548j113m25
4018b554R05K057J316M95j51j528j489j281L3O02J687J461P96n6j613j730j527
4035b577M09Q50J583J536M22j31j346j983j115N9J017J856J018Q87p57j152j706
4052a130j113K61O92J423J564N91m90j315j532j119l80J168J784J260O80k37j548
4069E59j311j453J15O28J813J333Q04l62j262j837j225k36J329J381J372O30l27
$$ y = [923, -781, -2415, -2451, -1215, 306, 1614, 2545, 1981, 707, -1066, -2621, -2535, -1394, 86, 1613, 2784, 2151, 659, -813, -2385, -2472, -1592, 49, 1748, 2376, 2100, 574, -834, -2310, -2505, -1347, 269, 1437, 2462, 1674, 673, -1283, -2429, -2339, -1654, 322, 1623, 2468, 1834, 783, -1179, -2144, -2626, -1715, 134, 1596, 2631, 1997, 891, -1062, -2137, -2372, -1424, 274, 1364, 2527, 1666, 532, -1016, -2129, -2554, -1649, 408, 1724, 2219, 2068, 540, -949, -2230, -2197, -1595, 92, 1553, 2349, 2293, 680, -1050, -2577, -2168, -1318, 265, 1801, 2223, 2092, 746, -1237, -2352, -2293, -1276, 580, 1598, 2485, 1728, 576, -1130, -2243, -1982, -1290, 133, 1697, 2288, 1798, 483, -1049, -2168, -2548, -1380, 404, 1664, 2344, 2107, 559, -752, -2205, -2090, -1462, 351, 1684, 2488, 2126, 864, -973, -2198, -2434, -1105, 276, 1648, 2278, 1951]
4086A951j345j604j191j46J364J334J520N70r09j055j435j161p9P37J639J340
4102A530O28n37j262j664p86k8P95J475J441R52p15j216j574j321J26J178J136
4119A58J451O81l98j135j750j065%R55J277J335P01m64j306j365j246O0Q84J349
4137A22J542M63l67j574j039j172K6P48J526J235K69K14j474j430j298J16P51
4154a342J747J607m8l55q85j798j041n0Q96J533J407O61l56j512j425r83j4Q09
$$ y = [1951, 606, -998, -2189, -2335, -971, 363, 1883, 2453, 1544, 489, -946, -2107, -2186, -1449, 190, 1530, 2158, 1621, 359, -1305, -2091, -2119, -1324, 151, 1592, 2544, 1829, 613, -961, -2282, -2156, -978, 158, 1609, 2290, 1892, 757, -993, -2058, -2058, -1103, 174, 1509, 2210, 1746, 440, -925, -2171, -2111, -1227, 122, 1664, 2127, 1760, 186, -853, -2025, -1999, -1251, 275, 1510, 1779, 1993, 519, -911, -2209, -2093, -1342, 405, 2012, 1964, 1609, 724, -1074, -2115, -2165, -1269, 264, 1671, 2332, 1976, 464, -961, -1944, -1958, -1149]
$$ [...]
8191c16
##END NTUPLES=NMR FID
##END=
