##TITLE=1H_LR-673-R2-HCR1
 D2O, 8 sc, 
 18.12.2019
##JCAMPDX= 6.0         $$ Bruker NMR JCAMP-DX V2.0
##DATA TYPE= NMR FID
##DATA CLASS= NTUPLES
##ORIGIN= UXNMR, Bruker Analytische Messtechnik GmbH
##OWNER= root
$$ XWIN-NMR		Version 3.5
$$ Wed Dec 18 16:35:09 2019 Russian Standard Time (UT+4h)  she@DPX200
##.OBSERVE FREQUENCY= 200.1315
##.OBSERVE NUCLEUS= ^1H
##.DELAY= (6, 6)
##.ACQUISITION MODE= SIMULTANEOUS
##.ACQUISITION SCHEME= undefined
##.AVERAGES= 8
##.DIGITISER RES= 18
##SPECTROMETER/DATA SYSTEM= spect
##.PULSE SEQUENCE= zg30
##.SOLVENT NAME= CDCl3
##.SHIFT REFERENCE= (INTERNAL, CDCl3, 0, 15.7039)
##AUDIT TRAIL= $$ (NUMBER, WHEN, WHO, WHERE, WHAT)
$$ ##TITLE= Audit trail, XWIN-NMR		Version 3.5
$$ ##JCAMPDX= 5.01
$$ ##ORIGIN= Bruker BioSpin GmbH
$$ ##OWNER= she
$$ F:/spectra/data/she/nmr/H-F/1/audita.txt
$$ ##AUDIT TRAIL=  $$ (NUMBER, WHEN, WHO, WHERE, WHAT)
(   1,<2019-12-18 16:33:52.43 +0400>,<she>,<DPX200>,
      <created by zg, POWCHK disabled, PULCHK disabled
       configuration hash MD5:
       00 E9 B6 7A A2 85 ED C7 34 08 36 98 17 FE 4E 26
       data hash MD5: 16K
       60 54 CE 07 33 87 50 FD 72 DC 98 60 24 90 17 AD>)
$$ ##END=
$$ 
$$ hash MD5
$$ 74 23 BF 5B 38 7D 65 C6 06 5B EB E1 C0 EC CA 3C
##$RELAX= 
##$RELAX= 
##$RELAX= 
##$RELAX= 
##$RELAX= 
##$RELAX= 
$$ Bruker specific parameters
$$ --------------------------
##$DU= <F:/spectra>
##$EXPNO= 1
##$NAME= <H-F>
##$PROCNO= 1
##$TYPE= <nmr>
##$USER= <she>
##$AMP= (0..31)
100 100 100 100 100 100 100 100 100 100 100 100 100 100 100 100 100 100 
100 100 100 100 100 100 100 100 100 100 100 100 100 100 
##$AQSEQ= 0
##$AQ_mod= 1
##$AUNM= <au_zg>
##$AUTOPOS= <>
##$BF1= 200.13
##$BF2= 200.13
##$BF3= 200.13
##$BF4= 200.13
##$BF5= 200.13
##$BF6= 200.13
##$BF7= 200.13
##$BF8= 200.13
##$BYTORDA= 1
##$CFDGTYP= 0
##$CFRGTYP= 5
##$CHEMSTR= <none>
##$CNST= (0..31)
1 1 145 1 1 1 1 1 1 1 1 1 1 1 1 1 1 1 1 1 1 1 1 1 1 1 1 1 1 1 1 1 
##$CPDPRG= <>
##$CPDPRG1= <>
##$CPDPRG2= <>
##$CPDPRG3= <>
##$CPDPRG4= <mlev>
##$CPDPRG5= <mlev>
##$CPDPRG6= <mlev>
##$CPDPRG7= <mlev>
##$CPDPRG8= <mlev>
##$CPDPRGB= <>
##$CPDPRGT= <>
##$D= (0..31)
0 1.2 0 0 0 0 0 0 0 0.06 0 0.03 0 0 0 0 0.0002 0 0 0 0 0 0 0 0 0 0 0 0 
0 0 0 
##$DATE= 1576672431
##$DBL= (0..7)
120 120 120 120 120 120 120 120 
##$DBP= (0..7)
150 150 150 150 150 150 150 150 
##$DBP07= 0
##$DBPNAM0= <>
##$DBPNAM1= <>
##$DBPNAM2= <>
##$DBPNAM3= <>
##$DBPNAM4= <>
##$DBPNAM5= <>
##$DBPNAM6= <>
##$DBPNAM7= <>
##$DBPOAL= (0..7)
0.5 0.5 0.5 0.5 0.5 0.5 0.5 0.5 
##$DBPOFFS= (0..7)
0 0 0 0 0 0 0 0 
##$DE= 6
##$DECBNUC= <off>
##$DECIM= 24
##$DECNUC= <off>
##$DECSTAT= 4
##$DIGMOD= 1
##$DIGTYP= 9
##$DL= (0..7)
0 120 120 120 120 120 120 120 
##$DP= (0..7)
150 150 150 150 150 150 150 150 
##$DP07= 0
##$DPNAME0= <>
##$DPNAME1= <>
##$DPNAME2= <>
##$DPNAME3= <>
##$DPNAME4= <>
##$DPNAME5= <>
##$DPNAME6= <>
##$DPNAME7= <>
##$DPOAL= (0..7)
0.5 0.5 0.5 0.5 0.5 0.5 0.5 0.5 
##$DPOFFS= (0..7)
0 0 0 0 0 0 0 0 
##$DQDMODE= 0
##$DR= 18
##$DS= 0
##$DSLIST= <SSSSSSSSSSSSSSS>
$$ [...]
##$SUBNAM2= <"">
##$SUBNAM3= <"">
##$SUBNAM4= <"">
##$SUBNAM5= <"">
##$SUBNAM6= <"">
##$SUBNAM7= <"">
##$SUBNAM8= <"">
##$SUBNAM9= <"">
##$SW= 24.9337058887773
##$SWIBOX= (0..15)
0 0 2 0 0 0 0 0 0 0 0 0 0 0 0 0 
##$SW_h= 4990.01996007984
##$TD= 16384
##$TD0= 1
##$TE= 0
##$TE2= 300
##$TE3= 300
##$TEG= 300
##$TL= (0..7)
0 120 120 120 120 120 120 120 
##$TP= (0..7)
150 150 150 150 150 150 150 150 
##$TP07= 0
##$TPNAME0= <>
##$TPNAME1= <>
##$TPNAME2= <>
##$TPNAME3= <>
##$TPNAME4= <>
##$TPNAME5= <>
##$TPNAME6= <>
##$TPNAME7= <>
##$TPOAL= (0..7)
0.5 0.5 0.5 0.5 0.5 0.5 0.5 0.5 
##$TPOFFS= (0..7)
0 0 0 0 0 0 0 0 
##$TUNHIN= 0
##$TUNHOUT= 0
##$TUNXOUT= 0
##$USERA1= <user>
##$USERA2= <user>
##$USERA3= <user>
##$USERA4= <user>
##$USERA5= <user>
##$V9= 5
##$VALIST= <valist>
##$VCLIST= <CCCCCCCCCCCCCCC>
##$VD= 0
##$VDLIST= <DDDDDDDDDDDDDDD>
##$VPLIST= <PPPPPPPPPPPPPPP>
##$VTLIST= <TTTTTTTTTTTTTTT>
##$WBST= 1024
##$WBSW= 4
##$XGAIN= (0..3)
0 0 0 0 
##$XL= 0
##$YL= 0
##$YMAX_a= 1003787
##$YMIN_a= -819681
##$ZGOPTNS= <>
##$ZL1= 120
##$ZL2= 120
##$ZL3= 120
##$ZL4= 120
##$ABSF1= 10
##$ABSF2= 0
##$ABSG= 5
##$ABSL= 3
##$ALPHA= 0
##$AQORDER= 0
##$ASSFAC= 0
##$ASSFACI= 0
##$ASSFACX= 0
##$ASSWID= 0
##$AUNMP= <proc_1d>
##$AZFE= 0.1
##$AZFW= 0.1
##$BCFW= 1
##$BC_mod= 2
##$BYTORDP= 1
##$COROFFS= 0
##$CY= 11.3945322036743
##$DATMOD= 1
##$DC= 2
##$DFILT= <>
##$DTYPP= 0
##$F1P= 16.9975609425685
##$F2P= -3.02152046262296
##$FCOR= 0.5
##$FTSIZE= 0
##$FT_mod= 4
##$GAMMA= 1
##$GB= 0.15
##$INTBC= 1
##$INTSCL= 1
##$ISEN= 128
##$LB= 0.24
##$LEV0= 0
##$LPBIN= 0
##$MAXI= 10000
##$MC2= 0
##$MEAN= 0
##$ME_mod= 0
##$MI= 1.114404
##$NCOEF= 0
##$NC_proc= 0
##$NLEV= 6
##$NOISF1= 3.799351
##$NOISF2= 2.8
##$NSP= 1
##$NTH_PI= 0
##$NZP= 0
##$OFFSET= 15.70392
##$PC= 1
##$PHC0= -10151.04
##$PHC1= 11.80082
##$PH_mod= 1
##$PKNL= yes
##$PPARMOD= 0
##$PSCAL= 0
##$PSIGN= 0
##$REVERSE= no
##$SF= 200.130013532006
##$SI= 16384
##$SIGF1= 3
##$SIGF2= 2
##$SINO= 400
##$SIOLD= 16384
##$SREGLST= <1H.CDCl3>
##$SSB= 0
##$STSI= 0
##$STSR= 0
##$SW_p= 3612.71676300578
##$SYMM= 0
##$S_DEV= 0
##$TDeff= 0
##$TDoff= 0
##$TI= <>
##$TILT= no
##$TM1= 0
##$TM2= 0
##$TOPLEV= 0
##$USERP1= <user>
##$USERP2= <user>
##$USERP3= <user>
##$USERP4= <user>
##$USERP5= <user>
##$WDW= 1
##$XDIM= 8192
##$YMAX_p= 0
##$YMIN_p= 0
$$ End of Bruker specific parameters
$$ ---------------------------------
##NTUPLES= NMR FID
##VAR_NAME=  TIME,          FID/REAL,        FID/IMAG
##SYMBOL=    X,             R,               I
##VAR_TYPE=  INDEPENDENT,   DEPENDENT,       DEPENDENT
##VAR_FORM=  AFFN,          ASDF,            ASDF
##VAR_DIM=   8192,          8192,            8192
##UNITS=     SECONDS,       ARBITRARY UNITS, ARBITRARY UNITS
##FACTOR=    0.0002004,     1,               1
##FIRST=     0,             0,               0
##LAST=      1.6414764,     0,               0
##MIN=       0,             -819681,         0
##MAX=       1.6414764,     1003787,         0
$$ Real data points
##PAGE= N=1
##DATA TABLE= (X++(R..R)), XYDATA
0 0 0 0 0 0 -8 8 -8 12 -16 24 -24 32 -47 48 -64 80 -92 115 -132 156 -187 212 -255 288 -335 383 -435 499
28 499 -563 639 -724 811 -914 1020 -1140 1274 -1414 1575 -1747 1935 -2147 2376 -2630 2912
44 2912 -3224 3581 -3968 4413 -4925 5513 -6203 7020 -8015 9248 -10823 12929 -15887
57 -15887 20371 -28040 44461 -148282 510453 889785 166387 40801 312302 107149 -556179
68 -556179 -708612 -372750 84096 436766 556827 289445 52256 18456 -184181 -612725
78 -612725 -582206 -30369 378448 431572 478621 366680 -114043 -509744 -429681 -267546 -230764
89 -230764 46756 536882 648109 286037 -117752 -369557 -470177 -320183 -81328 -10726
99 -10726 135243 568897 690788 63744 -577110 -491383 -150738 -175984 -206767 195360 628995
110 628995 576637 130137 -331163 -524038 -364894 -111185 -33797 72268 424084 605689
120 605689 236219 -257174 -385108 -349022 -351482 -136651 268183 423856 316316 261887 126500
131 126500 -304261 -618844 -416715 -17240 189923 310625 410596 300152 32961 -183488
141 -183488 -389073 -528224 -276081 252064 455512 260867 177478 231582 -19774 -463436
151 -463436 -541440 -219339 98566 284135 391475 332277 116468 -83317 -262578 -450707
161 -450707 -408319 -24367 337494 383240 287588 203199 -7234 -314378 -434633 -304602 -100339
172 -100339 131072 375331 436807 224503 -55582 -229704 -332537 -351157 -191513 88695
182 88695 320316 412931 322974 48114 -246040 -356754 -305684 -204328 -18628 261774 434586
193 434586 337031 75952 -168339 -324868 -352613 -226012 -17072 187542 347216 374563
203 374563 179979 -123338 -312562 -333976 -261764 -94872 159287 351623 358529 214271 -11395
214 -11395 -261521 -393327 -298186 -78606 113532 268415 368366 283465 11381 -236499 -321293
225 -321293 -294460 -185200 38436 278050 360017 261526 77311 -135062 -316016 -350722 -206700
236 -206700 14504 214336 341707 319470 121573 -126910 -277599 -311410 -248615 -64384
246 -64384 190930 347790 309546 147674 -42818 -224154 -333341 -285203 -92310 133821
256 133821 293133 328905 215558 64 -205976 -314543 -298271 -151439 81743 276426
266 276426 321157 224558 55975 -141506 -303707 -323400 -170657 49433 219815 298413 267917
277 267917 114404 -107360 -280381 -316910 -209069 -8514 190818 297167 277607 150021
287 150021 -50445 -249575 -330655 -239747 -46635 142447 268685 294391 188686 -15165
297 -15165 -211680 -307826 -265690 -105276 98578 249784 292524 217093 39372 -170796 -295352
308 -295352 -270533 -137886 41082 218089 310961 243960 58942 -128115 -250641 -284797 -192190
319 -192190 9118 202296 284468 248384 116662 -79058 -248385 -292075 -202526 -40210 141819
330 141819 275907 278644 143646 -44817 -203619 -284672 -241942 -79399 116119 246555 275585
341 275585 190850 6942 -183336 -271757 -238381 -119975 57109 231307 290888 199223 34520
352 34520 -125409 -246153 -272786 -158323 37846 198251 264023 226933 88538 -101529 -240608
363 -240608 -265782 -181722 -19776 162068 269536 242675 112465 -55968 -204897 -270305 -209138
374 -209138 -51923 122202 245106 262760 153819 -25200 -176139 -246758 -226516 -103982
384 -103982 86617 235709 257164 168658 24204 -136517 -251093 -244948 -118824 49609 189523
395 189523 254160 207103 57463 -116628 -231411 -244604 -153974 7430 165370 248049 222979
406 222979 99626 -75547 -216144 -247990 -171235 -31041 124930 238938 242479 126454 -40631
417 -40631 -179139 -243319 -203619 -66116 102139 215213 233670 157332 6109 -156667 -243815
428 -243815 -212495 -91874 59950 188552 240374 181141 35803 -125193 -227241 -224979 -123172
439 -123172 29243 166954 235631 202521 72205 -92816 -208951 -228128 -150772 -8923 141279
450 141279 228863 212387 101897 -52640 -185420 -235194 -174626 -37936 108798 207190 218536
461 218536 132981 -18074 -163485 -230499 -190629 -68353 78257 189242 220831 155493 15934
472 15934 -133472 -219607 -203683 -99108 48374 174523 221676 171318 48188 -96847 -204305
483 -204305 -220277 -129040 20480 152309 212117 184687 79503 -64325 -184237 -221726 -157021
494 -157021 -19502 125037 206927 194207 101104 -32393 -156283 -216548 -177922 -53862 95393
505 95393 198140 206830 121946 -9822 -130488 -198450 -187681 -89033 60406 184537 215296
516 215296 143644 15436 -108055 -183496 -191066 -121849 16255 161869 224438 165628 37517
527 37517 -84048 -167637 -196763 -143700 -11634 132296 209085 183005 75343 -58530 -157532
538 -157532 -189876 -150449 -43566 97036 195985 193267 103420 -19565 -135812 -201942 -170902
549 -170902 -52357 79143 162619 187643 142512 18728 -129979 -207114 -173282 -68522 47092
560 47092 139029 182521 156476 53762 -91753 -199528 -195101 -90346 30456 113966 167054
571 167054 176069 93179 -65833 -190315 -195324 -108440 -1912 93604 169034 184510 102991 -41661
583 -41661 -158441 -185850 -132882 -38500 71645 165801 189323 112963 -18319 -126608 -171835
594 -171835 -155619 -80550 44279 164400 200850 126182 -1561 -102599 -152414 -162793 -115067
605 -115067 12748 159652 208208 129471 14897 -65149 -128110 -175361 -141419 -4721 138262
616 138262 186186 140049 56791 -35363 -126589 -180428 -149537 -31150 106603 176858 153406
627 153406 79000 -9705 -111019 -189356 -166909 -37400 94189 145226 140835 114662 34335
638 34335 -102887 -195920 -163016 -48820 53183 117057 154122 142361 53829 -81036 -178430
649 -178430 -174993 -81277 32969 109109 146200 148222 80701 -58094 -173761 -173693 -86603 740
661 740 73399 148252 171349 85603 -52980 -137070 -145517 -117913 -54448 58571 164830 179213
673 179213 90931 -27524 -110316 -143152 -135321 -77482 36153 155735 189664 106160 -17249
684 -17249 -93565 -122166 -135334 -105028 4666 137115 184532 120039 14131 -67316 -119513
695 -119513 -145935 -116439 -14859 108658 171887 141685 51833 -48476 -127840 -155902 -114008
706 -114008 -18712 81979 146612 149271 83062 -23627 -117003 -155215 -124363 -36350 64580
717 64580 125952 135530 108666 31509 -95174 -184421 -147851 -31896 52307 92557 133809 139268
729 139268 47615 -90291 -164563 -143497 -67479 26060 103808 132870 114435 61447 -32529 -138544
741 -138544 -170695 -93988 14784 85905 124418 133403 80086 -24379 -115719 -152799 -126948 -33996
753 -33996 86283 150132 126772 65683 -860 -82068 -149192 -140026 -50487 55578 126968 142012
765 142012 92881 4862 -73213 -119323 -132876 -91900 13823 124565 160167 107909 18402
776 18402 -62080 -114621 -130877 -97547 -9993 98853 158719 126530 35548 -52479 -107680 -126128
788 -126128 -97892 -27255 61445 133182 146988 78143 -36361 -112518 -121573 -99827 -54437 35950
800 35950 132413 153817 87902 -8551 -90304 -135886 -118855 -46487 33900 96746 134963 115659
812 115659 23089 -81076 -126864 -116139 -72637 6919 95671 133423 105810 47555 -32837 -121852
824 -121852 -153912 -87808 14201 80750 112564 119671 71858 -26307 -112622 -137828 -100871 -19163
836 -19163 70152 118603 111649 72648 6657 -81123 -140978 -119448 -36306 48809 105591 124375
848 124375 92553 15822 -70503 -127367 -126507 -62137 31269 101334 123855 99449 31045 -59323
860 -59323 -118671 -117868 -72977 -1353 81522 131426 109906 39408 -35114 -97158 -128010 -95579
872 -95579 -12213 68732 115338 122215 71134 -25378 -102041 -117874 -93809 -40621 46155 122230
884 122230 124395 64771 -2685 -67532 -121409 -117258 -44033 39166 90662 115483 99366 21609
896 21609 -70449 -114014 -107837 -69616 6543 94582 128055 92764 30710 -37231 -105376 -127780
908 -127780 -75939 6224 69692 109582 113035 54566 -35700 -95272 -108547 -89805 -31047 56958
920 56958 116928 111877 61844 -7327 -80329 -119902 -98370 -35964 35225 99626 124750 79789
932 79789 -3767 -69520 -101878 -105459 -60564 24983 95245 111817 86084 28164 -51142 -109084
944 -109084 -108455 -62613 1313 72502 118960 101225 34066 -35322 -89203 -117242 -86951 -3809
956 -3809 70269 98935 97338 64421 -13662 -93974 -115871 -81335 -25521 41449 101131 110613 64083
969 64083 -1996 -64361 -110918 -106610 -38582 41329 85761 100104 85465 22096 -63578 -109437
981 -109437 -97268 -53938 9660 80233 113320 86183 25192 -38665 -93413 -110837 -68996 3968
993 3968 64485 100019 101055 49245 -33307 -90147 -98947 -76240 -25309 50131 106785 103499 52051
1006 52051 -12306 -71726 -105256 -89553 -30439 37988 88818 105822 72866 1612 -66253 -99031
1018 -99031 -92021 -47569 22062 82171 101991 79207 23897 -48671 -101250 -100027 -52607 8472
1030 8472 64398 101781 93542 34683 -38228 -87517 -99560 -70811 -7432 60062 96605 90598
1042 90598 49077 -15729 -78787 -103698 -78385 -20280 43761 91024 97368 58637 -4731 -63577
1054 -63577 -97629 -90847 -38666 34064 86308 96509 66906 11016 -51532 -92928 -92743 -51862
1066 -51862 14456 76789 101560 75295 19235 -36868 -80304 -97054 -69068 383 69446 98336
1078 98336 80685 34506 -23038 -75058 -97931 -74343 -14145 52212 92202 89036 47948 -11427
1090 -11427 -67017 -95259 -80514 -27676 37289 83384 93207 62566 2890 -59841 -93360 -82986
1102 -82986 -38312 20889 72831 95562 74319 15616 -48719 -87788 -86930 -49844 7273 61643
1114 61643 91789 81481 32572 -34280 -84255 -91175 -57409 -4765 48617 86761 89055 46244
1126 46244 -22408 -76511 -90362 -65856 -18005 36639 80103 91576 57697 -7086 -66537 -89478
1138 -89478 -72937 -30957 23764 74039 93234 65625 6230 -52342 -85495 -81701 -42417 14702
1150 14702 65831 89135 72994 21748 -40096 -81450 -84896 -53263 1171 56742 88025 77467
1162 77467 32223 -24163 -70960 -88979 -66065 -9820 49322 82776 79313 43376 -10198 -60519
1174 -60519 -87544 -75566 -24793 39597 80386 79278 48899 5114 -45728 -86289 -85673 -36111
1186 -36111 29996 72763 79063 58286 17235 -35932 -79999 -87569 -48871 14339 65563 81416
1198 81416 64237 26239 -24554 -72012 -88773 -58755 419 53271 79114 73310 38109 -16838
1210 -16838 -65932 -84013 -63216 -16223 37130 76819 83474 48306 -10839 -59923 -77796 -65620
1222 -65620 -29961 21096 70629 88428 59131 -304 -53072 -74098 -66474 -39375 5555 58574
1234 58574 90308 70988 11252 -45413 -70400 -68562 -48126 -6028 50102 86650 75994 25616
1246 25616 -31501 -67396 -74048 -53272 -11795 39701 77377 77864 39701 -15374 -60074 -78005
1258 -78005 -62707 -19812 32300 68994 76266 50577 2263 -50244 -81250 -71907 -26977 26716
1270 26716 62727 71592 55930 17409 -37130 -79409 -78883 -35615 17415 53619 69208 62238 28265
1283 28265 -25703 -70805 -80613 -50104 3007 50518 71152 63336 34234 -12849 -61591 -82603
1295 -82603 -58283 -8000 39434 68515 70828 40729 -8841 -50958 -71359 -65617 -29058 28633
1307 28633 71561 72493 42885 4308 -37234 -71002 -72952 -35540 18004 59815 75834 56726
1319 56726 11062 -35433 -63791 -68669 -46563 2417 54074 76053 59139 21292 -21970 -59363
1331 -59363 -72704 -51024 -6095 40022 69266 68911 35877 -14849 -57062 -71355 -55865 -16675
1343 -16675 29912 64690 71921 45427 -3992 -51086 -71335 -58112 -23610 18097 55955 72462
1355 72462 53992 7018 -41704 -67348 -62217 -33403 6198 47842 73409 63187 16991 -34907
1367 -34907 -61951 -63039 -45039 -5322 45776 74851 61037 21389 -19109 -52419 -69140 -53094
1379 -53094 -8647 36562 63610 63576 36552 -8150 -48262 -66469 -58091 -23826 26865 64604 66998
1392 66998 40408 3098 -36584 -68714 -67155 -26715 23107 53811 61816 50169 15709 -32360
1404 -32360 -64997 -64533 -34957 8160 45439 62253 54735 25251 -18443 -60066 -72570 -43925
1416 -43925 3024 38811 57711 60737 37001 -13332 -58884 -69085 -44687 -8185 26468 56038
1428 56038 64796 40321 -5919 -46218 -62454 -53443 -24157 18117 55476 66484 45272 4559
1440 4559 -35976 -61039 -60266 -32314 11350 50728 66802 50537 11327 -30018 -54744 -58250 -40634
1453 -40634 -1554 43737 66763 53264 18186 -16963 -46604 -62531 -50484 -9488 36126 61632
1465 61632 58831 31542 -9784 -46280 -61544 -50820 -18222 25261 58955 61528 35178 -1686
1477 -1686 -35568 -59449 -57203 -24587 18991 48793 57844 46654 12990 -31815 -61624 -57296 -29781
1490 -29781 6015 40661 62070 53647 17327 -25240 -54034 -59650 -39198 -238 37572 56983
1502 56983 52980 27521 -12520 -49010 -60531 -43043 -9987 26730 54133 58361 33990 -5448
1514 -5448 -40893 -58507 -51880 -20882 21987 53288 58009 37849 3623 -33241 -57066 -54744 -26958
1527 -26958 13271 45795 57698 44412 11693 -25874 -51641 -55081 -35039 1135 38794 58974
1539 58974 50777 18867 -18668 -47289 -57316 -41731 -5601 32787 55056 53095 28811 -10310
1551 -10310 -45608 -57126 -41250 -12321 20032 49006 58264 36364 -4134 -37804 -53589 -48666
1563 -48666 -22691 15930 46040 55375 41912 9992 -31150 -57287 -52024 -23927 8472 37408
1575 37408 55132 47415 14793 -23608 -49006 -54486 -35711 1294 35857 50895 46031 25642
1587 25642 -9922 -46651 -59161 -40727 -5464 27903 49743 51390 29757 -5289 -37712 -54990
1599 -54990 -47644 -15722 23531 48323 50379 33753 3620 -30082 -52272 -49689 -24732 11987
1611 11987 44382 54682 38821 8018 -24031 -46832 -51966 -32847 2726 38317 55344 45428
1623 45428 14123 -20204 -41765 -48642 -38836 -8634 31802 55547 47844 20064 -10325 -36912
1635 -36912 -50916 -42154 -13119 22403 48775 52908 30516 -5589 -34956 -48604 -44519 -20657
1647 -20657 16053 45671 50601 35031 6762 -27561 -52019 -48118 -21560 8994 34093 49532
1659 49532 44220 14148 -23388 -47556 -48807 -29996 1757 31706 47205 43998 23471 -12350
1671 -12350 -46032 -53761 -32305 -1976 23730 43191 48827 29913 -7515 -39970 -50637 -38379
1683 -38379 -11637 17979 41354 49175 34325 898 -33529 -48962 -41685 -19678 10111 39143
1695 39143 51648 37512 5560 -25220 -44088 -45869 -28088 4391 35513 49632 40400 12914
1707 12914 -18185 -39996 -46377 -34045 -4053 30419 49327 42663 18517 -10155 -35726 -48357
1719 -48357 -38705 -9501 24307 45305 45536 25616 -4355 -31119 -45528 -42364 -17692 18125 43419
1732 43419 45370 29658 5097 -23973 -46271 -46650 -21488 11710 36261 45089 35757 11553 -19442
1745 -19442 -42918 -47007 -27811 4267 31471 43743 38806 18093 -13024 -39726 -47380 -31738
1757 -31738 -3297 24849 43010 42757 23217 -7067 -34786 -46521 -36892 -10163 19692 40336
1769 40336 44497 28932 -784 -30403 -44380 -38497 -17497 11270 36646 45873 32968 5467
1781 5467 -23990 -41840 -41380 -23154 4763 31569 45640 38223 10856 -20268 -38743 -40946 -28460
1794 -28460 -3059 27208 45605 40189 16865 -12219 -34805 -42823 -32215 -8004 20281 41860
1806 41860 43778 23862 -6997 -31001 -41176 -35910 -15424 14963 39209 43528 28035 934
1818 934 -25747 -41290 -38466 -19040 8406 33296 43719 33237 7453 -20534 -38952 -40909 -24245
1831 -24245 4097 29436 41450 36399 15349 -14138 -37767 -42330 -27476 -1918 23401 39049
1843 39049 38636 20471 -7529 -33093 -43471 -33014 -7496 18836 35714 39208 26034 -501
1855 -501 -28381 -42706 -36338 -13403 13963 34108 39373 28033 5588 -20835 -40180 -39968 -19257
1868 -19257 9466 30803 38810 31471 11411 -15417 -36461 -41274 -26216 1852 28821 39311
1880 39311 32653 14981 -8474 -31567 -42552 -31305 -4234 23299 37589 35703 19858 -3844
1892 -3844 -27510 -39574 -34394 -11907 16892 36247 37835 23821 348 -23152 -38017 -35529 -16585
1905 -16585 9547 31898 40445 29678 4376 -21401 -35653 -34048 -21276 975 26202 41705
1917 41705 35163 9537 -18451 -33659 -33582 -23923 -5521 20133 40163 39005 15696 -13518 -31189
1930 -31189 -34251 -26755 -9688 14619 36262 40531 22052 -6605 -27669 -34756 -29473 -14017 10529
1943 10529 32833 38731 25418 1366 -21770 -36033 -34718 -17278 8155 28624 35571 28588 9499
1956 9499 -15113 -34923 -38756 -22137 4529 26041 33865 28603 15198 -6558 -31185 -41666 -27138
1969 -27138 1956 23300 30072 29191 21017 -182 -27780 -41581 -30027 -4763 17291 29422 31919
1982 31919 23097 2652 -22962 -38121 -33156 -12280 12186 28395 33971 26208 5770 -19026 -34589
1995 -34589 -33058 -18045 3212 24940 36740 30522 8441 -15309 -29174 -32064 -24104 -4026 21310
2008 21310 37853 33247 12247 -11265 -26950 -31097 -26073 -9303 15100 34859 35513 16731 -7402
2021 -7402 -23198 -30178 -28518 -14601 10698 32722 36571 21310 -905 -19366 -31020 -31766 -17019
2034 -17019 7541 28345 34290 25697 7323 -15979 -32030 -32860 -18436 2864 21768 32385 28821
2047 28821 12125 -10561 -28886 -34454 -23352 -1100 18994 29799 29778 18067 -4053 -27569 -35542
2060 -35542 -24971 -5251 14435 28696 32283 20378 -1262 -22001 -32821 -28948 -11415 10813
2072 10813 27012 30858 23637 5182 -17628 -32384 -30721 -15110 4475 23295 33272 27330 7337
2085 7337 -14522 -28208 -30907 -20881 -493 21318 32555 27510 10909 -8770 -24961 -31220 -23741
2098 -23741 -4470 16621 30441 29961 16708 -3538 -22968 -31945 -26064 -8819 11675 28206 31899
2111 31899 20389 -357 -19804 -30310 -28361 -13612 7860 25364 30144 22826 5758 -14656
2123 -14656 -29633 -29711 -16331 2363 20633 30969 27466 9635 -11365 -25856 -30050 -21688 -1306
2136 -1306 20021 30024 26703 13978 -5344 -24681 -31466 -22000 -4819 13071 26907 29529 17875
2149 17875 -2938 -20557 -29232 -26674 -11280 10394 26138 29343 20642 3781 -16662 -30460 -27643
2162 -27643 -12683 5570 21328 29621 24554 6978 -13960 -26823 -27509 -17217 680 18699 28957
2175 28957 25847 11737 -8593 -25243 -29629 -20657 -3030 15297 28002 27817 14685 -5202 -22350
2188 -22350 -29186 -23040 -7466 11728 26339 28802 17460 -1257 -17326 -26519 -26532 -13211 8169
2201 8169 25586 28588 18657 4340 -12077 -26175 -29049 -16255 4095 21610 28493 22124 6510
2214 6510 -10738 -22831 -27514 -20385 -1033 19578 27887 22828 10417 -5123 -21478 -29473 -21703
2227 -21703 -3912 13602 25191 27592 16961 -2963 -20823 -27076 -22344 -8614 8627 23406
2239 23406 28063 19934 1585 -18157 -28252 -23065 -10039 4188 17510 27642 25118 6252 -16337
2252 -16337 -26917 -23444 -13373 -157 15182 27580 26611 9867 -11260 -25030 -25875 -16806 -1954
2265 -1954 14043 25671 26193 13906 -5319 -21540 -26644 -20041 -6218 10775 23691 25922 15742
2278 15742 -259 -16023 -25993 -25274 -11177 9794 23607 24275 15941 3836 -10872 -25030 -28222
2291 -28222 -14431 7289 22286 24112 17418 6938 -6831 -21421 -27854 -19038 1924 19821 25195
2304 25195 19757 9737 -3998 -19619 -28144 -21424 -2841 14803 24156 23096 13036 -2713 -18172
2317 -18172 -25138 -21146 -8236 8734 22597 26224 16477 -904 -15936 -23325 -21706 -11137 4363
2330 4363 19903 27058 20771 3502 -14500 -23249 -20946 -12677 -398 15177 27169 24109 6778
2343 6778 -12172 -22047 -21842 -15598 -3403 12598 24866 24689 11876 -6845 -21274 -23599 -17319 -5310
2357 -5310 9110 22013 25410 15712 -2321 -17203 -24025 -20539 -7916 7925 20165 23303 17306
2370 17306 3243 -13361 -24681 -22934 -10344 5571 17406 22940 18823 6834 -9623 -22934
2382 -22934 -24592 -14301 2185 16186 22281 20101 9688 -5493 -19691 -25393 -18006 -1978 13651
2395 13651 21936 20991 11827 -1814 -16348 -24598 -20542 -5587 10254 21289 22086 13795 414 -13620
2409 -13620 -22553 -21940 -10261 6675 20322 23104 15508 2763 -10800 -21395 -22397 -13407 2794
2422 2794 17484 23562 18652 5875 -8238 -19096 -22571 -16196 -1362 14372 22809 20487 9520
2435 9520 -4734 -17666 -22528 -17324 -4473 10746 21030 22262 13135 -2486 -16170 -21763 -18594
2448 -18594 -7276 7058 19048 22723 15924 1434 -13974 -22084 -19889 -9377 4365 16173 22881
2461 22881 18975 5255 -11043 -20968 -20459 -11973 699 13444 22217 20544 8396 -7919 -18870
2474 -18870 -20910 -14752 -2615 10840 20850 21102 10969 -4397 -17326 -21114 -16761 -5938 8074
2487 8074 19886 22040 12624 -1496 -13748 -20086 -18996 -9420 5962 18923 22123 14719 2110
2500 2110 -10681 -19304 -20637 -12345 2780 16809 22297 16565 5142 -7514 -17747 -21966 -15019
2513 -15019 -5 14390 20511 17483 8563 -4222 -16546 -21972 -16633 -2934 11490 19331 18417
2526 18417 11581 -603 -14808 -22326 -17807 -4645 8694 17032 19506 14602 2454 -12812 -21925
2539 -21925 -19128 -7769 5195 14985 19758 16771 5534 -10177 -20714 -20076 -10309 1496 12647
2552 12647 19527 19010 8234 -7497 -18093 -19827 -13124 -1653 10840 19465 19598 9796 -4357 -15728
2566 -15728 -19415 -15258 -5057 8271 19538 20288 11227 -2250 -12892 -18328 -17987 -9541 5710 18322
2580 18322 20831 12936 861 -9852 -17408 -19048 -12112 2487 16737 21271 15148 3349 -7604
2593 -7604 -15539 -19226 -13709 -572 14081 20531 16592 6754 -5185 -15443 -19603 -14829 -2911 10693
2607 10693 18907 18096 10027 -2209 -14385 -20260 -15936 -4919 7452 16147 19151 13539 857 -12972
2621 -12972 -19791 -16692 -7105 4741 14124 18737 16030 5004 -10215 -19681 -17725 -8313 2220 11453
2635 11453 18093 17695 7250 -7478 -17955 -18710 -11477 -640 10199 17367 17445 9233 -4112 -15728
2649 -15728 -19685 -14385 -2968 9007 17076 17959 10948 -976 -12340 -18703 -16628 -6644 6721 16630
2663 16630 18400 12018 1796 -9032 -17472 -18435 -9598 3925 14859 18473 13812 3813 -7436 -15711
2677 -15711 -18105 -12227 250 13133 19072 15205 5088 -5491 -14032 -17695 -14169 -2946 10521
2690 10521 18254 17290 8528 -2607 -13104 -17784 -14422 -5469 6988 16644 18618 11431 -875 -11696
2704 -11696 -17196 -15820 -7461 4228 14634 17890 13636 2548 -9698 -17451 -16424 -8613 2211
2717 2211 11889 17360 15229 5864 -7117 -16313 -17804 -10789 230 10598 16860 15951 8220 -4011
2731 -4011 -14958 -18458 -12864 -1733 8656 15078 16340 10623 -910 -12777 -18164 -14449 -5122 5904
2745 5904 14758 17001 12070 923 -10325 -17063 -16260 -8127 4116 13893 16852 12855 3367 -7907
2759 -7907 -15428 -16470 -10101 447 12129 17933 14558 4618 -5804 -13144 -16700 -13220 -2249 10557
2773 10557 17820 15565 7109 -3284 -12265 -16794 -13901 -4305 7183 15755 16629 9334 -1105 -10342
2787 -10342 -15517 -14853 -6774 4899 14361 16364 11648 2325 -8040 -16159 -16199 -7779 3148 12055 16091
2802 16091 14330 5340 -7132 -16078 -16441 -9252 230 9745 15522 14940 7433 -3987 -14386 -17016
2816 -17016 -11661 -1808 7402 14220 16037 10260 -1708 -12855 -16558 -12616 -4498 5302 14203 16607
2830 16607 10988 -168 -10051 -15032 -14141 -7191 3463 12810 16353 12068 2292 -7706 -14560 -15300 -9598
2845 -9598 712 11526 16955 13717 4336 -5897 -12986 -15472 -11940 -1374 10241 16281 13783 6464
2859 6464 -2449 -11434 -16338 -12979 -3102 7787 13984 14599 9537 -447 -10235 -15875 -13890 -5685 5242
2874 5242 13258 15145 10499 1910 -8273 -15636 -15426 -7086 3688 11442 14606 12505 4730 -6640
2888 -6640 -15091 -15072 -8881 534 9789 15375 13878 6080 -4083 -12410 -15679 -11218 -1302 8231 14358
2903 14358 14068 8079 -2172 -11528 -14663 -11774 -4407 5399 13908 15241 9275 -559 -9264 -13867 -13516
2918 -13516 -7000 3611 12715 15435 11011 1716 -7750 -13584 -13919 -8378 1330 11060 15437 13090 4153
2933 4153 -6114 -12794 -13802 -9544 -796 8326 14668 13870 6377 -3928 -11743 -14536 -11299 -2645 6775
2948 6775 13155 14454 8936 -1310 -11382 -14978 -11351 -4396 4431 12223 14752 10496 922 -8356
2962 -8356 -14168 -13271 -6289 3463 10766 13667 12081 4072 -6580 -14171 -14309 -8243 768 9192 14572
2977 14572 12431 5285 -3931 -11913 -14992 -11045 -888 8548 13156 12042 7034 -1274 -10263 -15120
2991 -15120 -11673 -2998 6946 13192 13115 8242 390 -8272 -14187 -13661 -5716 5071 12429 13817 9508
3006 9508 1784 -6927 -13241 -13724 -7711 2272 10754 13903 11387 3423 -5293 -12266 -13611 -9026 -479
3021 -479 8678 14375 12782 5377 -3615 -10960 -13476 -10152 -2483 6596 13192 13937 7410 -2179 -10399
3036 -10399 -13176 -10318 -4525 3592 12387 14939 9592 -667 -9091 -12386 -11786 -6428 2402 10810 14339
3051 14339 10888 1938 -7204 -12534 -12099 -7273 595 8886 13963 12549 4177 -5303 -11423 -12573 -9257
3066 -9257 -1236 7765 12739 12340 6526 -2228 -10449 -13490 -10396 -2525 5846 12019 12830 8059 -233
3081 -233 -8942 -13616 -12232 -4440 4655 10984 12134 9112 2425 -6451 -13275 -13174 -6339 3231 9636
3096 9636 12049 10107 4376 -4412 -12612 -13939 -7889 1276 8702 11971 10806 5464 -2881 -10865 -13636
3111 -13636 -9281 -1123 7375 11670 11707 6911 -1644 -9129 -13163 -10477 -3009 4836 11093 13319 8077
3126 8077 -28 -8140 -12034 -11263 -5739 2963 10627 13437 9737 1196 -6813 -11244 -11322 -7302 412 9116
3142 9116 13891 10956 2636 -5498 -10301 -11391 -8549 -1582 7487 13131 11886 4548 -3545 -9773 -11752
3157 -11752 -9339 -2842 5786 11983 12306 7074 -1159 -8302 -12187 -10378 -4295 4019 10474 12326 8314
3172 8314 800 -7005 -12300 -11453 -5273 2677 9382 11570 9975 3241 -5177 -11758 -12169 -6513 1242
3187 1242 7770 11467 10537 5153 -3408 -10521 -12460 -8253 -473 6264 10894 11103 6433 -1463 -9435
3202 -9435 -12291 -9548 -2741 5009 10650 11829 7542 -96 -7615 -11808 -10588 -4227 3360 9965 11760
3217 11760 8695 1219 -6070 -11120 -11053 -6409 1402 9157 12244 9509 3068 -4781 -10201 -11471 -7398
3232 -7398 -330 7452 11554 10510 4873 -3105 -9375 -11454 -8850 -1815 5855 11110 10809 6410 -1221
3247 -1221 -8292 -11858 -9372 -3100 3860 9800 11391 7902 623 -6946 -11135 -10167 -4977 2694 9119
3262 9119 11597 9000 2528 -5593 -10872 -11032 -6204 935 7979 11276 9961 3832 -3834 -9596 -11194
3277 -11194 -8158 -1173 6593 11226 9856 5032 -2121 -8657 -11141 -9288 -2612 5195 10646 10593 6366
3292 6366 -648 -6744 -10542 -10232 -4871 3548 10061 10986 7471 942 -5621 -10265 -10322 -5317 2004 8571
3308 8571 11290 8346 2654 -4635 -9622 -10680 -6806 2 7062 10734 9860 4294 -3180 -9364 -11033
3323 -11033 -7635 -1239 5626 10134 10139 6104 -1593 -8467 -10778 -8170 -2559 3788 9268 10834 7513
3338 7513 -154 -7096 -10511 -9002 -4196 2541 8226 10697 8197 1823 -5445 -10168 -9945 -5485 1297
3353 1297 7120 10756 9456 3560 -4060 -9217 -10341 -7031 -622 6288 10405 9491 4784 -2070 -8093
3368 -8093 -10949 -8128 -1850 5124 9698 9803 5750 -491 -7134 -10373 -9089 -3681 3855 9549 10099
3383 10099 6940 831 -5218 -9966 -9990 -5281 2347 8458 10037 7840 2142 -4312 -9523 -9954 -6137
3398 -6137 439 6788 10569 8710 3363 -2704 -8276 -9973 -7539 -1109 5868 9728 9451 5251 -1641
3413 -1641 -7536 -10119 -8281 -2460 4173 9170 10181 6285 -255 -6678 -9713 -8988 -3631 2693 8145
3428 8145 10242 7326 1344 -5466 -9485 -9414 -4888 1094 7103 9860 8913 2733 -4180 -8951 -9594 -6133
3444 -6133 -426 5999 9886 9168 4093 -2722 -8005 -9883 -7078 -1567 4849 9040 9330 5876 -894
3459 -894 -7035 -9667 -7823 -2973 3256 8624 9947 6597 196 -5830 -9390 -9319 -4188 2487 7525 9452
3475 9452 7306 1952 -4566 -9483 -9310 -5152 807 6485 9399 8685 3452 -3295 -8443 -9918 -6553
3490 -6553 -337 5827 9398 8625 4440 -1734 -7089 -9698 -7473 -1780 4496 8473 9278 5563 -532
3505 -532 -5949 -9085 -8211 -3580 3156 7950 9641 6383 1095 -4563 -8960 -9003 -4894 1687 6971 9067
3521 9067 7614 2372 -3922 -8273 -9267 -5457 -174 6025 9377 8226 3367 -2590 -7499 -9068 -6744
3536 -6744 -1413 4719 8731 8622 4438 -1104 -6872 -9222 -7467 -2600 3788 8095 9181 6227 12
3551 12 -5692 -8859 -8192 -3708 2173 7446 9026 6940 1637 -4108 -8755 -8625 -4730 1034 6137 8844
3567 8844 7891 2675 -3540 -8062 -8342 -5688 -539 5469 9243 8133 3783 -1734 -7126 -9029 -6914
3582 -6914 -1812 4231 7749 8720 5782 -703 -6343 -8678 -7439 -3186 2753 7794 8969 5884 191
3597 191 -4868 -8484 -8025 -4274 1899 6904 8584 6483 2117 -3985 -8212 -8636 -4706 349 5554 8780
3613 8780 7599 3150 -2836 -7281 -8747 -6113 -788 5016 8160 7728 4524 -1237 -6506 -8816 -6850
3628 -6850 -2027 3489 7569 8352 5238 -21 -5517 -8535 -7535 -3714 2524 7182 8694 6324 1047
3643 1047 -4323 -7854 -8240 -4379 1273 6043 8223 6915 2394 -3030 -7402 -8004 -5666 -428 5091
3658 5091 8384 7766 3300 -1977 -6567 -8112 -6608 -1484 4439 7821 7781 4708 -898 -5759 -8136 -7292
3674 -7292 -2624 3080 7172 8010 5507 180 -4730 -8050 -7712 -3498 1865 6177 8029 6405 1973
3689 1973 -4100 -7890 -7828 -4721 656 5204 8186 7403 3120 -2731 -6867 -7790 -5532 -750 4564 7749
3705 7749 7334 3798 -1303 -6320 -8286 -6217 -1833 3244 7013 7680 4945 -335 -5456 -7760 -7054 -3039
3721 -3039 2471 6888 7667 5292 1113 -4140 -7614 -7786 -4219 1180 6346 7756 6339 2163 -3071
3736 -3071 -6734 -7918 -5548 -113 5498 7891 7066 2826 -1791 -6175 -7982 -6075 -1141 4025 7486
3751 7486 7607 3853 -840 -5558 -7473 -6542 -2300 2658 6764 7936 5220 162 -4843 -7486 -6605 -3503
3767 -3503 1621 6181 8205 6012 1288 -4229 -7092 -6992 -4387 521 4825 7565 6650 2409 -3026
3782 -3026 -6843 -7367 -4923 -661 4215 7156 7086 3345 -1534 -6365 -7676 -5745 -1290 3429 6594 7508
3798 7508 4887 -401 -5176 -7643 -6831 -2631 2603 6134 7086 5333 999 -3844 -7485 -7309 -3404 1589
3814 1589 5503 7045 5640 2240 -2838 -6849 -7485 -4716 388 5023 6860 6116 2886 -2044 -6248
3829 -6248 -7295 -5169 -958 3752 6820 6814 3709 -1350 -5367 -7334 -6068 -2503 2433 6546 7273 4352
3845 4352 -245 -4565 -6620 -6245 -3307 1353 5944 7897 5557 398 -3725 -6076 -6489 -4089 408
3860 408 5004 7344 6021 1824 -2801 -6014 -6788 -4845 -844 4071 7256 6461 3051 -1612 -5469 -7077
3876 -7077 -5522 -1264 3652 6544 6548 4124 -274 -5025 -7215 -6072 -2092 2539 6099 6532 4638 965
3892 965 -3883 -7142 -6787 -2794 1573 5110 6820 5719 1938 -2965 -6359 -6948 -4069 492 4737 6564
3908 6564 6339 2872 -2001 -6027 -6800 -4716 -530 3201 6655 6624 3571 -1086 -4961 -7000 -5551 -1858
3924 -1858 2727 5944 6955 4524 -139 -4485 -6455 -5805 -2808 1539 5940 6836 4935 785 -3456
3939 -3456 -6218 -6631 -3578 988 5237 6748 5346 1927 -2510 -5716 -6412 -4329 6 4143 6475
3954 6475 5865 2715 -1553 -5277 -6786 -5084 -916 3500 6115 6187 3565 -318 -4330 -6761 -5860 -2467
3970 -2467 2159 5747 6340 4220 669 -3546 -6523 -6103 -2995 1609 5187 6256 5050 1236 -3207
3985 -3207 -6003 -6320 -3662 393 4412 6113 5895 2233 -2176 -5670 -6424 -4413 -315 3389 6364 6159
4001 6159 3298 -1262 -4710 -6321 -4873 -1429 2536 6001 6112 3954 -79 -4097 -6158 -5348 -2228
4016 -2228 1670 5372 6388 4705 567 -3636 -5748 -5704 -3075 973 4343 6516 5097 1926 -2432
4031 -2432 -5826 -6217 -4031 -48 3891 5969 5744 2652 -1874 -4830 -6205 -4641 -868 3095 5723
4046 5723 6028 3549 -366 -4542 -6251 -5037 -1612 2320 5200 5939 4238 143 -3532 -5914 -5729 -2693
4062 -2693 1338 4860 6036 4665 1016 -2724 -5358 -5892 -3411 564 4127 5781 5339 2255 -1709
4077 -1709 -5287 -6002 -3919 -368 3420 5732 5187 2905 -831 -4742 -5959 -4847 -1339 2829 5563
4092 5563 5894 3573 -255 -3714 -6261 -5306 -2235 1878 5302 5898 4073 296 -3180 -5643 -5629 -2966
4108 -2966 1072 4577 5904 4721 1746 -2513 -5145 -5650 -3807 -328 3681 5744 5118 2062 -1831
4123 -1831 -4718 -5823 -4209 -1093 2996 5437 5451 2821 -739 -4203 -5727 -4231 -1617 2102 5116
4138 5116 6046 3838 -145 -3824 -5417 -4845 -2683 1264 4631 6093 4265 871 -2670 -5329 -5464 -3127
4154 -3127 768 3877 5749 5037 1749 -2189 -4840 -5735 -3709 -296 3357 5517 5171 2529 -1258 -4590
4170 -4590 -5828 -4234 -1041 2653 5015 5277 3150 -224 -3766 -5724 -4575 -1794 1748 4890 5659
4185 5659 3899 262 -3096 -5404 -5236 -2542 1234 4196 5289 4026 1458 -2552 -5136 -5353 -3012
4200 -3012 178 3438 5669 4747 2218 -1532 -4710 -5260 -4048 -1004 3141 5292 5291 2688 -592 -3862
4216 -3862 -5277 -4348 -1240 2159 4830 5451 3642 20 -3324 -5276 -4757 -2432 1522 4326 5758 3909
4232 3909 638 -2928 -5114 -5020 -3048 882 3796 5625 4557 1671 -2015 -4671 -5135 -3243 -170 2959
4248 2959 5128 5065 1964 -1010 -4080 -5323 -4039 -995 2478 4509 4881 2853 -368 -3470 -5507 -4525
4264 -4525 -1348 2107 4379 5014 3631 -130 -2921 -4920 -4604 -2650 1161 4158 5079 4217 1108 -2268
4280 -2268 -4728 -4950 -3107 549 3508 5367 4484 1822 -1480 -4465 -5118 -3368 -517 2742 4822 4612
4296 4612 2424 -764 -3814 -4985 -4323 -1087 2104 4429 4701 2973 -161 -3214 -4861 -4504 -1921 961
4312 961 4241 5063 3520 850 -2541 -4866 -4828 -2406 693 3621 4682 4222 1540 -1964 -4382 -4987
4328 -4987 -3177 69 2910 5040 4450 1877 -1287 -4036 -4675 -3467 -682 2609 4414 4576 2468 -654
4344 -654 -3697 -5117 -3736 -1239 1644 4234 4880 2966 -50 -3134 -4562 -4283 -2244 925 3760 5017
4360 5017 3517 706 -2133 -4364 -4643 -2851 231 3441 4880 3993 1708 -1735 -3932 -4830 -3219 -370
4376 -370 2629 4509 4244 2184 -1360 -3607 -4940 -3609 -666 2364 4398 4350 2854 -513 -3391 -4734
4392 -4734 -3863 -1795 1265 3777 4722 3316 334 -2592 -4370 -4503 -2655 537 3340 4987 3971 1301
4408 1301 -1878 -4112 -4495 -2632 -104 2942 4741 4475 1914 -1424 -3677 -4575 -3455 -665 2790 4416
4424 4416 4272 2172 -572 -3170 -4733 -3707 -1052 1720 4222 4538 3226 575 -2957 -4709 -4203 -2119
4440 -2119 1176 3710 4608 3222 791 -2138 -3978 -4521 -2600 304 3288 4613 3723 1538 -1746 -3696
4456 -3696 -4446 -3118 -261 2785 4413 4277 2236 -991 -3860 -4525 -3556 -698 1986 3990 3997 2926 -134
4473 -134 -2979 -4436 -3393 -1267 1322 3754 4594 3341 132 -2516 -4288 -3767 -2201 661 3102 4464
4489 4464 3565 1188 -1915 -4016 -4127 -2541 130 2661 4141 3933 1796 -1293 -3760 -4310 -2952 -459
4505 -459 2300 4022 3898 2272 -366 -3194 -4185 -3602 -1097 1982 3968 4138 2709 -83 -2416 -4412
4521 -4412 -3860 -1963 1451 3498 4070 3179 560 -2256 -4003 -4349 -2172 607 3040 4082 3342 1124
4537 1124 -1716 -3450 -4401 -2980 -188 2564 3996 3593 2054 -1062 -3291 -4090 -3338 -1000 2164 3974
4553 3974 4012 2580 -480 -2803 -4390 -3354 -1410 1140 3695 4119 2787 331 -2462 -3832 -3867 -1745
4569 -1745 748 2851 4227 3442 1035 -1735 -3710 -3726 -2423 448 2654 4062 3466 1348 -1455 -3242
4585 -3242 -4146 -2801 -606 2077 4076 3541 1776 -813 -3168 -4074 -3141 -1021 1626 3676 3563 2524
4601 2524 -54 -2482 -4045 -3247 -1127 1199 3246 4144 3026 137 -2150 -3758 -3700 -2033 546 2693
4617 2693 4029 3220 1007 -1648 -3402 -3749 -2572 101 2284 4122 3428 1418 -741 -2970 -4257 -2836
4633 -2836 -595 1941 3831 3361 2185 -313 -2547 -4049 -2965 -985 1326 3468 3707 2421 177
4648 177 -2223 -3798 -3397 -1724 834 3027 4039 2813 735 -1455 -3310 -3762 -1885 335 2620 4030
4664 4030 3484 1053 -1387 -3372 -3946 -2563 -81 2249 3573 3316 1643 -798 -2806 -3802 -3165 -928
4680 -928 1529 3470 3857 2409 -110 -2376 -3738 -3182 -1075 1134 3090 3696 2639 466 -2032 -3314
4696 -3314 -3314 -1867 476 2890 3731 3019 1085 -1402 -3362 -3522 -2360 37 2441 3785 3355 1520 -1242
4713 -1242 -2845 -3695 -2696 -496 1601 3654 3647 1942 -594 -2718 -3449 -2885 -1017 1826 3167 3445 2249
4730 2249 -130 -2383 -3677 -3300 -1624 845 3010 3652 2607 674 -1764 -3005 -3542 -1905 725 2465
4746 2465 3385 2972 1502 -1250 -3142 -3443 -2383 151 2253 3276 3235 1860 -721 -2804 -3492 -2863 -424
4763 -424 1654 3315 3350 1799 -103 -2297 -3628 -2979 -1173 1270 2797 3425 2688 265 -1935 -3484
4779 -3484 -3106 -1628 479 2726 3478 2698 1044 -1522 -3464 -3344 -1896 -24 1981 3325 3076 1211
4795 1211 -971 -2992 -3385 -2223 -356 1771 3381 3180 1449 -585 -2461 -3283 -2723 -1017 1419 2793
4811 2793 3223 2261 -29 -2175 -3532 -2953 -1610 1108 2825 3175 2260 441 -1550 -3063 -3135 -1742 361
4828 361 2499 3364 2857 986 -1424 -2820 -3371 -2210 -162 1993 3053 2983 1585 -500 -2657 -3158 -2601
4845 -2601 -620 1517 3049 3559 1799 -234 -2402 -3317 -2713 -749 1160 2566 3237 2466 189 -2018
4861 -2018 -2926 -2981 -1723 803 2441 3071 2176 873 -1443 -2937 -3391 -2118 260 2123 3146 2813 1314
4878 1314 -884 -2675 -3156 -2058 -542 1779 3357 3191 1627 -626 -2331 -3064 -2396 -919 1491 3036
4894 3036 3085 1804 -86 -2043 -3189 -3001 -1152 831 2657 3286 2298 472 -1425 -2956 -3066 -1580
4910 -1580 453 2427 3184 2395 827 -1024 -2546 -2842 -1921 -295 1885 2916 2914 1224 -990 -2761 -3163
4927 -3163 -2244 -567 1515 2864 2738 1877 -329 -2087 -3210 -2634 -982 1028 2644 3148 1900 312
4943 312 -1654 -3097 -2824 -1414 557 2506 3051 1940 482 -1185 -2933 -2834 -1570 99 2123 2816
4959 2816 2221 1199 -877 -2658 -2871 -1909 -141 1689 2827 2681 1431 -790 -2430 -2994 -2429 -690
4975 -690 1228 2324 3109 2153 -31 -1923 -2942 -2568 -1125 927 2266 3104 2287 336 -1670 -2976
4991 -2976 -2770 -1654 551 2143 3019 2330 1037 -994 -2809 -2961 -1717 181 1642 2908 2649 896
5007 896 -886 -2189 -3059 -2190 -236 1261 2876 2482 1707 -603 -2278 -2805 -2599 -374 1403 2295 2603
5024 2603 1722 -38 -1904 -2592 -2477 -1189 813 2422 2694 2236 586 -1650 -2625 -2940 -1777 334 2101
5041 2101 2931 2306 586 -960 -2553 -2774 -1892 -413 1488 2631 2542 1250 -397 -2291 -2715 -2213 -677
5058 -677 1255 2502 2639 1739 -190 -2094 -2618 -2169 -863 794 2265 2474 1947 303 -1595 -2612 -2176
5075 -2176 -1514 315 2175 2849 2242 878 -1425 -2522 -2580 -1987 282 1537 2656 2278 1301 -818 -2367
5092 -2367 -2514 -2040 -332 1444 2527 2652 1528 -138 -1860 -2572 -2441 -762 736 2353 2524 1510
5108 1510 367 -1830 -2657 -2259 -849 711 2009 2899 1934 544 -1260 -2393 -2584 -1743 260 1974
5124 1974 2726 2109 434 -978 -2068 -2689 -1588 -83 1513 2284 2396 1160 -271 -2052 -2672 -2113 -362
5141 -362 1375 2488 2595 1452 -194 -1691 -2523 -2253 -975 1026 2333 2534 1964 67 -1577 -2020 -2283
5158 -2283 -1119 481 2049 2272 1932 441 -1159 -2522 -2605 -1736 -5 1710 2217 2376 1172 -860 -2189
5175 -2189 -2451 -1559 -391 1172 2361 2763 1228 -471 -1866 -2483 -2042 -537 987 2278 2556 1866 107
5192 107 -1705 -2328 -2181 -1091 497 1860 2451 1916 461 -1246 -2415 -2280 -1117 -19 1771 2489 2007
5209 2007 917 -1184 -1987 -2460 -1545 11 1575 2381 2072 881 -833 -1665 -2846 -2078 -156 1156 2037
5226 2037 2204 1532 -109 -1836 -2264 -2038 -817 702 2254 2161 1559 240 -1082 -2258 -2218 -1459 365
5243 365 1865 2146 2058 381 -1016 -2124 -2194 -1262 114 1573 2394 2031 866 -618 -1872 -2387 -1427 -410
5261 -410 998 2110 2292 1141 -407 -1784 -2374 -1860 -829 938 2111 2412 1567 -87 -1459 -2373 -1894
5278 -1894 -988 605 2137 2284 1579 234 -1135 -1961 -2129 -1288 366 1677 2169 2055 912 -706 -2033
5295 -2033 -2424 -1556 -145 1352 1920 1842 992 -591 -1564 -2490 -1773 -302 1003 2184 1997 1289 -158 -1622
5313 -1622 -2418 -2069 -520 735 2068 2132 1475 387 -1205 -2229 -2052 -1023 636 1621 1974 1782 394
5330 394 -1150 -2182 -2002 -1458 319 1549 2035 1641 668 -503 -1998 -1902 -1433 -186 1108 2182 1810
5347 1810 1306 -290 -1568 -2168 -1826 -476 946 2050 2002 1027 -122 -1525 -2083 -1869 -867 701 2023
5364 2023 2381 1883 52 -1006 -2070 -1870 -1375 -35 1196 2180 1698 663 -674 -1976 -1769 -1462 -74
5381 -74 1249 2050 1841 1005 -673 -1717 -2071 -1492 -612 1027 1822 1982 1194 -297 -1503 -2349 -1785 -864
5399 -864 775 1858 2158 1454 154 -1113 -2200 -1856 -688 706 1461 2164 1781 474 -956 -1805 -2028
5416 -2028 -1240 72 1646 2047 1351 836 -557 -1588 -2043 -1307 -42 1391 1965 1914 1120 -120 -1769
5433 -1769 -1956 -1604 -377 952 2024 2097 1078 24 -1522 -1819 -1937 -739 466 1671 1917 1129 -28
5450 -28 -1012 -1788 -1875 -1279 125 1620 2151 1776 454 -719 -1797 -2123 -953 101 1063 1987 1715 829
5468 829 -474 -1763 -2120 -1461 -202 751 1948 1968 1411 -628 -1332 -1711 -1872 -633 790 1807 2015 1735
5486 1735 285 -1088 -2188 -2136 -916 497 1759 2139 1630 448 -956 -1883 -2110 -854 267 1145 1956
5503 1956 1782 675 -662 -1101 -1748 -1524 -307 1011 1818 1765 1088 -530 -1756 -1760 -1518 -551 793 1884
5521 1884 1996 1197 118 -1206 -1695 -1919 -530 495 1391 1420 1381 441 -796 -1837 -2041 -905 132 1507
5539 1507 1783 1535 277 -1092 -1692 -2063 -1408 90 1094 1871 1412 746 -706 -1620 -1643 -1298 -218 1103
5557 1103 1681 1856 953 -188 -1397 -1816 -1608 -513 606 1619 1711 898 -34 -1241 -1782 -1709 -707 363
5575 363 1271 1761 1356 316 -737 -1589 -1773 -986 5 1442 1729 1604 685 -713 -1455 -1736 -1152 -458 951
5594 951 1742 1577 925 -445 -1479 -1777 -1259 -532 745 1358 1779 935 -16 -892 -1876 -1931 -832 290 1366
5613 1366 1345 1176 210 -1067 -1418 -1733 -811 279 1230 1786 1306 571 -441 -1329 -1884 -1190 44 1061
5631 1061 1861 1227 462 -432 -1386 -1722 -1519 -143 953 1631 1356 993 -298 -1096 -1961 -1702 -437 657
5649 657 1545 1611 1200 220 -978 -1641 -1288 -811 261 1180 1723 1435 499 -844 -1484 -1646 -916 -115 1021
5668 1021 1419 1420 266 -881 -1423 -1403 -1090 32 539 1304 1602 703 -187 -910 -1717 -1296 -269 409 1177
5687 1177 1396 857 -170 -1416 -1654 -1580 -748 475 1512 1332 839 398 -1044 -1545 -1538 -836 360 1303 1536
5706 1536 1095 755 -545 -1214 -1599 -898 -45 746 1705 1416 652 -269 -1130 -1654 -920 20 878 1433 1429 1166
5726 1166 165 -924 -1489 -1416 -572 637 1355 1686 928 -35 -743 -1573 -1279 -492 405 1209 1523 1305 158
5745 158 -742 -1508 -1416 -911 348 1322 1667 1348 475 -567 -1130 -1660 -1235 -366 834 1590 1435 758 -386
5764 -386 -1106 -1512 -1182 -390 720 1658 1467 875 199 -1184 -1561 -1255 -423 375 1302 1485 695 285 -1179
5783 -1179 -1415 -1570 -698 239 1070 1538 1104 395 -558 -1411 -1255 -717 -121 444 1189 1193 721 -433 -1231 -1502
5803 -1502 -957 -470 878 1401 1575 657 -47 -853 -1572 -1557 -290 335 1296 1292 876 -115 -871 -1389 -1417 -294
5823 -294 299 1357 1209 1190 217 -631 -1560 -1339 -1004 141 1015 1544 1000 454 -395 -1007 -1533 -1044 -276 1149
5843 1149 1208 1016 684 -118 -1241 -1252 -1142 -264 540 965 1307 773 -25 -1324 -1459 -1131 -424 719 933
5862 933 1144 1076 568 -710 -1135 -1367 -671 20 1049 1480 1308 374 -805 -1287 -1365 -977 -38 855 1421 1201
5882 1201 911 -173 -1060 -1197 -1033 -490 577 1320 1133 488 -318 -979 -1134 -755 -443 674 1221 1446 751
5901 751 -61 -788 -1070 -1264 -475 359 919 1326 998 438 -559 -955 -1136 -572 269 957 1289 1283 477 -590
5921 -590 -1263 -1291 -1056 -43 1033 1248 1422 995 -282 -1136 -1292 -929 -182 333 1113 1139 1054 -253 -788 -1136
5941 -1136 -853 -493 661 839 1202 1008 90 -668 -1305 -1170 -678 242 1130 1021 1151 45 -590 -1223 -1433
5960 -1433 -625 80 1186 1267 908 411 -477 -1189 -1226 -902 -200 659 1210 1201 494 -342 -665 -1093 -972 -331 480
5981 480 1232 1250 897 69 -706 -1405 -1085 -513 446 958 1127 989 368 -649 -1229 -1220 -849 123 650 1233 977
6002 977 395 -435 -1097 -1270 -938 40 767 1338 901 161 -460 -838 -1094 -711 -126 251 1320 1100 645 27
6022 27 -888 -1059 -937 -670 333 1041 1282 1114 -279 -598 -926 -914 -780 226 1033 1445 1020 384 -449 -1386
6042 -1386 -1227 -447 -121 657 954 1158 668 -84 -1153 -1174 -839 -327 553 929 1052 517 -83 -790 -1477 -961
6062 -961 -48 481 783 1165 973 130 -858 -1155 -1212 -400 162 891 1188 706 490 -393 -1226 -1248 -757 21 738
6083 738 1075 876 228 -467 -808 -1159 -809 0 723 944 957 438 -237 -712 -936 -919 -397 400 1093 1121 398
6104 398 -387 -854 -1011 -1039 -188 587 950 960 680 -4 -181 -1096 -1081 -632 143 625 1101 614 483 -24 -1044
6125 -1044 -1380 -856 295 569 1351 1178 776 -283 -1068 -1291 -546 -101 556 960 1154 877 -283 -953 -1048
6144 -1048 -820 -377 251 713 986 749 21 -818 -949 -937 -263 -144 767 1209 782 285 -533 -970 -1088 -305
6164 -305 274 905 1139 672 290 -606 -767 -1150 -938 -10 412 1047 1422 307 -109 -517 -1067 -930 -385 454
6184 454 910 905 627 -210 -749 -1011 -909 -366 304 927 1064 810 -77 -519 -1061 -1217 -664 27 810 1071 857
6205 857 225 -587 -814 -1187 -365 -52 704 1064 1009 493 -435 -881 -927 -499 -145 549 707 1205 270 -81 -788
6226 -788 -1027 -1182 -265 572 829 929 753 -106 -974 -851 -1200 -612 355 693 1090 705 133 -427 -973 -946
6246 -946 -588 414 834 1079 832 359 -494 -955 -1237 -623 127 628 909 798 325 -427 -698 -735 -723 -88
6266 -88 458 823 1040 569 57 -945 -1020 -845 -223 575 930 1085 614 -169 -457 -923 -747 -173 55 559
6286 559 968 607 85 -521 -788 -999 -460 -38 732 1020 887 297 -271 -898 -852 -769 -244 507 1110 747 579
6307 579 -155 -843 -751 -1129 -103 607 1001 981 570 219 -575 -1056 -1135 -259 250 776 755 809 -9 -601 -984
6328 -984 -660 -406 201 773 698 414 213 -407 -891 -967 -578 -3 584 639 986 343 31 -767 -857 -625 -130
6349 -130 619 721 735 611 -241 -512 -962 -1034 -250 349 832 879 597 -191 -731 -590 -687 -484 369 707 1021
6370 1021 840 292 -486 -651 -430 -520 87 405 753 810 190 -240 -546 -778 -927 -71 385 798 689 594 -167
6391 -167 -595 -1027 -402 -75 564 871 1121 544 138 -733 -753 -603 190 540 541 985 749 218 -494 -854 -963
6412 -963 -164 48 754 719 506 315 -348 -727 -1110 -469 -118 283 795 901 212 -228 -723 -690 -617 -308 647
6433 647 811 723 349 -288 -777 -882 -1089 -211 539 789 843 540 -153 -589 -476 -551 -347 -21 994 735 453
6454 453 113 -667 -532 -565 -481 221 579 1119 740 381 -334 -717 -601 -473 -40 438 808 789 79 -271 -316
6475 -316 -1026 -394 -122 370 686 719 294 -98 -324 -957 -549 -553 437 819 486 608 33 -619 -653 -513 -141
6496 -141 424 771 709 633 440 -73 -514 -1042 -688 330 401 572 613 430 -526 -798 -799 -651 -241 140 569 690
6518 690 599 -29 -653 -750 -582 -292 466 668 712 333 -341 -571 -849 -655 -597 442 515 767 559 -33 -359
6539 -359 -823 -580 -519 10 550 591 573 459 -200 -466 -901 -457 -99 478 1041 772 -12 -131 -471 -621 -675
6560 -675 -133 516 521 859 209 42 -821 -617 -519 -56 34 743 1041 740 207 -359 -620 -747 -323 40 417
6581 417 387 805 301 -379 -507 -666 -597 -128 414 666 719 200 -39 -559 -840 -484 114 649 563 523 180 -180
6603 -180 -411 -724 -404 -450 453 423 642 131 -36 -574 -506 -203 -291 187 754 925 547 -11 -236 -778 -669
6624 -669 -334 123 666 908 670 267 -517 -685 -567 -306 -33 748 748 599 237 -160 -496 -632 -258 73 280
6645 280 271 447 430 -133 -284 -553 -701 -143 326 473 698 357 -10 -621 -889 -482 -333 175 424 778 704
6666 704 106 -140 -653 -865 -614 224 659 495 725 -61 -373 -376 -632 -703 -82 312 494 919 145 -13 -435
6687 -435 -654 -777 -7 272 572 771 437 250 -526 -650 -381 -135 339 236 710 321 69 -518 -746 -412
6707 -412 -270 76 542 865 475 68 -345 -560 -543 -597 0 451 439 922 442 -19 -655 -416 -372 13 249
6728 249 707 554 134 -42 -417 -603 -605 -50 392 677 329 477 -126 -397 -748 -447 -48 198 333 680 517
6749 517 180 -159 -899 -684 -63 -163 368 581 594 92 -343 -522 -390 -419 198 687 654 612 160 -172 -366
6770 -366 -679 -556 -216 267 512 588 278 -109 -331 -661 -620 -479 181 627 726 631 -84 -356 -379 -601 -539 363
6792 363 386 550 256 168 -26 -411 -514 -424 164 456 240 454 192 24 -488 -766 -296 -207 318 396 600 51
6814 51 -248 -567 -710 -374 -169 286 323 655 298 -162 -315 -615 -629 -196 369 481 696 614 -141 -365 -330 -438
6836 -438 -132 140 541 528 414 262 -481 -464 -648 -255 -137 491 762 662 239 -67 -422 -564 -385 -48 332
6857 332 768 665 256 -120 -693 -600 -645 -95 414 856 689 418 91 -500 -646 -412 -107 264 311 530 422
6878 422 130 -262 -504 -604 -258 -133 513 724 574 176 -358 -798 -299 -521 -160 479 712 540 128 -67
6898 -67 -543 -506 -407 -311 285 537 476 189 -37 -495 -643 -337 -138 165 561 636 420 -104 -383 -320 -545 -321
6920 -321 137 774 781 699 142 -85 -450 -585 -159 -199 239 402 858 245 -261 -320 -665 -332 -83 301 421 500
6942 500 284 -43 -456 -598 -591 3 198 733 638 381 -131 -514 -728 -327 -527 -86 489 675 324 263 -309
6963 -309 -425 -712 -354 102 198 720 600 35 -163 -131 -327 -535 -127 451 547 337 99 -251 -76 -419 -337
6984 -337 -143 505 657 735 5 -193 -305 -441 -453 -112 297 451 736 410 14 -379 -405 -730 -208 -300 440
7005 440 462 518 156 -365 -507 -568 -244 -7 516 521 579 492 37 -701 -324 -459 -290 220 575 177 326 111
7027 111 -228 -326 -417 -15 141 621 417 354 182 -335 -482 -731 -534 -155 562 654 511 40 -242 -515 -554 -232
7049 -232 112 737 505 619 28 -322 -312 -631 -669 2 319 517 608 424 165 -160 -776 -370 -387 467 564 436
7071 436 88 -114 -272 -576 -218 -106 170 432 749 263 -74 -405 -389 -395 -273 160 398 217 220 134 -134 -649
7093 -649 -384 -317 31 255 258 358 225 -193 -67 -401 -141 379 283 831 574 400 -96 -539 -380 -541 -445 301
7115 301 458 367 239 -188 -418 -553 -466 -183 300 766 578 277 282 -427 -438 -205 -347 85 115 376 549 102
7137 102 -166 -482 -587 -304 -122 244 774 545 446 -100 -277 -605 -224 33 210 699 575 399 -42 -220
7157 -220 -412 -406 -9 76 156 464 417 -115 -640 -516 -604 -431 382 506 653 581 208 -67 -602 -539 -212 -76 353
7180 353 560 238 69 -62 -428 -289 -707 -130 448 553 557 219 121 -499 -466 -555 -131 459 219 509 438 -362
7202 -362 -419 -394 -447 -273 392 700 310 514 218 -119 -853 -724 -380 101 517 592 146 -3 32 -317 -577 -257
7224 -257 332 452 493 514 91 152 -416 -525 -262 -162 526 374 842 338 -56 -471 -707 -609 -584 267 599 781
7246 781 220 -76 -356 -684 -537 -325 416 384 495 481 178 -176 26 -559 -287 335 328 496 522 324 -188 -638
7268 -638 -481 -412 50 362 71 528 84 19 -256 -327 -458 -206 280 440 455 205 15 -384 -485 -246 -227 3
7290 3 344 264 419 126 -260 -427 -445 -246 91 662 732 364 30 -304 -530 -192 -238 -207 105 492 192 208 -221
7313 -221 -264 -416 -304 15 221 750 339 587 -178 -375 -434 -354 -224 280 471 346 287 256 -51 -445 -659 -440
7335 -440 99 466 77 328 132 -127 -499 -261 -256 181 453 393 663 163 -93 -129 -590 -454 87 331 770
7356 770 415 -379 -132 -164 -478 -167 -70 280 446 510 142 -112 -390 -535 -417 -333 171 431 495 367 246 -124
7378 -124 -492 -507 99 112 81 454 414 239 -187 -380 -496 -259 49 295 375 247 379 -170 -410 -284 -261 -154
7400 -154 431 399 342 309 -58 -257 -459 -649 -76 -1 307 654 612 -152 -456 -547 -634 54 83 270 361 337 16
7423 16 -504 -497 -248 -546 56 420 475 283 396 -24 39 -183 -41 -40 281 572 473 106 -67 -418 -92 -60 21
7446 21 -16 388 516 341 -156 -147 -192 -331 -172 124 556 172 296 106 223 -530 -459 -206 -206 318 460 218 135
7469 135 -94 -175 -592 -177 136 130 615 191 59 -72 -111 -458 -21 81 211 605 443 204 -194 -409 -943
7490 -943 -635 -53 57 781 378 131 -321 -645 -200 -217 -59 129 400 512 162 69 -119 -507 -497 -143 -2
7511 -2 158 690 432 -68 -244 -45 -477 -400 -131 359 259 452 73 -109 -560 -435 -436 80 82 643 478 184
7533 184 -55 -321 -113 -251 -381 80 65 399 345 94 -294 -552 -281 -380 -130 342 559 329 32 -302 -34
7554 -34 -197 -196 37 312 442 327 177 -398 -333 -617 -323 -463 240 436 320 262 -215 -104 -497 -305 -361 163
7576 163 457 313 288 -111 34 -356 -236 9 102 456 510 356 179 -268 -393 -330 155 117 396 528 373 -70
7598 -70 23 -269 -307 -160 -72 15 239 535 294 40 -297 -95 -185 -295 202 183 492 188 119 -309 -542 -602 -67
7621 -67 292 288 230 410 112 -28 -433 -161 -204 -85 238 49 328 117 -11 -685 -168 -397 -200 197 463 485
7643 485 121 -75 -352 -555 42 -50 436 512 338 -8 135 -141 -575 -54 -317 196 168 364 290 40 -304
7664 -304 -493 -222 -57 99 263 193 98 75 -247 -376 -288 -299 144 61 244 215 -39 -303 -416 -455 -319 169 291
7687 291 610 275 -240 -243 -81 -297 -414 32 190 466 391 -95 24 -485 -381 -159 169 219 412 413 457 -180
7709 -180 -340 -164 -328 -166 230 242 379 626 38 1 -487 -614 -68 20 375 752 90 -82 -147 -374 -425 -152
7731 -152 -129 252 133 113 226 -21 -82 -360 22 -19 261 237 343 271 -111 -351 -295 -195 -8 122 39 394 436
7754 436 -438 -580 -389 -399 -8 -27 359 242 304 -91 -219 -303 -439 -91 -142 90 511 318 152 -180 -269 -286
7776 -286 -205 -27 25 211 320 434 96 -165 -569 -463 -88 91 347 69 352 -10 -290 -246 -436 -186 299
7797 299 329 157 603 312 -102 -538 -560 73 113 228 33 328 74 -120 -394 -391 -217 -224 125 432 362 242 -5
7820 -5 -619 -280 -322 86 211 625 317 34 -16 -284 -520 -295 -467 129 179 436 251 -158 -219 -261 -418 -163
7842 -163 106 345 616 481 184 -179 -96 -242 -114 -31 74 113 104 130 108 -435 -422 -321 -201 193 531 469 233
7865 233 -24 -187 -81 -131 74 -157 212 356 77 30 -169 -743 -409 39 194 324 299 249 -142 -119 -245 -276
7887 -276 -209 42 272 371 212 -204 -104 -251 -112 -21 -66 318 548 524 193 215 -293 -497 -509 82 131 383 309
7910 309 222 330 -304 -515 -211 -192 69 185 289 79 -138 -375 -529 -301 -196 -74 26 530 69 -65 56
7931 56 -12 -482 -193 -75 221 32 178 13 -304 -474 -642 -197 -97 218 162 80 -122 -23 -454 -114 -146 -150 196
7954 196 429 373 351 -216 -368 -340 -343 -143 84 210 514 57 -121 -204 -357 -388 -312 153 323 663 419 138 -132
7977 -132 -321 -333 59 -155 139 258 548 104 -57 -256 -431 -22 -64 7 156 127 367 0 -223 -292 1 2
7999 2 -31 335 311 380 -125 -119 -443 -243 -136 210 88 171 553 -324 -188 -369 -139 -152 -105 71 267 557 240
8022 240 -128 -120 -281 -263 -55 267 40 339 23 -18 -414 -311 98 84 -237 40 310 21 -9 -365 -252 -378
8044 -378 74 253 266 97 337 -119 -228 -416 -95 171 99 239 690 58 217 -4 -476 -100 -60 13 123
8065 123 595 212 172 41 -183 -191 -265 -50 75 100 238 -5 -127 -50 -297 -191 -86 390 442 410 357 328 -31
8088 -31 -359 -171 -182 17 139 500 -77 -188 -529 -156 -148 -372 -3 118 139 345 52 -62 -452 -250 -296 -27
8110 -27 215 207 367 373 26 -167 -510 -430 4 373 481 278 302 39 -160 -407 -445 -65 17 351 305 187 -80
8133 -80 -100 -267 -149 -132 75 400 112 148 205 -145 -539 -391 -383 67 318 293 190 348 -76 -237 -280 -490 -320
8156 -320 199 283 434 243 215 -254 -559 90 -126 288 473 310 127 276 -368 -295 -244 -95 261 337 326 328 113
8179 113 53 -368 -138 -530 -133 52 343 406 -43 163 -111 -329
8191c29
$$ Imaginary data points
##PAGE= N=2
##DATA TABLE= (X++(I..I)), XYDATA
0 0 0 0 0 -8 8 -8 16 -22 24 -32 40 -56 64 -80 98 -112 141 -168 197 -231 266 -316 364 -416 481 -545 624
27 624 -710 799 -909 1020 -1147 1286 -1432 1603 -1781 1979 -2201 2438 -2704 2993 -3315 3669
43 3669 -4059 4506 -4996 5552 -6195 6928 -7784 8801 -10026 11546 -13469 16015 -19543
56 -19543 24771 -33355 49878 -93283 444959 1003787 -95048 -383135 -70651 -131157 -627668
67 -627668 -485267 116618 555990 591128 392843 -48073 -337405 -309542 -290481 -438007 -198607
78 -198607 407966 674497 397480 120360 -98860 -459934 -630080 -281953 109660 209081
88 209081 338693 565154 391801 -164723 -531387 -508998 -312157 -7686 274424 313546
98 313546 280016 404338 279031 -371446 -819681 -437989 147437 207689 112692 359034 547366
109 547366 212650 -349032 -629240 -495624 -100369 241660 295736 256627 362166 312357
119 312357 -160572 -583413 -476455 -146217 24604 216444 474720 427726 91117 -121556
129 -121556 -227388 -451676 -499965 -78818 391844 461276 316984 192864 -28809 -308305
139 -308305 -406065 -348327 -221772 117524 533163 521721 101370 -139850 -108306 -247553 -489893
150 -489893 -330601 158811 447221 410197 264700 51161 -211318 -346866 -333016 -269129
160 -269129 -59790 322214 529019 333341 19993 -146142 -278162 -407770 -315308 -5011
170 -5011 252563 360253 372701 218113 -109703 -363856 -374360 -252640 -93746 133208 351323
181 351323 397705 250020 -3995 -278386 -426917 -325821 -78804 122338 264030 376967
191 376967 329785 53149 -256951 -386333 -328936 -158195 73982 271354 343106 291429 126857
202 126857 -142060 -373893 -382093 -190974 26762 204947 342064 342845 152328 -106736 -297632
213 -297632 -374944 -290527 -35750 229128 333745 300300 198718 -7643 -272422 -390308
223 -390308 -273221 -65011 118598 281704 360358 246720 -3169 -218431 -323128 -314001
233 -314001 -164717 83463 283275 337244 258967 73292 -173535 -342930 -322100 -163635
243 -163635 24890 209826 343724 311979 99294 -142929 -282219 -307830 -228964 -38236
253 -38236 192798 330011 308810 158303 -59656 -256513 -332562 -253114 -73143 135390 300209
264 300209 331792 192298 -30631 -212192 -302034 -285182 -136174 100179 283184 310797 207185
275 207185 36510 -155827 -299729 -307935 -164527 52833 240731 317523 247932 74377 -119845
286 -119845 -266077 -311896 -212310 6123 216748 305733 261499 123584 -68639 -246449 -313997
297 -313997 -231296 -45000 157131 286859 283840 157031 -29612 -206724 -306020 -261896 -85144
308 -85144 117825 250894 285876 207513 17310 -191569 -291939 -253902 -125498 54662 233899
319 233899 307076 221758 44806 -134272 -262479 -285237 -166714 32266 200851 278975 250026
330 250026 104554 -102071 -253550 -280109 -194141 -28757 161855 279249 259372 128839
340 128839 -48487 -215180 -292832 -222779 -51557 120801 241159 275602 179161 -19442 -194872
351 -194872 -262191 -228133 -109905 75775 241614 280729 186045 26275 -141886 -259526 -258329
362 -258329 -132266 45501 197844 272093 225140 65132 -120751 -239958 -257221 -170994 -3135
373 -3135 170912 261821 235736 109280 -72213 -224122 -262769 -182619 -39244 120728 248055
384 248055 262635 137980 -43592 -184048 -246790 -216210 -81176 102854 231330 248562 164307
395 164307 11395 -155851 -254093 -230103 -104445 60374 200244 252891 190367 44111 -120320
406 -120320 -237064 -248436 -139608 29881 172256 239967 213702 89126 -87307 -220335
416 -220335 -243530 -163018 -17429 141979 241410 224921 108548 -45686 -182153 -246171 -194360
427 -194360 -46000 116726 217767 226412 141831 -9578 -162409 -241839 -208944 -81776 79457
438 79457 200990 231164 163719 24823 -131590 -232193 -222368 -110308 44305 176013 233560
449 233560 188788 57334 -99161 -209365 -226875 -143351 8397 154635 226672 198217 88132
460 88132 -60858 -188484 -232382 -166705 -23998 125174 212865 206571 113047 -29607 -164470
471 -164470 -228527 -186363 -58030 92554 199376 217080 138210 -1726 -139019 -214760 -199522
482 -199522 -94337 59964 188280 223692 157069 28942 -106843 -199173 -208072 -121912 23017
493 23017 158964 221441 180561 58727 -82312 -182667 -207656 -145379 -14876 128094 212828
504 212828 197026 89106 -57452 -170968 -204708 -154221 -43254 91203 195996 211818 121151
515 121151 -26794 -152893 -201776 -164168 -66403 57641 170352 219307 157858 7541 -137548
526 -137548 -197915 -172483 -91895 26527 150816 213853 169920 41287 -101051 -189966 -189601
537 -189601 -110846 5854 121309 196046 183749 74886 -68986 -168622 -193443 -143227 -25162
548 -25162 115347 195276 176361 91400 -21259 -138881 -208948 -170863 -38405 100825 175798
559 175798 174769 112135 8201 -110215 -195033 -191095 -80011 74406 171211 172473 119795 41061
571 41061 -73843 -188957 -210073 -102756 49697 147896 171015 143209 65106 -59814 -174469
582 -174469 -199094 -116279 12367 117191 170055 164346 88243 -42682 -158253 -188111 -128094
593 -128094 -26135 79520 163871 188281 115894 -26549 -150037 -183120 -133300 -51820 42169
604 42169 145958 204090 142389 -12206 -137189 -162383 -131979 -85516 6864 136889 206563
615 206563 147260 14299 -94380 -147559 -154154 -110640 -7269 119270 193726 161047 46493
626 46493 -70135 -137069 -159935 -135038 -33320 112727 192473 150320 53334 -27316 -102360
637 -102360 -173602 -166513 -45764 100976 165432 144403 88973 11603 -90920 -174420 -172501 -71655
649 -71655 67181 157028 158557 102571 28037 -65291 -162127 -185857 -89294 52877 133206 141680
661 141680 123671 65044 -55908 -166500 -171634 -85416 8002 82504 147648 164749 85320 -53017
673 -53017 -152975 -161952 -103921 -22241 63031 142869 175465 110303 -31840 -146899 -159652 -101504
685 -101504 -37836 29903 121765 180637 130183 -5375 -120067 -150396 -120113 -65638 13816
696 13816 110691 171494 138941 28052 -88555 -150168 -146780 -86865 11287 108229 155450 131890
708 131890 52809 -51601 -136385 -157353 -104313 -7212 92093 149168 134044 63568 -17918 -95239
720 -95239 -158947 -153479 -39077 101568 152077 117341 74762 21783 -79757 -171223 -156267 -47403
732 -47403 65821 131676 140528 91732 10707 -65231 -125885 -152368 -97939 30015 133546 144945
744 144945 98987 38329 -43456 -127319 -152057 -99325 -5477 95075 161612 141530 42112 -57002
756 -57002 -108190 -127248 -114043 -36773 76858 148550 139647 71468 -23479 -106826 -135827 -106844
768 -106844 -47027 31989 119381 161347 108811 -6511 -103433 -136735 -114672 -57054 20417 102021
780 102021 151417 124720 23477 -87259 -137697 -120341 -64798 9444 84577 130697 124432 60853
792 60853 -44839 -136289 -146764 -78355 2152 62641 116900 141015 83842 -32304 -121489 -141182
804 -141182 -103969 -25196 67602 122192 120092 80262 7592 -88952 -148166 -118348 -35257 42563
816 42563 102852 133180 98871 11294 -68917 -116002 -131926 -85835 25093 121819 134284 88954
828 88954 31686 -40910 -117779 -140703 -86444 6519 90942 133696 111331 38945 -36151 -91704
840 -91704 -125027 -109692 -26574 76863 130089 116862 63605 -11782 -88622 -129444 -111270 -41587
852 -41587 51232 121618 129248 76804 123 -75637 -125462 -117200 -48885 34410 95546 123937
864 123937 101485 22262 -69177 -116052 -112939 -72665 4410 89950 128633 103547 41700 -38414
876 -38414 -114195 -132812 -77216 2162 65855 114281 123877 59820 -38318 -99086 -111006 -94043
888 -94043 -33994 59559 119853 110656 64337 2047 -77517 -129524 -107110 -34557 36162 95033
900 95033 127046 91908 2479 -73948 -107933 -109508 -66952 22945 101133 117188 86675 32314
912 32314 -46565 -114282 -117595 -62752 4215 66921 116731 112657 44130 -39759 -95595 -114829
924 -114829 -87532 -14563 64649 107836 108771 66803 -16329 -96199 -117770 -83902 -29430 37455
936 37455 102882 119641 70366 -4409 -68681 -110314 -106875 -46041 34002 88843 109809 90799
948 90799 21339 -63963 -107920 -101289 -63905 5916 86911 120370 86123 26426 -32608 -92094
960 -92094 -120438 -78441 4930 69859 101115 100496 52714 -27643 -89220 -105045 -85725 -29238
972 -29238 55633 111765 101317 52711 -3105 -66884 -115161 -100248 -30200 41884 88194 107133
984 107133 79284 5807 -67206 -101018 -96274 -54710 19921 88247 106690 79193 27000 -43176
996 -43176 -103421 -108161 -56234 8668 62576 101928 100489 41089 -39409 -90741 -101184 -74520
1008 -74520 -12690 59378 100992 96005 53097 -14211 -81001 -108073 -81103 -22631 41855 91701
1020 91701 102556 63931 -1709 -63418 -101711 -96683 -40811 34566 85680 96360 74181 19654
1032 19654 -53044 -101583 -97103 -50336 13254 73278 103107 83122 25551 -38483 -86050 -101221
1044 -101221 -68198 -946 64846 98092 89304 42340 -25185 -80445 -98025 -74320 -20066 47677
1056 47677 96945 97919 51065 -13194 -68411 -95864 -82847 -32052 33556 85261 100707 67837
1068 67837 906 -62804 -91398 -82691 -46577 13316 76740 105578 76955 13114 -48266 -85158
1080 -85158 -89185 -57746 2712 65685 98818 83850 30856 -33295 -80621 -92830 -66097 -9563
1092 -9563 53444 92491 88077 45067 -16936 -71757 -96402 -75570 -19630 42810 83192 89767
1104 89767 58771 -322 -62876 -95771 -82126 -31781 29082 75766 90370 67213 13716 -48026
1116 -48026 -90458 -90622 -45635 18598 68336 87250 73564 29425 -34374 -86323 -94521 -55512
1128 -55512 5325 57616 84212 79117 41236 -20200 -76699 -95986 -66219 -8107 46424 79721
1140 79721 84132 52649 -8129 -67270 -91867 -73890 -24478 33665 77280 87282 59155 4717
1152 4717 -53076 -88377 -81745 -36660 21912 68809 87714 68390 16216 -43060 -80965 -83468
1164 -83468 -51156 4848 62041 90351 74350 25464 -30856 -72411 -83902 -61121 -9830 50276
1176 50276 88762 81844 34456 -22039 -61657 -79373 -70576 -27151 39101 87172 85219 43333
1188 43333 -8634 -52302 -78146 -76014 -37404 25288 77337 88826 55545 2661 -44651 -74211
1200 -74211 -78120 -47462 11841 68032 87243 64542 17709 -33483 -72648 -82060 -52811 1749
1212 1749 53173 80261 74019 35179 -22896 -72504 -84428 -55841 -7187 39437 71844 79366
1224 79366 49747 -9537 -66510 -86091 -61617 -15105 29191 62513 78484 62001 6967 -57879
1236 -57879 -87480 -67718 -24139 18417 54942 79032 69210 18076 -45549 -81566 -74761 -36993
1248 -36993 10189 51762 75850 69096 28411 -29091 -72132 -79054 -50824 -2779 46157 75509
1260 75509 71286 34708 -15681 -59619 -80007 -64748 -16605 41095 76016 72392 38928 -5206
1272 -5206 -46365 -75224 -73056 -30800 31439 72507 72737 45145 6658 -36059 -71167 -76021 -41390
1285 -41390 15314 63677 78834 56454 12605 -30569 -63456 -75135 -51910 2846 56076 76775
1297 76775 62358 25603 -22218 -62898 -73192 -51008 -10702 36155 73254 76219 35768 -18476
1309 -18476 -54492 -67607 -60083 -24963 28976 69863 74990 46210 -2053 -49567 -72992 -61680
1321 -61680 -27239 16098 57706 77430 56956 6247 -41146 -66005 -65622 -39626 7324 52626
1333 52626 72193 60267 22255 -26514 -65650 -72946 -45651 -335 43421 68620 65500 32631
1345 32631 -16074 -59236 -75197 -53476 -8016 36870 62533 65007 41782 -3184 -50855 -73946
1357 -73946 -59832 -18180 25811 56753 66471 51195 9654 -43547 -74156 -63293 -25627 13613
1369 13613 49135 71461 60238 12563 -38671 -63565 -61782 -39590 1471 47202 70125 58104
1381 58104 22253 -21426 -57247 -67729 -46614 -7270 35268 66542 67620 32589 -16587 -50992
1393 -50992 -63978 -55934 -20823 31961 68136 64490 33880 -2952 -39282 -65415 -61940 -25740
1405 -25740 22525 56724 64690 44912 7548 -31559 -59898 -65885 -40062 11768 56090 66282
1417 66282 47358 17372 -20458 -58780 -72081 -43288 7689 46200 59524 53558 28390 -14310
1429 -14310 -54736 -67430 -45853 -7344 31274 58115 62364 37090 -7616 -48303 -64723 -52893
1441 -52893 -19343 23092 57120 65172 43211 271 -42278 -63648 -54175 -24098 12693 46891
1453 46891 65642 51726 9058 -35172 -56417 -54977 -36286 209 42407 66419 55270 19002
1465 19002 -23196 -54619 -61763 -41486 -3634 35235 60612 59993 28675 -16462 -49176 -58243 -46309
1478 -46309 -15354 27734 58711 58863 32606 -1904 -37004 -61656 -57097 -20559 22792 50752
1490 50752 57861 44108 8396 -35004 -61156 -56429 -28070 11069 46723 60900 46033 12661
1502 12661 -24272 -52901 -59677 -37585 3212 39584 56861 51351 24258 -16358 -50084 -59358
1514 -59358 -42609 -8261 30662 57857 58065 29516 -10959 -43467 -57304 -48073 -16689 24138
1526 24138 53586 57604 35861 -820 -36414 -56539 -50961 -23531 13655 45150 58385 45280
1538 45280 9544 -30773 -54661 -53765 -30787 5296 41095 58741 47986 16054 -20892 -50318
1550 -50318 -58282 -36663 1925 34520 51073 49879 28232 -11098 -47676 -58305 -40977 -9166
1562 -9166 25298 51437 54220 31729 -3798 -37028 -58087 -51688 -16994 23873 47991 51337 37227
1575 37227 6222 -31783 -55145 -50806 -24983 11010 43557 55956 40409 9474 -21593 -46482
1587 -46482 -55796 -36838 3792 40359 54072 45283 18701 -16412 -45309 -54012 -39204 -7193
1599 -7193 30806 54960 50511 23244 -10555 -38413 -51814 -43653 -14734 21704 48808 54262 33488
1612 33488 -2933 -35803 -50836 -44703 -21588 12530 43637 55667 40524 5993 -31270 -51166
1624 -51166 -46202 -24260 4165 34071 54660 47792 12971 -25105 -46396 -47443 -32367 -2930
1636 -2930 31172 50997 48123 23277 -13648 -44882 -52032 -36261 -7672 23340 48485 51854 27815
1649 27815 -6990 -35566 -50578 -45116 -15693 22188 45337 46194 32654 6206 -28903 -52505
1661 -52505 -48409 -20617 13266 40104 49593 36998 9465 -20718 -45545 -52892 -31155 8640
1673 8640 38798 46598 38249 18887 -12702 -44039 -53223 -34404 -363 30119 46070 43469 23990
1686 23990 -6972 -38096 -52469 -39729 -8187 22863 42618 47262 31549 -1947 -35131 -49080
1698 -49080 -40736 -16979 13633 40392 49947 35126 3955 -28227 -46249 -43032 -22803 5811
1710 5811 34745 50159 41249 10826 -22988 -42121 -44263 -29850 -1146 30907 49002 43191 17634
1723 17634 -14980 -39651 -46184 -33578 -7966 23394 46591 47055 22809 -9435 -32817 -44207
1735 -44207 -39821 -15820 18744 44284 46193 27813 43 -27413 -44512 -42464 -20840 12002
1747 12002 39486 46735 32817 6611 -21480 -41978 -45322 -26384 6043 33931 45323 37049
1759 37049 14086 -16139 -40070 -45999 -30904 -2064 27914 44516 40378 19735 -9472 -35872
1771 -35872 -46624 -34779 -7120 21165 40225 42868 27118 -2711 -31698 -44919 -38116 -14046
1783 -14046 14921 37240 43642 32306 4616 -26709 -44924 -40154 -18100 8224 31257 44059
1795 44059 37045 9590 -21701 -41030 -41702 -24858 2090 28236 42443 39099 17595 -14255 -38956
1808 -38956 -43181 -28466 -4064 21904 40855 42158 22145 -8207 -33012 -42606 -33904 -10523 18155
1821 18155 37575 41561 27403 -455 -28150 -42607 -37351 -16362 11720 35234 42522 30095
1833 30095 5293 -21261 -40000 -41375 -22326 7202 31730 40988 33554 11931 -15350 -36744
1845 -36744 -41977 -27780 130 27505 41084 35352 16314 -8715 -31996 -42907 -32915 -6354
1857 -6354 22237 39335 38159 20716 -4783 -27441 -39587 -35864 -14303 16041 37742 39780 24572
1870 24572 1282 -22628 -38096 -37506 -19442 8546 33559 42224 30404 5018 -18981 -34155
1882 -34155 -37642 -25622 1181 29379 42213 33303 11018 -13800 -32462 -38221 -28068 -5127
1894 -5127 22116 39589 37607 17557 -9091 -30059 -38020 -30560 -9173 17075 35496 38619 24390
1907 24390 -1352 -27684 -40049 -32179 -11322 11598 30008 38173 30562 5846 -23711 -40629
1919 -40629 -34648 -14487 7101 24716 36401 34632 13063 -18287 -39052 -36996 -19336 2618
1931 2618 20605 34618 35417 18462 -11269 -35150 -39070 -24023 -2584 17733 32972 36365 21420
1944 21420 -5389 -28684 -37101 -29816 -10086 14629 33633 36516 22693 292 -21846 -35199
1956 -35199 -34543 -17786 9723 32471 37940 24849 3427 -16187 -30516 -36245 -25170 3501 31373
1969 31373 38960 25366 6889 -9052 -26018 -37760 -29393 -1400 26710 37005 29453 13219
1981 13219 -5537 -25313 -36501 -30649 -7636 19551 34947 33177 18498 -2553 -22885 -35709
1993 -35709 -31444 -11521 12585 29154 34087 26228 4115 -21988 -35262 -30631 -14598 4853 23767
2006 23767 35820 31295 9070 -18109 -33845 -31839 -17634 938 19325 33199 33480 15000 -13160
2019 -13160 -32453 -32604 -20329 -3794 14141 31191 35354 19279 -7700 -28032 -32959 -25603 -9583
2032 -9583 12330 31159 35020 21186 -1375 -21769 -32920 -30466 -13489 10361 28190 33162 24339
2045 24339 4906 -16016 -31215 -32531 -18505 4473 25422 33376 25782 8546 -10372 -27683
2057 -27683 -35189 -23624 810 22936 31417 27514 13648 -7073 -26550 -33461 -24647 -5164 16674
2070 16674 31418 30954 16673 -2674 -21256 -32590 -29015 -10288 12903 28236 31452 22766 2826
2083 2826 -20188 -32647 -28943 -13482 6065 24379 33003 25638 5227 -16463 -29069 -29348 -18427
2096 -18427 1245 20733 31659 27397 10665 -10495 -26707 -31260 -22195 -2571 18289 30385
2108 30385 29745 15702 -6136 -24885 -31438 -23797 -6941 13360 28605 31015 17744 -1387 -19427
2121 -19427 -29880 -27939 -11912 9966 25480 29486 22381 4612 -16975 -30197 -28474 -15126 4113
2134 4113 22950 32119 24830 6397 -12713 -26010 -29950 -19559 1483 20742 28980 25938 13083
2147 13083 -7593 -25253 -30112 -21349 -4697 14398 28921 29435 15373 -4112 -20896 -30518 -26603
2160 -26603 -9008 13195 26679 28081 19137 1737 -18288 -30153 -26664 -11526 7704 22942
2172 22942 29223 22058 5609 -13456 -27191 -28765 -16600 3399 20558 28813 24489 9302 -10416
2185 -10416 -26057 -29368 -19520 -1183 17277 27848 26246 13024 -6924 -23185 -28208 -20700 -6688
2198 -6688 11372 27016 29947 16268 -3927 -19025 -25837 -24462 -12151 8617 25959 29620 19605
2211 19605 1072 -16895 -26450 -24354 -13316 3241 21277 30198 22728 4004 -13375 -23592 -26071
2224 -26071 -18598 46 19363 27484 23370 10561 -7328 -24114 -29712 -19608 -1676 15072 25635
2237 25635 25834 14525 -3213 -20606 -29531 -22815 -4847 13442 22694 23178 18076 3887 -16763
2250 -16763 -30387 -25352 -7571 9602 19491 24054 21158 6999 -14065 -28389 -26895 -12678 5412
2263 5412 18824 25204 21941 8869 -9426 -24853 -27464 -17118 249 16248 25540 23993 11436
2276 11436 -6129 -20620 -25756 -20711 -6597 12228 26560 27162 12993 -4949 -16997 -23117 -23050
2289 -23050 -12172 8499 25912 27709 14501 -2090 -14448 -21345 -22815 -15157 3265 22477 29316
2302 29316 19374 1992 -12277 -20508 -23646 -17668 -244 19051 28071 22167 7351 -8552 -20870
2315 -20870 -25239 -17791 -2328 13769 23663 24112 13004 -5186 -20657 -25600 -19242 -5469 9520
2328 9520 21435 24503 16950 387 -17801 -26998 -21708 -6129 8152 18475 23133 20566 5650
2341 5650 -14941 -26831 -22946 -9240 4635 15777 23208 21687 8609 -10161 -24300 -25330 -14130
2354 -14130 1749 14612 22031 21791 11908 -5672 -21286 -24963 -17800 -2672 12876 22677 22204 12634
2368 12634 -2338 -16208 -24090 -21179 -7317 10669 22267 22969 14341 1333 -13042 -23104 -22705
2381 -22705 -11368 6192 20336 24262 16695 3274 -10692 -20905 -23668 -14999 1442 17691 24456
2394 24456 19417 5940 -8100 -18740 -22915 -17287 -2592 14218 23838 21539 9898 -5560 -17583
2407 -17583 -22490 -18056 -5678 9673 21976 23367 13205 -2661 -15657 -21692 -19712 -9082 6617
2420 6617 19920 23558 16379 1213 -13713 -21842 -20807 -11088 2608 16904 23779 18798 5201
2433 5201 -10023 -20299 -21448 -14158 281 14563 22296 20039 9131 -6031 -19282 -22572 -15667
2446 -15667 -2071 12025 20485 20918 12163 -2703 -16639 -23290 -18612 -4996 9310 19114 21173
2459 21173 14486 1316 -13884 -23094 -20892 -7827 6731 17330 20915 16803 5156 -10861 -21743
2472 -21743 -21358 -10756 3184 15002 21038 18573 7691 -7911 -20084 -21844 -13522 -688 12151
2485 12151 20075 20110 10451 -5448 -18306 -21536 -15613 -4361 9063 19822 21732 12610 -2671 -15447
2499 -15447 -20797 -17312 -7762 6525 18656 22479 15490 433 -12957 -19541 -18561 -10860 2887 16779
2513 16779 22702 16329 3418 -9547 -18177 -19979 -13583 260 14821 21740 17429 6277 -6104
2526 -6104 -16103 -20951 -16048 -2459 13147 20640 17853 8932 -2318 -14236 -21286 -17863 -5251 10338
2540 10338 19074 19034 12015 1139 -11764 -20703 -20039 -7814 7272 17153 18725 14499 3974 -9596
2554 -9596 -20130 -20661 -10288 3423 14267 19462 16791 6513 -7670 -18382 -19920 -12392 38
2567 38 11746 19243 19166 9474 -5720 -17437 -19627 -13604 -3625 7961 18464 21031 11822 -3638
2581 -3638 -15722 -18608 -15325 -7026 5010 16989 21712 14166 -323 -13162 -18221 -16204 -9060 2100
2595 2100 15128 21385 16106 2619 -10038 -17374 -17554 -11185 664 13555 20206 16984 6394 -6650
2609 -6650 -16229 -19353 -13652 -1563 11684 18664 17285 9299 -2639 -14542 -20326 -16004 -3789 9617
2623 9617 17124 17291 11648 843 -11744 -20049 -18413 -6408 7467 15917 17215 13137 3842 -8901
2637 -8901 -18926 -19264 -8941 4397 14591 17907 14673 5410 -6726 -16602 -19369 -12386 675 12490
2651 12490 18454 16310 7045 -4763 -15133 -18978 -14223 -3189 9714 18239 18336 9705 -3119 -12925
2665 -12925 -17808 -15534 -6500 6309 17207 19397 11626 -306 -11328 -17344 -15584 -8006 3267
2678 3267 14477 19305 14568 2360 -10015 -16914 -16293 -9625 455 12156 18745 16025 5522 -7169
2692 -7169 -15978 -17536 -12022 -1261 10081 17219 17533 8955 -3908 -15043 -18248 -13074 -3237 8077
2706 8077 16109 17137 10657 -534 -12547 -18153 -15520 -5768 6001 15030 16768 12121 2103 -9583
2720 -9583 -17642 -17145 -8457 3832 13892 17266 13536 4091 -6758 -15954 -18217 -11731 1646 12639
2734 12639 17192 14067 6398 -3876 -13728 -18482 -13163 -1508 10069 16593 15995 9023 -2372 -12651
2748 -12651 -17535 -14344 -4685 7295 15749 17015 10513 -442 -10955 -16685 -15184 -6651 4157 13472
2762 13472 17301 13117 2320 -9926 -15972 -15146 -8622 686 11356 18239 15495 4685 -7650 -14607
2776 -14607 -15724 -10897 -1159 10071 16900 15843 7115 -5006 -14085 -16108 -11966 -3675 7403 15644
2790 15644 16730 8944 -2205 -11294 -16238 -14758 -5647 6342 14938 15849 10516 1464 -9070 -16650
2804 -16650 -16184 -7081 4590 13290 15530 12099 3725 -6777 -15301 -16679 -9804 1604 11691 15304
2818 15304 13070 6468 -4322 -14223 -17726 -11807 -473 9296 14436 15067 8552 -2725 -12998 -16256
2832 -16256 -12153 -3322 6655 14078 15807 10135 -355 -11019 -15683 -13707 -6215 3990 12989 16701
2846 16701 12132 1765 -9147 -15438 -14150 -8093 1407 11233 16981 13340 3327 -7128 -13798 -14555
2860 -14555 -10592 -1045 10194 16180 13739 6025 -3418 -11916 -15486 -12161 -2784 8373 15151 14713
2874 14713 7896 -1944 -10563 -15397 -13750 -5234 6661 14722 14691 8823 241 -8281 -15104 -15191 -6707
2889 -6707 4325 12242 14872 11812 3203 -7471 -14302 -14914 -8766 1232 10883 15335 12770 4727 -5085
2904 -5085 -13326 -15471 -9721 -502 8433 14033 14755 7575 -3685 -12573 -14590 -10856 -3599 5954 13305
2919 13305 15130 9587 -1109 -10588 -15038 -12780 -5186 4425 12405 15324 10859 1326 -8857 -14851
2933 -14851 -13159 -6545 2515 10362 14554 12253 4091 -6394 -13552 -14558 -8560 347 9188 14332
2947 14332 12895 6192 -3619 -12611 -15762 -10714 -766 8425 13075 13173 7772 -1511 -10570 -14910 -12139
2962 -12139 -3713 6138 13331 13695 8445 541 -8276 -14391 -13752 -6287 4677 11553 14295 10914 2440
2977 2440 -6996 -13058 -13732 -8166 1028 10759 14756 11422 3185 -4855 -11255 -14112 -10351 -884 8887
2992 8887 14635 13100 5328 -3314 -10395 -13308 -11225 -3622 6901 14686 14043 7302 -1608 -9299 -13481
3007 -13481 -12007 -5142 4324 12233 14394 9222 587 -8204 -13107 -12819 -7240 2454 10690 14217 11402
3022 11402 3257 -6885 -13163 -13087 -7627 755 8915 13372 12374 5312 -4098 -11998 -14057 -8896 -173
3037 -173 7199 12124 13017 8303 -1702 -11674 -14384 -10096 -2647 4985 11259 13602 9428 -9 -9189
3052 -9189 -14164 -12082 -4641 4061 10415 12939 10441 2412 -7538 -13657 -12487 -6359 1721 9172 13094
3067 13094 10984 3892 -5179 -11602 -13191 -8545 243 8320 13210 11613 5429 -3252 -10399 -13204 -10393
3082 -10393 -2325 7228 12915 12350 6259 -1424 -8216 -12649 -11993 -4957 5251 12290 12721 7312 392
3097 392 -6671 -12253 -12805 -6405 3313 11127 12934 9253 2299 -5357 -11574 -12699 -8338 852 9677
3112 9677 13332 10606 3618 -3916 -10716 -12771 -9490 -1119 7772 12311 11583 6276 -2674 -10467 -13148
3127 -13148 -9583 -2641 5213 11397 12623 8173 -516 -9175 -12771 -10098 -3950 3519 9997 12633 10197
3142 10197 1252 -7814 -12592 -11157 -5344 1778 8241 12652 11185 3175 -6113 -11758 -11641 -6853 -160
3157 -160 7228 12269 11703 5602 -4119 -10642 -12275 -8756 -1712 6299 11588 11839 6522 -1690 -9380 -12155
3173 -12155 -10479 -3511 4919 11031 11863 7265 5 -7165 -11580 -11745 -5163 3582 10272 11551 8641
3188 8641 2005 -5526 -11242 -12162 -6961 1875 9282 11737 9253 3335 -3845 -10318 -12378 -8426 -90
3203 -90 7295 11469 10575 5257 -2572 -9473 -12464 -9280 -2528 5767 11097 11561 6842 -1005 -8208 -11689
3219 -11689 -10081 -4067 4046 10016 11991 8200 889 -7127 -11171 -10811 -5536 2278 8866 12293 9197
3234 9197 2577 -5492 -10842 -11331 -6627 607 7483 11447 9961 4178 -3644 -9790 -11660 -8408 -1268
3249 -1268 6741 10759 10539 5882 -1632 -8766 -11792 -9511 -2766 4927 10428 11440 7222 -182 -7112
3264 -7112 -11241 -10403 -4222 3480 9778 11082 8367 1837 -5762 -10824 -10413 -5783 1113 8134 11535
3279 11535 9598 2888 -4718 -9795 -10958 -7381 -427 6794 11230 10443 4610 -3269 -9276 -10854 -8332
3294 -8332 -2139 4803 10664 11268 5956 -1859 -7989 -10993 -9001 -3563 3561 9859 11493 7467 299
3309 299 -6825 -10642 -9711 -4790 2322 8663 10779 8127 2252 -5053 -10223 -10835 -5952 1132 7542 10823
3325 10823 9234 3857 -3156 -9241 -11248 -7472 -52 6403 9918 9358 5361 -1503 -8463 -11596 -8435
3340 -8435 -1872 5109 9322 10134 6317 -435 -7169 -10784 -9808 -3619 3642 9134 10206 7440 1337
3355 1337 -5245 -10305 -10006 -5164 1633 7714 10514 8677 2484 -4597 -9360 -10450 -7040 -46 6652
3370 6652 10337 9166 3898 -3182 -8475 -10390 -7780 -1675 5383 10162 9942 5345 -1866 -7502 -9971
3385 -9971 -8615 -3503 3940 9842 10656 6147 -323 -6167 -10009 -9266 -4412 2355 8069 10835 7581
3400 7581 1388 -5425 -9406 -9536 -5547 612 7189 10319 8773 3045 -3770 -9000 -9986 -6757 -446
3415 -446 6173 9701 8858 4550 -2213 -8163 -10341 -7422 -2026 4709 9251 9791 5799 -832 -7014 -10123
3431 -10123 -8601 -3224 3618 8416 9795 6991 1030 -5639 -9808 -9304 -4579 2156 7377 9764 7701
3446 7701 2407 -4373 -9194 -9467 -5664 547 6770 9450 8273 3490 -2523 -8212 -10178 -7121 -745
3461 -745 5362 8968 8917 5130 -1206 -7330 -9678 -7888 -2398 4303 8546 9527 5668 -172 -6049 -9232
3477 -9232 -8820 -3581 3091 7690 9760 7031 1376 -5001 -9104 -9216 -5154 1030 7135 9641 7878
3492 7878 2441 -3552 -8017 -9156 -6351 129 6245 9314 8219 3526 -2584 -7646 -9495 -7267 -1653
3507 -1653 4507 8839 8873 5342 -1492 -6729 -9184 -7837 -3155 3558 8472 9328 5882 -41 -5644 -9404
3523 -9404 -8655 -4073 1966 7271 9131 7201 1859 -4797 -8479 -8637 -5209 492 6141 9387 8124
3538 8124 3032 -3219 -7744 -9396 -6320 -654 5691 8571 8351 4204 -1845 -7307 -8863 -7166 -2014
3553 -2014 3801 8145 9005 5497 -396 -5675 -8647 -8113 -3542 3007 7687 8833 6313 1349 -5210
3568 -5210 -9123 -8391 -4459 1412 6595 8752 7181 2196 -4035 -7857 -8589 -5844 22 5585 8862
3583 8862 7794 3659 -1946 -7317 -8935 -6491 -1038 4602 8211 8425 4591 -1206 -6673 -8659 -7139
3598 -7139 -2513 3334 7924 8786 5454 248 -5078 -8324 -8274 -3896 2066 7056 8741 6585 1350 -4313
3614 -4313 -8009 -8194 -4377 798 6084 8781 7315 2533 -3021 -7154 -8752 -5853 -372 5302 8309
3629 8309 7729 3711 -1864 -6879 -8614 -6684 -1696 3739 7771 8364 4658 -859 -5868 -8338 -7343 -2979
3645 -2979 2908 7258 8405 5830 493 -4858 -8359 -7562 -4054 1421 6258 8578 6895 2076 -3739
3660 -3739 -7558 -7928 -5139 -119 5644 8312 7405 3275 -2721 -6998 -8230 -5751 -928 4552 7999
3675 7999 8044 4245 -1467 -6111 -8154 -6653 -2111 3384 7325 7909 5007 144 -4931 -8127 -7283 -3387
3691 -3387 2437 6669 7755 5918 1408 -4040 -7846 -7691 -4186 1026 6171 7861 6931 2749 -2869
3706 -2869 -7078 -8134 -5422 62 5014 7696 7054 3541 -1776 -6167 -8105 -6088 -1238 3850 7580
3721 7580 7833 4557 -717 -5571 -7482 -6684 -2575 2571 7019 7842 5275 124 -4807 -7515 -7152 -3714
3737 -3714 1399 6183 8048 6193 1344 -4091 -7140 -7226 -4454 240 5306 8053 6842 2527 -2609
3752 -2609 -6762 -7386 -5162 -731 4535 7258 7164 3845 -1694 -6044 -8057 -5965 -1443 3386 6676 7411
3768 7411 4830 -4 -5255 -7912 -6591 -2788 2428 6092 7306 5540 1196 -3899 -7465 -7169 -3661
3783 -3661 1515 5419 7206 6357 1912 -2993 -6648 -7783 -5055 129 5067 7521 6485 2835 -1377
3798 -1377 -6011 -7665 -6099 -921 4013 6888 6912 3621 -1119 -5194 -7320 -6381 -3054 2999 6956 7519
3814 7519 4587 -84 -4068 -7250 -7072 -3512 1738 6205 7512 5390 1376 -3554 -6633 -7296 -4517
3829 -4517 511 5011 7099 6338 2591 -2462 -6343 -7150 -4939 -459 4105 7045 7032 3407 -1568 -5853
3845 -5853 -7219 -5337 -1360 2894 6111 7223 5052 -31 -5105 -7290 -5951 -2576 1534 6016 7181
3860 7181 5264 678 -4585 -6839 -6682 -3347 1044 4986 7289 6214 1851 -3142 -6349 -6953 -4776
3875 -4776 -17 4754 7101 6245 2581 -1868 -5592 -6971 -5463 -999 3974 6660 6640 3557 -792 -4671
3891 -4671 -7313 -6335 -2192 2949 6512 6536 4155 394 -3733 -7098 -6835 -3097 2190 5707 6584 5182
3907 5182 1373 -3364 -6466 -6757 -3965 870 4988 6580 5781 2378 -2357 -6139 -6383 -4341 -397 4213
3923 4213 6548 6212 3016 -1512 -5563 -7025 -5292 -1496 3063 5855 6814 4141 -559 -4839 -6548
3938 -6548 -5624 -2530 2063 5773 7018 4240 321 -3531 -6224 -6019 -3275 821 5327 6830 5459
3953 5459 1457 -3029 -5912 -6295 -4289 -12 4511 6815 5722 2446 -1933 -5383 -6571 -5081 -866
3968 -866 3576 6397 6274 3246 -883 -4711 -6303 -5693 -2046 2680 5642 6275 4175 68 -4200 -6454
3984 -6454 -6141 -2793 1668 5138 6278 4797 1241 -3286 -6011 -6218 -3428 506 4304 6219 5434 2129
4000 2129 -2420 -5860 -6115 -4077 -446 4042 5903 5603 2817 -1543 -5232 -6388 -5029 -1207 3110
4015 3110 5723 6530 3565 -690 -4477 -6380 -5030 -2112 2274 5574 6178 4387 630 -3453 -6226
4030 -6226 -5724 -2898 1440 4873 6405 5133 1502 -2842 -5736 -5783 -3408 339 4133 5962 5384 2530
4046 2530 -1607 -5458 -6304 -4579 -678 3658 5912 5772 2989 -1195 -4627 -6449 -4937 -1486 2477
4061 2477 5558 6238 3829 -105 -3939 -5619 -5561 -2496 1587 4956 5973 4305 763 -3344 -5782 -5909
4077 -5909 -3437 800 4496 5933 4714 1511 -2723 -5333 -5764 -3683 -195 3712 5915 5255 2273
4092 2273 -1690 -4631 -5862 -4730 -878 3021 5713 5386 3254 -283 -4322 -6103 -4933 -1996 1924
4107 1924 5148 5978 3829 -11 -3238 -5428 -5274 -2765 1167 4343 5636 4417 1085 -2929 -5399
4122 -5399 -5526 -3035 282 3849 5876 4867 2124 -1850 -5240 -6198 -3728 -140 2949 5467 5371 2877
4138 2877 -1078 -4699 -5912 -4518 -1036 2282 4998 5640 3786 -506 -3904 -5555 -4755 -1744 1820
4153 1820 4652 5781 4026 739 -3007 -5680 -5552 -2622 796 4179 5377 4623 1469 -2611 -5031
4168 -5031 -5484 -3471 104 3724 5746 4993 2005 -1485 -4541 -5565 -4284 -828 2838 5289 5340 2958
4184 2958 -543 -3941 -5157 -4731 -1915 2300 4990 5642 3348 24 -3124 -5531 -5224 -2281 1320 4316
4200 4316 5610 3954 920 -2607 -5214 -4946 -3053 495 3708 5591 4676 1624 -1985 -4907 -5172 -3856
4216 -3856 -560 3326 5215 4762 2528 -1184 -4333 -5588 -4116 -1068 2335 4771 5307 2972 -672
4231 -672 -3688 -5086 -4796 -1671 1738 4500 5273 3527 4 -3162 -5050 -5037 -2687 1035 4170 5118
4247 5118 4225 1338 -2631 -4891 -5068 -3112 -238 3394 5330 4339 1915 -1740 -4423 -5227 -3919 -647
4263 -647 2981 5136 5068 2507 -484 -3711 -5144 -4490 -1369 2033 4768 5299 3341 182 -3403 -4966
4279 -4966 -4404 -2251 1170 4316 5071 3602 847 -2524 -4848 -5056 -2588 835 3755 4752 4220 1746
4295 1746 -2106 -4464 -4911 -3466 -206 3235 5240 4331 2106 -1226 -4053 -5108 -3800 -800 2606
4310 2606 4640 4602 2997 -540 -3672 -5075 -4586 -1614 1791 4385 4897 3204 281 -2753 -4730 -4779
4326 -4779 -2253 1015 3878 5112 3918 1149 -2487 -4780 -4894 -2699 210 3190 4992 4284 1741
4341 1741 -1510 -4034 -4774 -3709 -413 2741 4456 4407 2409 -931 -3945 -4924 -3989 -1057 1734 4389
4357 4389 4786 3234 -122 -3571 -4490 -4301 -1790 1261 4101 4745 3130 533 -2392 -4611 -4899 -2817
4373 -2817 623 3228 4616 3745 1352 -1914 -4342 -4883 -3108 -226 3243 4603 4256 1625 -1196 -4010
4389 -4010 -4961 -3760 -544 2174 4208 4316 2749 -369 -3273 -5046 -4002 -1552 1695 4050 4487 3407
4405 3407 242 -2805 -4535 -4519 -2093 1174 4047 4696 3225 720 -2305 -4216 -4621 -2644 107 2938
4421 2938 4800 4081 1443 -1537 -3923 -4788 -3277 -399 2672 4522 4152 2114 -909 -3617 -4265 -3143
4437 -3143 -734 1827 4112 4586 2733 -528 -3334 -4540 -4076 -2012 1277 3966 4639 3129 581 -2210
4453 -2210 -4137 -4185 -2374 765 3415 4333 3644 953 -1698 -3965 -4207 -2787 55 2943 4014 3790
4469 3790 1847 -905 -3428 -4759 -3449 -470 2255 4226 4108 2314 -468 -3387 -4559 -3497 -1213
4484 -1213 1484 3647 4139 3081 309 -2532 -4490 -3944 -1820 973 3545 4434 3516 933 -2077 -4138
4500 -4138 -4334 -2489 347 2975 4168 3678 1297 -1483 -3977 -4331 -2829 -325 2465 4547 4000 1565
4516 1565 -1102 -3126 -4280 -3127 -887 1888 3728 4297 2655 -362 -2631 -4098 -3406 -1480 1327
4531 1327 3682 4238 2899 497 -2471 -4109 -4126 -2026 951 2968 4206 3485 872 -1747 -3737 -3966
4547 -3966 -2580 112 2894 4192 3708 1490 -971 -3615 -4259 -3070 -162 2139 3850 3803 2090 -708
4563 -708 -3186 -4246 -3096 -1256 1324 3594 4080 2800 25 -2584 -3803 -3599 -1685 936 3292 4042
4579 4042 3089 571 -2421 -3898 -3929 -2104 502 2841 3967 3372 1227 -1754 -3527 -4077 -2692 -119
4595 -119 2627 3820 3502 1716 -863 -3126 -4127 -2809 -955 2171 3689 4030 2094 -494 -2880 -4290
4611 -4290 -3435 -1397 1409 3380 3931 2783 410 -2079 -3921 -3521 -1647 877 3140 4162 2924 982
4627 982 -1873 -3684 -3964 -2022 191 2591 3877 3346 1197 -1241 -3326 -3860 -2435 -615 2250 3571
4643 3571 3711 1789 -916 -2945 -3991 -3022 -903 1499 3529 3776 2163 -253 -2537 -3302 -3451 -1617
4659 -1617 1141 3261 3954 2538 370 -2162 -3462 -3559 -1774 674 2711 3704 3093 993 -1655 -3269
4675 -3269 -3899 -2579 26 2233 3513 3063 1904 -799 -2907 -3815 -2760 -766 1863 3471 3451 1897
4691 1897 -337 -2410 -3849 -2837 -889 1265 2768 3422 2403 224 -1958 -3586 -3521 -1655 792 2748
4707 2748 3532 2637 800 -1675 -3313 -3794 -1824 -3 2130 3843 3347 1268 -1264 -3050 -3460 -2142
4723 -2142 -590 2036 3755 3435 1869 -852 -2787 -3523 -2869 -1033 1549 3262 3688 1775 70 -2338
4739 -2338 -3466 -3012 -1350 938 3208 3368 2272 159 -1917 -3257 -3455 -1838 800 2597 3748 2840
4755 2840 1013 -974 -3211 -3415 -2255 -101 2198 2945 3230 1356 -890 -2858 -3826 -2660 -487 1942
4771 1942 3111 2947 1909 -191 -2536 -3400 -2881 -925 1327 2771 3259 2071 -212 -1772 -3324 -2824
4787 -2824 -1288 994 2508 3422 2788 467 -1604 -3351 -3083 -1707 412 2318 3573 2654 868 -1347
4803 -1347 -2950 -3237 -2151 -308 1647 3048 2897 1367 -908 -2620 -3463 -2580 -416 1646 2740 3297
4819 3297 1951 -357 -2227 -3272 -2910 -1354 900 2882 3284 2320 64 -2028 -3053 -3343 -1475 649
4835 649 2516 3201 2567 552 -1390 -2872 -3135 -2036 183 2138 3401 2744 1445 -772 -2602 -3257
4851 -3257 -2248 -336 1991 3148 2967 1703 -263 -2313 -3314 -2470 -836 1357 3103 3267 2081 -113
4867 -113 -1834 -3337 -2908 -1406 913 2266 3222 2002 325 -1510 -3096 -3025 -1918 152 1889 3254
4883 3254 2909 1015 -1156 -2543 -2894 -1902 -118 1815 2835 2653 1181 -614 -2695 -2857 -2514 -686
4899 -686 1359 2911 3102 1686 196 -2198 -2934 -2776 -914 1097 3137 3103 2324 217 -1983 -3030 -2992
4916 -2992 -1529 598 2032 3274 2167 470 -1361 -2712 -2939 -1786 -58 2052 3166 2714 1270
4931 1270 -1208 -2622 -3082 -2289 -633 1389 2779 2883 1689 -321 -2246 -3371 -2755 -804 1520 2671
4947 2671 3069 1892 -78 -1831 -2945 -2381 -1527 878 2490 3087 2041 261 -1622 -2750 -3123 -1641
4963 -1641 595 2234 2821 2485 658 -1468 -2788 -3144 -1821 -113 1845 2693 2631 1076 -843 -2480
4979 -2480 -3233 -2749 -570 1394 2516 2788 1351 -148 -1991 -2844 -2623 -870 865 2646 3034 1747
4995 1747 -16 -1714 -2847 -2555 -1368 527 2392 2794 2347 353 -1541 -2369 -3079 -1933 257 2071
5011 2071 2921 2569 1265 -855 -2490 -2742 -1873 -83 1903 2680 2793 1255 -619 -2313 -3000 -2199 -590
5028 -590 1131 2839 2721 1479 -27 -1643 -2829 -2482 -1148 1114 2422 2682 2156 204 -1482 -2581
5044 -2581 -3004 -1381 782 1991 2729 2162 794 -1176 -2760 -2861 -1514 24 1820 2721 2222 1235 -682
5061 -682 -2427 -3076 -2062 -408 1586 2755 2555 1710 -92 -2139 -2856 -2293 -703 870 2491 2803 1628
5078 1628 -75 -1732 -2745 -2372 -1191 701 2100 2816 2362 337 -1010 -2196 -2715 -1718 408 2028
5094 2028 2594 2420 833 -905 -2391 -2656 -1997 -424 1443 2607 2370 999 -324 -2128 -2607 -1720 -625
5111 -625 1260 2242 2426 1883 -12 -1497 -2560 -2377 -902 921 2338 2618 1857 440 -1570 -2380 -2169
5128 -2169 -1259 537 2010 2830 2106 554 -1225 -2278 -2416 -1664 43 1720 2619 2582 749 -811 -2102
5145 -2102 -2348 -1770 -359 1486 2364 2163 1564 -455 -1801 -2696 -2014 -760 1007 2336 2579 1576 21
5162 21 -1714 -2526 -2210 -850 560 1862 2515 1839 499 -1204 -2283 -2438 -1431 313 1890 2387 2166
5179 2166 1147 -866 -2229 -2464 -1874 154 1498 2197 2159 1292 -393 -2283 -2570 -2163 -580 1442 2174
5196 2174 2411 1552 -237 -1932 -2814 -2044 -870 631 1740 2321 1676 216 -1355 -2279 -2449 -1293 474
5213 474 2042 2508 1659 576 -831 -2160 -2450 -1316 13 1896 2293 2092 740 -878 -1914 -2335 -1625
5230 -1625 -833 1503 2277 2564 1045 19 -1300 -2517 -2033 -625 875 2012 2427 1467 195 -1470
5246 -1470 -2106 -2195 -868 394 2021 2551 1755 747 -1265 -2325 -2338 -1357 178 1743 2412 2290 777
5263 777 -817 -2419 -2485 -1393 -17 1430 2252 2261 1223 -325 -1927 -2078 -1671 -455 1154 2279 2238 1585
5281 1585 62 -1586 -2098 -2079 -801 931 1963 2484 1651 298 -1530 -2235 -1983 -1675 572 1896 2372
5298 2372 1897 504 -973 -2086 -2406 -1577 119 1297 2133 1857 649 -650 -2000 -2172 -1773 -251 1273
5315 1273 2203 2031 1218 -333 -1695 -2245 -1849 -681 1008 2308 1804 1243 -158 -1523 -2078 -2556 -856
5332 -856 454 1663 2050 1594 197 -1122 -1854 -2173 -1203 217 1470 2040 1708 525 -664 -2113 -2392
5349 -2392 -1840 -109 1423 2154 2150 950 -552 -1767 -2311 -1541 -145 1098 2195 1911 1360 -47 -1583
5366 -1583 -2230 -1782 -749 893 1957 1982 1624 138 -1377 -2102 -1940 -1381 670 1768 2192 1590 559
5383 559 -827 -2086 -1727 -1192 -95 1279 1947 1881 803 -796 -1659 -1984 -1437 -430 1321 1962 2226 944
5401 944 -214 -1445 -2349 -1536 -440 793 2114 2346 1318 -189 -1220 -2096 -2040 -824 277 1691 2138
5418 2138 1643 336 -1115 -2078 -1883 -1101 227 1832 1969 1830 836 -875 -1547 -1906 -1619 -185 1329
5435 1329 2228 2093 1063 -263 -1906 -2145 -1393 -258 784 1836 1995 1390 -183 -1006 -1909 -1695 -404
5452 -404 771 1738 1786 1206 223 -1471 -1802 -1780 -1070 -10 1464 1920 1446 435 -543 -1407 -2076 -982 119
5471 119 1365 2100 1876 877 -910 -1505 -2268 -1167 -459 984 1952 1886 1044 -42 -1200 -2210 -1445 -477
5489 -477 1279 1793 2097 1077 149 -987 -1758 -1901 -794 334 1510 1883 1449 112 -1090 -1971 -1722
5506 -1722 -993 582 1649 1982 1694 859 -750 -1600 -2020 -1324 75 1232 1864 1470 570 -517 -1617
5523 -1617 -1753 -1185 -311 965 1712 1682 1029 -262 -1219 -1816 -1430 -766 237 1625 2246 1172 126 -1098
5541 -1098 -1749 -1825 -476 173 1260 1676 1352 48 -760 -2000 -1599 -1049 178 1216 1923 1742 727 -576
5559 -576 -1620 -1796 -1319 -5 988 1963 1366 930 -575 -1429 -1854 -1438 -563 611 1726 1706 969 133 -1109
5578 -1109 -1469 -1360 -462 604 1327 1588 1474 365 -1113 -2054 -1787 -1032 488 1110 1242 1394 552 -574
5596 -574 -1736 -1921 -1217 21 1160 1535 1593 987 -434 -1670 -1857 -1295 -492 685 1511 1848 769 37
5614 37 -1010 -1708 -1392 -708 501 1692 1686 1009 69 -1054 -1662 -1605 -666 568 1306 1712 1293 175 -848
5633 -848 -1469 -1601 -725 113 1039 1720 1591 887 -765 -1372 -1782 -1080 -176 1228 1686 1986 1068 -273 -1319
5652 -1319 -1420 -1093 -235 777 1649 1434 872 -50 -877 -1700 -1337 -316 157 1226 1992 1383 389 -906
5670 -906 -1447 -1482 -963 255 940 1672 1461 518 -784 -1339 -1444 -1220 -73 1155 1223 1427 505 -204 -1484
5689 -1484 -1416 -1135 -401 970 1588 1405 980 -97 -1252 -1756 -1225 -736 411 1343 1221 948 -14 -747 -1511
5708 -1511 -1455 -822 362 1574 1217 1560 370 -902 -1114 -1396 -958 -87 1206 1746 1302 384 -883 -1166
5726 -1166 -1509 -1046 -170 962 1691 1354 757 -33 -1033 -1742 -1127 -362 784 1518 1679 1257 -191 -1014
5744 -1014 -1394 -1249 -451 313 1445 1548 858 202 -1158 -1546 -1543 -904 237 1198 1519 1227 404 -595 -1440
5763 -1440 -1498 -974 205 843 1301 1240 791 -78 -1291 -1616 -1426 -709 584 1378 1121 805 -117 -1135 -1394
5782 -1394 -1294 -431 629 1227 1155 1120 64 -772 -1432 -1400 -729 430 1161 1531 1085 467 -465 -1247 -1402 -735
5802 -735 74 983 1503 1238 366 -272 -1228 -1239 -980 -267 563 1311 1297 827 -400 -1213 -1284 -1163 -212 426 1391
5823 1391 1451 860 -134 -794 -1159 -1386 -704 304 1257 1488 930 -46 -929 -1377 -1315 -614 155 1380 1324 1173
5843 1173 107 -553 -1075 -1242 -924 55 1033 1290 1120 475 -114 -1098 -1590 -950 -236 657 1055 1147 893 62
5863 62 -1115 -1471 -960 -494 876 1292 1295 698 52 -701 -1160 -1340 -775 230 1101 1315 1039 315 -536 -1112
5883 -1112 -1334 -749 134 906 1372 1102 297 -563 -1235 -1082 -771 -4 760 1359 1504 882 -150 -1052 -1502
5902 -1502 -1072 -582 404 1279 1220 1047 -196 -855 -1412 -918 -332 465 1081 1266 976 287 -918 -1246 -1214 -435
5922 -435 486 903 1478 1072 617 -518 -1069 -984 -714 -54 594 1354 1102 775 -305 -1086 -1314 -960 81
5941 81 753 1438 1272 477 -135 -888 -1191 -952 -268 647 1375 1252 775 215 -496 -1020 -1064 -626 488 1093
5961 1093 1238 1058 181 -436 -1288 -1078 -490 235 1133 1314 1312 419 -557 -984 -1024 -774 199 708 1713 1071
5981 1071 431 -294 -836 -1075 -1042 -436 476 1080 1094 709 89 -827 -1189 -1303 -407 411 934 1098 894 112
6001 112 -619 -947 -1123 -361 120 643 1265 1401 242 -501 -1248 -948 -754 -94 523 1254 1204 486 -245 -1072
6021 -1072 -1260 -807 -44 410 1071 1103 735 -266 -1015 -1295 -806 -333 476 1012 1178 817 14 -505 -1306 -834
6041 -834 -569 487 1058 1295 895 192 -408 -811 -1012 -616 155 889 1430 946 324 -485 -876 -1434 -764 -174
6061 -174 624 1008 881 635 -196 -718 -1225 -968 -132 668 1371 1115 492 -161 -831 -1415 -882 -361 398 1195
6081 1195 1179 828 190 -615 -920 -795 -585 -177 875 1098 993 631 -599 -1371 -1274 -871 -212 873 1029
6100 1029 938 303 -482 -1049 -728 -741 -353 369 977 1133 456 -187 -551 -988 -773 -204 426 1034 1164 558
6120 558 62 -791 -830 -1108 -645 179 1181 1338 772 363 -475 -843 -1239 -482 170 694 688 1141 368 -235 -743
6141 -743 -1244 -615 99 803 979 1040 350 -77 -920 -1459 -878 1 313 1058 860 406 79 -886 -882 -720 -395
6162 -395 419 621 967 821 285 -686 -1198 -1323 -285 382 506 876 968 236 -806 -1094 -1132 -963 136 580
6182 580 1177 897 661 -316 -782 -968 -869 -369 371 877 1115 284 21 -702 -897 -722 -330 366 836 1101
6202 1101 582 102 -553 -907 -1093 -310 308 1100 938 593 0 -455 -888 -1491 -465 79 769 1074 662
6221 662 256 -283 -1002 -750 -591 108 511 779 1085 346 -336 -711 -1305 -832 -330 570 824 974 629 -366
6241 -366 -734 -1014 -927 -160 238 765 923 570 294 -369 -821 -722 -641 6 861 1067 808 203 -524 -871 -504
6262 -504 -494 61 558 1130 928 50 -299 -841 -830 -747 -89 516 593 1030 558 184 -733 -905 -920 -390 380 731
6284 731 951 493 237 -583 -920 -1172 -245 325 893 636 722 289 -664 -886 -675 -466 311 513 967 710
6304 710 294 -339 -1295 -830 -730 22 499 819 701 136 -523 -679 -898 -888 -189 521 809 786 660 116 -511
6325 -511 -720 -860 -676 297 577 909 429 -163 -398 -836 -729 -585 310 662 838 740 293 -576 -864 -849 -191
6346 -191 -9 569 851 715 312 -204 -831 -959 -662 -159 278 1088 808 323 -31 -786 -664 -848 -259 475
6366 475 788 715 521 -227 -782 -839 -731 -309 146 643 1054 660 -111 -349 -1065 -815 -331 455 505 965 463
6387 463 235 -580 -1019 -582 -614 65 574 670 628 287 13 -653 -1181 -765 -294 579 1070 777 513 -88 -280
6408 -280 -878 -924 -283 537 812 932 628 -55 -621 -653 -761 -502 86 756 846 653 138 -345 -724 -1004 -378
6429 -378 62 779 708 468 -128 -367 -724 -721 -404 -133 384 871 706 322 -146 -505 -512 -354 21 405 803 877
6451 877 309 -35 -735 -799 -633 -222 160 1064 932 491 -110 -267 -1126 -709 -49 355 369 812 575 371 -195
6472 -195 -865 -810 -644 -9 673 778 1036 182 -114 -539 -856 -470 -208 452 811 881 314 43 -457 -735 -757
6493 -757 -483 549 412 447 752 -82 -466 -717 -543 -324 216 699 553 743 256 -229 -552 -766 -485 278
6513 278 535 586 613 380 -277 -472 -768 -179 53 767 713 577 206 -327 -588 -664 -456 -416 358 758 427 597
6535 597 -265 -592 -666 -774 -232 179 722 873 262 35 -277 -971 -376 -256 226 295 555 657 184 -248 -611
6556 -611 -616 -492 -49 633 842 270 87 -558 -408 -622 -641 -24 437 537 326 431 -166 -600 -707 -683 -345
6577 -345 683 826 1091 325 53 -347 -692 -462 -220 370 474 876 681 -104 -280 -364 -530 129 82 211
6597 211 673 420 209 -380 -638 -432 -589 -181 554 793 913 142 -254 -509 -556 -574 -9 408 847 792 379
6618 379 -6 -700 -429 -671 -145 293 682 620 289 183 -732 -863 -647 -695 266 476 777 415 -103 -182 -620
$$ [...]
8191g4
##END NTUPLES=NMR FID
##END=
