##TITLE=1H_LR-673-H-AK1
 D2O, 8 sc, 
 22.10.2019
##JCAMPDX= 6.0         $$ Bruker NMR JCAMP-DX V2.0
##DATA TYPE= NMR FID
##DATA CLASS= NTUPLES
##ORIGIN= UXNMR, Bruker Analytische Messtechnik GmbH
##OWNER= root
$$ XWIN-NMR		Version 3.5
$$ Tue Oct 22 15:23:52 2019 Russian Standard Time (UT+4h)  she@DPX200
##.OBSERVE FREQUENCY= 200.1315
##.OBSERVE NUCLEUS= ^1H
##.DELAY= (6, 6)
##.ACQUISITION MODE= SIMULTANEOUS
##.ACQUISITION SCHEME= undefined
##.AVERAGES= 8
##.DIGITISER RES= 18
##SPECTROMETER/DATA SYSTEM= spect
##.PULSE SEQUENCE= zg30
##.SOLVENT NAME= D2O
##.SHIFT REFERENCE= (INTERNAL, D2O, 0, 15.7039)
##AUDIT TRAIL= $$ (NUMBER, WHEN, WHO, WHERE, WHAT)
$$ ##TITLE= Audit trail, XWIN-NMR		Version 3.5
$$ ##JCAMPDX= 5.01
$$ ##ORIGIN= Bruker BioSpin GmbH
$$ ##OWNER= she
$$ F:/spectra/data/she/nmr/H-F/1/audita.txt
$$ ##AUDIT TRAIL=  $$ (NUMBER, WHEN, WHO, WHERE, WHAT)
(   1,<2019-10-22 15:22:42.57 +0400>,<she>,<DPX200>,
      <created by zg, POWCHK disabled, PULCHK disabled
       configuration hash MD5:
       00 E9 B6 7A A2 85 ED C7 34 08 36 98 17 FE 4E 26
       data hash MD5: 16K
       DB D4 C8 37 DC E7 A1 6F 6B 64 E9 91 74 23 EE CD>)
$$ ##END=
$$ 
$$ hash MD5
$$ 73 8D 9E E3 2D FA 54 A5 CF 9E 65 FD 4F CF 75 49
##$RELAX= 
##$RELAX= 
##$RELAX= 
##$RELAX= 
##$RELAX= 
##$RELAX= 
$$ Bruker specific parameters
$$ --------------------------
##$DU= <F:/spectra>
##$EXPNO= 1
##$NAME= <H-F>
##$PROCNO= 1
##$TYPE= <nmr>
##$USER= <she>
##$AMP= (0..31)
100 100 100 100 100 100 100 100 100 100 100 100 100 100 100 100 100 100 
100 100 100 100 100 100 100 100 100 100 100 100 100 100 
##$AQSEQ= 0
##$AQ_mod= 1
##$AUNM= <au_zg>
##$AUTOPOS= <>
##$BF1= 200.13
##$BF2= 200.13
##$BF3= 200.13
##$BF4= 200.13
##$BF5= 200.13
##$BF6= 200.13
##$BF7= 200.13
##$BF8= 200.13
##$BYTORDA= 1
##$CFDGTYP= 0
##$CFRGTYP= 5
##$CHEMSTR= <none>
##$CNST= (0..31)
1 1 145 1 1 1 1 1 1 1 1 1 1 1 1 1 1 1 1 1 1 1 1 1 1 1 1 1 1 1 1 1 
##$CPDPRG= <>
##$CPDPRG1= <>
##$CPDPRG2= <>
##$CPDPRG3= <>
##$CPDPRG4= <mlev>
##$CPDPRG5= <mlev>
##$CPDPRG6= <mlev>
##$CPDPRG7= <mlev>
##$CPDPRG8= <mlev>
##$CPDPRGB= <>
##$CPDPRGT= <>
##$D= (0..31)
0 1.2 0 0 0 0 0 0 0 0.06 0 0.03 0 0 0 0 0.0002 0 0 0 0 0 0 0 0 0 0 0 0 
0 0 0 
##$DATE= 1571743362
##$DBL= (0..7)
120 120 120 120 120 120 120 120 
##$DBP= (0..7)
150 150 150 150 150 150 150 150 
##$DBP07= 0
##$DBPNAM0= <>
##$DBPNAM1= <>
##$DBPNAM2= <>
##$DBPNAM3= <>
##$DBPNAM4= <>
##$DBPNAM5= <>
##$DBPNAM6= <>
##$DBPNAM7= <>
##$DBPOAL= (0..7)
0.5 0.5 0.5 0.5 0.5 0.5 0.5 0.5 
##$DBPOFFS= (0..7)
0 0 0 0 0 0 0 0 
##$DE= 6
##$DECBNUC= <off>
##$DECIM= 24
##$DECNUC= <off>
##$DECSTAT= 4
##$DIGMOD= 1
##$DIGTYP= 9
##$DL= (0..7)
0 120 120 120 120 120 120 120 
##$DP= (0..7)
150 150 150 150 150 150 150 150 
##$DP07= 0
##$DPNAME0= <>
##$DPNAME1= <>
##$DPNAME2= <>
##$DPNAME3= <>
##$DPNAME4= <>
##$DPNAME5= <>
##$DPNAME6= <>
##$DPNAME7= <>
##$DPOAL= (0..7)
0.5 0.5 0.5 0.5 0.5 0.5 0.5 0.5 
##$DPOFFS= (0..7)
0 0 0 0 0 0 0 0 
##$DQDMODE= 0
##$DR= 18
##$DS= 0
##$DSLIST= <SSSSSSSSSSSSSSS>
$$ [...]
##$SUBNAM2= <"">
##$SUBNAM3= <"">
##$SUBNAM4= <"">
##$SUBNAM5= <"">
##$SUBNAM6= <"">
##$SUBNAM7= <"">
##$SUBNAM8= <"">
##$SUBNAM9= <"">
##$SW= 24.0689530833862
##$SWIBOX= (0..15)
0 0 2 0 0 0 0 0 0 0 0 0 0 0 0 0 
##$SW_h= 4816.95568400771
##$TD= 16384
##$TD0= 1
##$TE= 0
##$TE2= 300
##$TE3= 300
##$TEG= 300
##$TL= (0..7)
0 120 120 120 120 120 120 120 
##$TP= (0..7)
150 150 150 150 150 150 150 150 
##$TP07= 0
##$TPNAME0= <>
##$TPNAME1= <>
##$TPNAME2= <>
##$TPNAME3= <>
##$TPNAME4= <>
##$TPNAME5= <>
##$TPNAME6= <>
##$TPNAME7= <>
##$TPOAL= (0..7)
0.5 0.5 0.5 0.5 0.5 0.5 0.5 0.5 
##$TPOFFS= (0..7)
0 0 0 0 0 0 0 0 
##$TUNHIN= 0
##$TUNHOUT= 0
##$TUNXOUT= 0
##$USERA1= <user>
##$USERA2= <user>
##$USERA3= <user>
##$USERA4= <user>
##$USERA5= <user>
##$V9= 5
##$VALIST= <valist>
##$VCLIST= <CCCCCCCCCCCCCCC>
##$VD= 0
##$VDLIST= <DDDDDDDDDDDDDDD>
##$VPLIST= <PPPPPPPPPPPPPPP>
##$VTLIST= <TTTTTTTTTTTTTTT>
##$WBST= 1024
##$WBSW= 4
##$XGAIN= (0..3)
0 0 0 0 
##$XL= 0
##$YL= 0
##$YMAX_a= 183493
##$YMIN_a= -259633
##$ZGOPTNS= <>
##$ZL1= 120
##$ZL2= 120
##$ZL3= 120
##$ZL4= 120
##$ABSF1= 10
##$ABSF2= 0
##$ABSG= 5
##$ABSL= 3
##$ALPHA= 0
##$AQORDER= 0
##$ASSFAC= 0
##$ASSFACI= 0
##$ASSFACX= 0
##$ASSWID= 0
##$AUNMP= <proc_1d>
##$AZFE= 0.1
##$AZFW= 0.1
##$BCFW= 1
##$BC_mod= 2
##$BYTORDP= 1
##$COROFFS= 0
##$CY= 11.3945322036743
##$DATMOD= 1
##$DC= 2
##$DFILT= <>
##$DTYPP= 0
##$F1P= 20.1720416913024
##$F2P= 0.152960286110954
##$FCOR= 0.5
##$FTSIZE= 0
##$FT_mod= 4
##$GAMMA= 1
##$GB= 0.15
##$INTBC= 1
##$INTSCL= 1
##$ISEN= 128
##$LB= 0.24
##$LEV0= 0
##$LPBIN= 0
##$MAXI= 10000
##$MC2= 0
##$MEAN= 0
##$ME_mod= 0
##$MI= 1.114404
##$NCOEF= 0
##$NC_proc= 0
##$NLEV= 6
##$NOISF1= 3.799351
##$NOISF2= 2.8
##$NSP= 1
##$NTH_PI= 0
##$NZP= 0
##$OFFSET= 15.70392
##$PC= 1
##$PHC0= -9572.948
##$PHC1= 12.80086
##$PH_mod= 1
##$PKNL= yes
##$PPARMOD= 0
##$PSCAL= 0
##$PSIGN= 0
##$REVERSE= no
##$SF= 200.130013532006
##$SI= 16384
##$SIGF1= 3
##$SIGF2= 2
##$SINO= 400
##$SIOLD= 16384
##$SREGLST= <1H.CDCl3>
##$SSB= 0
##$STSI= 0
##$STSR= 0
##$SW_p= 3612.71676300578
##$SYMM= 0
##$S_DEV= 0
##$TDeff= 0
##$TDoff= 0
##$TI= <>
##$TILT= no
##$TM1= 0
##$TM2= 0
##$TOPLEV= 0
##$USERP1= <user>
##$USERP2= <user>
##$USERP3= <user>
##$USERP4= <user>
##$USERP5= <user>
##$WDW= 1
##$XDIM= 8192
##$YMAX_p= 0
##$YMIN_p= 0
$$ End of Bruker specific parameters
$$ ---------------------------------
##NTUPLES= NMR FID
##VAR_NAME=  TIME,          FID/REAL,        FID/IMAG
##SYMBOL=    X,             R,               I
##VAR_TYPE=  INDEPENDENT,   DEPENDENT,       DEPENDENT
##VAR_FORM=  AFFN,          ASDF,            ASDF
##VAR_DIM=   8192,          8192,            8192
##UNITS=     SECONDS,       ARBITRARY UNITS, ARBITRARY UNITS
##FACTOR=    0.0002076,     1,               1
##FIRST=     0,             0,               0
##LAST=      1.7004516,     0,               0
##MIN=       0,             -259633,         0
##MAX=       1.7004516,     183493,          0
$$ Real data points
##PAGE= N=1
##DATA TABLE= (X++(R..R)), XYDATA
$$ [...]
167 -13715 -98536 -67790 -32609 -16754 46597 90567 45263 -2076 -5455 -43009 -93144 -49603
179 -49603 36186 53780 47628 65688 25924 -68165 -85042 -27676 -12711 -8694 62559 102839
191 102839 28149 -44983 -36276 -38527 -70394 -28023 61353 76123 38754 26884 -3636 -76211
203 -76211 -87716 -15206 30833 28296 49790 69366 17050 -52744 -64779 -49937 -32474 20221
215 20221 74629 63808 18959 -3028 -32050 -75760 -62660 7519 46327 43726 52932 44500 -22208
228 -22208 -77178 -58310 -19817 -2910 32687 77887 60433 -6362 -44283 -47657 -51245 -34259
240 -34259 19274 61410 59660 35464 -711 -47185 -69576 -44798 -2782 28704 55582 62372
252 62372 25249 -27638 -52171 -51867 -41214 -3218 49930 68627 40815 4476 -25138 -55345
264 -55345 -62544 -25636 26304 52600 53007 36638 869 -43156 -63265 -46778 -8994 31476 56190
277 56190 53577 24480 -16621 -51320 -60739 -35997 6530 41274 55593 47120 14110 -30505 -58223
290 -58223 -52799 -22477 16214 47463 57222 37401 -2082 -40722 -59075 -44810 -8611 27195
302 27195 51147 54724 28555 -18499 -52238 -52448 -32432 -2279 36210 61149 47101 6298 -28090
315 -28090 -48221 -53356 -28647 17630 49759 51319 34165 2917 -37858 -59378 -42488 -8215
327 -8215 22779 49614 56081 24629 -19913 -43758 -48591 -39156 -3556 42641 56786 36265 11123
340 11123 -17061 -51601 -58722 -21541 21854 39725 46594 41272 3969 -42846 -54491 -36210 -13597
353 -13597 18164 52826 54531 19238 -15811 -36724 -51490 -41418 2597 40679 46621 38175 19960
366 19960 -20817 -57158 -48925 -14439 9986 32835 55496 42620 -5398 -39800 -43431 -38604 -20270
379 -20270 22641 53752 44888 18496 -5600 -36742 -57431 -36127 7350 32789 41762 44025 19554
392 19554 -26414 -51122 -40492 -21674 2882 39904 56669 31671 -5526 -27451 -43314 -46933
404 -46933 -16522 28015 46102 39369 25456 -3521 -42598 -53125 -28139 1384 23487 46392
416 46392 48295 13072 -27375 -42084 -40092 -27661 5794 42233 48933 27685 3040 -24343 -49295
429 -49295 -45005 -9534 23090 37834 42645 30433 -7957 -43136 -45761 -27670 -4491 24543 48208
442 48208 42178 11144 -18724 -38760 -46123 -27412 11070 39303 42126 30424 7180 -26843 -48811
455 -48811 -39084 -10327 16791 37641 45795 26792 -10131 -37104 -42290 -30776 -6418 25774 46802
468 46802 40447 13040 -18818 -40592 -41602 -22079 6279 31327 44191 36069 5404 -30323 -45522
481 -45522 -35087 -11265 14623 36183 43542 27040 -6462 -36088 -44234 -30482 -3764 24487
493 24487 42376 37959 13571 -15940 -36638 -41927 -26854 5635 35834 44166 29094 2704 -24188
506 -24188 -39655 -36037 -15801 11101 37837 47516 25840 -12422 -35703 -35335 -27188 -11077 19887
519 19887 45971 41031 12073 -17040 -36052 -40508 -22725 6822 28331 37637 34756 10691 -26791
532 -26791 -45354 -33881 -11696 11719 36219 43060 20258 -8790 -23447 -35030 -39581 -13134
544 -13134 31005 47466 29798 8234 -9673 -31436 -41353 -24824 2834 27712 43763 35209
556 35209 554 -28616 -31745 -27884 -23323 4902 42892 46296 16712 -8137 -23345 -39877 -35303
569 -35303 -1087 26930 29867 29109 24540 -5362 -42013 -45060 -19035 6533 28028 39735 27671
582 27671 1355 -15570 -29263 -41888 -25419 19943 43324 29948 15040 5890 -21602 -46911
594 -46911 -32859 565 19228 31426 40003 18895 -21071 -35832 -25243 -20528 -9803 24276
606 24276 47506 31709 1885 -19004 -36039 -39067 -11395 19378 26137 26957 29741 7583 -32361
619 -32361 -44175 -23472 -4706 13255 37657 40074 9902 -16335 -23317 -32835 -33966 152 38293
632 38293 36492 15953 8316 -6562 -35853 -42795 -13906 14232 27583 36890 28198 -5776 -32271
645 -32271 -29970 -20985 -13097 11478 38321 36070 13099 -7690 -27967 -41728 -25266 9540 26448
658 26448 26330 28344 16467 -18975 -41584 -28560 -8517 3336 24099 41924 25711 -7572 -23740
671 -23740 -28467 -31852 -14852 22462 40341 25970 8806 -3735 -23012 -37373 -26045 568
683 568 23125 35988 31664 5716 -20384 -29272 -28888 -20627 6397 34653 34562 13960 1158 -12218
697 -12218 -35674 -39227 -6083 26237 29271 23170 19273 -430 -32277 -40407 -18073 6363 18892
710 18892 27663 28713 12872 -13666 -33572 -34949 -14885 11727 26849 28782 23448 5450 -23587
723 -23587 -38448 -24974 -1973 12330 23865 33599 22930 -8641 -32784 -32235 -18206 -1025 18795
736 18795 33540 29053 7136 -16502 -28938 -28866 -16702 4850 26196 34461 22983 -702 -21078
749 -21078 -30898 -27439 -9788 14780 30600 29032 15646 -4496 -25667 -34060 -21426 1202 18649
762 18649 29122 29363 12377 -15377 -32767 -29671 -13235 7026 23616 29618 22398 4562 -18829
775 -18829 -35140 -28164 -4543 14157 23461 29611 21974 -6462 -31373 -29208 -15451 -4993 12663
788 12663 34255 32965 4922 -18206 -23776 -25375 -20324 2351 26842 32872 21556 2045 -20102
801 -20102 -31469 -23193 -6650 7012 24982 35688 18354 -11965 -24432 -22810 -23063 -10425 21583
814 21583 36921 20775 3284 -4730 -22622 -37004 -18976 12340 23712 22608 23792 8806 -20896
827 -20896 -33130 -21392 -8848 5021 28478 35243 12668 -10261 -17411 -26047 -28250 -4316 24744
840 24744 27404 18915 14457 -4732 -33389 -33046 -7904 5876 12493 30180 31385 -497 -25731
853 -25731 -22243 -18252 -17991 5540 34749 29914 7087 -2632 -13710 -33296 -28476 2827 20351
866 20351 20567 24688 18422 -12789 -33278 -22168 -9517 -4669 16937 37884 22828 -6017 -13957
879 -13957 -18573 -30865 -17948 18358 30615 17056 13200 8571 -20986 -39008 -17731 5051 8525
892 8525 20659 34058 13886 -19903 -24317 -16746 -20036 -7080 26875 36032 12737 -860 -5744
905 -5744 -25212 -33843 -7824 16345 17049 21344 26518 516 -32199 -27979 -8427 -6679 3207 31734
919 31734 33631 2426 -14732 -13252 -24676 -27942 3657 30475 22266 11252 11687 -6728 -34952
932 -34952 -28914 -1853 8764 15298 29803 22684 -9479 -22980 -15881 -19855 -17302 14977 38539
945 38539 20865 25 -2336 -15023 -33889 -20715 10983 18724 16309 24303 14557 -20060 -33422
958 -33422 -15419 -5425 -1871 20214 35567 15435 -9574 -13471 -20109 -28607 -8226 23362 24983
971 24983 12212 13418 4248 -26358 -35515 -10079 7523 10363 23703 28950 3032 -21510 -18446
984 -18446 -15696 -19643 433 31359 29807 6303 -1734 -8414 -27831 -28517 -236 18416 16494 20531
998 20531 19844 -6878 -30397 -22015 -7373 -4765 9917 31875 24969 -1194 -13453 -16668 -25925
1011 -25925 -17850 12535 26750 16197 11528 8896 -13996 -33923 -20839 2008 9316 17140 28318
1024 28318 15357 -13198 -22182 -16747 -16622 -7454 19495 31127 15405 926 -5016 -19758 -29581
1037 -29581 -12012 12051 18161 19716 20740 3206 -22739 -25608 -12011 -5863 3202 23990 29284
1050 29284 8065 -9932 -14543 -21455 -22511 -990 22944 23023 13390 8384 -5749 -25882 -25885 -7065
1064 -7065 6478 13954 23925 20511 -1378 -18683 -20139 -17903 -10901 10457 27166 20756 5780
1077 5780 -2018 -13825 -26966 -19811 3179 16528 18741 19878 10926 -11713 -25835 -19251 -7946
1090 -7946 1205 16369 26957 16570 -3027 -13425 -19283 -21270 -9852 12072 23237 19577 10814
1103 10814 -1571 -19072 -25216 -13802 990 11666 20862 21992 6687 -11822 -19894 -19376 -14042
1116 -14042 2626 21229 23786 11986 497 -9739 -21594 -22926 -6658 12450 19733 19069 12784
1129 12784 -1991 -18388 -23533 -15561 -1459 13271 22632 18671 5189 -7849 -18275 -22534 -13760
1142 -13760 5010 18602 20070 14512 4042 -12352 -24199 -19943 -4358 9552 17541 20591 13380
1155 13380 -2639 -17550 -22275 -15662 -1655 12980 20973 18278 7305 -7587 -19709 -21856 -11434
1168 -11434 4747 15900 20009 16057 3636 -12851 -22525 -19023 -5850 8572 18267 19905 12246
1181 12246 -2037 -16120 -22560 -15842 -904 13220 19271 17807 8691 -6601 -20239 -21845 -10167
1194 -10167 4244 14881 19129 16440 4035 -12737 -22129 -18105 -5785 7131 16268 20585 14218
1207 14218 -2636 -18519 -21241 -12369 -1416 8884 18509 21111 9774 -9297 -21076 -18900 -8489
1220 -8489 1986 12296 20271 17892 3485 -13753 -20814 -16211 -6142 5350 17100 21223 12374
1233 12374 -3778 -15725 -18834 -14857 -4653 10935 21681 18968 5444 -8282 -16049 -17582 -12759
1246 -12759 -825 14847 22884 16249 437 -12788 -17441 -15605 -8317 4463 17215 21412 12605
1259 12605 -3399 -15548 -19667 -13977 -2634 9625 18383 18438 8312 -6434 -17739 -19420 -11370
1272 -11370 2089 14391 19728 14502 2309 -9514 -17120 -17838 -9874 5869 19169 20404 9716
1285 9716 -4276 -12507 -15643 -15827 -7254 9830 22259 18664 4457 -8030 -14317 -17329 -13309 -261
1299 -261 14025 20513 15205 2648 -10619 -18453 -16986 -7635 5944 16438 18229 10926 -119 -11224
1313 -11224 -19986 -18505 -2832 13825 17877 12813 7124 -1421 -15114 -21944 -13070 3208 14295
1326 14295 17456 14589 3468 -9288 -16862 -16443 -9061 4298 17464 19623 10605 -2027 -12286
1339 -12286 -17903 -14716 -2701 8495 15707 17666 10883 -5346 -19057 -18136 -8489 287 10225 18813
1353 18813 16054 2665 -9022 -15771 -18037 -10256 6920 17708 16028 9162 1973 -10384 -20525
1366 -20525 -16213 -2180 9580 16388 16715 7821 -5798 -14479 -15497 -13015 -2413 13757 20636 12916
1380 12916 2015 -6856 -16126 -19008 -7427 7219 12763 14489 14465 3069 -15253 -20233 -11257 -2131
1394 -2131 4971 15738 19659 7916 -6922 -13595 -15945 -13393 -328 14059 16991 11608 5804 -5448
1408 -5448 -18398 -18614 -5861 5037 11985 17920 14022 -2457 -14088 -13756 -11569 -8389 5597 20376
1422 20376 17457 4454 -3688 -10569 -18850 -14463 2615 13583 14015 12894 7425 -7880 -18783 -14762
1436 -14762 -5721 1752 12289 19668 11851 -2590 -10234 -13955 -16285 -6128 10944 17174 11724 7251
1450 7251 710 -14027 -20463 -9462 2720 7786 14036 18436 6174 -12202 -16080 -11379 -8397 -312
1464 -312 14635 19516 8942 -1041 -7085 -15831 -17931 -4028 10690 14175 13424 10384 -2078 -16488
1478 -16488 -16118 -7851 -1952 6898 18854 16688 945 -8846 -10440 -14911 -13465 3368 17944 15381
1492 15381 7424 2668 -7383 -18812 -14990 -1748 6831 11468 16417 11897 -4613 -15367 -13911
1505 -13911 -10243 -3764 10439 18764 12127 1776 -3630 -12289 -19468 -9802 6918 13091 12209 12183 4636
1520 4636 -11537 -18496 -11051 -3218 3735 14100 18398 7033 -5867 -10068 -12637 -14494 -3370 13005
1534 13005 16891 10241 5107 -3219 -15521 -17611 -6232 4524 9488 14128 13868 1566 -11823 -14966
1548 -14966 -11845 -6617 4848 16509 15366 5461 -1371 -9156 -17563 -14424 1562 11719 11626 11388
1562 11388 8665 -4287 -17320 -15224 -5630 1863 9506 16597 12739 -11 -9747 -13115 -13424 -6228
1576 -6228 6766 14470 12813 8256 503 -11940 -18137 -9944 1533 7109 12245 15185 7039 -7806
1590 -7806 -14866 -11849 -7664 -374 11230 16748 10998 542 -7693 -14189 -14371 -4848 6581 12070
1604 12070 13335 9687 -1038 -13153 -15306 -9279 -1897 6189 14812 15074 4868 -6667 -12527 -13570
1618 -13570 -9523 1584 11706 14471 10367 2658 -7756 -15426 -13233 -3998 4955 11484 14673 9852
1632 9852 -2921 -12133 -13524 -9883 -3436 6980 15042 13865 5067 -5465 -12234 -13564 -8545 838
1646 838 10524 14769 11801 1970 -9152 -13832 -11754 -5252 3645 12293 15063 8557 -2176 -10401 -13529
1661 -13529 -11108 -2669 7892 14520 12771 5142 -4470 -11938 -13630 -8827 462 10369 14750 10173
1675 10173 1484 -7270 -13001 -13205 -6293 4824 12568 13386 8176 -1233 -10143 -13436 -10576 -3312 6801
1690 6801 14347 13842 4746 -4935 -11443 -13399 -9062 782 10435 13868 10490 3293 -6449 -14357 -12849
1705 -12849 -4852 3991 10707 13906 9601 -1123 -10359 -13095 -10609 -3444 7218 14209 11989 4358
1719 4358 -2891 -10843 -14573 -9436 1838 9979 12265 10929 3325 -7317 -13496 -11087 -5659 2384
1733 2384 11889 15108 8231 -2517 -8186 -11639 -11866 -4184 7940 13411 10994 6047 -1945 -11861 -14426
1748 -14426 -7218 1128 7586 12930 12365 2514 -8240 -11810 -11081 -6961 2832 12443 12992 6357 388
1763 388 -6573 -14530 -13094 -1227 8116 10433 10756 7482 -2799 -12447 -12923 -7048 -1009 7642 14667
1778 14667 11500 715 -6377 -10164 -12458 -8119 3792 12064 11833 7901 1437 -8710 -14386 -9345
1792 -9345 -954 4132 10256 14347 7342 -5539 -11842 -10643 -7926 -1818 8861 14191 9066 2403
1806 2403 -3703 -11304 -14621 -6096 5663 10018 10637 9266 1605 -9205 -13000 -9265 -3653 4158 13057
1821 13057 13734 3784 -4325 -7756 -11527 -11236 -1206 10510 12630 8617 3717 -4307 -13173 -12245 -3711
1836 -3711 2606 7524 13160 11063 -600 -10462 -11360 -8737 -4754 4886 12530 11313 4653 -1157 -8681
1851 -8681 -14246 -9964 1879 9072 10105 9749 5101 -5148 -12341 -11026 -5656 1283 10363 14266 7621
1866 7621 -1739 -6317 -9814 -12125 -5732 6799 12888 9910 5481 -912 -9705 -13404 -7764 627 6175
1881 6175 10922 11983 4183 -6475 -11812 -10729 -5970 1963 10034 11993 7335 1550 -5624 -13041 -12427
1896 -12427 -1858 6938 9491 9821 7809 -1226 -10527 -12309 -7436 -933 6537 12382 10847 2103 -5120
1911 -5120 -9279 -11257 -7610 2299 10348 11415 7708 1575 -6837 -12442 -9806 -2306 3980 9218 12382
1926 12382 7814 -2538 -9983 -10975 -7511 -1517 6869 11614 9536 3860 -3509 -10331 -12531 -6354 2920
1941 2920 8617 10327 8927 2166 -7458 -11980 -9140 -3255 3453 9913 11766 6878 -2510 -8629 -10788
1956 -10788 -8424 -1670 6625 11518 10102 4059 -4540 -10611 -10912 -5583 1034 7407 11532 9504 1163
1971 1163 -7661 -10652 -9308 -4581 3790 10783 11153 5558 -1606 -7457 -11022 -9020 -1452 6680 11056
1986 11056 9953 3645 -3787 -10213 -10879 -6481 1261 8906 11224 7816 792 -5644 -10415 -10403 -4464
2001 -4464 4142 10400 10426 6280 -862 -8405 -11678 -8389 -920 6314 10020 9595 4636 -3227 -9879 -10733
2017 -10733 -6551 1296 8437 10903 8569 1199 -6309 -10556 -9833 -3838 3124 9157 10462 6564 -717
2032 -717 -7684 -10965 -8544 -1586 6327 10677 9366 3816 -3699 -9211 -10283 -6237 877 7453 10634
2047 10634 8716 1849 -5453 -10755 -10083 -4207 3507 9211 10186 6157 -132 -7307 -11045 -8355 -1481
2062 -1481 5458 9835 10012 5050 -3130 -10074 -10406 -5586 712 7003 10115 8276 2054 -5418 -10084
2077 -10084 -9752 -4184 3262 8897 10475 7083 -641 -8098 -10399 -7540 -2474 4471 10348 9934 4175
2092 4175 -3291 -8524 -10036 -6564 -147 7296 11010 8435 1428 -5604 -9693 -9195 -4434 2417 8080
2107 8080 10464 6824 -647 -7401 -10376 -7765 -1898 5040 9879 9065 4060 -2714 -8614 -10350 -7042
2122 -7042 566 7441 9910 7764 2361 -4631 -9535 -9864 -4869 2813 8889 10078 5804 -509 -6741
2137 -6741 -9543 -8289 -2682 4688 9415 10045 4403 -3421 -8743 -9268 -5621 -298 5999 9846 8382
2152 8382 2329 -4829 -9722 -9388 -4146 2740 7800 9336 7141 713 -6850 -10311 -8329 -1641 4791
2167 4791 9336 8789 4146 -2132 -7274 -9721 -7235 -89 7754 9875 7467 2170 -4515 -8957 -9033 -4491
2183 -4491 1963 7634 9986 7148 -700 -7458 -9021 -6808 -2892 3587 8878 9747 4664 -2397 -8108
2198 -8108 -9746 -6068 426 5861 8427 8393 3700 -4275 -9839 -9011 -4024 1984 7539 10232 6371 -518
2214 -518 -5636 -8218 -8569 -3958 4949 10361 8359 3434 -1880 -7247 -9455 -6637 -633 5738 9879
2229 9879 8805 2104 -5767 -8305 -7415 -5312 551 8352 10308 5856 158 -5270 -9414 -9087 -2300
2244 -2300 5074 7741 7958 5612 -907 -8583 -9916 -5808 -269 5395 9657 8227 1467 -3975 -6728
2259 -6728 -8992 -6283 2180 9325 8676 4987 759 -4671 -9375 -8523 -2065 3745 8080 9445 5104
2274 5104 -2889 -7583 -7589 -6190 -2062 6129 10630 7733 1809 -2936 -7736 -10171 -4888 3194 7363 7044
2290 7044 6840 2619 -5765 -10308 -7212 -1937 2769 7971 9522 4342 -2100 -5733 -8514 -7990 -803
2305 -803 7411 9214 5858 3282 -1692 -8678 -10174 -3782 2618 5898 8463 7733 631 -6513 -7886
2320 -7886 -6251 -3701 2623 9037 8990 3628 -1139 -5638 -9549 -7630 316 5935 6880 7125 4910 -2919
2336 -2919 -10173 -8115 -3014 973 5386 9786 7406 167 -5051 -7605 -8541 -3792 4518 8645 6561
2351 6561 4174 635 -6327 -10764 -6313 729 4496 7187 8797 3423 -4687 -8211 -6874 -5090 -429
2366 -429 7017 9948 5411 282 -3983 -8052 -8803 -2709 4545 6535 7259 6359 -151 -8557 -8992 -4206
2382 -4206 -685 2722 8237 9310 2634 -4160 -6751 -7728 -5839 1162 7713 7690 4932 1929 -3833 -9577
2398 -9577 -8213 -1646 2918 5758 8781 6255 -1882 -7381 -7248 -5505 -2543 4033 9675 7764 1637
2413 1637 -2558 -6451 -8958 -5741 1184 6271 7407 6737 2385 -5684 -8877 -6256 -2158 1104 6790
2428 6790 9546 4952 -2238 -6008 -7338 -7194 -2206 5311 8406 6329 2957 -1877 -7410 -8990 -4287
2443 -4287 1305 5555 7945 7563 1273 -5594 -7586 -6445 -3881 1619 7881 8660 3762 -1017 -4911
2458 -4911 -8240 -7461 -1157 4878 7054 7257 4039 -2422 -8025 -7961 -4011 132 4823 8856 6949 437
2474 437 -4488 -6606 -7156 -4338 2468 7758 7625 4163 72 -5536 -8608 -6585 -936 3948 7179 7970
2490 7970 3650 -3071 -6774 -7152 -5180 -323 5945 8410 5510 813 -3430 -7233 -7788 -3943 3078
2505 3078 6841 6980 5225 163 -5952 -8325 -5999 -1516 3655 7600 7923 3230 -2541 -6264 -7736
2520 -7736 -5474 109 5865 7989 5791 1484 -3550 -7577 -7256 -2955 2334 5679 7869 5192 -667
2535 -667 -5874 -7619 -6133 -1954 3530 7814 7014 3167 -1928 -6095 -7912 -5387 478 5797 7432
2550 7432 6329 1884 -3594 -7295 -7355 -3524 2001 6618 7699 4690 -234 -4734 -7653 -6542 -1834
2565 -1834 4254 7479 6975 3612 -2028 -6445 -7716 -4906 -43 4713 7382 6396 2203 -3589 -7047
2580 -7047 -6956 -3385 1852 5858 7394 5052 118 -4661 -7490 -6231 -1523 3343 6767 7144 3427 -1709
2596 -1709 -5905 -7354 -4968 11 5139 7526 5605 1276 -3111 -6741 -6929 -3828 1809 6038 7349
2611 7349 5342 315 -5018 -7265 -6313 -2191 3007 6827 6827 3361 -1378 -5895 -7251 -5093 -98 4484
2627 4484 6909 6415 2368 -3208 -7215 -6677 -3370 1230 5587 7328 4730 231 -4619 -7064 -6090 -2426
2643 -2426 3110 6866 7239 3571 -1229 -5937 -7311 -4860 -416 4119 7199 6346 2107 -3269 -6428
2658 -6428 -6830 -3958 1024 6009 7062 4612 361 -4060 -7066 -6192 -2209 3365 6359 6563 3846 -1120
2674 -1120 -5788 -7289 -4945 -429 4030 7306 6143 1889 -3006 -6308 -6589 -4013 1121 5694 6793
2689 6793 4706 946 -4356 -6952 -6246 -1763 2667 5781 6966 3680 -1324 -5727 -6641 -4831 -1065
2704 -1065 4230 6848 5921 2189 -2370 -5983 -6920 -4081 1275 5620 6424 4833 270 -3897 -6782 -6044
2720 -6044 -2208 2518 6447 6926 3507 -1574 -5099 -6798 -5279 -506 4058 6716 5794 2513 -1992
2735 -1992 -6382 -6964 -3603 1455 4753 6520 4984 1177 -3998 -6889 -6022 -2179 2604 6047 6311 3533
2751 3533 -639 -4695 -6894 -5241 -533 4102 6184 6086 2796 -2654 -6378 -6236 -3329 721 4684 6930
2767 6930 5175 862 -4285 -6345 -5897 -2695 2306 6051 6548 3706 -587 -4943 -6602 -4993 -478
2782 -478 3876 6476 5715 2549 -2226 -5650 -6374 -3695 834 4722 6593 5021 723 -3543 -6611 -6057
2798 -6057 -2495 2456 5945 6274 3735 -796 -4933 -6332 -4804 -854 3692 6111 5806 2510 -2221
2813 -2221 -5824 -5952 -3747 270 4452 6375 5525 811 -3949 -6042 -5510 -2286 1980 5643 6484 4043
2829 4043 -232 -4620 -6825 -4944 -905 3392 6168 5915 2611 -2194 -5541 -6093 -3350 187 4425
2844 4425 6488 5095 1054 -3073 -5952 -5675 -2666 2177 5362 6130 3907 -405 -4660 -6153 -4781
2859 -4781 -1123 3185 6093 5739 2644 -2116 -5296 -6383 -4065 590 4798 6213 4794 1041 -3155
2874 -3155 -6134 -5874 -2474 1800 5062 5849 4367 -783 -4710 -6088 -4537 -1318 2843 6313 5443 2204
2890 2204 -1785 -5029 -6302 -3869 641 4555 6020 4906 1325 -3017 -6233 -5503 -2401 1478 5077
2905 5077 6223 3956 -700 -4396 -5851 -5181 -1550 3218 6145 5036 2469 -1501 -5094 -6517 -3830
2920 -3830 602 3789 5748 5400 1610 -3158 -6068 -5512 -2623 1269 5130 5930 3813 -281 -3506 -5894
2936 -5894 -4785 -1257 3005 5451 5588 2947 -1619 -5316 -5922 -3752 -250 3662 5923 5249 1034 -3171
2952 -3171 -5360 -5121 -3124 1130 5145 6029 3837 26 -3434 -5980 -5081 -1052 2831 5342 5462 3122
2968 3122 -1434 -5125 -5447 -4001 -358 3886 6150 4391 1352 -2601 -5395 -5481 -2851 1499 5019 5420
2984 5420 3782 -236 -4199 -5793 -4614 -1266 2001 5520 5817 3174 -1660 -4851 -5786 -3654 -219
2999 -219 3751 5271 4729 1489 -2628 -5508 -5492 -2708 1232 4374 5802 4157 434 -3605 -5589 -4958
3015 -4958 -1876 2810 5743 5662 2556 -1399 -4492 -5412 -4086 -597 3723 5689 5057 1288 -2537 -5278
3031 -5278 -5028 -2764 499 4598 5915 4255 243 -3682 -5480 -4651 -1447 2203 5132 5375 2609 -715
3047 -715 -4347 -5937 -4045 -440 3578 5590 4364 1619 -1937 -4764 -5256 -3034 1054 4622 5501 3706
3063 3706 42 -3158 -5093 -4602 -2149 2140 5284 5558 2840 -1143 -4390 -5280 -3695 -759 3461 5716
3079 5716 4631 1569 -2251 -5199 -5337 -2699 1233 3981 5274 3741 617 -3359 -5369 -4467 -1541
3094 -1541 2559 4886 4877 2394 -406 -3868 -5447 -4564 -279 3742 5123 4234 1708 -1686 -4821 -5071
3110 -5071 -2918 496 4117 5700 3894 48 -3173 -5053 -4535 -1721 2342 4614 4883 2965 -425
3125 -425 -4079 -5942 -3806 128 3066 4520 4568 2557 -1819 -5093 -5271 -2573 788 3931 5246 3403
3141 3403 765 -2564 -5120 -4920 -1890 2317 4907 4752 3042 -521 -3912 -5151 -3870 -521 2518
3156 2518 5254 5154 1709 -2558 -4350 -4496 -3016 509 3634 5166 3877 1037 -2944 -5677 -4534
3171 -4534 -1272 1693 3777 5097 3810 -764 -4035 -5021 -3612 -734 2737 5223 4485 1762 -1687
3186 -1687 -4175 -5086 -3206 732 3739 4799 3656 1036 -3000 -5422 -4380 -1823 1246 4254 5698
3201 5698 2960 -1017 -3451 -4540 -4056 -982 2831 5005 4296 2233 -1444 -4690 -5225 -2693 741 2885
3217 2885 5106 4200 1054 -3109 -4680 -4117 -2138 1039 4711 5105 2492 -131 -2835 -4919 -4374 -744
3233 -744 3207 4287 4179 2197 -1132 -4558 -4805 -2718 -53 3158 5228 4123 609 -2950 -3993 -4381
3249 -4381 -2680 1359 4355 4954 2798 354 -3564 -4983 -3818 -649 2124 3902 4559 2024 -1948
3264 -1948 -4496 -4302 -3017 -414 3208 4990 3869 826 -1950 -4084 -4979 -2296 1883 4002 4231 3170
3280 3170 295 -3295 -5123 -3402 -1093 2170 4465 4713 2096 -1293 -3759 -4640 -3651 5 3440 4489
3296 4489 3383 1365 -1908 -4689 -4402 -1867 1199 3374 4575 3636 -68 -3673 -4490 -3900 -1180 1977
3312 1977 4398 4720 1717 -952 -3409 -4758 -3439 72 3210 4164 3620 1288 -2287 -4552 -3959 -1956
3328 -1956 961 3593 5257 3157 -221 -3087 -4152 -4025 -1663 2464 4576 4008 2189 -902 -3826
3343 -3826 -4740 -2980 178 2764 4239 4073 1541 -2237 -4399 -3966 -2371 944 3600 4824 2726 -214
3359 -214 -2681 -4527 -3983 -1354 2237 4061 4219 2504 -851 -4121 -4597 -2934 -199 2662 4642 4135
3375 4135 1335 -2345 -3965 -4022 -2573 960 3732 4296 3118 346 -2638 -4663 -3739 -1181 1787 4005
3391 4005 4509 2345 -992 -3655 -4150 -3317 -543 2807 4754 3676 1162 -1807 -3977 -4521 -2488 1054
3407 1054 3648 4179 3353 639 -2539 -4601 -3690 -1280 1726 4222 4423 2370 -680 -3418 -4211 -3214
3423 -3214 -239 2617 4033 3720 1397 -1451 -4142 -4301 -2390 885 3361 4381 2969 520 -2580
3438 -2580 -4029 -3866 -1744 1680 3900 4104 2070 -790 -3601 -4028 -3159 -449 2632 4119 3713 1376
3454 1376 -1452 -3759 -3844 -2357 697 3235 4175 2821 322 -2576 -3972 -3783 -1563 1422 3750 4240
3470 4240 2524 -290 -3191 -4410 -2896 -409 2438 4000 3768 1442 -1591 -3668 -3885 -2361 391
3485 391 3305 4283 3194 532 -2197 -4185 -3877 -1655 1554 3927 4072 2325 -430 -3233 -4252 -2923
3501 -2923 -418 2283 4049 3346 1454 -1309 -3663 -4149 -2046 593 3216 4243 2943 420 -2363
3516 -2363 -4044 -3724 -1612 1581 3562 4094 2151 -611 -3025 -3778 -3154 -759 2175 3957 3350 1387
3532 1387 -1279 -3744 -3930 -2257 283 2989 3840 3083 1151 -2122 -4192 -3767 -1268 1453 3596 3928
3548 3928 2547 -304 -2741 -4057 -2905 -327 2247 3738 3482 1368 -1147 -3428 -3828 -2668 94
3563 94 2474 3958 3013 522 -1891 -3742 -3717 -1842 1232 3488 4122 2510 -205 -2998 -4004 -2862
3579 -2862 -516 2093 3524 3208 1752 -966 -3560 -3955 -2380 508 2448 3694 2835 841 -1906 -3826
3595 -3826 -3685 -1853 1432 3686 3696 2422 -290 -2590 -3678 -3117 -737 1843 3599 3569 1534 -1138
3611 -1138 -3211 -3644 -2460 -5 2649 4065 3150 958 -2151 -3778 -3149 -1568 845 3216 3763 2969
3627 2969 291 -2699 -3729 -2947 -616 1724 3523 3561 1600 -1160 -3178 -3684 -2473 254 2871 3730
3643 3730 3045 882 -1642 -3384 -3551 -1779 836 3070 3862 2560 -154 -2668 -3400 -3009 -1143 1615
3659 1615 3667 3458 1685 -917 -3061 -3797 -2477 387 2359 3514 3238 1417 -1708 -3826 -3516 -1451
3675 -1451 795 2999 3697 2436 -143 -2379 -3333 -3165 -974 1720 3630 3395 1664 -567 -2678 -3617
3691 -3617 -2393 -110 2591 3324 3078 659 -1606 -3327 -3069 -1796 687 2949 3644 2693 226 -2282
3707 -2282 -3696 -3229 -889 1803 3080 3409 2116 -570 -2743 -3662 -2329 -240 2069 3499 3320 720
3723 720 -1484 -3387 -3449 -2043 643 3048 3258 2239 10 -2286 -3832 -3097 -947 1522 2976 3468
3739 3468 2080 -939 -2748 -3372 -2238 -388 1963 3550 2721 1088 -1378 -2773 -3294 -1742 537 2773
3755 2773 3181 2783 376 -2148 -3396 -3139 -1074 1125 3389 3610 2126 -779 -2563 -3232 -2439 -238
3771 -238 2097 3561 2835 1306 -1238 -3066 -3342 -1901 478 2386 3422 2807 386 -2281 -3250 -2698
3787 -2698 -1180 1141 3360 3421 1605 -633 -2212 -3617 -2602 -238 1971 3397 2676 1481 -1114 -3052
3803 -3052 -3353 -2094 469 2354 3371 2660 62 -1837 -2843 -2636 -1260 1127 3571 3049 1923 -324
3819 -324 -2554 -3405 -2782 -478 1908 3325 3072 1297 -1403 -2691 -3148 -1755 13 2352 3549 2375
3835 2375 512 -1658 -2978 -3130 -1381 1365 3115 3002 1647 -176 -2610 -3313 -2340 -749 1562 3244
3851 3244 2951 1089 -1151 -2696 -2932 -1915 155 2571 3328 2256 692 -1561 -3188 -3209 -956 1168
3867 1168 2642 3241 1980 -17 -2440 -3157 -2242 -307 1769 3286 2884 1187 -881 -2598 -3108 -2222
3883 -2222 396 2301 3386 2684 548 -1663 -3288 -2963 -1044 928 2685 3163 2098 -246 -2257 -3081
3899 -3081 -2337 -670 1545 2939 2946 1349 -934 -2703 -2907 -1887 92 2218 3081 2283 519 -1909 -2997
3916 -2997 -2966 -1252 788 2527 2944 1991 338 -2239 -3273 -2563 -730 1464 2826 2742 1470 -875 -2852
3933 -2852 -3343 -2053 395 2158 2654 2595 665 -1577 -2790 -2950 -1451 762 2618 3228 1747 -47
3949 -47 -2146 -2996 -2309 -635 1517 2831 2900 1548 -848 -2718 -2867 -1893 174 2127 3163 2342 698
3966 698 -1566 -2765 -2796 -1389 818 2487 2716 2187 -84 -2353 -3025 -2561 -816 1192 3046 3126 1374
3983 1374 -660 -2479 -3048 -1829 175 1793 3108 2672 542 -1252 -2641 -2655 -1318 320 2280 3005
3999 3005 1991 -17 -2173 -2880 -2276 -585 1227 2631 2382 1323 -442 -2444 -2822 -1724 -33 1797
4015 1797 2587 2662 756 -1196 -2564 -2814 -1414 526 2373 3285 2095 167 -1855 -2713 -2529 -773 1110
4032 1110 2531 2695 1217 -686 -2268 -2702 -2153 -181 1948 2977 2548 901 -1275 -2219 -2923 -1458
4048 -1458 603 2228 2769 2036 62 -1869 -3202 -2308 -766 1095 2406 2840 1589 -628 -1879 -2403
4064 -2403 -2531 -588 1818 2562 2376 883 -718 -2706 -2905 -1489 316 2023 3033 2023 309 -1613
4080 -1613 -2720 -2335 -1258 1332 2587 2850 1440 -439 -1977 -2944 -2142 173 1980 2731 2256 1043
4096 1043 -859 -2532 -2655 -1484 555 2323 2769 1774 368 -1621 -2786 -2359 -978 1007 2746 2775
4112 2775 1307 -477 -2279 -2574 -1983 -154 1570 2610 2435 1147 -1021 -2406 -2721 -1362 7 2110
4128 2110 2829 2169 276 -1868 -2531 -2645 -1035 1218 2308 2523 1688 -282 -2143 -2743 -2163 -285 1830
4145 1830 2496 2666 933 -812 -2284 -2749 -1597 336 1853 2679 1817 698 -1271 -2542 -2500 -532 859
4162 859 2343 2577 1468 -355 -2025 -2788 -2158 -361 1373 2665 2393 1154 -850 -2380 -3003 -1545
4178 -1545 106 2101 2183 2370 430 -1113 -2831 -2457 -1017 855 2147 2689 1428 -187 -1795 -2471
4194 -2471 -1895 -701 1438 2267 2218 1335 -669 -2197 -2268 -1461 288 1553 2339 2106 609 -1622 -2286 -2247
4212 -2247 -888 827 2224 2763 1625 -251 -1735 -2460 -2145 -636 1091 2575 2697 1047 -592 -2315
4228 -2315 -2444 -1741 76 1866 2542 1932 774 -1489 -2462 -2445 -1077 883 2248 2531 1661 14 -1775
4245 -1775 -2559 -2281 -693 1226 2216 2348 1168 -779 -2123 -2401 -1737 -90 1633 2669 1963 361 -1345
4262 -1345 -2201 -2317 -1335 564 1916 2360 1618 175 -1732 -2489 -1942 -417 1203 2162 2425 1140 -478
4279 -478 -1949 -2601 -1651 -3 1786 2414 2054 660 -903 -2033 -2269 -1001 694 2028 2365 1551 168
4296 168 -1547 -2457 -2131 -700 1188 2721 2052 1158 -388 -1772 -2274 -1621 -445 1285 2331 2047 675
4313 675 -1198 -2494 -2176 -1181 645 1923 2569 1930 162 -1548 -2485 -1798 -489 1109 1860 2234 1097
4330 1097 -524 -1968 -2299 -1601 215 1506 2189 1938 816 -969 -2399 -2225 -1516 837 2155 2128 1911
4347 1911 341 -1604 -2261 -2305 -573 1097 1836 2347 1152 -525 -1784 -2024 -1517 -112 1351 2226 2093
4364 2093 835 -597 -2214 -2008 -1205 210 1572 2352 1965 471 -1448 -2018 -1819 -365 747 2186
4380 2186 2370 1389 -445 -1645 -2226 -1766 -196 1412 2369 1902 1025 -1095 -2101 -1947 -1090 323 1658
4397 1658 2608 1758 352 -1296 -2004 -1987 -943 599 2080 2301 1432 -436 -1617 -2211 -1493 -282 1518
4414 1518 2211 2094 979 -613 -2031 -2136 -1593 292 1912 2417 1839 268 -1099 -2352 -1883 -696 923
4431 923 2035 2307 1126 -380 -1650 -2108 -1836 -678 1452 2293 1816 1135 -871 -1833 -2033 -1310 76
4448 76 1800 2364 1967 334 -1210 -1839 -2168 -1077 455 1869 2074 1184 -60 -1407 -2151 -1713 -518
4465 -518 1038 2152 2074 1020 -425 -1964 -2320 -1264 247 1330 2428 1650 530 -1035 -2157 -1954
4481 -1954 -1313 680 1826 1849 1410 278 -1352 -2153 -1364 -173 929 2032 1973 859 -371 -1939 -2193
4498 -2193 -1458 -197 1316 2282 2000 406 -1458 -1853 -1928 -1001 483 1444 2199 1647 -120 -1530 -1930 -1598
4516 -1598 -366 942 2010 1950 1122 -230 -1633 -1956 -1126 -122 1311 2035 1642 533 -1010 -2393 -2050
4533 -2050 -1125 386 1642 2273 1421 -27 -1405 -2021 -2034 -770 930 1950 1705 828 -389 -1833 -2109
4550 -2109 -1413 34 993 1914 1874 403 -911 -1781 -1709 -958 170 1915 2090 1489 -94 -1173 -1977 -2050
4568 -2050 -310 766 2056 1985 1279 -516 -1683 -1836 -1412 -542 1355 2155 1616 353 -992 -1689 -1682 -1104
4586 -1104 119 1434 2441 1557 78 -1086 -2039 -1506 -622 635 1614 2185 986 -105 -1622 -1923 -1430
4603 -1430 -185 1340 2166 1472 658 -847 -1635 -1565 -1085 210 1460 1857 1378 393 -1293 -1676 -1759 -713
4621 -713 461 1632 1804 917 -439 -1384 -1706 -1592 -253 1161 2135 1744 750 -750 -1639 -2030 -631 296
4639 296 1389 1759 1370 -127 -1445 -1699 -1800 -880 508 1953 1806 1086 -130 -1284 -1824 -1423 -121
4656 -121 973 1852 1494 755 -633 -1843 -1793 -1194 290 1332 1768 1163 -72 -1102 -1848 -1888 -608 489
4674 489 1521 1809 923 -49 -1205 -1803 -1301 -345 1070 1408 1890 695 -616 -1691 -1888 -1015 31 1684
4692 1684 1649 1415 420 -829 -1820 -1707 -552 734 1430 1794 1382 -314 -1449 -1789 -1690 -205 863 1721
4710 1721 1654 844 -533 -1599 -1853 -789 252 1340 1618 1338 439 -779 -1736 -1891 -757 583 1441
4727 1441 2058 848 -392 -1406 -1755 -1584 -622 939 1737 1753 544 -298 -1558 -1964 -1227 342 1390
4744 1390 1732 1503 215 -1038 -1786 -1447 -836 595 1439 1886 1247 -397 -1380 -1777 -1572 -402 817 1640
4762 1640 1699 725 -271 -1341 -1656 -1131 264 1157 1782 1504 313 -852 -1716 -1547 -985 461 1434 1948
4780 1948 866 214 -1070 -2021 -1638 -141 1063 1820 1771 771 -425 -1298 -1667 -1030 93 1154 2062
4797 2062 1546 291 -750 -1694 -1609 -833 481 1306 1885 1198 -65 -916 -1629 -1377 -213 954 1517 1517 748
4816 748 -246 -1471 -1334 -1409 -9 1265 1750 1502 390 -778 -1754 -1838 -1101 35 1871 1707 1340 128
4834 128 -1310 -1737 -1498 -495 660 1688 1719 1173 -488 -1317 -1638 -926 22 987 1653 1675 782 -847 -1543
4853 -1543 -1243 -1043 430 1410 1627 1011 257 -1096 -1794 -1248 -678 562 1756 1878 992 -99 -1273 -1837
4871 -1837 -1101 -10 1120 1653 1332 337 -657 -1432 -1912 -892 -9 1331 2005 1441 202 -744 -1649 -1480
4889 -1480 -208 895 1144 1609 760 -369 -1078 -1811 -1029 -364 965 1542 1608 481 -533 -1174 -1571 -927
4907 -927 528 1258 1764 1154 153 -845 -1454 -1608 -720 587 1625 1387 942 -144 -1211 -1475 -1411 -196
4925 -196 998 1925 1521 635 -548 -1297 -1588 -1089 169 1321 1741 1450 328 -1035 -1700 -1555 -620 405
4943 405 1240 1800 828 -355 -1318 -1588 -1308 -177 840 1513 1618 525 -568 -1809 -1374 -1024 219 1021
4961 1021 1830 1391 218 -818 -1777 -1307 -514 649 1517 2030 661 7 -1323 -1545 -1221 -385 997 1408
4979 1408 1295 715 -670 -1500 -1810 -968 -8 913 1576 1715 -183 -894 -1448 -1477 -966 566 1549 1702 974
4998 974 -29 -1035 -1569 -1509 -362 826 1260 1464 622 -49 -1235 -1539 -1255 180 939 1529 1581 115
5016 115 -918 -1916 -1573 -416 272 1244 1610 791 -36 -899 -1757 -1059 -224 573 1505 1381 740 -234 -1357
5035 -1357 -1619 -868 21 996 1576 1574 192 -646 -1332 -1418 -565 238 1314 1646 1061 48 -1162 -1568 -939
5054 -939 -400 931 1490 1477 686 -427 -1333 -1388 -923 -116 805 1387 1251 705 -522 -1382 -1002 -678 66 1305
5074 1305 1595 1011 -150 -1410 -1528 -1229 -440 664 1304 1337 720 -298 -1266 -1594 -866 110 1322 1678
5092 1678 1114 370 -497 -1139 -1548 -734 323 1071 1204 828 156 -601 -1329 -1385 -543 627 1183 1152 663 -174
5112 -174 -1349 -1406 -1056 -133 704 1459 1123 237 -542 -1520 -1532 -813 190 1265 1570 1116 168 -927 -1788
5131 -1788 -1291 -480 707 1578 1336 879 -282 -1014 -1547 -887 -102 1067 1393 1298 333 -557 -1108 -1627 -619
5150 -619 366 1146 1488 1090 1 -778 -1356 -1275 -539 697 1132 1398 1152 -134 -1246 -1331 -957 -397 951
5169 951 1353 1280 611 -668 -1108 -1621 -1054 141 1193 1597 1067 504 -797 -1135 -1275 -363 420 1277 1386
5188 1386 874 -191 -943 -1400 -1082 -449 749 1533 1138 640 -329 -1282 -1357 -758 309 645 1169 987 294
5207 294 -819 -1316 -1030 -627 471 1381 1673 642 -167 -1015 -1324 -1180 115 492 1268 1226 305 -534 -1301
5226 -1301 -1220 -781 142 1319 1551 1117 -11 -671 -1041 -1099 -398 487 1323 1284 595 4 -976 -1180 -1167 -335
5246 -335 578 1603 1107 569 -247 -1095 -913 -811 123 721 1146 1102 279 -615 -1355 -1270 -559 488 978 1475
5266 1475 851 -171 -1332 -1276 -1077 -290 951 1325 1128 459 -274 -938 -1423 -592 237 914 1133 900 321
5285 321 -378 -1446 -899 -682 168 1264 1505 997 -78 -882 -1214 -1077 -302 662 1381 1107 670 -205 -811
5304 -811 -1365 -855 -55 480 1271 702 300 -662 -1431 -1300 -515 161 1131 1302 889 -78 -794 -1387 -1122 -322
5324 -322 636 1233 1433 727 -327 -1407 -1112 -766 -149 1089 1160 1116 321 -679 -1336 -1203 -373 102 1003
5343 1003 1476 818 24 -991 -1217 -1002 -362 441 1153 1118 791 -101 -1072 -1291 -852 -228 907 1155 1090 321
5363 321 -819 -1047 -1075 -428 -69 1220 932 961 -50 -786 -1043 -919 -580 426 1185 1171 674 119 -880 -1150
5383 -1150 -1076 -386 739 901 815 461 -202 -1021 -1286 -585 232 923 1304 763 161 -640 -1291 -935 -549 457
5403 457 1010 1103 598 -263 -1022 -1382 -958 -130 822 1233 1186 384 -669 -1217 -1025 -574 389 980 1160 746
5423 746 -130 -761 -1196 -1045 -591 318 1207 1196 1026 148 -876 -1206 -671 -259 715 1136 865 405 -207 -1084
5443 -1084 -1244 -668 -83 1058 1417 643 204 -633 -1226 -1299 -421 838 986 1248 851 23 -771 -1269 -760
5462 -760 -298 296 1202 1228 370 -317 -876 -1149 -588 378 808 1005 844 159 -698 -779 -943 -410 348 665 1256
5483 1256 614 -27 -1080 -1478 -903 -47 718 1102 846 370 -147 -1305 -1366 -770 134 965 1288 898 245
5502 245 -661 -1147 -996 -820 599 838 1159 828 48 -599 -1285 -1011 -434 665 917 964 573 -214 -991 -1093
5522 -1093 -630 175 508 1152 846 186 -735 -1079 -1072 -362 298 852 1252 777 -25 -737 -1030 -887 -328 852
5542 852 1321 876 484 -454 -890 -1262 -771 261 901 1210 942 249 -516 -947 -1311 -323 479 1147 1116 997
5562 997 52 -677 -1068 -624 -467 499 960 986 409 -541 -1122 -1166 -733 -16 1065 1099 895 231 -415 -981 -952
5583 -952 -642 170 740 1064 1017 170 -656 -681 -996 -530 755 951 949 541 -175 -758 -1190 -819 63 596 1031
5604 1031 1098 133 -421 -903 -960 -293 229 932 1001 653 86 -720 -1215 -1097 -430 528 883 991 603 -87 -804
5625 -804 -1021 -426 -465 400 1393 1108 275 -496 -1149 -885 -848 83 950 1572 939 300 -825 -1128 -547 -267
5645 -267 352 955 1033 654 42 -868 -1016 -933 -34 763 1287 1100 640 -350 -942 -1009 -746 387 710 1057 658
5666 658 168 -587 -1356 -745 -222 539 1025 1298 794 72 -682 -1255 -912 -61 595 992 865 400 -489 -1086
5686 -1086 -1092 -1161 -5 838 946 587 80 -525 -963 -1091 -500 615 982 855 661 -154 -1065 -1060 -717 176 810
5707 810 1307 1220 459 -497 -794 -1294 -487 76 655 1148 683 29 -425 -1125 -1061 -582 139 680 921 587 -132
5728 -132 -885 -1264 -875 -324 615 803 914 410 -438 -887 -891 -750 213 979 1276 865 96 -658 -759 -1238 -504
5749 -504 93 889 1052 471 -55 -838 -1045 -1008 -70 626 824 830 551 -290 -796 -1062 -588 72 784 946 853
5770 853 484 -733 -1102 -647 -404 366 712 993 756 119 -771 -1031 -628 -166 566 1003 1075 435 -241 -592
5790 -592 -1018 -542 -128 986 1214 921 252 -745 -687 -393 -11 117 665 1077 671 8 -1032 -1230 -890 59
5810 59 462 949 1277 500 -255 -748 -809 -847 470 545 1033 775 117 -597 -881 -694 -533 216 776 1129 586
5831 586 80 -717 -1174 -1091 -401 565 1031 1094 399 -168 -684 -980 -613 -249 715 999 747 432 -424 -1217 -1191
5852 -1191 22 329 753 904 672 -76 -635 -1077 -886 -416 330 734 712 554 -276 -699 -786 -850 34 771
5872 771 1162 714 625 -227 -959 -1059 -441 359 775 1013 545 128 -756 -764 -1015 -451 335 1026 913 416 -370
5893 -370 -972 -1006 -546 -73 948 885 762 307 -465 -918 -1076 -456 106 602 1067 556 -24 -648 -1343 -619
5913 -619 -554 281 896 932 455 2 -663 -963 -682 -214 781 1067 807 308 -530 -661 -719 -465 -91 681 1218
5934 1218 927 308 -508 -911 -800 -360 536 655 949 724 -257 -762 -1012 -269 -64 504 900 966 624 -285
5954 -285 -880 -929 -599 83 631 920 790 205 -550 -978 -987 -169 529 794 868 661 -172 -1012 -1038 -731 -161 597
5976 597 735 891 60 -315 -1012 -758 -611 196 828 841 833 27 -529 -952 -782 -551 280 742 911 232 -26
5997 -26 -615 -922 -938 17 516 960 1003 478 -226 -967 -1174 -478 34 719 855 803 227 -524 -938 -803 -202
6018 -202 353 695 1061 466 -78 -732 -988 -1048 -210 810 722 1018 572 -349 -882 -1019 -332 19 565 1044
6038 1044 658 148 -521 -923 -1005 -373 248 742 733 675 54 -508 -768 -737 -224 42 1032 536 511 -222 -871 -1172
6060 -1172 -419 -51 802 875 602 -112 -250 -693 -728 -345 125 999 1121 414 96 -638 -889 -802 -173 415 942
6081 942 1026 393 87 -719 -766 -593 -41 437 1027 586 273 -283 -784 -971 -567 -36 670 996 468 247 -522
6102 -522 -950 -942 -253 321 992 812 218 -36 -1134 -901 -650 -98 533 890 643 231 -329 -705 -960 -357
6122 -357 347 715 917 774 29 -732 -990 -624 -184 430 715 923 492 -468 -732 -670 -641 -55 573 774 656
6143 656 507 -271 -991 -859 -641 416 553 1055 865 -28 -780 -981 -856 -188 302 1077 1006 317 -135 -807
6163 -807 -942 -822 44 704 955 1051 496 -444 -793 -1000 -479 237 626 920 495 412 -446 -984 -639 -239 -47
6184 -47 832 962 608 -246 -789 -680 -622 -110 767 1058 539 495 -311 -779 -1061 -290 221 510 771 760 45
6205 45 -490 -856 -788 -135 412 714 803 441 -312 -666 -732 -301 22 251 787 827 276 -450 -800 -687 -614 142
6227 142 907 945 805 246 -433 -1195 -581 -254 458 1001 739 238 91 -533 -603 -672 -6 241 1015 776 370
6248 370 -371 -840 -677 -540 -98 932 784 561 224 -561 -736 -538 -397 213 649 890 587 97 -888 -800
6268 -800 -695 -307 319 851 751 491 -107 -738 -855 -273 26 532 581 568 202 -439 -545 -875 -233 265 735
6289 735 738 662 -276 -548 -721 -761 -634 350 802 830 292 -294 -650 -754 -713 -112 406 795 800 22 -467 -677 -829
6312 -829 -405 86 707 760 352 150 -735 -993 -849 -349 34 953 927 340 -353 -478 -734 -575 -81 406 756
6333 756 676 326 -355 -812 -870 -591 -5 770 722 474 148 -402 -818 -460 -297 94 789 1054 548 -9 -597
6354 -597 -958 -586 62 634 823 823 366 -363 -701 -483 -513 111 696 721 325 -91 -312 -657 -839 -298 208
6375 208 705 916 247 -71 -521 -759 -757 -42 413 679 692 55 -307 -533 -727 -386 148 471 563 648 235 -393
6397 -393 -1032 -597 29 236 744 728 493 106 -391 -814 -751 -207 488 758 588 293 -303 -724 -752 -537 124
6418 124 924 803 666 -31 -371 -1001 -605 -415 93 888 796 480 -9 -419 -625 -779 -149 600 933 615
6438 615 242 -543 -779 -989 -395 285 792 575 486 -173 -546 -779 -803 -60 273 677 643 414 -90 -832 -1076
6459 -1076 -542 -40 398 947 529 329 -137 -792 -778 -235 4 401 596 514 210 -333 -683 -732 -418 514 870
6480 870 569 397 -110 -626 -639 -579 -271 337 517 735 136 -314 -292 -861 -596 -136 715 684 593 -146 -635 -613
6502 -613 -841 -410 404 671 676 446 117 -642 -537 -613 -239 516 801 689 533 -453 -747 -555 -255 134 547
6523 547 637 685 156 -403 -634 -933 -348 111 894 788 612 13 -649 -588 -613 -181 366 699 832 114 -325
6544 -325 -689 -792 -353 192 138 662 335 366 -400 -900 -802 -538 27 683 946 494 242 -731 -831 -614 -443
6565 -443 6 615 860 307 -398 -544 -528 -686 -68 273 563 619 156 -66 -708 -700 -256 219 576 604 347 93
6587 93 -451 -851 -505 1 474 411 696 348 -73 -570 -663 -283 145 285 690 656 423 -128 -626 -680 -117 560
6609 560 683 644 446 208 -492 -504 -851 -312 162 550 693 250 -287 -578 -661 -623 -205 357 648 443 33
6630 33 -302 -839 -241 -387 -12 621 957 574 87 -321 -518 -857 -209 523 599 863 526 -23 -556 -878 -616
6651 -616 -283 412 471 651 324 -206 -621 -1246 -508 74 589 657 613 -41 -389 -608 -524 -381 414 791 716 161
6673 161 -54 -389 -1115 -637 42 161 620 815 456 -174 -427 -592 -170 247 550 648 833 -62 -252 -817
6693 -817 -683 -420 558 456 824 343 -398 -528 -710 -619 62 634 532 640 79 -186 -626 -567 -255 141 635
6714 635 601 707 -50 -251 -628 -829 -247 462 437 592 424 149 -635 -721 -403 -160 647 318 690 -93 -149
6735 -149 -682 -566 -344 153 546 696 399 -86 -441 -920 -595 -339 439 411 464 291 -323 -576 -850 -545 83
6756 83 474 548 477 404 -166 -550 -639 -451 344 435 663 544 29 -372 -585 -831 -317 257 840 810 336 -148
6778 -148 -408 -774 -517 -75 450 840 628 211 -533 -897 -731 -328 -186 545 716 604 133 -368 -532 -956
6798 -956 -73 214 440 632 469 108 -607 -754 -676 -157 404 911 679 399 -375 -759 -938 -349 97 586
6818 586 818 539 11 -466 -840 -530 -409 -227 457 613 585 165 -477 -781 -317 59 211 558 672 709 100
6839 100 -768 -591 -218 -186 264 595 525 77 -479 -703 -505 -451 222 544 540 680 228 -397 -918 -140 27 270
6861 270 760 299 272 -195 -359 -874 -439 -510 254 780 585 208 -348 -810 -806 -251 -50 575 724 555 -23
6882 -23 -397 -710 -640 64 424 484 632 382 152 -451 -659 -643 317 586 563 769 288 -564 -808 -412 -533 86
6904 86 722 778 589 -247 -413 -773 -447 -7 157 841 698 251 157 -513 -518 -424 132 623 789 826 268 -279
6926 -279 -649 -812 -218 -84 833 664 776 -50 -489 -578 -644 -36 288 631 714 479 -56 -417 -582 -789 -128
6947 -128 342 555 454 464 -355 -696 -489 -394 -152 638 540 811 -321 -380 -798 -837 -290 530 757 506 433 -146
6969 -146 -494 -782 -743 97 610 825 467 255 -271 -835 -686 -428 152 399 834 558 103 -351 -432 -528 -220
6990 -220 -144 647 836 371 -37 -772 -391 -332 -227 461 771 811 68 -225 -702 -620 -703 10 538 675 538 -76
7012 -76 -473 -927 -801 -356 79 196 542 175 -131 -620 -743 -506 -101 321 551 525 192 -196 -595 -460 -364
7033 -364 55 288 701 465 258 -397 -707 -592 -143 98 638 562 355 -253 -480 -504 -522 -1 469 559 789
7054 789 193 -106 -841 -992 -406 123 650 678 564 233 -198 -619 -467 -281 410 388 536 374 247 -514 -646
7075 -646 -230 -56 418 749 616 409 -580 -581 -485 -430 86 685 896 643 116 -493 -531 -540 -60 205 589 676 421
7098 421 -145 -512 -693 -575 -256 330 398 606 379 -284 -476 -955 -593 -63 516 557 571 49 -220 -509 -556
7119 -556 30 7 484 593 430 7 -497 -603 -802 -308 406 684 552 337 -307 -552 -620 -366 63 481 630
7140 630 587 243 -278 -445 -335 -327 287 446 750 496 -15 -186 -700 -605 -292 287 589 394 297 -126 -759 -517
7162 -517 -532 115 211 819 727 170 -110 -863 -540 -321 204 591 601 756 98 -542 -481 -796 -416 314 817 551
7184 551 306 -108 -497 -709 -357 -67 406 647 449 237 21 -462 -789 21 97 563 524 619 105 -342 -400
7205 -400 -394 -247 183 823 507 498 -48 -299 -811 -351 -68 231 811 1000 407 -723 -554 -469 -501 175 514 620
7227 620 726 77 -445 -625 -421 -224 195 731 694 85 -43 -387 -576 -652 87 132 544 581 91 64 -525 -465
7249 -465 -293 -27 512 815 275 21 -294 -375 -420 -547 134 443 785 247 335 -496 -337 -395 23 306 937
7270 937 536 214 -247 -417 -821 -326 139 475 784 460 369 -299 -646 -733 -21 225 445 708 470 -146 -319
7291 -319 -404 -435 -158 174 761 550 344 -209 -1039 -671 -384 -184 514 374 263 -264 -336 -624 -436 -369 11
7312 11 407 468 385 -270 -321 -744 -602 -321 359 545 852 293 -26 -734 -262 -284 66 468 634 519 259 -539
7334 -539 -639 -633 -61 162 511 666 348 -68 -491 -339 -223 -243 358 479 267 471 -168 -712 -825 -349 -46
7355 -46 129 501 173 226 -126 -668 -512 -131 12 649 731 613 -319 -309 -661 -851 -80 150 477 764 382
7376 382 -283 -131 -621 -77 146 224 609 417 40 129 -332 -427 -326 -71 422 530 311 45 -278 -555 -456
7397 -456 -151 470 750 505 181 -270 -349 -626 -452 -132 511 315 707 260 -185 -507 -479 -258 136 453 712
7418 712 292 241 -215 -611 -520 -193 555 845 869 354 98 -432 -583 -263 -65 204 653 107 -79 -295 -775
7439 -775 -694 -206 127 427 652 383 1 -218 -414 -514 -24 393 725 438 290 -180 -447 -307 -701 118
7459 118 348 766 327 189 -121 -662 -668 -303 64 402 558 459 418 -291 -564 -691 -315 88 336 486 631
7480 631 -313 -362 -346 -604 147 529 578 583 329 -299 -524 -838 -330 186 448 501 451 221 -219 -576 -613 -278 350
7503 350 816 571 216 -61 -355 -825 -391 124 305 477 389 290 -201 -970 -501 -269 106 303 446 177 -81
7524 -81 -530 -618 -315 -413 500 396 508 591 -85 -435 -659 -470 -216 315 188 679 129 -220 -921 -518 -276
7545 -276 318 711 508 343 259 -294 -725 -306 -197 -2 541 707 93 82 -462 -439 -453 -106 467 320 453
7566 453 315 -164 -293 -606 -415 -193 547 540 457 95 -244 -574 -396 -401 250 521 519 273 28 -348 -699 -571
7588 -571 53 70 461 330 80 -163 -443 -453 -872 118 685 403 345 219 -354 -525 -657 -42 201 601 649
7609 649 408 -134 -289 -603 -494 -191 337 369 346 462 -146 -299 -596 -581 90 407 513 605 228 -207 -660
7630 -660 -451 -75 323 618 181 305 -122 -367 -821 -397 -225 414 399 562 249 -257 -467 -775 -358 -138
7650 -138 346 632 397 70 -508 -711 -543 -118 327 371 475 132 182 -588 -673 -504 -76 238 420 410 117
7671 117 -201 -187 -816 -366 -40 366 673 552 30 -194 -404 -610 -329 82 458 306 286 -28 -507 -775 -669
7692 -669 -152 93 463 504 219 -390 -698 -366 -150 367 256 291 416 -14 -171 -621 -517 -153 -8 780 774
7713 774 314 -192 -556 -531 -472 -122 171 625 336 85 -401 -539 -431 -514 55 762 444 601 232 -226 -577
7734 -577 -674 -283 198 494 650 265 -167 -325 -430 -441 27 214 510 440 462 -185 -584 -278 -638 -33 496
7755 496 756 598 235 -67 -644 -581 -520 -51 326 420 201 -236 -408 -644 -274 23 211 456 212 395 13
7776 13 -372 -641 -422 231 345 603 365 421 -186 -325 -398 -139 24 596 518 418 296 -541 -448 -372 -215 211
7798 211 726 468 352 -45 -229 -683 -622 -382 455 550 197 250 -2 -244 -269 -88 115 331 406 243 30 -413
7820 -413 -519 -633 -225 236 491 444 93 36 -624 -507 -397 -163 401 633 397 213 -284 -293 -580 -139 -79 283
7842 283 665 520 162 -170 -449 -367 -133 289 847 514 -19 -450 -407 -726 -436 103 464 606 424 135 -92
7863 -92 -354 -523 -185 -2 305 594 458 -217 -73 -375 -215 -259 33 650 541 114 -32 -382 -814 -380 84
7884 84 149 370 204 317 -234 -217 -368 -140 40 54 617 452 86 26 -657 -338 -123 346 458 265 204 -88
7906 -88 -419 -545 -645 -199 304 657 351 193 -422 -255 -479 -480 88 71 784 282 -126 -126 -827 -329 -254 230
7928 230 220 607 202 -183 -15 -362 -291 -189 221 585 132 301 -178 -479 -717 -79 293 144 459 301 183
7949 183 -281 -560 -213 -390 536 577 667 471 74 -156 -376 -154 37 311 528 472 394 -180 -350 -356 -323 64
7971 64 305 881 457 247 -146 -583 -525 -336 -41 485 465 126 -209 45 -340 -623 -202 83 297 386 36
7992 36 -309 -516 -662 -392 349 404 443 97 227 -242 -389 -521 -426 11 376 590 589 -53 -377 -455 -120 -234
8014 -234 295 478 478 51 -136 -667 -406 -84 -183 243 371 277 -11 -16 -619 -359 -413 388 242 449 82 -216
8036 -216 -208 -421 -221 -110 481 475 714 141 -17 -292 -537 -267 58 313 605 116 -248 -102 -515 -530 -309 -42
8058 -42 373 841 79 12 -169 -560 -508 -62 561 357 469 458 -175 -323 -545 -216 -136 538 258 299 326 -343
8080 -343 -573 -509 -134 165 353 628 113 -99 -346 -422 -783 -349 50 483 476 68 17 -296 -632 -441 -105 379
8102 379 632 558 204 -98 -428 -645 -258 -141 395 345 574 559 -390 -459 -443 -301 337 276 348 39 58 -544 -454
8125 -454 -370 40 62 341 338 -277 -160 -314 -448 -158 221 426 281 59 -192 -386 -705 -292 61 238 372
8146 372 613 332 -32 -288 -635 -273 -118 153 126 796 207 -359 -392 -403 -350 276 228 561 380 -127 -266 -365
8168 -365 -524 -273 31 472 465 368 198 -186 -497 -241 -206 102 721 486 316 -77 -537 -293 -606 -109 550
8189 550 741 528
8191E28
$$ Imaginary data points
##PAGE= N=2
##DATA TABLE= (X++(I..I)), XYDATA
0 0 0 0 0 0 0 0 0 0 -6 7 -8 8 -8 8 -16 16 -18 24 -25 32 -35 42 -49 54 -63 72 -82 94 -104 118 -134 149
32 149 -166 185 -208 231 -256 283 -316 349 -386 428 -472 524 -581 645 -717 804 -901 1012 -1148
51 -1148 1316 -1522 1790 -2148 2658 -3433 4750 -7395 14766 -76238 -259633 -39623 92222
64 92222 -26641 -39550 132064 125670 -33040 -70796 -36231 -87742 -75929 53074 105958 55264
76 55264 50061 23400 -90745 -118806 -16765 7211 -18101 86098 160310 4444 -125426
87 -125426 -25070 22569 -115388 -100597 128732 183493 9804 -55610 -4329 -57230 -112052
98 -112052 -11858 64503 20862 43929 119107 27662 -132156 -108776 -3867 -5018 3496 96587
110 96587 99636 -6211 -37742 -24646 -86492 -95849 34838 102300 34960 25771 69589 -18762
122 -18762 -136578 -79502 21917 8944 27975 123422 77289 -81794 -83140 15243 -34330 -109019
134 -109019 17483 159652 89373 -31387 -32153 -32980 -84083 -56385 29148 49392 48268 76352
146 76352 35474 -67780 -83226 -31553 -34106 -18946 83868 115742 12067 -41851 -6722 -47744
158 -47744 -116260 -28202 107072 77374 -5536 27257 45152 -61832 -123346 -42699 34154 42908
170 42908 64732 73063 2875 -59220 -47508 -41569 -54554 3015 85112 75448 20780 5170 -27082
183 -27082 -91144 -74862 15978 47702 31219 59072 66637 -23492 -93882 -54979 -11164 -16865
195 -16865 20335 88963 71517 -6098 -35908 -42718 -73639 -52801 37095 78658 43639 23858
207 23858 20391 -31067 -83413 -59588 -3979 26595 56415 74899 32002 -33414 -51382 -47182
219 -47182 -50866 -15681 56230 76700 35887 8696 -9221 -57907 -81577 -28352 33996 45312
231 45312 47803 55062 14293 -56452 -73850 -38305 -9066 15692 55026 68443 30723 -17613
243 -17613 -47404 -62628 -49250 682 47462 57632 46696 22243 -24048 -64614 -58559 -22056
255 -22056 9804 41042 66353 50297 -3425 -44932 -53533 -47360 -24611 23288 63235 58788 23659
268 23659 -11601 -42071 -60418 -46067 -2891 39790 59120 49713 17291 -24047 -53149 -56645
280 -56645 -32427 10751 49324 58600 38723 4298 -32984 -58022 -53537 -17054 25700 52496
292 52496 53835 30497 -8388 -44813 -58452 -42737 -3566 36615 55241 46301 19399 -19064
304 -19064 -54254 -59120 -27121 12746 39727 53080 45986 7226 -39097 -56112 -43921 -18975
316 -18975 16814 52373 57577 26665 -10421 -38478 -54971 -45021 -3822 36315 50854 45635 22873
329 22873 -19188 -54817 -52239 -24460 4782 36342 59550 43917 -1270 -33837 -44514 -47010
341 -47010 -27352 21566 56502 48006 22406 -1483 -34783 -60087 -42848 1300 30820 44590
353 44590 48899 24309 -23421 -50688 -44722 -27869 -480 40448 59068 35236 560 -22968
365 -22968 -46290 -54351 -20141 27492 44610 40547 32888 3150 -43271 -58678 -32093 -1422 21414
378 21414 47448 52387 17299 -23386 -40262 -44297 -36106 2027 44910 51344 30188 8053 -20055
391 -20055 -51562 -50427 -13283 20497 36186 46610 36840 -5193 -43557 -46334 -31753 -12267 22453
404 22453 53514 46102 12077 -15434 -35647 -49998 -34691 8495 39056 42018 35514 15316 -25094
417 -25094 -53904 -42451 -12376 12317 36616 50894 31313 -8477 -34294 -42156 -38757 -13249
429 -13249 28198 49080 37922 16615 -8183 -39169 -52213 -28550 8893 31685 41752 38865
441 38865 11473 -26714 -45275 -39519 -20165 10032 41699 48886 24844 -5352 -28003 -44231
453 -44231 -40385 -9051 27015 42609 38365 21179 -9752 -41069 -47039 -25586 3603 28157 43665
466 43665 38711 10075 -24356 -44048 -40253 -18111 13270 36660 41502 28355 2223 -29835 -48280
479 -48280 -37409 -5508 24663 39077 37424 21053 -8322 -37367 -46211 -28219 2849 30158
491 30158 42196 34983 10142 -21242 -40779 -39093 -19674 8736 35831 46014 28600 -3545
503 -3545 -30590 -41124 -33269 -9511 18444 36943 40322 24573 -9264 -42078 -45294 -20817 4483
516 4483 21390 37351 40153 14023 -24000 -42702 -37228 -17932 10239 35219 39168 24953 3181
529 3181 -22384 -45189 -39681 -7119 23459 35726 36911 22223 -11017 -37280 -35531 -22410 -8361
542 -8361 19993 49351 41863 2854 -25941 -32166 -32772 -22180 6236 33029 40067 29739 4430
555 4430 -30351 -45853 -27107 -3239 9700 28672 46080 27321 -16069 -37895 -33296 -25369 -6519
568 -6519 27638 44320 26399 4683 -7600 -29650 -46144 -26659 14285 36271 36602 25653 728
581 728 -27511 -34349 -26388 -17034 7353 43053 46884 11693 -16766 -22249 -31272 -35729 -6410 31999
595 31999 38859 26210 13877 -11562 -42390 -39423 -8320 9960 17544 35341 37862 4811 -30814
608 -30814 -37637 -30191 -13834 17535 40893 31188 10197 -128 -19254 -43538 -34675 3255 27485
621 27485 30991 32231 17254 -18807 -39622 -28582 -14910 -3566 26200 48605 26949 -10295
633 -10295 -21881 -23016 -32905 -22397 15996 39767 33073 17821 -1710 -30777 -42530 -20647 4698
646 4698 15805 27905 36452 16443 -17322 -33128 -32236 -23671 2832 35224 38196 16936 1813
659 1813 -11868 -35748 -39652 -8623 21124 26535 28160 26062 -981 -33887 -36967 -18936 -5659
672 -5659 13660 39239 37905 5531 -20419 -25057 -27118 -23547 -428 27852 36350 26397 5690
685 5690 -21891 -37346 -28028 -7613 8850 27876 38948 20439 -11795 -25175 -24897 -27308 -14950
698 -14950 21435 44030 27943 2646 -8965 -21745 -37274 -26512 8316 31794 30005 19388
710 19388 6541 -13730 -32137 -33479 -14675 13380 33241 32124 15247 -2968 -19783 -34758
722 -34758 -30630 -2288 24885 29453 22669 15278 -4018 -30843 -39063 -18367 8542 23538 29752
735 29752 25873 6677 -19087 -33335 -28156 -10446 9550 26294 32126 21631 -2426 -25445 -33017
748 -33017 -23675 -4640 16362 31823 30108 11144 -11191 -26483 -31246 -21237 3047 25418 31001
761 31001 22382 7258 -14152 -32548 -32475 -11159 13421 27665 28946 17733 -1577 -20178 -31357
774 -31357 -27870 -6377 20943 31634 23572 11777 -4021 -27311 -37099 -17885 8926 19890 24530
787 24530 27926 12059 -20501 -35853 -24205 -8120 4499 22542 34118 21633 -3443 -22662
799 -22662 -31176 -25020 -3676 17972 25057 25436 18874 -6079 -32770 -31668 -11762 1134 13430
812 13430 32502 31951 1624 -22141 -22521 -22349 -20745 4509 33432 31311 11184 -363 -13824 -32327
826 -32327 -29023 -2133 17066 22336 28183 19923 -10554 -31265 -24970 -14176 -5709 17565 36708
839 36708 24434 -894 -11171 -21195 -33153 -18810 15556 27859 19798 18647 9497 -21889 -38492
852 -38492 -18796 1701 6672 20783 35685 16993 -16159 -24174 -19937 -21936 -7254 24313 33936
865 33936 16843 4402 -5318 -27780 -35105 -9420 14220 16635 22946 27996 3278 -28552 -27943
878 -27943 -14119 -11063 4915 33873 33190 3539 -10865 -12072 -26704 -30314 1447 28225 22539
891 22539 15671 15289 -7667 -35770 -27661 -2734 3925 12220 33132 28272 -6934 -24774 -18539 -19995
905 -19995 -16390 12751 33738 21380 7141 2849 -17758 -38889 -20680 11715 16437 15057 27114
918 27114 18088 -18565 -32911 -16669 -9747 -5606 21317 38209 15736 -9371 -10902 -17872 -31099
931 -31099 -13728 20539 27332 17086 15539 2027 -27158 -31881 -9602 955 4849 26228 35797
944 35797 5626 -23159 -19857 -15865 -20651 -1247 29606 28465 8930 3400 -6331 -30964 -31897 -72
958 -72 17316 14895 21411 23703 -4130 -29511 -23157 -11461 -8360 10930 34839 24299 -2868 -9370
972 -9370 -11869 -28640 -24799 9479 28459 19126 14412 9749 -15709 -33844 -17990 404 2762
985 2762 15586 34041 19658 -13844 -22475 -15685 -19071 -11212 19140 32035 16054 3676 -1440
998 -1440 -21007 -33804 -12503 12875 15367 16860 24127 8861 -21250 -27871 -15190 -8921 2374
1011 2374 26994 30498 6192 -8962 -10243 -21075 -27942 -4274 23031 22795 14534 12379 -3753
1024 -3753 -28159 -27044 -6096 3983 10866 26186 25697 -873 -19866 -18058 -17551 -15286 6866 27901
1038 27901 23223 8675 514 -14301 -30116 -20212 4630 14324 15401 22235 16241 -10587 -26794
1051 -26794 -19253 -10227 -3366 16137 30845 17859 -3464 -11584 -17295 -24323 -13281 12159 23248
1064 23248 17932 13424 2654 -18708 -27617 -15370 -875 9087 22087 26387 8144 -12978 -18085
1077 -18085 -17170 -17096 -2173 20731 26309 13898 2857 -8034 -23462 -25375 -6652 11167 16821
1090 16821 19873 17447 -509 -20404 -22837 -14204 -5105 8625 24238 23684 6597 -8567 -17327
1103 -17327 -22704 -16428 3130 18683 20703 16118 6480 -11056 -24396 -20356 -7087 5263 17399
1116 17399 25110 15619 -5317 -17333 -18538 -16999 -7978 11401 24938 20199 6135 -5723 -16659
1129 -16659 -22949 -15696 1742 16317 22019 18027 3922 -12545 -20584 -18494 -10130 4489 20142
1142 20142 23465 12489 -2399 -12946 -20737 -20111 -5335 13627 21590 17731 8582 -4346 -17691
1155 -17691 -22837 -14078 1312 15076 21321 17295 4280 -10498 -19709 -20259 -10371 6184 19361
1168 19361 20843 12216 156 -12984 -21719 -18941 -4520 11517 20554 18730 8958 -4808 -17196
1181 -17196 -21223 -15027 442 15785 21690 15757 4112 -8841 -18840 -21209 -11019 6715 19275
1194 19275 19756 12385 571 -12304 -21474 -18936 -4409 11247 19010 17769 10014 -2905 -17628
1207 -17628 -23365 -14058 3226 14793 17467 15441 7927 -7159 -21837 -22231 -8095 8213 16012
1220 16012 17326 13550 3002 -13290 -22901 -17743 -2820 10170 17011 18153 11298 -3775 -17894
1233 -17894 -21027 -12226 361 11958 19751 18843 5696 -11389 -20059 -17185 -7515 3009 13764
1246 13764 20387 16243 1134 -15877 -21264 -14517 -2794 7707 15890 19003 11750 -4037 -17690
1259 -17690 -20891 -12645 1108 12498 18542 16131 6005 -7950 -18720 -19321 -9642 4273 15999
1272 15999 19648 13405 72 -12560 -18463 -15359 -6122 6226 17938 20979 11161 -6317 -17799
1285 -17799 -17183 -10455 -1897 8376 19083 20118 6244 -11382 -19336 -15894 -8038 1913 13429 19890
1299 19890 14876 931 -12424 -19299 -15877 -5001 8230 17176 18147 9582 -4247 -14103 -17620 -14397
1313 -14397 -3914 12423 22286 15825 1550 -8113 -12701 -16929 -13944 1885 17600 20003 11582
1326 11582 553 -10874 -18157 -15922 -5314 6055 16154 19176 11214 -4715 -16001 -17589 -12531
1339 -12531 -1763 11209 17758 14642 6616 -4866 -17367 -21261 -9315 6196 14073 15518 13798
1352 13798 3482 -11356 -18679 -14671 -6714 5334 17603 19494 7830 -5059 -11601 -15892 -15870 -3519
1366 -3519 13071 18737 14538 5699 -6027 -17153 -16842 -8108 1577 10765 19314 16298 388 -12828
1380 -12828 -15570 -14064 -8085 6816 18291 15846 6928 346 -10123 -20708 -16396 1146 12460
1393 12460 14047 14305 9457 -6143 -18717 -16395 -7766 927 12060 19598 12889 -591 -9105 -14353
1407 -14353 -17073 -8521 8640 16659 14247 9888 289 -14739 -20294 -10022 690 5816 14377 19346
1421 19346 7804 -9939 -15553 -13193 -11031 -1290 15232 19736 9960 388 -6337 -15780 -18186 -5602
1435 -5602 8424 13139 14779 12683 -602 -15907 -17087 -9877 -3572 6895 19002 16935 2651
1448 2651 -6831 -10527 -16303 -13867 2513 15664 14509 10206 6048 -7193 -20716 -16445 -1569 5673
1462 5673 10185 17293 13317 -3760 -14434 -13660 -11672 -6312 8850 20056 14031 3155 -3707 -12846
1476 -12846 -18736 -10563 4863 10954 12978 14949 5912 -12196 -17872 -10813 -5398 429 13847 21245
1490 21245 9147 -5955 -10389 -12944 -15039 -4844 11452 16586 11511 7214 -1350 -15213 -19107
1503 -19107 -8027 2977 9189 15612 15730 1729 -11279 -13095 -12098 -9943 2732 17671 16827 5966
1517 5966 -550 -7868 -17324 -15941 -832 10289 12468 13603 9753 -4801 -16805 -13805 -6770 -2028
1531 -2028 8428 19107 14746 -281 -8644 -11965 -15262 -9130 6126 15749 13016 8325 2222 -10066
1545 -10066 -18254 -12285 -1222 6705 13575 16696 7176 -6831 -12698 -12210 -11743 -2412 13307 18149
1559 18149 9097 834 -4010 -12825 -18354 -7986 7420 13245 12538 10448 1397 -11934 -16236 -10726
1573 -10726 -3190 5933 15020 15221 5366 -4417 -10589 -15095 -12489 928 13194 13544 9853 5595 -4998
1588 -4998 -16442 -15903 -4251 4959 10242 14467 12154 -238 -11335 -14159 -11543 -4721 7216 15577
1602 15577 13186 5676 -2383 -11371 -16442 -10700 2161 10233 12250 12535 5722 -7372 -15392 -13417
1616 -13417 -5811 2879 11656 15473 9760 -808 -9084 -14022 -13068 -4222 7903 13785 12512 7574
1630 7574 -2077 -12608 -15859 -8804 1124 7996 13346 12938 4447 -7472 -14103 -13199 -6440 2838 11357
1645 11357 14461 10075 954 -9357 -15523 -11992 -2836 6599 11797 13462 8164 -2801 -12411 -14346
1659 -14346 -9253 -154 8663 13929 12408 4031 -6455 -13003 -13256 -7000 2135 11080 14517 10338 134
1674 134 -9438 -13492 -11101 -4483 5561 13400 13744 7015 -3029 -11157 -13753 -9056 -481 8136 13348
1689 13348 12552 4589 -6538 -13522 -12362 -6625 1522 10721 14602 10066 306 -8101 -13266 -12537 -4370
1704 -4370 6534 12806 12369 7365 -1087 -11257 -14570 -9172 -487 7599 13208 12770 3779 -6866 -11368
1719 -11368 -12011 -8295 1361 11592 14149 8237 720 -7007 -13610 -12523 -3602 5815 10832 13231 9162
1734 9162 -2759 -12568 -12385 -7821 -2047 6689 14437 12654 2835 -5418 -10654 -13520 -8632 3044 11170
1749 11170 11762 9237 3129 -7377 -14902 -11172 -2999 4067 10815 14198 7799 -3510 -9710 -11014
1763 -11014 -10546 -3667 9198 15286 9762 2507 -3079 -10653 -14163 -7498 3163 9351 11773 10957 2119
1778 2119 -9575 -13340 -9368 -4401 2423 11954 14148 6376 -2788 -8640 -12617 -11382 -677 8979
1792 8979 10895 9596 6864 -3020 -14041 -13826 -4508 2505 7218 12555 11299 889 -8113 -10697 -10822
1807 -10822 -7203 3922 14244 12762 4854 -1111 -7689 -13453 -10409 -476 6763 11084 12319 6044
1821 6044 -6246 -12617 -9847 -6128 -1315 8373 15360 10001 -99 -6570 -10508 -12126 -5488 6404
1835 6404 11177 9824 7787 1698 -9767 -15088 -8497 138 5491 11067 12620 4651 -5287 -9812 -10440
1850 -10440 -9317 -513 11016 13442 7477 1066 -4688 -11494 -12521 -4911 4532 9880 12225 8817
1864 8817 -1515 -10862 -10818 -7172 -3632 4499 13534 12870 3378 -4729 -9028 -11600 -8899 954 10244
1879 10244 10755 8313 3519 -5344 -13250 -11579 -3440 3938 9622 12169 7434 -1810 -7704 -10905 -10416
1894 -10416 -4299 7987 13386 9260 2895 -1836 -8645 -13233 -8278 1953 8510 10830 10153 3153
1908 3153 -6942 -11898 -9516 -4676 2280 10128 12778 6917 -1340 -7722 -11454 -10229 -2129 6959 10734
1923 10734 9671 5873 -1983 -10865 -13064 -6417 1616 7257 11177 9660 1886 -5821 -10405 -10688 -6330
1938 -6330 2843 10979 11785 6067 106 -6833 -12142 -9981 -1782 6161 10019 10071 5888 -2825 -10524 -11118
1954 -11118 -6554 188 7390 11851 9718 2394 -5969 -11298 -10524 -4846 3380 8963 10556 8068 1144
1969 1144 -7984 -12690 -9006 -1835 4981 10046 11177 5585 -3479 -9379 -10661 -7474 -1167 7011 11543
1984 11543 9537 2170 -5369 -10315 -10354 -5390 2530 9576 11259 7597 -115 -7724 -10544 -8565 -3453
1999 -3453 4343 10904 11114 4934 -3112 -8906 -10909 -7845 202 7799 10924 8390 2669 -4366 -9943
2014 -9943 -10646 -5696 2750 9209 10732 7313 173 -7062 -11095 -8907 -2452 4663 9737 10032 5390
2029 5390 -2072 -8693 -10965 -8027 -530 7241 11135 8920 2745 -4594 -10182 -9882 -5112 2160 8271
2044 8271 10577 7583 534 -6526 -10647 -8940 -3308 4927 10144 10358 4769 -2189 -7968 -10323 -7761
2059 -7761 -799 7057 10396 8704 2986 -3761 -10287 -11006 -5240 3152 8747 9859 6806 764 -6288
2074 -6288 -10575 -9412 -3226 4909 9560 9803 5402 -1392 -8709 -11310 -7145 -23 6389 9854 8876
2089 8876 3865 -4273 -10293 -9608 -4728 1344 7475 10787 8184 766 -6926 -10349 -8498 -2742 3898
2104 3898 8685 9987 5690 -1341 -8147 -10523 -7306 -565 6455 9874 9081 3038 -4060 -9034 -9666
2119 -9666 -5992 1494 8399 10498 7077 456 -5793 -9458 -9011 -3800 3881 9518 9809 5186 -2124
2134 -2124 -7760 -9702 -7018 -1110 5463 9521 9347 3951 -3792 -9924 -10117 -4894 2125 7069 9160
2149 9160 7533 1559 -5795 -10175 -8882 -3292 3941 8920 9100 5247 -973 -6947 -10223 -7786 -704
2164 -704 6152 9564 8782 3333 -3860 -8433 -9185 -5536 295 6998 11017 7509 382 -5991 -8829 -8319
2180 -8319 -3698 3580 8463 9427 6080 -446 -7729 -10685 -6662 -390 4976 8304 8454 4593 -3217
2195 -3217 -8942 -9657 -5628 1411 7654 9414 6570 1449 -4249 -9676 -9842 -3405 3911 8099 9129
2210 9129 5696 -1209 -7796 -9146 -6587 -2165 3903 10277 9981 2861 -4479 -7964 -8342 -5854 652
2225 652 6798 9224 7825 1928 -5909 -10413 -8050 -2078 2159 6967 9810 6779 -1336 -7751 -8842
2240 -8842 -6964 -2234 5007 9840 7596 2757 -1691 -7093 -10271 -6477 1668 7415 8947 7655 1752
2255 1752 -5826 -8929 -7381 -3784 1106 8659 10679 5171 -2298 -6087 -7705 -7494 -2705 5497 9125
2270 9125 7599 3781 -2345 -8681 -9332 -4367 671 4840 9075 8652 1450 -6207 -8239 -7443 -4911 2326
2286 2326 9151 9181 3896 -196 -4475 -9474 -9179 -1099 6209 7972 7774 4360 -2742 -8436 -8236 -5050
2302 -5050 -794 5857 10824 7320 -192 -4494 -6671 -8657 -5543 3047 8934 7677 4745 848 -6089
2317 -6089 -10664 -6840 -564 3383 7630 9459 4698 -3488 -7563 -7404 -6179 -842 7087 9767 5569
2332 5569 1217 -2443 -7820 -10207 -3914 4261 7031 7131 6086 918 -6664 -8856 -6173 -2429 3274
2347 3274 9405 9136 2241 -3043 -5516 -8035 -7715 23 7679 8433 5444 2915 -3158 -9450 -8662 -2220
2363 -2220 2191 5680 8715 7332 -571 -6772 -7835 -6755 -3375 3950 9372 7549 2562 -848 -6328
2378 -6328 -10427 -6467 2032 6145 6431 6859 4164 -4073 -9133 -7358 -3293 1116 6912 9527 5244
2393 5244 -1155 -4836 -7312 -8287 -3099 5202 8335 6206 4153 -356 -7676 -9677 -4481 785 4250
2408 4250 7861 8583 2397 -5278 -7770 -6977 -4552 1172 7475 8841 4803 359 -4370 -9073 -8150 -845
2424 -845 4640 6228 6973 5835 -1307 -8061 -8417 -4557 -875 4152 9182 7586 1187 -3925 -6426 -8055
2440 -8055 -5335 2142 7370 7500 5212 1552 -4996 -9156 -6864 -1274 2968 6570 8472 4836 -2597
2455 -2597 -6882 -7107 -5392 -1345 5105 8688 6414 2035 -2685 -7130 -8782 -3959 2392 5820 7281
2470 7281 6360 1166 -5962 -8525 -5675 -2255 2025 7418 8554 3867 -2182 -6073 -7548 -6276 -648
2485 -648 5658 7970 6289 2943 -2912 -8033 -7738 -3611 1682 5138 8084 6451 196 -5458 -7381
2500 -7381 -6327 -2978 2752 8074 7960 3192 -977 -5526 -8170 -6061 -77 5086 7333 6410 3033
2515 3033 -3155 -7455 -7235 -4001 596 6029 8618 5659 106 -4613 -7408 -7154 -2655 3431 7411
2530 7411 6911 4459 -681 -6058 -8294 -5735 -485 4353 7257 6963 2603 -3162 -6804 -7003 -4446 945
2546 945 6264 7890 5744 576 -4457 -7584 -7006 -2677 3199 6963 7380 4406 -1008 -6187 -7372 -5296
2562 -5296 -1294 4093 7599 6771 2512 -2738 -7014 -7480 -3996 976 5844 7253 5579 1210 -4219
2577 -4219 -7494 -6789 -2632 2710 6460 7505 4211 -930 -5553 -7354 -5758 -1227 4323 7369 6552
2592 6552 2843 -2571 -6684 -7365 -4687 748 5800 7468 5744 603 -4419 -7083 -6399 -2796 2599
2607 2599 6574 7007 4195 -284 -5363 -7424 -5608 -798 3688 7172 6699 2775 -2601 -6344 -7009 -4722
2623 -4722 300 5755 7315 5572 878 -3757 -7348 -7133 -2923 2658 6401 6889 4322 -499 -5661
2638 -5661 -7123 -5507 -1161 3590 6854 6694 2711 -2059 -6064 -7209 -4558 557 5333 6876 5556
2653 5556 1417 -3719 -7039 -6511 -2598 2113 5982 7294 4582 -641 -5440 -7105 -5554 -1490 3779
2668 3779 7407 6368 2577 -1856 -5741 -7028 -4269 863 4875 6932 5744 1727 -4007 -7055 -6144
2683 -6144 -2805 1650 5938 7286 4519 -414 -4909 -6854 -5807 -1253 3931 6623 6425 2935 -1878
2698 -1878 -5976 -7011 -4324 349 4556 7230 5927 1697 -3594 -6351 -6210 -3202 1424 6062 7280
2713 7280 4168 -559 -4613 -6604 -5412 -1672 3320 6364 6638 3332 -1955 -5857 -6761 -4374 -72
2728 -72 4837 6994 5381 1175 -3098 -5939 -6477 -3561 1779 6039 6810 4123 212 -4225 -6939 -5623
2744 -5623 -1394 3627 6460 6020 3025 -1573 -5100 -6426 -4939 -148 4685 7093 5158 1503 -3089
2759 -3089 -6050 -6506 -3164 1952 5721 6455 4589 247 -4643 -6619 -5467 -1371 2889 6300 6610 3199
2775 3199 -1684 -5276 -6547 -4451 -122 4713 6558 5577 1532 -2930 -5945 -6373 -3254 1468 5309
2790 5309 6348 4536 169 -4284 -6208 -5314 -1701 2805 6254 6210 3271 -1619 -5383 -6585 -4642 -138
2806 -138 4576 6486 5325 1598 -2621 -5913 -6499 -2983 1484 4969 6355 4526 433 -4339 -6615
2821 -6615 -5352 -1771 2950 5646 6235 3274 -1289 -5027 -6669 -4550 -252 4079 6181 5207 1997
2836 1997 -2726 -6179 -6080 -3198 844 4794 6360 4318 179 -4318 -6135 -5525 -1988 2779 6069 5989
2852 5989 2826 -1151 -4667 -6456 -4619 -79 4079 5830 5428 2273 -2803 -5672 -5925 -3021 1065
2867 1065 4489 6499 4373 81 -3948 -5904 -5320 -2197 2772 5581 5328 3515 -788 -4895 -6794
2882 -6794 -4402 -248 3635 5879 5186 2355 -2518 -5577 -5750 -3316 619 5142 6055 4041 632 -3697
2898 -3697 -5886 -5572 -1733 2404 5535 5697 3319 -748 -4984 -5915 -4360 -920 3311 6292 5639 1460
2914 1460 -2571 -5648 -5766 -3588 944 5042 5824 4222 836 -3366 -6115 -5585 -1681 2415 4886 5950
2930 5950 3322 -1086 -4523 -5728 -4235 -896 3475 6099 4989 2126 -1797 -5456 -6120 -3193 1120
2945 1120 4483 5567 4446 715 -3495 -6040 -5269 -2084 1914 5057 5984 3504 -1035 -4517 -5579
2960 -5579 -4322 -839 3644 5685 4935 1952 -2051 -5196 -5895 -3277 949 4069 5834 4531 796
2975 796 -3431 -5424 -4731 -2348 1648 5341 5782 3258 -471 -4038 -6083 -4297 -394 3341 5229 4970
2991 4970 2615 -1865 -5459 -5734 -3128 800 4512 5635 4272 979 -3115 -5728 -4940 -2123 1986
3006 1986 4938 5504 3279 -351 -4279 -6130 -4670 -627 2994 5449 5323 2239 -1942 -5350 -5244 -3231
3022 -3231 139 3712 6055 4617 1093 -3215 -5664 -5054 -1784 1860 4586 5427 3604 -289 -4469
3037 -4469 -5671 -4286 -777 3011 5387 4973 2247 -1544 -5037 -5280 -3527 193 4123 5749 4288
3052 4288 681 -3040 -4717 -4987 -2770 1117 5051 5788 3571 -827 -3929 -5258 -4093 -1427 2628
3067 2628 5377 5513 2256 -1431 -4865 -5199 -2928 435 3566 5395 4633 1212 -2402 -5534 -5221 -2686
3083 -2686 1606 4520 5238 3101 -147 -3567 -5248 -4541 -1116 2757 5482 5099 1976 -1746 -4205 -4928
3099 -4928 -3770 -90 3898 6208 4304 741 -2322 -4686 -4867 -2875 1361 4321 5687 3545 133
3114 133 -4045 -5495 -4008 -1090 2559 4825 5218 2282 -1483 -3806 -5299 -3864 157 4279 4971 3660
3130 3660 1521 -1756 -5147 -5529 -2181 1621 4698 5233 3303 -728 -3256 -4907 -4509 -1972 2243 5521
3146 5521 4874 1754 -1538 -4374 -5414 -3686 385 3449 4954 4462 1801 -2457 -5534 -4578 -1970 1080
3162 1080 3970 5487 3524 -139 -3043 -4966 -4740 -1406 2947 4810 4290 2201 -439 -4057 -5546
3177 -5546 -3517 337 3352 4955 4525 1360 -2434 -4571 -4829 -2614 894 4457 5288 3102 -185 -2949
3193 -2949 -5001 -4599 -1120 2422 4220 4642 3447 -1009 -4662 -5040 -2856 -474 2649 5154 4603 1388
3209 1388 -2383 -4164 -4873 -2907 1260 4347 4623 3309 661 -2922 -5481 -4317 -825 1971 4303
3224 4303 4965 2734 -1422 -4268 -4341 -3619 -645 3169 5129 4129 973 -1809 -4226 -4945 -2869 1055
3240 1055 3947 4676 3609 649 -3551 -5377 -3698 -1382 1610 4075 5035 2488 -1139 -3716 -4426 -3834
3256 -3834 -396 3202 4829 4003 1875 -1376 -4651 -4974 -2336 903 3146 4691 3944 305 -3231 -4509
3272 -4509 -3858 -2217 1673 4700 4728 2005 -825 -3274 -5198 -3845 -74 3040 4430 4497 2162 -2127
3288 -2127 -4479 -4253 -2537 304 3497 5156 3529 315 -2438 -4365 -4375 -2376 1872 4540 4446 2739
3304 2739 -4 -3737 -5075 -3301 -255 2450 4316 4257 1925 -2009 -4163 -4419 -2790 460 3876 4652
3320 4652 3093 423 -2311 -4480 -4329 -1433 1899 3744 4266 2897 -436 -3744 -4764 -2969 -682
3335 -682 2398 4786 4469 1305 -2018 -3792 -4445 -2977 716 3750 4311 3343 897 -2317 -4604 -4250
3351 -4250 -1756 1426 4308 4477 2866 -734 -3429 -3989 -3167 -1000 2411 4703 4074 1398 -1479 -3647
3367 -3647 -4405 -2858 519 3321 4431 3556 1125 -2430 -4552 -3859 -1719 1138 3877 4749 2693 -362
3383 -362 -3415 -4774 -3446 -700 2641 4305 3877 1663 -891 -3958 -4438 -2579 414 2942 4494 3667
3399 3667 743 -2405 -4298 -4051 -1924 1384 4005 4508 2625 -301 -3029 -4338 -3670 -478 2246 3887
3415 3887 3858 1717 -1482 -3897 -3911 -2335 363 3214 4760 3709 725 -2029 -4102 -4062 -1971 1279
3431 1279 3743 4182 2697 -96 -3206 -4513 -3179 -875 1982 4055 4035 1867 -1104 -3632 -4136 -2749
3447 -2749 237 3183 4337 3507 744 -2240 -3903 -3759 -2027 1156 3338 3991 2810 -185 -3226 -4258
3463 -4258 -3298 -1063 2022 4233 3988 1584 -1003 -3403 -4150 -2795 -48 3005 4308 3629 823 -1661
3479 -1661 -3736 -3822 -1758 1079 3459 3955 2860 25 -2960 -4064 -3618 -1127 2051 3932 3793 1953
3495 1953 -986 -3544 -3944 -2582 344 2564 4262 3436 851 -1740 -3559 -4036 -1924 1131 3477 4033
3511 4033 2816 -193 -2580 -4199 -3392 -1209 1721 3766 3925 2090 -878 -3439 -3887 -2895 -133 2609
3527 2609 3847 3390 1000 -1772 -3754 -3819 -2067 808 3137 4003 2742 451 -2736 -3907 -3526 -777
3543 -777 1808 3697 3585 1998 -699 -3128 -3667 -2681 -408 2683 4061 3246 1097 -1704 -3257 -3593
3559 -3593 -2172 639 3237 4109 2823 550 -2656 -3965 -3501 -1018 1691 3407 3581 2153 -751 -3240
3575 -3240 -3934 -2469 -239 2519 3939 3267 1334 -1608 -3946 -4032 -2241 934 3086 3683 2659 -16
3591 -16 -2267 -3725 -3427 -1539 1497 3495 3623 1828 -642 -2947 -3818 -3143 -336 2726 3792 3436 1230
3608 1230 -1452 -3841 -3553 -1997 393 2836 3836 2837 371 -2008 -3884 -3313 -929 1812 3468 3567
3624 3567 2117 -252 -2768 -3963 -3014 -132 2378 3334 3287 1329 -1227 -3521 -3448 -2064 211 2611
3640 2611 3906 2843 -24 -2342 -3693 -3062 -1298 1442 3385 3493 2061 -347 -3172 -4090 -2774 -174
3656 -174 1930 3640 3421 1529 -1377 -3650 -3644 -2126 584 2665 3618 2591 415 -2104 -3621 -3480 -935
3673 -935 1443 3202 3497 2172 -368 -2909 -3685 -2787 -729 2067 3649 3547 1203 -1545 -2974 -3557
3689 -3557 -2305 238 2645 3610 2635 438 -2203 -3696 -3265 -1071 1258 2762 3788 2493 -408 -2799
3705 -2799 -3689 -2752 -767 1834 3799 3228 1222 -1246 -3051 -3681 -2356 644 2961 3451 2611 486
3721 486 -1998 -3512 -3335 -1539 1122 3247 3649 2131 -343 -2504 -3539 -3111 -720 2102 3434 3030
3737 3030 1703 -773 -2923 -3711 -1963 348 2396 3193 2909 1018 -1711 -3330 -2987 -1739 932 3072
3753 3072 3456 2158 -45 -2442 -3556 -2852 -557 1878 3130 3257 1830 -1211 -3151 -3132 -1900 69
3769 69 2296 3423 3065 493 -1751 -2995 -3234 -1533 1109 2716 3319 2105 89 -2340 -3862 -2565
3785 -2565 -684 1767 2989 3293 1536 -1011 -2669 -3133 -2329 -150 2165 3434 2676 797 -1461 -3037
3801 -3037 -2909 -1322 961 2679 3093 2517 248 -2387 -3549 -2312 -738 1349 3432 3358 1697 -784
3817 -784 -2611 -2888 -1989 -312 2504 3204 2495 619 -1437 -3285 -3014 -1528 628 2548 3488 2277 -171
3834 -171 -2131 -3185 -2597 -886 1438 3324 2953 1266 -626 -2588 -3427 -2268 -68 2073 3393 3014
3850 3014 881 -1406 -2952 -2982 -1633 397 2852 3529 2336 -84 -2167 -3259 -2598 -1068 1365 3084
3866 3084 2802 1357 -734 -2522 -3222 -2516 -197 2497 3291 2736 874 -1582 -2988 -2944 -1786 556 2619
3883 2619 3373 2286 80 -2112 -3051 -2754 -1281 1670 2770 2983 1722 -517 -2887 -3141 -2038 -462
3899 -462 1663 3091 2398 751 -1275 -2664 -3130 -1713 823 2559 3043 2116 378 -1461 -2949 -2824
3915 -2824 -1272 1368 2963 2852 1764 -363 -2326 -3168 -2131 -375 2101 2971 2665 959 -1075 -2930
3931 -2930 -3069 -1666 672 2573 2728 2251 366 -1962 -3172 -2644 -1192 1130 2507 2890 1673 -648
3947 -648 -2506 -2833 -2150 -92 1853 3113 2713 1280 -1011 -2576 -2886 -1637 355 2485 2947 2246 258
3964 258 -1910 -3123 -2661 -1117 1120 2703 3017 1793 -391 -2167 -3029 -2084 -426 1555 2609 2832
3980 2832 1052 -1095 -2656 -2685 -1775 195 2075 3302 2398 351 -1743 -2903 -2529 -1028 936 2748
3996 2748 2960 1694 -575 -2299 -2919 -2161 -287 1594 2653 2599 1268 -1043 -2826 -2632 -1921 201 2069
4013 2069 2974 2318 216 -1806 -3049 -2560 -1096 1226 2455 2998 1648 -427 -2097 -2913 -2223 -435
4029 -435 1556 2777 2496 1231 -998 -2638 -2890 -1633 102 1675 2932 2151 501 -1864 -2957 -2631
4045 -2631 -1271 942 2657 2857 1631 19 -1911 -2631 -2166 -464 1748 2554 2468 1124 -976 -2564
4061 -2564 -2799 -1723 283 1838 2795 2329 619 -1476 -2641 -2484 -1705 675 2247 2829 1815 159
4077 159 -2106 -2841 -2087 -364 1552 2653 2614 1164 -994 -2442 -2910 -1764 45 1961 3125 2168 493
4094 493 -1157 -2498 -2440 -1129 963 2521 2707 1997 157 -1891 -2950 -2113 -850 1097 2547 2481 730
4111 730 -769 -2284 -2715 -1782 165 1785 2803 2171 840 -1075 -2811 -2633 -1094 923 2100 2797
4127 2797 1817 -260 -1864 -2658 -2004 -635 1399 2444 2345 1456 -397 -1850 -2650 -1759 205 1994 2512
4144 2512 2410 915 -1282 -2524 -2424 -1315 455 2207 2713 1899 62 -1699 -2704 -2399 -592 1327
4160 1327 2293 2356 1040 -512 -2217 -2542 -1649 336 1715 2343 2195 912 -1066 -2477 -2318 -1585 662
4177 662 2155 2572 1688 -168 -1299 -2629 -2360 -733 1465 2221 2380 1248 -197 -2012 -2818 -1774 -218
4194 -218 1543 2571 2350 595 -1146 -2331 -2542 -1508 543 2163 2578 1886 230 -1605 -2757 -2351
4210 -2351 -776 1035 2200 2369 1580 -371 -2120 -2638 -1760 -394 1669 2481 2203 674 -830 -2267
4226 -2267 -2473 -1286 368 2001 2388 1934 200 -1592 -2838 -2342 -726 1063 2343 2313 1365 -386 -1920
4243 -1920 -2668 -2056 -168 1622 2402 2540 1206 -906 -2526 -2488 -1267 671 2057 2499 2085 136 -1611
4260 -1611 -2202 -2310 -927 439 2362 2565 1589 -485 -1805 -2410 -1669 -238 1569 2193 2121 917 -949
4277 -949 -1876 -2242 -1578 218 1997 2476 2098 354 -1289 -2289 -1977 -971 602 2272 2469 1258 -131
4294 -131 -1832 -2337 -1662 -250 1281 2389 2183 456 -974 -2131 -2252 -1380 269 1729 2304 1800 525
4311 525 -1344 -2401 -2486 -938 786 1883 2546 1521 -117 -1621 -2636 -2024 -266 1478 2225 2135 770
4328 770 -325 -1929 -2378 -1644 -70 1723 2606 1635 381 -967 -1962 -2162 -728 592 2010 2397 1403
4345 1403 -89 -1734 -2151 -1975 -333 948 2459 2131 1077 -561 -2052 -2066 -1612 107 1631 2382 1903
4362 1903 446 -1219 -2213 -2200 -1000 749 1707 2257 1343 -15 -1796 -2513 -1838 -542 1131 2017 2022 1061
4380 1061 -769 -1827 -2226 -1562 -9 1570 2430 1838 601 -1081 -2310 -2137 -1400 655 1793 2315 1676
4397 1676 30 -1312 -2243 -2090 -366 845 1988 1989 1218 -277 -2005 -2337 -1541 -124 1360 2199 1952
4414 1952 581 -654 -2131 -2155 -1049 444 1710 1894 1725 -252 -1579 -2163 -1697 -580 1152 2066 1977
4431 1977 985 -379 -1871 -1908 -1522 -367 1524 2155 1774 512 -997 -2133 -2334 -1194 511 1625 2079
4448 2079 1594 158 -1569 -2054 -1973 -548 1108 1805 2112 1076 -169 -1350 -2480 -1515 -180 1411 1980
4465 1980 1953 683 -819 -1906 -1998 -855 114 1746 2137 1256 217 -1433 -1779 -1951 -688 979 2229
4482 2229 1864 1190 -277 -1573 -2097 -1716 122 1108 2071 1511 840 -769 -1995 -1979 -1340 566 1554 2330
4500 2330 1477 196 -1246 -2432 -1845 -425 967 1929 2005 820 -162 -1590 -2455 -1667 -153 1097 1926
4517 1926 1819 771 -747 -1723 -2101 -1070 194 1305 2099 1362 220 -1124 -2147 -1603 -710 541 1601
4534 1601 2031 1345 -372 -1843 -1902 -1436 -487 1170 1873 2074 574 -654 -1663 -1872 -1142 187 1813
4551 1813 2067 1785 507 -1085 -2300 -1700 -694 667 1743 1969 1077 -370 -1464 -1986 -1442 -511 1190
4568 1190 1873 1754 930 -680 -1821 -2074 -1180 234 1523 2113 1402 350 -1067 -2007 -1563 -924 596
4585 596 1791 2028 1270 -227 -1366 -2088 -1719 -394 1095 1904 1539 748 -554 -1434 -1766 -1405 295 1060
4603 1060 1870 1453 163 -1300 -1871 -1723 -1094 505 1871 1997 1003 4 -1270 -1759 -1798 -262 1060 1329
4621 1329 2029 856 -462 -1726 -1755 -1115 -189 1249 2047 1354 205 -1012 -1678 -1756 -774 247 1525 1841
4639 1841 1405 84 -1170 -1867 -1283 -586 663 1894 1791 841 -506 -1597 -1963 -1446 -46 1453 2076
4656 2076 1552 482 -801 -1970 -2299 -627 539 1514 1961 1231 83 -1308 -1809 -1495 -373 809 1609
4673 1609 1971 1104 -303 -1702 -2089 -1293 -35 1135 1808 1744 368 -1109 -1655 -1913 -1243 459 1816
4690 1816 1948 1598 233 -1365 -1812 -1712 -282 974 1590 1608 1297 -546 -1457 -1866 -1202 -51 1539 1867
4708 1867 1448 755 -1128 -1887 -1779 -965 763 1423 1745 1310 92 -773 -1764 -1751 -306 1060 1489 1757
4726 1757 837 -201 -1311 -1596 -1275 94 1036 1621 1618 807 -604 -1732 -1774 -830 654 1551 1874 1075 70
4745 70 -1001 -1706 -1712 -812 552 1624 1523 1248 -63 -1618 -1968 -1474 -182 1085 1915 1504 390 -543
4763 -543 -1496 -1862 -1078 314 1485 1674 1159 129 -1233 -1241 -1515 -703 836 1779 1875 975 -440 -1600 -1586
4782 -1586 -1541 -383 867 1561 1555 707 -463 -1638 -1702 -898 -98 991 1669 1218 19 -1004 -1736 -1579 -687
4801 -687 512 1579 1905 1291 -160 -1255 -1794 -1614 -218 1163 1646 1314 858 -681 -1449 -1704 -1123 430
4819 430 1062 1647 1474 219 -1041 -1574 -1731 -853 678 1628 1604 984 -158 -1366 -1559 -1373 -120 782
4837 782 1757 1476 1019 -609 -1582 -1480 -782 216 1195 1688 1361 299 -675 -1552 -1597 -829 526 1525 1556 933
4857 933 -144 -1199 -1880 -1519 -479 957 1698 1329 827 -588 -1303 -1532 -1173 192 1394 1398 1443 54
4875 54 -950 -1489 -1770 -644 555 1391 1724 727 144 -1359 -1717 -1274 -171 532 1542 1471 832 -324
4893 -324 -1216 -1375 -1242 2 1018 1601 1271 580 -596 -1334 -1468 -860 363 1658 1687 840 115 -1077
4911 -1077 -1625 -1472 -415 566 1545 1532 720 -488 -1289 -1664 -900 384 896 1592 1652 275 -1026 -1469 -1716
4930 -1716 -508 323 1132 1334 810 -184 -1084 -1732 -1273 -89 812 1688 1565 792 -376 -1542 -1792 -1230
4948 -1230 -138 991 1558 1451 640 -895 -1173 -1230 -761 374 944 1677 1122 -77 -1009 -1446 -1278 -573
4966 -573 632 1409 1328 644 -371 -1203 -1743 -1295 13 835 1675 1632 524 -477 -1760 -1570 -756 297
4984 297 1243 1574 1220 156 -1078 -1669 -1448 -469 702 1356 1724 581 -349 -1657 -1782 -1285 -90 1149
5002 1149 1631 1318 614 -725 -1266 -1311 -806 508 1516 1625 845 335 -885 -1181 -1042 -631 603 1549
5020 1549 1517 571 -88 -1370 -1616 -1105 34 944 1786 1450 394 -189 -1543 -1355 -698 129 1059 1646 1175
5039 1175 227 -800 -1820 -1273 -421 561 1589 1558 740 13 -956 -1611 -847 -181 836 1437 1458 354 -778
5058 -778 -1388 -1524 -904 66 1111 1514 1173 246 -962 -1139 -1182 -517 465 1395 1262 1030 -341 -1008 -1358
5077 -1358 -1368 -324 699 1442 1726 174 -373 -1609 -1568 -870 -169 1398 1269 930 183 -880 -1587 -1561 -723
5096 -723 318 1444 1213 882 -248 -982 -1321 -1313 -562 630 1348 1476 815 -498 -1168 -1567 -942 97 743
5115 743 1472 1192 246 -781 -1258 -1422 -598 447 1379 1591 874 92 -1309 -1421 -1086 -20 730 1358 1368
5134 1368 751 -466 -1391 -1605 -939 94 1078 1457 983 154 -589 -1289 -1437 -593 301 1337 1724 789 -36
5153 -36 -724 -1513 -1067 -159 507 1422 1283 515 -423 -1229 -1386 -743 236 726 1528 1435 178 -591 -1082 -1435
5173 -1435 -789 567 1242 1810 938 -372 -859 -1425 -1074 -590 598 1336 1205 862 -383 -1310 -1162 -903
5191 -903 145 906 1420 1309 289 -573 -1348 -1448 -713 94 961 1349 791 138 -881 -1542 -1142 -377 650
5210 650 1095 1295 845 -352 -1231 -1399 -1090 103 905 1333 1179 165 -740 -1222 -1173 -1035 225 1186 1496
5229 1496 1004 -31 -885 -1282 -1264 -675 225 1290 1174 936 -21 -845 -1368 -992 -65 894 1349 1324 473 -440
5249 -440 -1354 -1241 -623 171 1009 1156 930 165 -746 -1400 -1114 -343 921 1117 1026 943 -205 -1413 -1257 -1210
5269 -1210 91 716 1416 951 363 -455 -1196 -1296 -772 221 1056 1315 866 85 -987 -1536 -1526 -339 334
5288 334 1159 1198 728 -443 -1196 -1552 -991 21 843 1415 1232 582 -868 -1382 -1323 -760 86 1038 1467 853
5308 853 -48 -796 -954 -1438 -246 441 1255 1135 296 -57 -931 -1324 -1047 -13 726 1098 1039 593 -674
5327 -674 -1050 -1246 -1109 331 767 1248 909 130 -758 -1386 -1371 -408 699 886 1130 589 40 -1147 -1130 -579
5347 -579 -219 586 1195 1088 422 -72 -1089 -1347 -808 169 482 1235 752 321 -829 -781 -892 -557 639
5366 639 1157 1116 456 -372 -915 -914 -1277 -285 620 1151 1391 550 -494 -903 -1301 -461 -6 691 1188 1145 76
5387 76 -617 -1478 -1193 -723 743 1359 1299 1020 -312 -808 -1443 -800 -145 939 1258 1036 578 -581 -1173
5406 -1173 -1180 -879 51 851 1602 1042 240 -363 -1381 -1121 -815 507 1442 1265 612 -197 -914 -1440 -1054 -105
5426 -105 649 1183 1206 754 -243 -784 -1156 -948 76 885 1483 1205 101 -479 -1166 -1023 -348 452 978 1340
5446 1340 644 72 -736 -1101 -1105 -194 664 1185 1071 665 -395 -894 -1221 -919 -60 894 960 837 321 -596
5466 -596 -1182 -1196 -527 446 974 1317 699 -37 -650 -1173 -855 -116 578 970 1108 527 -598 -1151 -1165 -840
5486 -840 -7 642 1095 1033 581 -855 -1135 -1348 -744 374 1047 1345 717 32 -835 -1136 -828 -212 520 1116
5506 1116 1084 877 101 -1143 -1254 -1060 200 747 984 1018 420 -339 -1120 -854 -620 375 1010 1052 400 351
5526 351 -723 -1188 -783 -603 615 1069 1261 805 -251 -721 -1067 -856 -7 587 975 1040 449 -489 -915
5545 -915 -1103 -728 36 812 1219 789 53 -981 -1147 -1160 -666 404 1130 1006 618 155 -799 -1325 -946 -46
5565 -46 1025 1347 1114 778 -460 -752 -1198 -272 107 699 1320 821 46 -893 -1112 -1028 -480 656 917 1041
5585 1041 620 -200 -748 -977 -795 -129 330 1115 1195 381 -139 -1081 -1146 -771 259 874 1205 781 -33 -917
5605 -917 -1221 -933 -370 445 1092 1244 531 -198 -536 -1033 -845 -235 715 1348 1189 718 -225 -1022 -1255 -523
5625 -523 -244 583 812 1102 24 -1020 -865 -985 -512 578 1246 939 613 -106 -841 -1463 -873 -117 377
5644 377 1224 1272 571 -220 -806 -1003 -590 286 809 1157 983 421 -661 -1188 -1134 -570 36 687 1141 677
5664 677 119 -842 -936 -1109 -295 498 1173 1005 342 -253 -711 -1099 -560 35 827 902 837 304 -475 -1120 -1186
5685 -1186 -237 348 1144 1062 745 -144 -793 -1053 -735 -60 381 836 957 559 -93 -797 -1073 -863 103 593
5705 593 987 978 163 -255 -1059 -1088 -663 120 626 929 575 -62 -611 -992 -836 -430 648 793 1226 539 -358
5726 -358 -1012 -1080 -1010 -53 345 881 1039 165 -527 -1104 -1034 -698 303 935 1200 751 -72 -511 -984 -990 -31
5747 -31 551 789 1011 433 78 -856 -1229 -664 -96 611 1188 922 133 -357 -1154 -875 -495 27 1092 884
5767 884 928 233 -840 -1162 -883 -514 473 1066 860 645 -177 -551 -895 -835 223 663 981 718 372 -490
5787 -490 -1318 -856 -680 36 680 1137 863 -2 -595 -1126 -876 -340 707 710 855 558 63 -735 -1155 -551
5807 -551 -149 552 1295 746 208 -297 -852 -1032 -681 52 473 1082 749 229 -546 -971 -908 -474 287 1156
5827 1156 1059 592 -75 -748 -975 -541 -105 758 1032 950 410 -363 -864 -892 -613 -72 633 1200 750 178 -575
5848 -575 -1010 -1016 -320 376 1119 922 701 -101 -1045 -836 -790 -302 542 877 968 279 -97 -1020 -908 -651 -59
5869 -59 801 920 896 374 -630 -978 -1028 -518 183 1050 984 411 -165 -664 -817 -637 -167 601 768 967 480
5890 480 -358 -945 -1012 -528 206 756 1144 946 340 -742 -1025 -997 -272 314 971 982 826 -16 -688 -904 -669
5911 -669 -138 647 883 1048 300 -360 -947 -704 -506 97 568 701 1020 62 -771 -972 -756 -606 301 659
5931 659 924 729 213 -697 -980 -1009 -230 476 963 864 577 -539 -1020 -1014 -1064 248 548 841 625 392 -509
5952 -509 -1097 -853 -670 287 642 913 933 356 -546 -658 -771 -39 343 978 774 281 -192 -766 -863 -618 141
5973 141 766 765 755 341 -289 -775 -764 -559 155 525 1144 811 32 -726 -920 -850 -60 480 796 925 647 -425
5995 -425 -972 -873 -646 104 367 916 656 281 -522 -710 -831 -382 -10 790 1130 498 402 -310 -869 -949 -263
6016 -263 389 776 804 293 -126 -714 -1286 -659 -287 627 698 590 321 -279 -662 -880 -221 138 948 756 640
6037 640 -16 -722 -754 -1257 -323 241 620 960 573 -99 -695 -955 -603 -149 600 873 990 139 -200 -1157
6057 -1157 -981 -225 127 870 924 558 31 -717 -895 -864 -568 389 856 930 670 -182 -521 -761 -858 30 727
6078 727 977 1217 492 -281 -978 -683 -504 444 528 921 620 147 -676 -1049 -625 -534 163 460 798 312 38
6099 38 -707 -1116 -594 -85 571 380 907 201 -544 -1092 -784 -617 -110 481 1091 780 170 -453 -863 -1031
6119 -1031 -391 378 725 921 545 -309 -762 -995 -675 -252 463 776 774 309 -449 -736 -848 -424 -158 465
6139 465 1019 769 167 -330 -775 -940 -330 307 706 760 816 -6 -688 -970 -498 -291 408 956 864 899 -113
6160 -113 -895 -928 -717 102 742 1062 1021 -65 -400 -856 -682 -301 9 856 713 647 29 -634 -1092 -649 -488
6181 -488 470 1104 816 471 -444 -552 -640 -486 118 514 846 503 106 -291 -693 -1078 -289 242 581 729
6201 729 618 123 -574 -1039 -679 -262 378 924 376 636 -86 -1068 -942 -883 126 498 1004 528 170 -400
6221 -400 -818 -677 -577 87 694 882 483 238 -357 -954 -785 -279 648 576 785 432 -81 -710 -834 -605
6241 -605 21 499 766 642 295 -271 -708 -884 -517 487 466 1059 605 214 -476 -611 -826 -254 291 784
6261 784 699 371 -65 -667 -849 -519 -95 329 596 881 522 -287 -802 -1042 -371 199 870 954 685 -156 -494
6282 -494 -797 -902 -51 396 615 765 705 11 -537 -812 -552 -110 678 821 593 179 -416 -789 -990 -287
6302 -287 -72 769 828 705 189 -208 -956 -1041 -173 231 716 760 492 -203 -899 -995 -493 64 446 760 643
6323 643 55 -82 -573 -738 -631 -15 411 851 520 -339 -710 -985 -676 -305 207 888 459 227 176 -632
6343 -632 -856 -570 -24 507 928 856 214 -275 -781 -531 -386 114 556 723 661 248 -338 -718 -616 -352 78
6364 78 681 731 513 43 -356 -583 -709 -303 300 744 578 391 -375 -963 -896 -720 245 731 759 744 28 -238
6386 -238 -766 -864 -313 348 570 849 383 -190 -481 -1125 -481 -322 432 637 581 280 -173 -739 -274 -700 -45
6407 -45 391 1107 724 -102 -448 -868 -792 -191 438 979 624 225 357 -407 -833 -760 -256 223 1037 871 449
6428 449 -215 -657 -867 -807 -153 442 850 344 228 -324 -764 -791 -705 255 590 920 578 54 -482 -954 -433
6449 -433 213 358 655 833 463 5 -676 -578 -823 50 307 864 597 58 -314 -579 -603 -483 104 170 804
6470 804 789 254 -602 -552 -615 -336 234 770 881 301 -108 -609 -909 -580 62 546 597 781 387 -385 -696
6491 -696 -772 -590 368 945 1114 293 42 -550 -732 -543 -521 568 739 799 238 -416 -619 -614 -421 -14 533
6512 533 657 566 152 -483 -547 -843 -571 182 515 934 425 -44 -589 -664 -961 102 579 680 615 441 -248
6533 -248 -669 -630 -598 6 629 931 624 380 -88 -874 -1007 -310 154 878 433 531 -104 -553 -979 -798 -85
6554 -85 377 543 889 653 -74 -530 -582 -537 -178 370 429 641 156 -328 -645 -785 -302 -32 564 752 483
6575 483 -237 -408 -916 -452 -186 2 879 504 451 -3 -518 -928 -809 -121 241 709 732 367 12 -809 -757
6596 -757 -595 124 646 502 790 14 -463 -633 -687 -74 -58 558 441 642 -47 -560 -534 -428 -251 207 700
6617 700 851 299 -337 -490 -645 -287 -84 474 570 583 217 -421 -763 -916 -338 337 742 759 483 287 -637
6638 -637 -468 -598 -52 461 520 642 243 -232 -599 -546 -482 11 354 731 484 -19 -393 -833 -518 -339 337
6659 337 500 674 444 -393 -492 -734 -375 -275 280 540 470 453 -130 -591 -649 -481 4 651 642 701 -55 -520
6681 -520 -962 -686 -225 215 465 678 631 -35 -555 -888 -679 136 259 533 852 383 -110 -549 -718 -455
6701 -455 123 158 875 672 456 -455 -728 -752 -361 84 601 776 414 61 -203 -712 -718 -45 382 660 616 528
6723 528 -139 -567 -622 -353 -149 736 625 390 298 -362 -711 -731 -278 -84 681 827 481 247 -434 -890 -544
6744 -544 -263 553 555 721 399 -107 -649 -541 -429 -62 615 909 492 112 -329 -502 -897 -369 -34 789 862
6765 862 675 -266 -478 -746 -656 -352 182 823 630 825 -175 -835 -693 -425 -164 436 649 524 444 -223
6785 -223 -653 -658 -744 -177 737 578 342 183 -380 -905 -506 -299 361 606 743 258 -75 -497 -1033 -684 20
6806 20 296 647 869 145 -101 -566 -861 -583 187 680 771 445 171 -358 -725 -416 -227 266 441 596 379
6827 379 -383 -626 -632 -440 -13 430 963 537 347 -254 -648 -595 -350 189 448 559 623 56 -158 -752 -779 -148
6849 -148 306 629 698 502 -181 -466 -682 -595 -34 314 882 489 100 -369 -504 -536 -476 40 233 427 814
6870 814 211 -238 -777 -525 -597 286 464 399 470 -126 -314 -779 -717 -166 731 637 447 327 -273 -714 -907 -546
6892 -546 273 428 570 369 287 -269 -610 -742 -113 376 611 875 213 -268 -533 -818 -527 41 299 564
6912 564 743 392 -19 -677 -444 -378 293 522 774 849 -29 -375 -463 -599 -257 110 415 681 568 39 -679
6933 -679 -686 -512 69 42 922 402 478 -365 -596 -707 -560 -229 623 666 462 120 23 -890 -610 -298 280 695
6955 695 510 275 -329 -238 -424 -423 -307 208 548 653 339 64 -797 -769 -482 140 356 527 461 303 -547 -529
6977 -529 -578 -423 198 387 660 291 -65 -282 -533 -589 -181 270 823 479 56 -302 -371 -815 -334 -12 365
6998 365 737 394 155 -231 -319 -517 -329 -9 454 577 396 282 -455 -937 -501 239 243 824 620 423 57
7019 57 -555 -753 -731 125 394 619 678 300 -115 -568 -839 -58 -58 595 585 446 -113 -329 -735 -684 -64 88
7041 88 627 655 368 -40 -574 -791 -547 -544 421 471 621 321 -180 -317 -496 -342 75 810 602 629 -113 -263
7063 -263 -1010 -401 -1 73 587 666 376 30 -720 -868 -612 -39 275 612 456 217 -68 -620 -734 -545 -93
7084 -93 388 461 499 142 -255 -476 -242 -193 214 447 312 519 110 -615 -363 -462 -219 496 710 407 98 166
7106 166 -540 -755 -395 114 544 554 420 225 -381 -821 -562 -377 -77 668 743 396 -31 -590 -662 -517 39
7127 39 484 553 706 270 -81 -571 -585 -453 0 684 632 779 64 -435 -643 -512 -133 163 582 743 363
7148 363 13 -408 -766 -411 -441 363 775 709 300 -366 -492 -342 -218 73 248 782 628 3 -97 -491 -338
7169 -338 -131 116 764 705 364 -87 -322 -600 -390 -154 178 612 611 424 -250 -324 -663 -665 106 506 717 213
7191 213 234 -323 -604 -837 -369 144 461 584 189 141 -628 -897 -398 30 346 474 621 494 -358 -601 -473
7212 -473 -451 61 392 480 696 29 -336 -822 -859 -268 135 499 646 624 28 -801 -1129 -746 -345 459 448 470
7234 470 437 -105 -438 -723 -276 28 249 677 272 292 -62 -523 -456 -390 -265 571 602 512 -192 -460 -459 -668 -221
7257 -221 493 775 554 486 -39 -536 -333 -210 -107 438 360 639 -165 202 -704 -541 -335 46 416 748 414
7278 414 -145 -368 -511 -706 -234 255 736 322 206 -394 -201 -437 -418 37 493 687 240 191 -306 -598 -713
7299 -713 -112 209 321 625 680 -67 -448 -684 -602 -72 217 746 429 388 115 -582 -675 -462 -4 475 680
7320 680 703 163 -232 -789 -1034 -287 123 715 669 515 377 -590 -728 -594 -134 578 321 580 -83 -61 -604
7341 -604 -756 -510 -24 355 618 656 404 -182 -323 -555 -314 312 303 646 298 -80 -163 -486 -339 -59 254
7362 254 560 483 139 -249 -342 -756 -443 -190 309 448 614 286 -112 -749 -581 -316 -137 451 666 508 108
7383 108 -135 -653 -542 -288 193 538 402 509 13 -518 -959 -506 63 574 751 331 237 -351 -420 -587 -83
7404 -83 -29 260 673 92 83 -180 -410 -721 -346 196 426 206 268 173 -409 -498 -486 54 155 761 408 440 -88
7427 -88 -581 -720 -554 85 387 515 704 53 -362 -642 -657 -657 100 463 287 422 -139 -463 -413 -286 -203 439
7449 439 717 416 -35 -200 -380 -447 -313 437 390 690 412 31 -47 -999 -442 -9 348 504 529 378 122
7470 122 -239 -651 -480 -87 331 628 617 139 -169 -634 -695 -279 -1 285 580 541 -78 -373 -472 -637 -375
7491 -375 129 495 535 306 83 -732 -623 -595 -162 603 548 476 281 -317 -479 -567 -418 -112 229 792 313 -140
7513 -140 -292 -514 -449 -121 -26 425 926 688 -84 -298 -571 -405 46 274 705 553 92 -7 -308 -538 -489
7534 -489 280 235 782 289 212 119 -637 -432 -467 -78 412 617 271 -215 -715 -670 -805 -264 282 736 408 384
7556 384 -248 -510 -229 -447 36 477 456 376 -104 -409 -556 -712 -298 141 312 619 88 59 -621 -719 -150
7577 -150 -221 240 432 762 223 45 -546 -643 -370 -275 459 782 697 180 -390 -632 -524 -294 128 372 427 149
7599 149 -1 -366 -543 -439 -157 423 312 423 317 -62 -327 -412 -309 73 496 570 299 35 -453 -567 -638
7620 -638 -262 86 334 425 284 180 -226 -465 -537 -299 59 559 578 529 -216 -266 -540 -490 -68 427 447 461 180
7643 180 -498 -561 -742 -266 104 508 455 308 261 -463 -645 -486 -283 53 474 548 310 128 -406 -702 -220
7664 -220 118 90 623 498 116 -293 -486 -621 -134 -16 183 962 565 -72 -401 -431 -802 -308 -1 611 543
7685 543 349 47 -431 -234 -451 23 512 498 422 299 -321 -576 -626 -138 172 296 631 375 48 -199 -368
7706 -368 -832 -619 463 485 659 298 145 -441 -490 -416 160 213 400 639 272 -69 -647 -390 -300 364 288 594
7728 594 513 95 -372 -465 -749 -421 253 633 357 265 -58 -444 -659 -229 -101 223 764 430 171 149 -509
7749 -509 -194 -521 -122 608 319 312 89 -254 -473 -532 -204 665 353 463 243 149 -504 -601 -463 -13 108 595
7771 595 602 8 -405 -501 -698 -330 39 593 820 397 210 -262 -721 -336 -103 247 372 538 266 -151 -422
7792 -422 -797 -319 -140 145 214 487 427 -274 -420 -667 -461 -3 385 211 462 281 18 -775 -501 -81 4
7813 4 698 417 201 47 -289 -528 -227 81 296 377 605 208 -143 -403 -407 -302 110 566 586 424 308 -439
7835 -439 -303 -442 36 -166 374 477 464 -204 -598 -722 -516 -13 371 567 362 121 -197 -244 -754 -265 -129
7856 -129 95 798 543 149 -389 -478 -700 -232 367 257 235 404 124 -421 -672 -277 -129 475 488 461 417 -216
7878 -216 -442 -387 -222 -54 515 650 418 43 -165 -687 -755 -395 70 407 732 143 -57 -202 -404 -510 -336
7899 -336 541 378 456 264 -295 -303 -635 -401 -108 262 509 379 36 -94 -444 -607 -195 33 465 602 257
7920 257 252 -183 -384 -308 -401 101 598 550 7 51 -181 -159 -530 -145 267 309 376 347 -187 -417 -535 -221 119
7943 119 81 374 337 291 -571 -408 -327 20 17 377 371 410 -126 -405 -556 -377 -61 355 489 355 -267 -82 -436
7966 -436 -458 -161 17 344 559 491 137 -190 -449 -314 -331 422 591 555 486 324 -433 -482 -298 64 296 576
7988 576 554 202 5 -182 -343 -251 -144 194 774 466 -41 -241 -110 -348 -206 68 408 411 287 -58 -615
8009 -615 -106 -446 -358 141 638 413 101 -384 -447 -150 -337 65 569 347 360 -124 -263 -619 -663 -282 269
8030 269 638 624 220 -232 -573 -689 -366 19 191 587 258 50 -217 -306 -277 -552 129 216 790 291 34
8051 34 -326 -442 -290 30 98 630 409 422 147 -653 -506 -146 -186 448 163 283 233 -337 -509 -251 -132 298
8073 298 315 594 528 134 -384 -340 -449 -83 299 569 503 318 -223 -511 -365 -335 64 234 347 359 277 -44
8095 -44 -601 -599 -164 25 546 577 477 274 -307 -422 -608 158 240 386 372 346 -258 -313 -561 -541 -114 236 471
8118 471 346 234 -148 -297 -644 -126 -183 402 439 231 297 -209 -418 -284 -261 271 589 613 445 114 -460 -730
8140 -730 -576 -24 211 558 332 -10 15 -433 -740 -368 -63 503 491 564 269 -416 -404 -310 -125 177 415 326
8162 326 -12 -369 -386 -431 -438 -171 285 413 540 237 -167 -316 -692 -475 -44 590 354 557 -15 -223 -490
8183 -490 -715 -139 -125 516 222 387 79 -404
8191d04
##END NTUPLES=NMR FID
##END=
