##TITLE=1H_LR-672-C1
 CDCl3, 8 sc, 
 25.6.2019
##JCAMPDX= 6.0         $$ Bruker NMR JCAMP-DX V2.0
##DATA TYPE= NMR FID
##DATA CLASS= NTUPLES
##ORIGIN= UXNMR, Bruker Analytische Messtechnik GmbH
##OWNER= root
$$ XWIN-NMR		Version 3.5
$$ Tue Jun 25 14:09:08 2019 Russian Standard Time (UT+4h)  she@DPX200
##.OBSERVE FREQUENCY= 200.13155
##.OBSERVE NUCLEUS= ^1H
##.DELAY= (6, 6)
##.ACQUISITION MODE= SIMULTANEOUS
##.ACQUISITION SCHEME= undefined
##.AVERAGES= 8
##.DIGITISER RES= 18
##SPECTROMETER/DATA SYSTEM= spect
##.PULSE SEQUENCE= zg30
##.SOLVENT NAME= D2O
##.SHIFT REFERENCE= (INTERNAL, D2O, 0, 15.7039)
##AUDIT TRAIL= $$ (NUMBER, WHEN, WHO, WHERE, WHAT)
$$ ##TITLE= Audit trail, XWIN-NMR		Version 3.5
$$ ##JCAMPDX= 5.01
$$ ##ORIGIN= Bruker BioSpin GmbH
$$ ##OWNER= she
$$ F:/spectra/data/she/nmr/H-F/1/audita.txt
$$ ##AUDIT TRAIL=  $$ (NUMBER, WHEN, WHO, WHERE, WHAT)
(   1,<2019-06-25 14:07:46.17 +0400>,<she>,<DPX200>,
      <created by zg, POWCHK disabled, PULCHK disabled
       configuration hash MD5:
       00 E9 B6 7A A2 85 ED C7 34 08 36 98 17 FE 4E 26
       data hash MD5: 16K
       0E F3 A6 BA 7D B2 51 36 63 D2 6F 88 4D DA E5 09>)
$$ ##END=
$$ 
$$ hash MD5
$$ EB A3 88 EE 2A 1F C4 19 B3 66 AA E0 CB 1F 74 95
##$RELAX= 
##$RELAX= 
##$RELAX= 
##$RELAX= 
##$RELAX= 
##$RELAX= 
$$ Bruker specific parameters
$$ --------------------------
##$DU= <F:/spectra>
##$EXPNO= 1
##$NAME= <H-F>
##$PROCNO= 1
##$TYPE= <nmr>
##$USER= <she>
##$AMP= (0..31)
100 100 100 100 100 100 100 100 100 100 100 100 100 100 100 100 100 100 
100 100 100 100 100 100 100 100 100 100 100 100 100 100 
##$AQSEQ= 0
##$AQ_mod= 1
##$AUNM= <au_zg>
##$AUTOPOS= <>
##$BF1= 200.13
##$BF2= 200.13
##$BF3= 200.13
##$BF4= 200.13
##$BF5= 200.13
##$BF6= 200.13
##$BF7= 200.13
##$BF8= 200.13
##$BYTORDA= 1
##$CFDGTYP= 0
##$CFRGTYP= 5
##$CHEMSTR= <none>
##$CNST= (0..31)
1 1 145 1 1 1 1 1 1 1 1 1 1 1 1 1 1 1 1 1 1 1 1 1 1 1 1 1 1 1 1 1 
##$CPDPRG= <>
##$CPDPRG1= <>
##$CPDPRG2= <>
##$CPDPRG3= <>
##$CPDPRG4= <mlev>
##$CPDPRG5= <mlev>
##$CPDPRG6= <mlev>
##$CPDPRG7= <mlev>
##$CPDPRG8= <mlev>
##$CPDPRGB= <>
##$CPDPRGT= <>
##$D= (0..31)
0 1.2 0 0 0 0 0 0 0 0 0 0.03 0 0 0 0 0 0 0 0 0 0 0 0 0 0 0 0 0 0 0 0 
##$DATE= 1561457265
##$DBL= (0..7)
120 120 120 120 120 120 120 120 
##$DBP= (0..7)
150 150 150 150 150 150 150 150 
##$DBP07= 0
##$DBPNAM0= <>
##$DBPNAM1= <>
##$DBPNAM2= <>
##$DBPNAM3= <>
##$DBPNAM4= <>
##$DBPNAM5= <>
##$DBPNAM6= <>
##$DBPNAM7= <>
##$DBPOAL= (0..7)
0.5 0.5 0.5 0.5 0.5 0.5 0.5 0.5 
##$DBPOFFS= (0..7)
0 0 0 0 0 0 0 0 
##$DE= 6
##$DECBNUC= <off>
##$DECIM= 24
##$DECNUC= <off>
##$DECSTAT= 4
##$DIGMOD= 1
##$DIGTYP= 9
##$DL= (0..7)
0 120 120 120 120 120 120 120 
##$DP= (0..7)
150 150 150 150 150 150 150 150 
##$DP07= 0
##$DPNAME0= <>
##$DPNAME1= <>
##$DPNAME2= <>
##$DPNAME3= <>
##$DPNAME4= <>
##$DPNAME5= <>
##$DPNAME6= <>
##$DPNAME7= <>
##$DPOAL= (0..7)
0.5 0.5 0.5 0.5 0.5 0.5 0.5 0.5 
##$DPOFFS= (0..7)
0 0 0 0 0 0 0 0 
##$DQDMODE= 0
##$DR= 18
##$DS= 0
##$DSLIST= <SSSSSSSSSSSSSSS>
##$DSPFIRM= 0
$$ [...]
##$SUBNAM2= <"">
##$SUBNAM3= <"">
##$SUBNAM4= <"">
##$SUBNAM5= <"">
##$SUBNAM6= <"">
##$SUBNAM7= <"">
##$SUBNAM8= <"">
##$SUBNAM9= <"">
##$SW= 24.9336996594482
##$SWIBOX= (0..15)
0 0 2 0 0 0 0 0 0 0 0 0 0 0 0 0 
##$SW_h= 4990.01996007984
##$TD= 16384
##$TD0= 1
##$TE= 0
##$TE2= 300
##$TE3= 300
##$TEG= 300
##$TL= (0..7)
0 120 120 120 120 120 120 120 
##$TP= (0..7)
150 150 150 150 150 150 150 150 
##$TP07= 0
##$TPNAME0= <>
##$TPNAME1= <>
##$TPNAME2= <>
##$TPNAME3= <>
##$TPNAME4= <>
##$TPNAME5= <>
##$TPNAME6= <>
##$TPNAME7= <>
##$TPOAL= (0..7)
0.5 0.5 0.5 0.5 0.5 0.5 0.5 0.5 
##$TPOFFS= (0..7)
0 0 0 0 0 0 0 0 
##$TUNHIN= 0
##$TUNHOUT= 0
##$TUNXOUT= 0
##$USERA1= <user>
##$USERA2= <user>
##$USERA3= <user>
##$USERA4= <user>
##$USERA5= <user>
##$V9= 5
##$VALIST= <valist>
##$VCLIST= <CCCCCCCCCCCCCCC>
##$VD= 0
##$VDLIST= <DDDDDDDDDDDDDDD>
##$VPLIST= <PPPPPPPPPPPPPPP>
##$VTLIST= <TTTTTTTTTTTTTTT>
##$WBST= 1024
##$WBSW= 4
##$XGAIN= (0..3)
0 0 0 0 
##$XL= 0
##$YL= 0
##$YMAX_a= 337586
##$YMIN_a= -504244
##$ZGOPTNS= <>
##$ZL1= 120
##$ZL2= 120
##$ZL3= 120
##$ZL4= 120
##$ABSF1= 10
##$ABSF2= 0
##$ABSG= 5
##$ABSL= 3
##$ALPHA= 0
##$AQORDER= 0
##$ASSFAC= 0
##$ASSFACI= 0
##$ASSFACX= 0
##$ASSWID= 0
##$AUNMP= <proc_1d>
##$AZFE= 0.1
##$AZFW= 0.1
##$BCFW= 1
##$BC_mod= 2
##$BYTORDP= 1
##$COROFFS= 0
##$CY= 11.3945322036743
##$DATMOD= 1
##$DC= 2
##$DFILT= <>
##$DTYPP= 0
##$F1P= 18.9103706918063
##$F2P= -1.10871071338519
##$FCOR= 0.5
##$FTSIZE= 0
##$FT_mod= 4
##$GAMMA= 1
##$GB= 0.15
##$INTBC= 1
##$INTSCL= 1
##$ISEN= 128
##$LB= 0.24
##$LEV0= 0
##$LPBIN= 0
##$MAXI= 10000
##$MC2= 0
##$MEAN= 0
##$ME_mod= 0
##$MI= 1.114404
##$NCOEF= 0
##$NC_proc= 0
##$NLEV= 6
##$NOISF1= 3.799351
##$NOISF2= 2.8
##$NSP= 1
##$NTH_PI= 0
##$NZP= 0
##$OFFSET= 15.70392
##$PC= 1
##$PHC0= -8497.518
##$PHC1= 13.00097
##$PH_mod= 1
##$PKNL= yes
##$PPARMOD= 0
##$PSCAL= 0
##$PSIGN= 0
##$REVERSE= no
##$SF= 200.130013532006
##$SI= 16384
##$SIGF1= 3
##$SIGF2= 2
##$SINO= 400
##$SIOLD= 16384
##$SREGLST= <1H.CDCl3>
##$SSB= 0
##$STSI= 0
##$STSR= 0
##$SW_p= 3612.71676300578
##$SYMM= 0
##$S_DEV= 0
##$TDeff= 0
##$TDoff= 0
##$TI= <>
##$TILT= no
##$TM1= 0
##$TM2= 0
##$TOPLEV= 0
##$USERP1= <user>
##$USERP2= <user>
##$USERP3= <user>
##$USERP4= <user>
##$USERP5= <user>
##$WDW= 1
##$XDIM= 8192
##$YMAX_p= 0
##$YMIN_p= 0
$$ End of Bruker specific parameters
$$ ---------------------------------
##NTUPLES= NMR FID
##VAR_NAME=  TIME,          FID/REAL,        FID/IMAG
##SYMBOL=    X,             R,               I
##VAR_TYPE=  INDEPENDENT,   DEPENDENT,       DEPENDENT
##VAR_FORM=  AFFN,          ASDF,            ASDF
##VAR_DIM=   8192,          8192,            8192
##UNITS=     SECONDS,       ARBITRARY UNITS, ARBITRARY UNITS
##FACTOR=    0.0002004,     1,               1
##FIRST=     0,             0,               0
##LAST=      1.6414764,     0,               0
##MIN=       0,             -504244,         0
##MAX=       1.6414764,     337586,          0
$$ Real data points
##PAGE= N=1
##DATA TABLE= (X++(R..R)), XYDATA
0 0 0 0 0 0 8 -8 8 -8 16 -24 24 -32 40 -48 56 -72 88 -104 120 -142 169 -196 225 -259 302 -345 391 -445
28 -445 506 -575 643 -723 813 -910 1015 -1133 1259 -1402 1555 -1720 1907 -2114 2337 -2586
44 -2586 2867 -3180 3533 -3932 4390 -4924 5546 -6296 7209 -8356 9836 -11847 14736 -19263
58 -19263 27415 -46656 185032 -61187 -449215 104981 277431 -162151 -278461 268637 320430
69 320430 -222795 -321917 208461 266157 -202723 -232318 238310 220773 -239819 -240178 199808
80 199808 196495 -174232 -133756 224969 134565 -251414 -188789 211580 202769 -142197 -157761
91 -157761 118665 87405 -173373 -100213 203225 143477 -177105 -159801 136312 134322 -119939
102 -119939 -95343 150685 106911 -151673 -118429 133532 114414 -102388 -60118 147083 71508
113 71508 -173174 -124156 128350 135763 -55927 -63761 68902 22034 -121075 -46656 148005
124 148005 119241 -83525 -117074 35072 73035 -45946 -57753 76928 91191 -67224 -115260
135 -115260 30055 84663 -50839 -88625 74377 119059 -75467 -158120 32900 141211 -15841
146 -15841 -97112 53840 85267 -114392 -139487 109978 175274 -69281 -157785 49517 111573
157 111573 -83390 -107258 109447 123335 -109505 -126965 105147 121493 -101579 -101809 127595
168 127595 122166 -116144 -125487 94358 104972 -83905 -61048 126841 67465 -160257 -112729
179 -112729 139539 132826 -91845 -94150 90212 55328 -127113 -57462 152547 83141 -141730
190 -141730 -85678 128192 66915 -137549 -63643 142054 64326 -139792 -66058 116374 25773
201 25773 -138785 -10820 169330 28197 -173800 -55076 136441 40526 -107892 2004
211 2004 118534 -25323 -144480 17136 152876 2353 -133072 -1200 114809 -11288
221 -11288 -108308 22336 109572 -20154 -96311 33634 98221 -38433 -102518 40675 116751
232 116751 -14778 -98952 5803 71605 -21827 -58983 49915 76451 -58279 -101618 35022
243 35022 96650 -19966 -77722 21162 59986 -39526 -63921 44067 63724 -50011 -68086
254 -68086 49316 66258 -54270 -75690 40835 66592 -34209 -52638 32589 29118 -56524
265 -56524 -34212 69997 54011 -59462 -63115 38285 53140 -24977 -30144 35638 24962 -44544
277 -44544 -25859 54128 39716 -47184 -43466 43444 50331 -30309 -44728 26751 40240 -24110
289 -24110 -28017 39191 31826 -52037 -45368 56087 63044 -42224 -64632 28541 49115 -32795
301 -32795 -37121 46052 33426 -65254 -48288 65377 55107 -64323 -61355 53026 50341 -54942
313 -54942 -44377 54275 30658 -67911 -29685 77780 34389 -84129 -46907 75201 49831
324 49831 -61713 -38231 58390 23757 -65528 -13984 81960 21821 -85907 -29211 85166
335 85166 38628 -70154 -29911 66787 23808 -62387 -7427 77175 9383 -83600 -10673 92819
347 92819 23975 -84600 -26614 73864 19833 -66466 -6037 69442 -6084 -83572 1768 89219
359 89219 4583 -91346 -16579 77720 13033 -68569 -5106 62027 -11361 -72880 11779 78292
371 78292 -11539 -87103 -2998 77345 6397 -68806 -6794 56521 -6111 -58114 15718 68254
383 68254 -14306 -75668 8360 81059 6631 -67873 -5920 60371 3188 -51887 10746 59612
395 59612 -13680 -67482 13082 78068 111 -73691 -4956 67422 7497 -54461 5035 55844
407 55844 -13463 -61742 18554 73544 -12491 -78879 477 70617 544 -64669 -513 51847
419 51847 -16665 -60148 21499 65896 -25057 -76789 15336 75120 -9114 -68236 5117 54642
431 54642 -16750 -53039 25803 55534 -34222 -66758 29595 70198 -22455 -67981 14960 55801
443 55801 -16079 -42527 30707 46697 -34532 -47581 41956 60561 -30977 -58623 24898 54402
455 54402 -16983 -39705 24941 33523 -34374 -35765 41397 44669 -37820 -49740 29803 49559 -19429
468 -19429 -38407 19985 29047 -27676 -26573 36075 30001 -42509 -42980 33113 40096 -30388 -41979
481 -41979 18075 26935 -24166 -21370 30590 18737 -41790 -28403 41747 37660 -33052 -37042 24100
494 24100 28127 -21628 -16839 28959 12433 -38038 -16985 42267 24457 -38366 -27219 33796
506 33796 29134 -22742 -15919 27482 11992 -29132 -2962 44302 12227 -46042 -19746 42105
518 42105 25175 -29377 -17336 23590 1937 -32974 1840 41779 -277 -48437 -7391 45306
530 45306 10666 -38017 -6694 31616 -1961 -32764 6572 31124 -17523 -41221 13686 43917
542 43917 -11141 -46701 -2119 29538 -4644 -19268 19070 21382 -28115 -30751 28103 40048
554 40048 -14201 -31588 11040 23837 -11105 -15188 19446 16412 -22654 -17655 25131 20708 -24415
567 -24415 -22384 24324 30389 -11420 -21002 8195 10172 -13472 -1332 31702 14412 -34571 -29599
580 -29599 21194 29103 -10204 -19725 7398 4564 -23300 -10510 26361 14840 -26134 -19405 21783
593 21783 16696 -24023 -21295 19273 22265 -12932 -16913 8554 2325 -23915 -6508 35315 21710
606 21710 -32703 -37468 11738 29227 -1283 -9458 15865 9678 -27635 -19674 32386 35272 -18907
619 -18907 -30023 19464 28682 -22204 -30431 24025 35572 -16828 -27636 20851 20058 -36023 -26773
632 -26773 48488 49577 -34229 -52847 17378 35272 -20260 -18660 42270 23797 -58384 -45404
644 -45404 46441 47312 -38483 -40745 36074 28497 -50470 -36878 49470 38032 -45974 -30434 50530
657 50530 21514 -68377 -33881 71770 49576 -53783 -43347 39456 16470 -54767 -5116 81520
669 81520 21822 -85275 -38221 69482 35340 -53503 -10523 67173 6178 -77135 -9685 78399
681 78399 15249 -65889 -14 73020 -4146 -83414 -6379 77931 14581 -56377 1579 48498
693 48498 -26861 -67977 27195 85322 -4721 -74866 -9260 45470 -8696 -39052 27758 51111
705 51111 -29580 -64573 10391 50313 -11068 -40056 19085 41451 -23276 -51626 7416 39068
717 39068 -2408 -19329 19241 21251 -33965 -42450 21657 53334 8030 -29836 -11415 6287
729 6287 -9373 -7458 27041 32477 -10776 -36017 -7643 22653 11017 -8476 3826 20357 2093
742 2093 -26666 -15690 17786 18769 -4707 -1506 16199 -3928 -40544 -19833 39390 41705 -16268
755 -16268 -35692 670 7943 -22434 -4944 45901 23636 -48894 -43614 28983 32636 -27495 -20195
768 -20195 39675 21466 -50307 -34738 39858 28622 -36615 -13276 52846 13697 -69023 -32859
780 -32859 60804 41986 -36555 -19136 37247 -3620 -60023 3066 80749 21992 -66298 -25604
792 -25604 49284 10565 -46072 8613 64125 -2045 -65834 -3888 55613 -3373 -51045 17764
804 17764 62936 -13502 -68274 -1924 50484 -1819 -32895 24070 37155 -41590 -61044 26326
816 26326 63502 -7953 -44739 6656 21774 -30016 -28259 37355 38698 -30328 -39554 19387 24890
829 24890 -26352 -22384 32089 29343 -23454 -26487 14020 10525 -19418 632 37906 13461 -37331
842 -37331 -27517 18743 23592 -550 1487 10379 -10263 -26315 1452 31012 14606 -12809 -7934
855 -7934 6351 -1452 -9162 3763 13375 2422 -5029 208 -1729 -11969 -7829 9087 14986 3728
869 3728 -8980 -14983 -12929 1019 16587 14688 -4447 -15608 -11131 -3275 3517 12045 9948 -8673
883 -8673 -17498 -2242 8335 -995 -6399 5662 9145 -4738 -8839 2591 3117 -6626 2161 20579
897 20579 9801 -18819 -17935 7925 15340 3699 3837 6896 -10368 -21500 2571 26285 9769
910 9769 -15686 -7818 8305 30 -8442 6664 14255 -4762 -13463 6651 13034 -10930 -18417 8086
924 8086 18850 -4153 -15398 -1347 1292 -12295 -1968 21275 9401 -24088 -21028 11394 16075
937 16075 -4985 -4932 9148 -2441 -19494 -509 22790 4131 -22068 -5292 18799 3399 -19317
950 -19317 -3257 16205 989 -11217 9050 17483 -11390 -22724 10671 30424 1133 -20738
962 -20738 -296 13229 -5292 -7412 17619 15169 -20149 -22518 15037 23323 -9849 -18777 8385
975 8385 13435 -11018 -10537 14953 9059 -19690 -10994 21870 14248 -22087 -20277 12734 14460 -10765
989 -10765 -9045 9941 -1165 -21919 -4218 24653 9564 -23378 -15332 15464 12277 -10214 -5118
1002 -5118 12048 965 -15028 1144 20060 2453 -21070 -6545 19260 10747 -12262 -8274
1014 -8274 8239 4300 -6260 4034 14668 -618 -17176 -2350 20308 11677 -11255 -10880 6265
1027 6265 7348 -3833 -2271 7250 -1105 -14677 -4664 16134 8509 -16379 -14707 9620 12813
1040 12813 -5888 -9516 4590 2534 -11213 -3119 15769 6197 -20473 -14984 14221 14878 -11563
1053 -11563 -14593 5637 6068 -10081 -3302 15645 4461 -19815 -9040 20925 15749 -13844 -13798
1066 -13798 10827 11350 -7555 -3965 13217 2542 -17800 -4189 22191 11423 -18743 -13619 14485
1079 14485 13101 -8313 -5977 11125 2546 -14775 -1272 20716 6507 -22090 -12300 16988 12423
1092 12423 -12993 -10738 7810 1923 -13294 -1025 16344 250 -22708 -7675 19751 10750
1104 10750 -15518 -11036 8970 4805 -8995 -107 12293 -2736 -19100 -2134 19595 6480
1116 6480 -17069 -10351 10666 8195 -6103 -829 9134 -1714 -12103 3896 19224 3555 -16225
1129 -16225 -6217 13769 9977 -5639 -3992 4634 -1111 -7072 4169 13140 -1258 -15623 -3863
1142 -3863 13784 7904 -8335 -6991 3161 1379 -3034 3177 6475 -5033 -13470 -1414 11928
1155 11928 4499 -11423 -9724 2289 3834 -1461 -598 1532 -4911 -8349 2174 10962 2404 -10732
1169 -10732 -7329 5628 7910 -306 -3539 -677 -1552 -2183 4452 8091 -970 -10158 -3580 9288 9128
1184 9128 -1332 -5492 -1413 2212 2516 5031 5576 -2344 -8452 -849 10067 6504 -5539 -7074 972
1199 972 3994 320 125 257 -4581 -6002 2657 9551 427 -11400 -7318 4465 5721 -616 -2054
1214 -2054 -2280 -7634 -4812 6799 9039 -4780 -11965 -2559 6295 1705 -2489 733 -322 -5599 -1284
1229 -1284 8971 4521 -9460 -6969 8714 9754 -2790 -5255 1208 240 -2880 6034 12726 -1010
1243 -1010 -15407 -4609 14088 10023 -5103 -3796 3903 -1730 -6662 6202 13745 -3559 -15313
1256 -15313 755 15149 -144 -14590 -1564 11435 -304 -9420 3068 6958 -11429 -14914
1268 -14914 11638 20393 -7520 -22716 -1109 12364 -2473 -6724 10416 6475 -18850 -15592 16492
1281 16492 18804 -10697 -15723 9104 11203 -11365 -9558 13327 9182 -12798 -5028 17698 5984
1294 5984 -20522 -9911 20729 16245 -9597 -9396 5900 258 -10078 6167 22619 3171 -22808
1307 -22808 -11112 14619 10699 -6586 -2341 8404 -2143 -13898 -1350 12577 1432 -11326
1319 -11326 -415 12353 -110 -16352 -7062 9748 8290 -1563 -2422 -1737 -9667 -10178 6173 16469
1333 16469 4840 -12835 -14169 -2320 5894 6256 3299 742 -2855 -6013 -4455 3395 8766 2770
1347 2770 -4762 641 8014 -883 -13658 -3665 16373 12941 -7028 -7957 3341 -3518 -10937 9674
1361 9674 27764 2427 -28186 -12720 18444 10258 -9692 3273 17503 -8312 -28568 1732
1373 1732 28243 1037 -24408 2057 24241 -8378 -32177 1748 29035 134 -21583 6725
1385 6725 18729 -20479 -32050 18486 41666 -5585 -36676 -1801 19989 -10973 -17241 25016
1397 25016 28892 -25339 -38066 15014 33064 -11692 -22907 21191 25521 -23397 -28382 21113
1409 21113 26817 -17111 -15131 29021 17739 -35985 -27661 30306 32297 -14906 -17438 14922 2514
1422 2514 -30177 -4854 40586 19497 -30745 -22182 17441 10212 -17280 -747 25206 3232
1434 3232 -27309 -10102 17123 2676 -17293 2454 21816 -223 -26116 -12507 11770 9418
1446 9418 -313 4878 5487 -12906 -20240 1969 22164 13894 -6402 -12029 -5438 -1162 601 6380
1460 6380 9660 3417 -7135 -8627 -214 6334 2907 -12 6301 9940 -2281 -15699 -7411 12406
1474 12406 14696 1609 -2394 -346 -9741 -16474 4733 27285 11371 -20244 -17089 6818 5364
1487 5364 -8559 4367 20357 -1382 -27283 -7490 21798 3988 -20395 940 25353 -1953
1499 -1953 -32456 -7273 23074 3015 -16985 9028 21461 -18046 -36132 9033 39203 3482
1511 3482 -24788 1039 15316 -14769 -18818 23647 30875 -15528 -30245 10115 22647 -12773
1523 -12773 -17648 20001 22679 -16513 -21055 13665 15161 -15632 -8353 27523 17263 -26056 -24898
1536 -24898 15141 20911 -6973 -5759 13746 -915 -28097 -9467 27743 16538 -18927 -14897
1548 -14897 11040 4226 -16783 -2476 20235 5103 -18786 -5649 14654 -1465 -19750 794
1560 794 22494 4798 -18701 -8917 6548 -1291 -5195 11679 14398 -10489 -21564 932 17672
1573 17672 6078 -3793 2286 2466 -8066 -4639 10315 9939 -3957 -5512 4219 3893 -4668 -4212 3279
1588 3279 5937 3027 1316 -1767 -6141 -5156 3596 9872 5847 -2872 -8568 -7520 277 8052 6590
1603 6590 -2020 -7331 -5081 -1523 1034 3384 2112 -3278 -4856 138 3110 -1664 -4769 -432 5606
1618 5606 2788 -3141 -3326 -2168 -3087 1138 8238 6146 -6286 -11704 -1133 8325 5965 -98 -132
1633 -132 -1192 -5485 -1506 9371 8526 -4909 -7309 4413 6952 -2741 -4162 4392 3236 -4033 131
1648 131 7386 -1169 -12091 -1675 13291 6351 -9275 -6246 3271 -780 -4224 6327 9112 -7353
1662 -7353 -15407 2004 13116 -469 -10384 107 4998 -5326 -6102 6961 5949 -9888 -8496
1675 -8496 9455 10050 -8465 -11306 4808 8835 -3232 -3440 6697 1613 -11708 -3792 14894 9857
1689 9857 -10862 -10430 7088 8615 -4027 -2424 8681 2075 -11160 -1831 15228 6365 -13551
1702 -13551 -7204 12576 8178 -8886 -5439 8363 1433 -10361 940 14210 -542 -18138 -4452
1715 -4452 15654 6156 -12539 -5665 7725 276 -9383 2528 11970 -3571 -16577 -895 14951
1728 14951 3060 -13262 -4710 8611 1882 -7181 1205 8166 -3757 -11824 2632 14903 1483
1741 1483 -13452 -3962 11448 5933 -6250 -1169 7723 -999 -8967 3415 14720 529 -15205
1754 -15205 -3387 14345 6375 -9697 -3924 8062 1039 -8336 2447 12068 -2244 -15613 -1508
1767 -1508 15278 3934 -13237 -5238 8656 1896 -8749 643 8965 -4267 -14471 1100 14886
1780 14886 1348 -15429 -5601 10738 3638 -8799 -1511 7688 -2691 -11784 2333 14692 70
1793 70 -15830 -3833 14020 5517 -9751 -3160 8301 441 -8745 3327 13526 -1707 -14984
1806 -14984 63 16399 4651 -11863 -3530 9600 1755 -7141 2881 11216 -3333 -13808 1652
1819 1652 16222 1898 -14507 -4132 10249 2646 -8877 -246 7670 -3823 -12156 3249 14089
1832 14089 -1455 -15576 -3003 11941 3089 -9348 -1613 6642 -3086 -9634 4001 11956 -4406
1845 -4406 -14954 186 13793 1800 -10533 -1569 7433 -1112 -6212 5631 9689 -5061 -11609
1858 -11609 4514 14169 388 -10494 -271 8292 512 -4534 4031 6094 -5769 -7660 6582
1871 6582 11659 -2777 -10245 228 8322 1238 -3958 1511 2413 -5342 -4316 6314 7003 -5587
1885 -5587 -10072 246 6522 301 -4885 -1046 112 -3122 -1868 4314 3120 -5622 -6249 2234 6592
1900 6592 383 -5730 -3014 1434 1526 562 1683 286 -4768 -4446 3574 7723 826 -5986 -3043 3921
1916 3921 3962 474 995 1622 -1596 -2409 3751 6301 -979 -6688 -193 6715 2452 -4445 -2016 1234
1932 1234 -1028 -440 4833 3737 -6346 -8066 2775 8193 1138 -4661 -1859 -2 -3254 -955 5527
1947 5527 2209 -7805 -6330 4461 5241 -4820 -5148 2889 2554 -3467 -1148 4222 -1287 -8199 862
1962 862 11389 3052 -10142 -5811 5790 3444 -2855 2959 6641 -5539 -11390 4094 14472 717
1976 717 -10221 134 9080 -1754 -7211 6029 9955 -5445 -9072 8297 10230 -9437 -12533
1989 -12533 8705 13956 -5487 -10733 4090 3894 -10596 -3722 16274 8520 -16858 -14206 10353
2002 10353 10894 -8019 -5809 10404 1675 -16293 -5380 15545 5841 -15457 -5883 14381 3812
2015 3812 -16890 -6081 14363 5885 -10743 -466 12127 -3545 -17501 2819 22773 5205
2027 5205 -16703 -5864 9934 374 -8091 7142 14894 -5968 -18035 1546 15855 1006 -11236
2040 -11236 2932 12215 -3407 -12280 2234 10179 -1810 -6179 6672 7778 -9268 -14294 2650
2053 2650 13004 3191 -6006 -3661 -2232 -5818 -2133 8009 8957 -3179 -11142 -5541 3986 4547 -478
2068 -478 -1368 1946 453 -5281 -5638 2857 5807 -707 -2664 4473 3236 -10060 -10286 9029 16867
2083 16867 343 -11288 -1045 4635 -6060 -3269 15984 14399 -13028 -18986 6833 15864 -4848
2096 -4848 -8945 11034 10817 -15193 -15033 13030 14631 -11793 -10298 17337 11676 -22199 -18583 17879
2110 17879 19243 -12013 -12318 13203 2876 -25115 -8586 29529 16169 -24990 -18540 15986 8539
2123 8539 -19113 -3396 26277 5103 -29240 -9599 24592 6746 -23568 -1372 27979 2313
2135 2313 -29749 -6294 24105 4288 -17794 6014 23668 -9423 -30956 3884 32134 5010
2147 5010 -20454 164 14973 -8973 -18201 14064 26433 -7167 -23628 3181 16991 -6727
2159 -6727 -14706 10755 17867 -7958 -17655 3994 10614 -8002 -8305 14254 13402 -13905 -19568 3614
2173 3614 13722 23 -4356 4823 76 -14653 -9017 11662 13660 -3960 -10166 -523 2735 -4260
2187 -4260 -2655 6947 6928 -2753 -5263 -215 1179 -2452 -698 7009 7760 -1092 -9329 -6280 3865
2202 3865 8781 4197 531 -658 -4119 -7795 -768 12178 10232 -5392 -10360 1255 5059 -3642
2216 -3642 -2655 8773 6166 -9389 -8792 6319 4974 -8827 -3786 13454 7310 -14803 -13312 7493
2230 7493 8438 -5689 -1168 10474 -2372 -20051 -5636 19050 10268 -12271 -7348 8566 -217
2243 -217 -12932 2305 17470 1139 -16417 -1563 14205 -833 -15168 2612 18537 1183
2255 1183 -15096 -917 10786 -3294 -9423 11025 17069 -8102 -20094 2347 16492 613
2267 613 -8326 5965 7340 -12025 -11820 11635 14896 -8179 -12520 7057 9068 -10023 -9362 9751
2281 9751 8720 -8978 -6328 9021 2302 -14718 -5388 15221 8828 -12113 -9253 5532 1521
2294 1521 -7379 2626 12400 -1978 -16304 -2985 12697 4290 -7871 -628 7895 -1792 -8855
2307 -8855 2421 9612 -1665 -8000 4001 9858 -3420 -11214 1505 10647 1540 -4365 2134 2844
2321 2844 -6171 -5001 8914 10827 -4407 -9959 461 6426 -443 -2611 3852 2441 -6655 -5091
2335 -5091 5589 5354 -5356 -6099 3736 5261 -3705 -6043 1086 2768 -1673 -1007 3433 529 -7345
2350 -7345 -5237 4869 7299 -1264 -6246 -2226 2222 183 -200 3242 2497 -4280 -4809 3259 7468
2365 7468 -498 -6113 330 6747 1472 -4494 457 4482 -1219 -3743 4445 7291 -4236 -10132 2428
2380 2428 11024 1265 -7623 -730 5125 -2402 -5673 5685 8626 -6010 -11082 4032 10840 -2601
2394 -2601 -10672 1026 7992 -3680 -8235 4233 6666 -7718 -10025 7769 10878 -7043 -12381
2407 -12381 3683 10428 -3396 -7414 5136 5536 -8782 -7612 10220 10788 -8636 -11836 6703
2420 6703 10968 -5213 -7681 6566 6928 -7634 -5477 11065 8025 -10245 -8930 10242 10839 -6649
2434 -6649 -8615 6195 6740 -7021 -4463 9575 4948 -11333 -7404 11195 9530 -8548 -9313 6331
2448 6331 6696 -6365 -4693 7407 3415 -10874 -6115 10699 7183 -10706 -9586 7016 7760 -6780
2462 -6780 -6432 6054 3677 -9063 -4282 11017 6048 -11131 -8473 9395 9198 -6548 -6893 6386
2476 6386 4881 -7267 -3104 10328 4780 -11410 -6443 11261 8705 -8042 -7097 7290 5942 -6047
2490 -6047 -2789 9058 3182 -10385 -3718 11688 6992 -10129 -7855 7723 6291 -6572 -4079
2503 -4079 6523 1603 -9933 -3123 10913 4071 -11275 -6779 8823 5987 -7317 -5003 5759
2516 5759 1835 -8058 -1747 9400 1749 -11448 -4917 9872 5635 -7336 -5137 5581 2901 -5543
2530 -5543 -224 8154 689 -9337 -1849 10631 5144 -7678 -4684 6481 4107 -4450 -1023 6193
2544 6193 289 -7590 -173 10012 2800 -9186 -4189 7488 4342 -4590 -2097 4796 -377 -6414
2558 -6414 805 7972 60 -9684 -3061 7785 2810 -6417 -3057 3340 -469 -4794 1253 6024 -2389
2573 -2389 -9006 -61 8493 1466 -6440 -2109 3816 195 -3003 2449 4409 -3640 -6693 2339 7462
2588 7462 -520 -6403 -164 4696 350 -2259 2268 2580 -3678 -2939 5816 6257 -3254 -6295 1634 5269
2604 5269 148 -1773 1895 403 -4387 -1042 5866 3224 -5161 -4535 3146 3413 -2018 -2003 1807 -521
2620 -521 -3496 509 4631 -1159 -6769 -1336 4804 2004 -4081 -2675 582 -1167 -1372 3143 3751 -3759
2636 -3759 -6450 754 6018 1461 -2846 -867 1107 -1304 -1042 3261 2546 -3034 -3289 3077 4481 -1025
2652 -1025 -3719 284 3596 1409 -228 770 -178 -2584 -745 4713 5020 -1737 -5853 -1540 3248 2643
2668 2643 -276 -200 -146 -2436 -2975 1948 4193 -735 -4988 -1207 3804 481 -5016 -2323 3422 1643
2684 1643 -2227 -1003 1638 -2905 -6177 1678 8838 2029 -8841 -5478 4548 3300 -2847 1181
2698 1181 5622 -2598 -9684 514 11210 2319 -9015 -918 9610 502 -9687 172 10351
2711 10351 616 -8120 2947 10414 -4955 -13540 4015 16449 450 -13299 -717 8989 -3977
2724 -3977 -8872 8853 13553 -9048 -17132 4666 14790 -4440 -12097 6451 10579 -9417 -13056
2737 -13056 8091 11584 -9269 -10773 10609 10802 -13404 -14759 10116 13616 -7147 -8982 8541
2750 8541 4542 -14522 -6999 17385 12068 -13234 -12485 8952 7957 -9131 -3132 13612 5125 -14563
2764 -14563 -6413 13074 6275 -11219 -2923 13745 4515 -13243 -5968 10737 4988 -6702 918
2777 918 9705 -2559 -14437 -1960 13985 6371 -7606 -4876 2742 -2152 -5872 3443 9225 -260
2791 -260 -9181 -3756 4255 1315 -3913 -237 4670 1531 -4931 -4567 351 2410 94 674 2743 221
2807 221 -6913 -6819 3932 10543 3240 -6061 -4314 1314 -844 -2345 6076 9590 -2663 -11488 -770
2822 -770 9410 1231 -6917 2664 10026 -2315 -11900 332 10244 -55 -7114 5611 10616 -7887
2836 -7887 -16319 3511 16786 954 -10595 958 6049 -9350 -11288 11194 16219 -7921 -17113
2849 -17113 3350 11339 -6993 -10306 10357 11863 -10771 -13969 7989 10334 -10319 -8460 14437
2862 14437 11373 -15036 -15051 9656 11731 -7563 -4895 12262 3268 -18467 -7729 18400 12295
2875 12295 -11565 -7789 9932 2917 -12721 -509 16768 4182 -14310 -3597 12418 807
2887 807 -12802 920 15388 1992 -13243 -3327 7985 -1307 -7435 6406 12436 -4923 -15721
2900 -15721 -1492 11024 2365 -5422 1806 3686 -7653 -9080 5052 9688 -2601 -7584 1207
2913 1207 3763 -4629 -5322 4333 5904 -1592 -3359 1573 -68 -5176 -908 7533 6052 -3053 -5971
2928 -5971 -1905 719 1354 4166 4105 -1530 -5796 -2100 2975 3717 2323 715 -956 -2069 -152 1316
2944 1316 117 411 2329 1704 -1859 -2690 -700 -195 164 3201 4472 -2283 -7670 -2790 4318 3197
2960 3197 -610 339 -329 -5721 -4628 3958 6813 -1751 -5823 133 2503 -3257 -3088 3896 3455 -3843
2976 -3843 -2980 4371 1225 -6486 -2071 7746 5204 -4993 -4367 2677 765 -2966 2915 7788 -1147
2991 -1147 -9929 -2118 8108 3367 -4077 368 4627 -2525 -6157 3318 7476 -2137 -6432 3122 6809
3006 6809 -3758 -8017 2901 6789 -2321 -4876 3722 2770 -8063 -5697 8601 7767 -6685 -8214
3020 -8214 3394 4020 -4955 -1754 7668 1423 -10222 -4250 8795 3434 -8064 -3229 7290 1786
3034 1786 -7682 -1187 7090 37 -7476 1996 9316 -1251 -9889 -155 9773 2162 -5687 531 5172
3049 5172 -2649 -5676 4360 9325 -2356 -8867 836 7617 -24 -5234 1305 4964 -2166 -4957
3063 -4957 3205 5363 -3499 -6451 2738 7162 -1878 -7505 -15 4824 -772 -3764 1917 2972 -5008
3078 -5008 -6270 3148 6917 -1361 -6958 -402 4410 -175 -3292 1333 3230 -2554 -4678 2647 5600
3093 5600 -2117 -6454 1020 6120 666 -4670 -482 3765 -406 -3248 2442 5658 -1845 -6833 1293
3108 1293 8187 1547 -6194 -1216 5120 636 -3943 1640 5898 -1949 -7327 1620 8328 -330 -8436
3123 -8436 -1060 6598 466 -5892 342 5153 -2488 -6762 2545 7790 -2359 -9202 195 7871 -183
3138 -183 -6897 221 5087 -2484 -5932 3620 7196 -3281 -8586 1884 8636 -446 -7284 641 5803
3153 5803 -1345 -4836 3360 6479 -3509 -7234 3645 8813 -1418 -7249 849 6463 -654 -4636
3167 -4636 2842 5305 -3760 -6066 4237 7612 -3250 -7838 1788 6939 -1131 -5407 1684 4085
3181 4085 -3408 -4937 4265 5835 -4347 -7646 2195 6865 -1589 -5659 692 3772 -2591 -4039 3046
3196 3046 4225 -4551 -6284 3090 6701 -1941 -5769 848 4165 -1223 -2935 2695 3912 -3604 -4576
3211 -4576 4107 6591 -2353 -6106 1297 5416 -474 -3231 2175 3179 -3157 -3286 4599 4642 -3496 -5508
3227 -5508 2498 5184 -952 -3678 1039 2333 -2246 -2238 3423 2682 -4391 -4447 2442 4326 -1446 -4482
3243 -4482 229 1827 -1609 -1821 2460 1452 -3940 -3529 2958 3909 -2264 -4244 612 3113 -648 -1555
3259 -1555 1248 1130 -2611 -1904 3872 3266 -2413 -3649 1460 3731 32 -1315 1117 1047 -1931 -595
3275 -595 3751 2060 -2922 -2301 2687 3286 -1136 -1923 1051 1047 -1692 16 3193 125 -3840 -1497 3367
3292 3367 1942 -2355 -2665 943 701 -1537 367 1794 -1450 -4343 -194 3973 1229 -3687 -2153
3307 -2153 1352 411 -1851 859 1778 -1915 -3464 1804 4108 -1252 -4069 230 3386 266 -1931
3322 -1931 1443 1631 -2781 -1190 4604 4105 -3626 -4165 2541 3935 -738 -980 2516 1050 -4219 -881
3338 -881 5294 2821 -4878 -2814 4296 2387 -4042 -1815 3614 673 -3581 26 4535 -1179 -6220
3353 -6220 -835 6339 1529 -5187 -2291 2521 -797 -3412 1850 4651 -2960 -6848 57 5815 447
3368 447 -4531 242 3452 -1298 -3940 1633 4172 -2076 -3587 2403 4552 -2185 -5237 966 5155
3383 5155 1011 -1883 671 1134 -2466 -1764 4480 5091 -1816 -4894 -80 3123 1221 -883 1107 1607
3399 1607 -1633 -3107 930 2426 -518 -2184 325 3150 -130 -3815 -2046 2946 2516 -580 -1711
3414 -1711 39 -1470 -3487 124 5373 2417 -4940 -5347 1379 3212 -1469 -1407 3124 1320 -5312 -2952
3430 -2952 5061 3921 -4396 -3154 5781 3544 -6601 -4699 6081 5275 -4089 -2101 5875 924 -9085
3445 -9085 -1923 10968 6372 -8315 -5528 6172 2687 -6049 134 10220 1025 -11231 -3105 10031
3459 10031 2471 -9454 -1039 9962 124 -11677 -1691 9092 345 -8700 1977 9882 -3806
3472 -3806 -13640 759 12917 1269 -9498 -184 6505 -5062 -9420 5979 12426 -3869 -12056
3485 -12056 1475 8794 -3185 -7301 5320 9170 -5153 -9193 4228 7489 -4742 -5700 8091
3498 8091 8280 -6775 -9296 3777 7538 -1853 -2711 5323 2311 -8835 -5254 8216 7696 -3471
3512 -3471 -5151 2028 1509 -4027 -855 5900 2988 -4620 -3688 1856 947 -3556 -833 4166 2511 -3051
3528 -3051 -4452 -1225 517 976 1606 2230 -649 -4719 -4042 1233 5107 2977 -1747 -3497 -1280 -239
3544 -239 -45 1536 3766 1427 -3492 -2897 2185 2158 -2008 -660 5038 2879 -5020 -4377 3301 3895 -977
3561 -977 179 4851 -119 -8214 -2901 8006 6256 -4209 -3856 2757 -91 -6363 553 9082 1619
3576 1619 -8733 -3061 6371 477 -7495 205 8696 374 -9007 -2152 5843 -1472 -6759 3935
3590 3935 9324 -3652 -11724 -557 8539 672 -4644 2546 5017 -6326 -8274 5515 9938 -2432
3604 -2432 -7609 2717 5362 -5006 -5478 6118 7117 -4658 -5260 4831 3419 -6208 -3455 8143
3618 8143 6734 -5802 -5790 3401 2726 -3892 465 7894 819 -9887 -4179 6863 3804 -4189 -1028
3633 -1028 4194 -1606 -6856 354 6864 -330 -5602 383 4619 -2361 -6754 1125 5641 -134 -3792
3648 -3792 1170 1517 -4302 -3445 5322 5662 -2711 -5295 155 1986 -1233 381 4220 1147 -4652 -2476
3664 -2476 3712 2733 -1519 -552 2589 679 -2492 -535 1886 975 -706 1734 2426 -1319 -3362 -700
3680 -700 3077 2237 390 -944 -1171 -2119 -566 2232 2639 -157 -2498 -1789 -42 1096 560 -217 -611
3697 -611 -553 -119 -632 -534 -50 -101 58 571 846 -1185 -3014 -540 2767 2445 -1366 -2230 -155 -115 -530
3716 -530 1589 3413 -525 -4299 -648 3861 1767 -2131 -435 2847 -402 -2856 1051 3692 -1205
3731 -1205 -3902 2223 5078 -1257 -5449 705 4863 -197 -3467 1764 2760 -3987 -4570 4114 5934
3746 5934 -3181 -6312 1726 4085 -2366 -3164 3160 2871 -4773 -4258 4515 3875 -5074 -4697 4320 4302 -4153
3763 -4153 -4110 3380 3084 -4200 -2232 5541 3089 -6617 -3783 6140 4888 -4392 -3592 4491 2706 -4596
3779 -4596 -1123 6387 2022 -6604 -2357 6660 3196 -4934 -2727 5245 2226 -4455 -1182 5012 605
3794 605 -5613 -569 6404 1430 -6139 -2625 4865 2217 -4136 -1239 3483 -306 -5294 -650 5186
3809 5186 642 -6055 -2047 4466 2173 -4132 -1881 3358 755 -3983 -500 4547 503 -5321 -1431
3824 -1431 5470 2349 -4543 -2340 3678 1663 -3184 -286 4035 474 -4465 -413 6104 2219 -4787
3839 -4787 -2141 4269 2457 -3170 -1031 3708 404 -4373 -270 5459 1098 -5452 -2079 4433 2248
3854 2248 -3638 -1669 3305 592 -3689 -260 4628 441 -5705 -2007 5013 2057 -4614 -2293 2944
3869 2944 1201 -3365 -527 4005 219 -5403 -950 5142 1992 -4767 -2107 3974 1929 -3236 -477
3884 -477 3771 34 -4214 211 5378 1176 -4825 -1198 4499 2027 -3251 -750 3375 151 -3365
3899 -3365 976 4767 -21 -5149 -733 4736 1627 -3565 -1080 2832 264 -2903 457 3478 -601
3914 -601 -4805 -118 4648 608 -4370 -1518 2803 141 -2696 379 2414 -1393 -4160 757 4095
3929 4095 -504 -4579 -678 2995 84 -2278 159 2038 -1352 -2577 1776 3716 -1432 -3444 455
3944 455 3247 663 -1696 489 1256 -1061 -1374 2141 2333 -1784 -2939 1183 3043 270 -1791 -6
3960 -6 1212 -233 -420 1591 1212 -2437 -2106 1909 2327 -911 -1987 -312 973 -277 -615 480 -41
3977 -41 -1961 -1035 1743 1388 -1520 -2270 0 959 164 -426 156 -413 -1120 229 1975 590 -1933 -1707
3995 -1707 889 1532 183 -486 -205 -10 -788 72 1942 744 -1365 -987 1544 1959 -443 -1186 462
4012 462 936 -500 142 1431 2 -1851 -214 2371 1298 -1880 -1731 548 1408 -663 283 1662
4028 1662 -657 -3063 -418 3198 725 -3047 -1676 1778 444 -2465 -532 2095 -519 -3025 790
4043 790 3343 -978 -4353 265 4288 724 -3265 -214 2270 -911 -2522 2520 4369 -1984 -4973
4058 -4973 1449 4814 -165 -3381 1705 3518 -2085 -3303 3070 4462 -2901 -3837 3422 4787 -3280
4073 -3280 -4677 2986 4762 -2092 -2686 3116 2383 -5132 -3036 5649 4385 -4628 -4682 2798 2759 -3523
4089 -3523 -1640 4576 1619 -5955 -2633 4788 2467 -5081 -2419 4566 1871 -4526 -2082 4155 1305
4104 1305 -4006 -153 4964 109 -5787 -1415 5565 2713 -3032 -1349 2040 -394 -2574 1842 4964
4119 4964 332 -4396 -1115 3809 1273 -1730 486 2450 536 -2430 -519 2122 436 -1695 898
4134 898 2535 55 -3477 -2231 1827 2651 463 -1527 -668 -684 -1979 -556 2641 2425 -2068 -4497
4150 -4497 -162 2551 -51 -2325 878 2335 -1630 -3795 561 3365 -1051 -3196 2080 3989 -2624
4165 -2624 -5845 1284 5819 -48 -3657 1481 3159 -4175 -4522 5036 7027 -2638 -6496 1850 5051
4180 5051 -2503 -3444 4769 5412 -4861 -5947 4365 5039 -4377 -4328 5877 5311 -6254 -6786 4458
4195 4458 4957 -3903 -2818 6309 2108 -8457 -4759 8083 5779 -5710 -4446 4697 1250 -6999
4209 -6999 -1506 8334 2291 -8346 -3211 6370 1504 -6984 -384 7942 1177 -7228 -1634 5904 48
4224 48 -5174 2547 7735 -1110 -8330 -563 6422 1345 -3472 1811 3844 -3351 -5668 3145 6476
4239 6476 -626 -4557 1034 3224 -2371 -3533 2903 4242 -1983 -2800 1430 1680 -2604 -2063 3634 3055
4255 3055 -2068 -3819 -545 675 -462 1007 2657 -250 -3719 -2562 934 2163 594 -336 -922
4270 -922 -1605 -1107 19 717 730 951 20 -967 -934 -88 -144 299 1698 2041 -576 -2942 -1375 2058 1868
4289 1868 419 1024 411 -2674 -2643 2228 4680 354 -2949 -203 1407 -1359 -1660 2604 3111 -1924
4305 -1924 -2903 1385 1867 -3178 -2164 3799 3371 -2958 -3481 1190 1248 -2361 -30 4131 613 -5819
4321 -5819 -3313 3430 2951 -2345 -942 2623 -925 -4348 77 5098 470 -4043 -128 3725 -816
4336 -816 -4219 677 4771 -238 -3042 1194 2622 -2535 -3690 3655 5699 -1355 -4616 1185 3040
4351 3040 -1568 -1139 4125 2348 -4645 -3697 3575 3401 -2858 -2125 3159 1136 -4105 -1641 3813 1291
4367 1291 -3702 -416 4017 -141 -5454 -1307 4476 1285 -3358 -182 2028 -2056 -3998 2082 5414
4382 5414 -357 -5473 -67 3269 -595 -2877 1844 3088 -2195 -3694 2026 3392 -1824 -2957 2425
4397 2425 3308 -1523 -2835 1399 2412 -1140 -771 2764 1506 -3247 -2189 2897 3451 -880 -2024 846
4413 846 945 -1409 -33 2343 1094 -2413 -1785 1461 1583 -1426 -1719 857 873 -1096 -1283 246 462
4430 462 -1223 -513 1675 853 -1771 -2642 197 2253 231 -1668 -451 424 -818 -1244 1139 2002 -854
4447 -854 -2604 82 2685 602 -2103 52 2356 60 -1810 497 2351 -484 -2439 1331 3572
4462 3572 -393 -3607 -15 3646 601 -2395 826 2649 -1554 -3228 1680 4150 -1103 -4510 467
4477 467 3708 -472 -3676 387 3051 -1676 -3618 1673 3173 -2191 -4834 1399 4155 -1629 -4082
4492 -4082 1059 2936 -1783 -2915 2080 2803 -3214 -3429 2508 4216 -1814 -3851 1527 3270 -1255
4507 -1255 -2431 2431 2963 -2349 -3020 3075 3590 -2239 -3470 2255 3504 -1363 -2540 1785 2351 -2076
4523 -2076 -2106 3191 2909 -2842 -3555 2652 3347 -1498 -2867 1569 1974 -1726 -2400 2596 2088 -3080 -2925
4540 -2925 2191 2855 -1911 -3342 1469 2150 -1805 -2046 2129 1317 -2895 -2726 2389 2746 -2492 -2981 1430
4557 1430 2683 -1413 -1565 1735 1291 -2420 -1810 2796 2635 -2358 -2684 2230 2540 -1386 -1666 1658 1778
4574 1778 -1922 -1053 2563 2060 -2474 -2113 2354 2848 -1613 -2192 1188 1634 -1616 -1219 1901 1057 -2487
4591 -2487 -1768 2131 1871 -2290 -2525 969 1428 -1084 -1190 1266 505 -2189 -1254 2073 1479 -2113 -1791
4608 -1791 1349 1855 -715 -1317 792 962 -1360 -702 1967 1274 -2108 -1588 1928 2071 -880 -1344 963
4625 963 1090 -670 -164 1860 817 -1931 -958 2224 2050 -1515 -1386 1263 1159 -907 -223 1296 -10
4642 -10 -1905 -510 1844 841 -2124 -1195 1249 802 -1082 -492 710 -227 -1364 319 1575 -226
4658 -226 -2580 -756 1695 490 -946 -257 178 -639 -1107 1024 1765 -864 -1907 460 1762 41
4674 41 -1026 92 699 -221 -319 1262 1114 -1067 -1103 1156 1730 -498 -1102 706 592 -447 277 1410
4692 1410 78 -1543 -346 1730 1000 -969 -835 686 175 -873 539 1079 -543 -1657 117 1344
4708 1344 -404 -1709 -499 826 215 -666 40 559 -980 -1177 953 1649 -461 -1857 -593 843
4724 843 220 -745 390 395 -726 -1149 641 1192 -538 -1202 399 1221 395 -807 -39 824 489 -204 624
4743 624 789 -564 -1275 553 1732 561 -1469 -1313 542 692 -221 263 717 -147 -1867 -323 1877
4760 1877 685 -1663 -1121 1345 717 -1817 -1182 1506 325 -1563 -712 1924 363 -3267 -1331 2856
4776 2856 1764 -2853 -1382 1578 500 -2613 205 3446 294 -4002 -885 3725 1113 -3077 -519
4791 -519 3498 406 -3533 -247 3988 154 -3880 795 4424 -571 -4803 341 5034 255 -3403
4806 -3403 543 3043 -1760 -3950 2282 5435 -1262 -5061 733 4122 -1272 -3313 1952 3622 -2553
4821 -2553 -4234 2135 3755 -2603 -3754 2524 3488 -2970 -4354 1881 3227 -1848 -1919 3050 1811 -3920
4837 -3920 -3115 3431 3437 -2153 -2838 1754 1298 -2553 -902 3505 2092 -2911 -1847 2321 1676 -1931 -814
4854 -814 2530 1969 -1842 -1259 1592 852 -1001 497 2506 650 -2405 -1704 1442 1920 252 -612 -133
4871 -133 -894 -1303 -317 1524 1132 -569 -1921 -1018 808 303 -855 -364 1560 296 -2024 -1637 730
4888 730 782 -1004 255 1714 -259 -3577 -1434 2949 2178 -1656 -1288 1424 90 -2673 432 4337
4904 4337 965 -3797 -1213 2789 690 -2355 480 4209 426 -4007 -639 3377 58 -3013 1668
4919 1668 4852 -776 -5168 -24 4110 255 -2670 1501 3135 -2830 -4780 2095 5278 -815 -4255
4934 -4255 924 2700 -2134 -3440 2808 4064 -2766 -4063 1984 2445 -3111 -3034 3602 3849 -3386 -3801
4950 -3801 2356 1616 -3000 -852 4581 1767 -4694 -2866 3596 3069 -2071 -722 2890 -207 -4162
4965 -4162 -8 4318 1255 -3144 -415 3151 16 -3292 340 3660 379 -2393 -125 1740 -1491
4980 -1491 -2251 2138 3709 -803 -3143 -265 959 -515 -75 2095 1067 -2505 -2228 1299 1574 -812
4996 -812 -607 922 -176 -1802 -728 613 307 -1098 857 973 -965 -1845 -76 1475 569 82 -43
5013 -43 -854 -1617 -605 1723 1611 -159 -732 -354 -327 -218 1103 1326 -247 -1055 89 640 -267 -375 999
5032 999 1059 -229 -648 492 -129 -983 575 1858 326 -1975 -1399 586 -72 -14 966 441 -1958 -2197
5050 -2197 944 1771 -462 -948 477 44 -1613 -750 1464 963 -1600 -728 1799 49 -2507 -671
5066 -671 2227 940 -1589 -69 1763 -586 -2252 1131 3759 -106 -3342 -568 2052 -226 -1344
5081 -1344 1719 2178 -1538 -2679 1513 2891 -1411 -2383 2168 2540 -1783 -2452 1793 2024 -2069 -1594
5097 -1594 3067 1101 -3548 -2304 2677 2361 -2382 -1781 2246 375 -3252 -530 3647 702 -3875
5112 -3875 -1222 2871 1011 -2967 -391 2607 180 -2723 -255 3017 -158 -2828 469 3278 132
5127 132 -3060 -381 2868 242 -1528 501 2299 -1110 -2554 1018 3011 194 -2431 -45 2233
5142 2233 -221 -1408 751 2258 -488 -1790 570 2290 -437 -2322 243 2014 -37 -2020 -469
5157 -469 1287 -59 -1304 402 1905 -918 -3005 -11 2236 564 -1916 -837 1407 251 -1500
5172 -1500 65 1894 -85 -2340 -145 1987 604 -2418 -906 2126 836 -1799 -358 1862 303
5187 303 -1986 321 2727 727 -2766 -779 2979 1327 -2187 -1003 1975 340 -1975 -48 2646
5202 2646 281 -2791 -747 3022 932 -2701 -726 2230 222 -2071 -586 2436 -421 -2679 207
5217 207 2952 67 -2916 -748 2235 621 -2114 -335 1804 -528 -2612 84 2680 214 -2916
5232 -2916 -813 2718 587 -2328 -158 2136 -431 -2007 529 2594 -129 -2621 279 2956 505
5247 505 -2210 -129 2404 -94 -1506 732 2244 -397 -2689 246 2981 275 -2380 -261 1893
5262 1893 112 -1873 164 1884 -576 -2686 654 2286 -351 -2376 -212 1967 -57 -2052 -286
5277 -286 1381 -670 -2211 651 1944 -953 -2379 45 2122 -470 -1778 85 1270 -627 -1453
5292 -1453 847 1590 -824 -2049 748 2101 -330 -1518 -31 1391 -336 -735 648 1271 -965 -1402
5308 -1402 781 1925 -282 -1645 -73 1225 70 -1067 198 840 -767 -938 790 1288 -806 -1155
5324 -1155 333 1176 -190 -1213 -70 215 -553 -680 374 958 -767 -1225 328 1256 -285 -1074 -2
5341 -2 615 -327 -327 407 592 -1142 -862 983 1046 -522 -1247 594 777 -334 -46 782 461 -899 -491 1036
5361 1036 1153 -567 -938 827 598 -183 -472 598 423 -945 2 1391 560 -1101 -391 847 708
5378 708 -430 -350 608 -178 -1118 -12 1132 -145 -1547 -232 1081 437 -997 -87 311 -870 -782 271
5396 271 1361 -932 -1727 386 1289 -416 -1432 170 847 -208 -769 835 740 -1222 -1022 1328 1444
5413 1444 -955 -1299 596 1173 -264 -529 1524 713 -1653 -678 1954 1239 -1177 -1035 1376 710 -1157
5430 -1157 -730 1360 478 -1614 -526 1252 218 -2009 -971 1528 831 -1540 -659 848 -201 -1157
5446 -1157 -134 1510 -121 -2200 -652 1390 397 -1456 -285 1154 86 -1232 261 1346 -255
5461 -255 -1082 46 1346 271 -1298 -778 1150 901 -238 -14 381 20 -945 62 1752 800 -972
5478 -972 -770 391 868 92 -364 786 631 -724 -378 986 823 -690 -842 833 973 -878 -1287 305
5496 305 1354 -459 -1113 818 358 -1618 -1633 1765 2392 -1315 -2332 694 1739 -1040 -1382 1722 1374
5513 1374 -1884 -1926 1843 2134 -1640 -1566 2291 1961 -2473 -2073 1912 1634 -1843 -1213 2965 1508 -3216
5530 -3216 -1657 3466 2716 -2332 -1628 2444 923 -2605 -234 4275 1080 -3550 -1193 3063 1101
5545 1101 -2724 -459 3353 575 -3556 -593 2819 159 -3070 587 3315 -515 -3870 -674 3002
5560 3002 85 -2595 608 2186 -1532 -3299 726 3259 -247 -2718 119 1851 -654 -1869 1357
5575 1357 2535 -1087 -2191 945 1666 -1133 -1556 1535 2368 -625 -1928 627 1225 -367 -126 1582
5591 1582 1166 -1683 -1711 794 1662 -33 -736 176 119 -527 -431 723 637 -282 -804 -502 285 -172 -232 119
5611 119 721 120 -550 -1099 -336 468 89 216 537 -175 -1163 -1333 763 1912 2 -1367 -277 240
5629 240 -980 -659 1513 2047 -1398 -1585 885 1420 -1218 -1147 1973 1597 -1245 -1868 946 1385 -1172
5646 -1172 -447 2419 995 -2569 -1810 2111 2098 -1139 -458 2057 -158 -2754 -380 3086 1309 -2383
5662 -2383 -935 2105 -89 -2555 50 2824 325 -2649 -324 1803 -1069 -2570 885 3017 -541
5677 -541 -3277 -186 2025 -893 -1523 1482 2017 -2543 -2912 1173 2458 -993 -1474 1581 1628 -1736 -1421
5694 -1421 2136 1595 -1709 -1107 2016 875 -2472 -867 2551 1503 -1549 -620 1662 -236 -1953 570
5710 570 2970 457 -2380 -205 1679 -143 -1494 1051 1915 -1222 -2417 682 1788 -602 -1434 943
5726 943 1523 -1575 -1573 699 1267 -579 -898 1294 433 -1913 -1207 1502 1758 -321 -704 349 -221 -1203
5744 -1203 -71 1989 469 -1564 -1022 1075 575 -719 345 1158 -84 -779 109 525 182 -356 603
5761 603 974 -87 -997 -530 443 718 766 269 -275 -569 -279 -104 597 535 -11 -729 -610 314 341 -88 -320
5782 -320 167 -99 -766 -419 675 258 -815 -350 777 264 -1563 -718 1017 691 -903 -416 864 -352
5800 -352 -1646 413 1983 -41 -2223 -402 1708 287 -1384 428 2135 -533 -1623 629 2384
5815 2384 -780 -1959 837 2495 -540 -2328 529 1758 -910 -1570 1477 1729 -1706 -2445 1446 2272
5831 2272 -1027 -1967 872 1563 -1277 -1436 1717 1663 -2069 -1886 1611 2026 -1729 -2177 1504 1373 -1998
5848 -1998 -1654 1544 1276 -1796 -1373 2227 1421 -1721 -1402 1891 1628 -1511 -882 1759 719 -1568 -1029
5865 -1029 2099 1136 -1801 -1014 1992 1390 -1183 -839 1639 1008 -1720 -503 1790 972 -1996 -802
5881 -802 2145 1446 -1753 -1222 1378 1014 -1321 -838 1497 588 -1965 -900 1471 968 -1590 -1413 723
5898 723 846 -1167 -840 1097 540 -1293 -532 1165 1189 -1409 -1043 1043 1326 -1215 -1209 1446 905 -937
5916 -937 -568 1258 747 -1555 -1023 1369 1187 -920 -974 1173 1330 -879 -495 1324 973 -1290 -670 1767
5934 1767 1298 -1103 -910 1082 879 -1087 -464 738 509 -1498 -757 1192 522 -1566 -1110 1288 1032
5951 1032 -1289 -1020 1090 328 -1165 -523 1466 553 -1826 -850 1522 885 -1195 -737 993 930 -1129
5968 -1129 -142 1265 609 -1323 -672 1735 1152 -1393 -610 827 1087 -840 -451 1363 435 -1354 -204
5985 -204 1745 468 -1169 -381 1530 635 -764 -269 910 357 -1266 104 1665 269 -1859 -657
6001 -657 1411 538 -956 -547 600 -261 -805 -217 1042 -521 -1484 64 939 -80 -990 -362 728
6018 728 -372 -534 -17 725 -307 -1002 202 1058 135 -868 25 769 -70 -350 188 827 -396 -565
6036 -565 445 648 35 -650 223 796 89 -582 137 350 -379 -166 251 423 -383 -498 410 774 77 -318
6056 -318 10 -261 -641 -210 435 182 -699 -775 304 96 -93 -600 19 37 -255 -17 222 -401 -660 -193
6076 -193 537 399 -145 -439 362 146 -250 45 475 219 -526 -213 727 406 -383 -322 836 358 -210 -132
6096 -132 530 -118 -411 23 777 67 -1127 -280 1201 765 -574 -273 908 69 -786 341 1091 59
6114 59 -1424 -367 1031 389 -1022 -477 708 -255 -1066 324 926 -130 -1424 80 1436 -274 -1668
6131 -1668 -73 1017 61 -1051 283 877 -647 -1855 1013 1887 -643 -2115 403 1612 -522 -1335
6147 -1335 662 1472 -629 -1299 1371 1977 -797 -1183 1333 1703 -970 -1258 1305 1492 -1094 -925 1503
6164 1503 1126 -1424 -1400 1405 1596 -853 -1098 753 876 -1265 -789 1360 752 -1594 -1236 1334 808
6181 808 -1386 -821 846 654 -1373 -739 944 619 -1323 -354 1080 307 -1198 -970 1057 1229 -295
6198 -295 -324 537 129 -852 -107 1233 810 -644 -653 413 721 -310 -181 700 736 -134 -551 112 683 -165
6218 -165 -482 469 945 -308 -1088 -220 1216 572 -1017 -125 219 -771 -1257 410 1379 -189 -1890 -371
6236 -371 1276 -91 -1336 312 1800 -522 -1883 374 1387 -544 -1801 767 2157 -895 -2347
6251 -2347 677 1933 -283 -1372 954 1856 -1645 -2234 1571 2589 -633 -1868 868 1771 -937 -1472
6267 -1472 1897 2222 -1287 -1815 1438 1757 -1831 -1415 2066 1854 -1967 -1766 1494 1318 -1744 -703 2484
6284 2484 810 -2779 -1487 2134 1246 -1815 -638 1595 204 -2447 -681 2424 773 -2220 -635
6299 -635 1549 -48 -1857 -19 2607 -6 -1636 -215 1201 -638 -1532 657 1956 -10 -1966
6314 -1966 -255 973 -230 -618 1064 1357 -967 -1520 710 1636 40 -561 760 376 -1069 -203 838
6331 838 653 -155 -491 431 -74 -570 -10 607 531 -253 -633 -75 -456 -293 596 437 -43 -481 -510 -466 51
6352 51 203 426 -66 -742 -110 -302 -350 167 688 530 -780 -363 511 -110 -604 259 1225 341 -836 -105
6372 -105 559 309 144 377 640 -680 -1394 451 1309 -25 -582 420 629 -611 -536 1188 1324 -657
6390 -657 -644 1105 631 -1131 -376 1061 743 -1039 -612 726 -251 -1310 204 1731 133 -1907 -920
6407 -920 885 -297 -1154 802 1529 -1127 -1865 448 1629 -443 -1141 771 1282 -1167 -1400 975 1220
6424 1220 -1030 -928 1534 1148 -1890 -1186 1785 1423 -1338 -880 1060 276 -1591 -444 2155 914
6440 914 -2025 -820 1350 403 -1475 153 1936 9 -1978 -446 1719 103 -1524 523 1815
6455 1815 -328 -2190 173 1573 -452 -1150 548 1146 -1312 -1839 694 1694 -645 -1921 315 1063
6471 1063 -992 -1252 1244 1135 -1178 -1134 831 834 -576 -981 750 845 -625 -809 805 744 -591 -644 961
6490 961 650 -824 -1136 400 1046 -163 -610 353 328 -409 -339 598 762 -483 -1084 334 826 -61 -731
6509 -731 162 484 -137 -868 -166 610 -321 -865 240 1013 -209 -961 -386 1107 -1 -1133 -181 378
6527 378 83 -1203 -139 1308 47 -1436 -253 1171 450 -1348 -145 1228 315 -1081 -97 1491
6543 1491 25 -1299 322 1445 206 -1523 47 1642 96 -1327 387 1292 -248 -1428 545
6558 545 2018 17 -1896 211 1718 -310 -1690 613 1534 -903 -1577 382 1356 -301 -1943 496
6574 496 1724 -665 -1391 207 1126 -690 -1305 925 1361 -822 -1629 711 2134 -658 -1609 397 1396
6591 1396 -686 -1191 1014 1277 -798 -1017 674 1278 -613 -1048 988 997 -789 -896 707 847 -884
6608 -884 -1155 1112 1172 -923 -1235 781 1100 -575 -904 496 591 -529 -827 754 1138 -838 -996 365
6626 365 954 -698 -1023 493 558 -766 -551 751 898 -688 -711 447 864 -674 -1050 499 738 -233
6644 -233 -574 544 724 -587 -489 778 732 -603 -943 414 860 -308 -661 497 593 -486 -278 903
6662 903 655 -444 -371 497 1122 -21 -636 505 631 -294 -439 593 643 -691 -733 719 671 -607 -691
6681 -691 446 244 -566 -155 384 140 -464 -658 229 616 -617 -830 345 539 -541 -542 465 49 -606
6700 -606 -671 703 570 -573 -581 773 471 -293 -327 764 68 -418 44 997 385 -544 -301 531 478 -435
6720 -435 -179 379 250 -460 288 475 -43 -620 -72 682 332 -852 265 258 -493 -510 -239 417 -44 -558
6740 -558 102 749 -123 -813 -77 170 -219 -505 468 319 -237 -625 7 495 -458 -514 280 336 -376 -399 344
6761 344 442 -419 -387 467 508 -802 -192 486 371 -349 -280 373 435 -362 212 682 246 -817 -507 472 80
6782 80 -388 -186 157 -75 -401 209 580 -58 -522 -174 754 228 -501 -241 343 78 -641 -25 276 -141
6802 -141 -716 19 405 -273 -772 -324 582 -79 -235 26 392 -52 -752 -319 511 6 -415 -317 616 455
6822 455 -310 -295 208 346 -348 143 387 -9 -656 -319 716 656 -688 -341 756 479 -321 42 642 365
6842 365 -681 -632 920 696 -1011 -624 913 360 -937 -674 813 478 -1110 -570 1110 393 -1721
6859 -1721 -982 1178 650 -1359 -617 899 312 -1271 -99 1317 230 -1701 -405 1401 95 -1287
6875 -1287 -158 1345 -40 -1343 -191 1493 -75 -1754 47 1802 -304 -1433 226 1903 -70
6890 -70 -1235 664 1469 -696 -1678 890 1646 -190 -1505 649 1259 -739 -1293 709 1031 -623 -1478
6907 -1478 677 1167 -989 -1021 807 1109 -883 -1231 183 1001 -664 -508 717 709 -947 -1029 564 1045
6925 1045 -249 -705 137 89 -675 -542 839 569 -584 -619 385 709 -105 -217 475 418 -322 -264 359 337
6945 337 -192 43 471 516 -225 -632 -440 475 573 -81 -85 231 -178 -546 -89 465 392 -993 -700 279 337 -502
6967 -502 -531 433 376 -824 -744 736 189 -859 -382 1038 427 -1512 -373 1052 737 -968 -222 952
6985 952 -248 -1429 91 1832 528 -1296 -173 1490 -99 -1092 59 1385 167 -1584 98
7000 98 1305 -383 -1615 698 1875 -559 -1392 406 1215 -434 -971 967 1175 -1206 -1420 546 1401
7017 1401 -550 -1244 695 638 -1384 -1215 1101 884 -1188 -813 812 185 -1112 -701 1386 822 -1345
7034 -1345 -502 686 -130 -1519 10 1777 -23 -1549 -351 1006 -78 -837 469 1302 -685 -1285
7050 -1285 404 1298 118 -689 438 965 -531 -972 403 882 -39 -444 793 269 -1086 -904 573
7067 573 824 -383 -492 451 -439 -1072 643 921 134 -1045 -117 219 49 -673 120 632 -641 -919 -391
7086 -391 461 -237 -322 526 483 -750 -756 -105 40 -120 123 427 50 -649 -24 244 387 26 237 -170 -383
7107 -383 81 526 515 -275 -200 223 40 -310 157 270 25 -181 80 441 -270 -577 346 327 -457 -456 31 350
7129 350 -439 76 934 199 -813 -487 648 201 -744 184 903 -251 -1026 -208 1016 105 -1019 101
7147 101 993 -78 -1143 90 1011 -199 -892 402 844 -986 -1051 801 1539 -426 -899 612 901
7164 901 -395 -501 1279 1256 -1188 -798 720 844 -785 -596 1628 632 -1202 -1087 1443 565 -1311
7181 -1311 105 1085 523 -1628 -314 1152 436 -1016 -348 1093 87 -1500 -48 1187 57 -1245
7197 -1245 -409 946 13 -1270 -137 1151 -36 -1144 -58 962 -69 -1322 118 1434 137
7212 137 -1230 -21 1006 -102 -688 406 1121 -251 -900 181 1074 200 -609 192 853 -164 -457
7229 -457 590 893 -113 -710 106 929 -114 -757 -84 822 308 -636 -143 710 194 -522 250 460 -2
7248 -2 -896 -323 652 528 -768 -420 476 144 -1021 -100 590 147 -660 -480 794 292 -664 -308 791
7267 791 330 -784 41 851 -150 -671 -66 1076 293 -1043 -337 1034 366 -690 -447 904 139 -951
7285 -951 -393 1024 422 -939 -182 955 206 -889 -285 993 -101 -820 -243 1002 -55 -1209 -222
7302 -222 1173 -3 -1092 -200 744 114 -911 206 861 -207 -1002 67 1220 74 -872 -377 831
7319 831 -39 -983 -7 780 -253 -732 241 977 -211 -908 254 929 259 -478 -81 657 -51 -1103 174
7338 174 986 -24 -1049 490 1059 -303 -833 267 779 -209 -314 -15 633 -369 -793 224 797 -11
7356 -11 -372 -89 605 -498 -537 244 569 -303 -677 225 355 -163 -562 329 365 -362 -407 162 358 -44 -204
7377 -204 565 397 -311 -515 436 396 52 -385 58 346 -177 -193 399 474 -137 -569 198 605 -58 -205 156
7398 156 303 -159 40 164 449 -174 -471 439 308 -213 -561 378 603 -419 4 308 173 -567 -379 65
7418 65 294 -356 -341 80 218 -165 -326 118 -23 -420 -123 218 -58 -410 -482 288 124 -221 -314 560 131
7439 131 -298 -323 436 409 -560 -205 543 362 -255 -90 518 117 -347 -70 362 81 -63 -339 572 -68 -225
7460 -225 57 515 -34 -572 139 -4 -31 -333 92 755 -87 -502 141 421 -189 -206 359 407 -541 -443 298
7481 298 577 -422 -797 634 350 -306 -511 343 379 -326 -432 470 438 -893 -498 806 651 -36 -170 356
7501 356 349 -359 -327 498 658 -528 -290 948 551 -552 -277 394 119 -748 -63 596 43 -636 -428 708
7521 708 326 -691 -485 483 428 -277 -207 217 -9 -609 -286 570 323 -554 -760 519 206 -281 -5 212
7541 212 342 -536 -270 594 345 -299 -368 618 412 -289 -931 355 223 -412 -85 65 336 -295 -29 408
7561 408 576 -326 -302 147 193 -309 -253 577 362 -338 -556 515 643 -403 -546 251 759 -570 -675 254
7581 254 628 -555 -683 659 538 -638 -616 713 973 -869 -755 617 444 -824 -861 679 557 -1235
7599 -1235 -973 770 646 -1034 -582 1185 799 -957 -634 1100 727 -992 -319 1366 419 -967 -436
7616 -436 1309 674 -992 -361 873 222 -1235 -48 1763 255 -1360 -350 941 -7 -1035 184
7632 184 1207 98 -1330 -9 920 -87 -1106 -51 1017 -238 -1166 315 490 -5 -748 360
7648 360 979 -769 -1208 320 1308 -324 -820 428 151 -407 -527 656 623 15 -515 487 508 -255 -276
7667 -276 550 807 -88 -278 194 -165 28 154 630 552 3 -403 34 454 201 244 -97 -190 -229 67 -130
7688 -130 407 400 -496 -205 -19 -54 -123 -257 129 209 -259 -794 -20 241 -194 -128 345 282 -216 -772 279 765
7710 765 -91 -476 266 140 -609 -392 707 455 -150 -691 328 387 -625 -145 550 798 -108 -462 717
7729 717 135 -790 -33 1434 527 -1031 -433 765 349 -620 5 1022 -38 -1217 234 1092 170 -732
7747 -732 242 1029 -432 -786 328 830 -423 -747 609 532 -392 -881 663 518 -669 -910 782 391
7765 391 -903 -294 776 546 -903 -557 896 528 -568 -219 910 361 -937 -296 1128 256 -616
7782 -616 84 711 34 -599 -71 650 320 -503 542 688 -498 -806 294 1189 -328 -838 11 703 -602
7801 -602 -496 967 727 -558 -462 341 185 -676 -254 299 284 -673 -421 577 34 -250 -54 662 9 -711
7821 -711 -421 237 230 -319 -50 426 -188 -800 59 526 3 -116 -182 252 68 -180 237 280 -283 -488 -72
7842 -72 19 7 180 -178 417 405 -179 -244 80 273 167 164 228 155 -203 -275 -162 556 164 -581 -228 268 109
7865 109 -158 -93 526 -55 -648 -310 595 -182 -451 38 760 -78 -923 -166 475 -444 -551 309 658 -361
7885 -361 -914 228 901 -239 -746 171 537 -146 -904 270 1058 -509 -797 444 706 -675 -758 675
7903 675 1095 -589 -972 276 898 -293 -646 925 625 -712 -1055 574 1033 -696 -624 580 568 -581
7921 -581 -596 750 709 -976 -876 532 584 -809 -330 546 650 -597 -755 812 240 -881 -464 609
7939 609 406 -959 -590 505 628 -736 12 1022 174 -806 -253 721 272 -566 -72 865 125 -499 -449
7958 -449 707 514 -535 -5 964 90 -638 -412 715 336 -700 -561 553 331 -549 -381 344 160
7976 160 -636 -515 398 719 -539 -589 73 197 -401 -326 32 69 -638 -341 221 193 -445 -191 218 423 -568
7997 -568 -358 476 36 -557 -508 256 462 -269 -167 614 586 -371 -535 232 509 -366 -447 627 554 -395 -160
8018 -160 505 371 -289 -502 313 440 -604 -120 644 325 -778 -153 482 506 -591 -392 449 224 -337
8037 -337 -339 233 -184 -441 -72 655 510 -613 -419 342 414 -565 -53 464 -105 -569 -134 537 306 -760
8057 -760 -306 605 206 -443 -219 573 2 -347 -169 504 262 -715 133 1040 20 -408 194 316 -277 -318
8077 -318 -94 662 -95 -353 161 608 -92 -237 -45 463 308 -255 -309 -15 -516 -217 172 232 -215 -479 -142
8098 -142 850 -289 -334 -147 216 -445 -279 418 335 -567 -547 305 177 146 -314 206 362 -239 -270 292 61
8119 61 -293 -45 10 39 -81 77 124 113 -225 72 197 -179 -139 23 207 366 -115 -134 62 184 -130 -58 338
8142 338 -113 -535 -136 -61 331 -396 -297 207 22 -261 -66 26 73 -221 -135 168 157 -276 -251 129 -47 -261
8164 -261 -135 0 -112 -579 -16 420 -34 -430 -37 447 130 -237 -261 176 -96 -390 -37 468 106 -235
8184 -235 -25 400 235 -193 127 390 196
8191A96
$$ Imaginary data points
##PAGE= N=2
##DATA TABLE= (X++(I..I)), XYDATA
0 0 0 0 0 0 -8 0 -4 8 -8 8 -9 16 -24 24 -32 40 -48 49 -60 72 -85 96 -111 130 -149 168 -189 220 -247 277
30 277 -311 351 -393 437 -486 543 -603 667 -740 821 -911 1005 -1113 1234 -1368 1519 -1689
47 -1689 1887 -2113 2379 -2696 3086 -3569 4187 -5018 6192 -7965 10955 -16917 33276 -165266
61 -165266 -504244 80187 337586 -116724 -268586 234709 296570 -250258 -334900 212047
71 212047 289414 -204605 -254396 214631 211972 -251854 -241893 217680 219939 -182197 -165732 193209
83 193209 122285 -244213 -158679 243827 208530 -169591 -182774 125137 121662 -137645 -81658
94 -81658 197907 122922 -195316 -158389 154913 150933 -121447 -110577 136116 99921 -151400
105 -151400 -107997 152175 129530 -105469 -80571 123709 59577 -164798 -95474 160604 140540
116 140540 -88853 -107806 47811 29926 -98355 -28250 141650 82788 -124526 -129479 52692
127 52692 96833 -32215 -56310 65882 72434 -78292 -109481 44853 100511 -36465 -83228
138 -83228 61428 97768 -83775 -144839 54390 156073 -17263 -117817 30474 86228 -82794
149 -82794 -102334 127188 169939 -84770 -168109 57023 136188 -60310 -102045 101419 115949
160 115949 -111725 -127212 107549 126583 -100032 -108354 116207 111059 -123939 -124498 108724
171 108724 123255 -80933 -79278 101983 56471 -150125 -90706 154289 126792 -117851 -122821
182 -122821 79312 66062 -110827 -54121 142160 68817 -151934 -89344 132365 77188 -130109
193 -130109 -62566 141221 63716 -143713 -69323 125641 46451 -123996 -14672 153533 14207
204 14207 -178615 -44854 158370 54836 -115923 -17420 111757 -14702 -129301 27492
214 27492 155208 -3648 -142635 -3534 123572 -4009 -109951 17697 108810 -22765
224 -22765 -105167 23701 94214 -38630 -100416 40969 110200 -29664 -112190 6341 84318
235 84318 -11369 -63125 34578 62504 -60742 -93611 45382 99890 -27660 -90705 15166
246 15166 63747 -33302 -62443 41135 62806 -47754 -66304 50189 67549 -51366 -69908
257 -69908 50039 74811 -35310 -59912 31767 40677 -42336 -27708 67122 45076 -66332 -59660
269 -59660 50529 62026 -27288 -39449 30358 27326 -38785 -22981 52329 34075 -50755 -41349
281 -41349 45657 46978 -37600 -49071 26778 41681 -25172 -35218 28565 26412 -48223 -39420 54291
294 54291 53638 -52485 -68537 32162 56094 -29978 -43683 36617 32090 -57982 -41038 66318
306 66318 51847 -66227 -59703 57975 56444 -52986 -47122 54688 38033 -59781 -27660 74339
318 74339 32419 -80983 -39454 82981 51956 -66062 -43327 60721 33061 -58381 -15675
329 -15675 75760 18766 -83930 -24562 87478 35279 -77697 -36117 67336 26529 -64281
340 -64281 -16007 68070 6166 -81981 -10173 88209 15856 -91437 -27666 78072 23163 -70752
352 -70752 -15201 64450 -3727 -78891 3086 84704 -1757 -93807 -13155 83601 14825 -73247
364 -73247 -10648 63248 -3184 -65760 13955 76896 -11528 -81892 5990 84943 7315 -71785
376 -71785 -7039 62454 1536 -54475 12411 63362 -15040 -71304 13871 81523 1707 -73136
388 -73136 -5669 65770 7577 -53134 5299 55543 -12652 -63412 13698 72838 -8278 -78955
400 -78955 -5342 68573 5083 -62862 -4431 51788 -11217 -59720 16070 66842 -17269 -77610
412 -77610 5999 75288 325 -68778 -2921 56095 -9333 -56767 18404 60980 -26141 -73035
424 -73035 20243 77330 -11374 -71419 6930 62729 -7288 -49619 24271 56324 -28518 -58532
436 -58532 34864 71196 -24961 -69467 18395 62771 -13650 -47549 23572 44058 -33297 -46366
448 -46366 40071 55382 -36258 -59254 29284 59192 -19039 -46599 19640 34796 -30727 -35393
460 -35393 36762 37618 -43330 -50977 31481 47919 -26606 -46462 16958 32383 -23658 -26753 32294
473 32294 27784 -40116 -36238 39310 42407 -31598 -42296 22683 34294 -20905 -24291 26507 18234
486 18234 -37542 -22332 44286 34984 -36625 -35833 31102 36590 -18461 -18966 27361 15639 -31934
499 -31934 -12506 42210 21193 -41193 -26961 35689 28367 -28850 -24199 23035 12991 -28019
511 -28019 -6718 36989 7091 -46008 -15285 45698 23892 -35363 -23514 23341 7743 -29296
523 -29296 -1344 35069 -4662 -49125 -6223 45545 8101 -42966 -10003 34552 2901 -31011
535 -31011 5806 33065 -10483 -33644 17799 44097 -12653 -46562 4254 39411 670 -22994
547 -22994 10974 18608 -24679 -25258 31173 38223 -19457 -34940 14045 30594 -7431 -16630 17548
560 17548 16433 -20709 -16784 23765 18548 -25760 -22878 23358 25207 -20447 -28961 6775 14428
573 14428 -9749 -4039 22203 5875 -35442 -22663 28612 31390 -15008 -26395 5766 9249 -16663
586 -16663 -7804 24471 11446 -28564 -19389 22235 16979 -23043 -17643 23940 24416 -14393 -19065
599 -19065 11326 11555 -12980 102 32773 14186 -36131 -31141 23225 36270 -3278 -18556 6857
612 6857 7666 -22478 -13200 33395 30658 -24067 -32689 18967 30237 -19674 -27815 24585 33797 -21445
626 -21445 -34333 15075 20956 -29808 -23168 42781 36482 -46034 -56448 22722 44521 -15982 -25128
639 -25128 30312 18002 -53432 -34727 54427 48914 -41832 -45099 34738 32537 -44223 -32330 51247
652 51247 38324 -47667 -35381 46571 25421 -57864 -23279 75104 45268 -62285 -47767 45911
664 45911 31814 -42228 -5608 70211 11609 -86908 -31821 78736 40111 -59087 -23078 58317
676 58317 5431 -73233 -7002 79960 14623 -71069 -8307 67001 -4821 -79504 -433 82634
688 82634 11366 -69152 -11124 46764 -17261 -58053 29156 77405 -18745 -85478 -6690 59272
700 59272 2697 -38601 20034 43763 -31599 -59945 20224 60014 -7416 -43310 15244 39220
712 39220 -23666 -47768 16672 48894 -1187 -27095 9938 17604 -28115 -29277 33036 53429
724 53429 -4872 -43351 -12643 16926 3595 -1773 22201 20122 -21900 -38058 13 30045
736 30045 11473 -13799 -3719 11701 -4406 -26274 -9753 23262 19185 -10150 -12043 6191
748 6191 -5832 -30555 -6614 43271 32276 -30564 -44057 3692 20482 -9024 -3172 34790
760 34790 12116 -51056 -36734 39630 41471 -24234 -24630 33354 19405 -46306 -27761 47394 35249
773 35249 -34841 -19335 43790 11305 -61681 -20729 69746 41860 -46829 -32641 33390 6296
785 6296 -46336 7986 74110 9383 -76822 -27536 56592 19587 -44594 1212 54580 -8400
797 -8400 -68247 -2969 60611 1256 -52098 10542 54955 -19195 -69680 4173 60349 2225
809 2225 -40914 10642 30738 -36537 -49827 36785 66183 -16022 -56280 3836 31025 -17331
821 -17331 -21682 37034 34985 -35079 -40840 23985 32756 -20554 -20858 31600 26700 -28783 -29099 18851
835 18851 20549 -12844 -914 30905 5346 -40189 -20828 30507 29488 -6766 -11398 2025 -9635
848 -9635 -19568 7091 30460 7380 -24167 -14441 6772 2123 -7801 3746 11694 -1214 -11115
861 -11115 -3689 -437 -7156 -2722 11624 11858 -4950 -15887 -12850 -3166 9095 17065 7348 -12130
875 -12130 -18305 -4611 7583 10860 11037 4728 -10915 -14037 3284 14447 3118 -5009 4787 8194
889 8194 -5423 -9739 3547 6913 -2846 1868 14880 3152 -21052 -14369 15242 20127 540
902 540 -5432 352 -8602 -14920 7256 25332 3390 -23349 -12089 9257 2897 -9240 2659
915 2659 10350 -7422 -15536 4770 11988 -9776 -15791 10343 19054 -6570 -18975 -255 7214
928 7214 -5208 -495 16731 4366 -24907 -16888 17764 20480 -6843 -9933 6689 1226 -13028
941 -13028 3551 23945 4163 -20919 -3529 22151 5766 -18182 -2207 18216 3305 -13087
953 -13087 3612 13550 -11034 -20129 12097 28291 -4523 -26221 -1526 16945 -1124 -8982 11986
966 11986 10573 -20285 -20057 16488 22470 -13623 -22911 6970 13484 -11671 -13587 11257 8137 -18109
980 -18109 -10309 20571 12259 -22771 -17341 18357 18601 -10958 -11426 9402 3138 -15454 -572 23734
994 23734 6581 -24555 -13114 19881 14920 -11830 -7698 11610 3980 -11576 2333 19726 1899
1007 1899 -19562 -3022 21456 9706 -15410 -10322 9993 6439 -7061 -591 9132 -4268 -17239
1020 -17239 -1022 19192 7157 -16372 -12248 8488 9769 -4713 -5139 4456 -974 -12265 -2292
1033 -2292 14423 4808 -17999 -13375 11737 13376 -8611 -12734 3993 5386 -7167 -1536 14483
1046 14483 4906 -17892 -9604 18911 16653 -11669 -14343 8397 10765 -7047 -3657 12814 3310
1059 3310 -17967 -5832 21850 13261 -16621 -14282 13085 13951 -7536 -5807 10892 3332 -15137
1072 -15137 -2473 20683 7540 -21881 -14200 15528 13099 -12262 -10917 7291 2928 -13642 -2393
1085 -2393 17521 3249 -22678 -9482 20058 12614 -15321 -12478 9601 5612 -10646 -1518 13817
1098 13817 -923 -20768 -4783 21123 9820 -17973 -11658 12504 9243 -7410 -888 11845
1110 11845 -489 -14529 2513 21517 5373 -18353 -8191 14868 10219 -7524 -4137 7061
1122 7061 -967 -10143 3745 16514 23 -18226 -4614 16310 9310 -9342 -7241 4245 1079
1135 1079 -5902 2127 9387 -4430 -16461 -2729 14016 4622 -12670 -9368 3892 3627 -3006 479
1149 479 4131 -4901 -10035 2201 13429 2901 -12227 -7382 6700 7432 -1483 -2409 967 -2510
1163 -2510 -4556 4845 10763 567 -10808 -4141 9723 9449 -1499 -4659 489 2164 827 4409
1177 4409 5940 -2788 -8934 -1093 10707 6848 -5478 -8123 -751 3470 1932 1429 872 -4887 -7648
1192 -7648 718 9712 3295 -8620 -8248 2388 4864 -709 -2835 -1777 -3851 -4300 3334 7075 -2324
1207 -2324 -11836 -4540 7730 7069 -2113 -4136 -1679 -2564 -28 8326 8078 -5654 -10650 1685 10634
1222 10634 3759 -3487 -151 1272 -2833 719 8721 3852 -8598 -4792 10518 10111 -4955 -7668
1236 -7668 2039 3558 -639 3690 7973 -4516 -15025 -1804 15411 7960 -9800 -8605 2821
1249 2821 -71 -5432 4110 9620 -6312 -15958 794 14562 -1063 -15877 -2079 12252 582
1262 582 -11317 379 6934 -7931 -10565 12328 17899 -10899 -23078 2785 18415 1331 -8185
1275 -8185 6339 5790 -15108 -10210 19288 18860 -12609 -16860 10163 14323 -8914 -9229 13343 10521
1289 10521 -11903 -6581 15271 5390 -19023 -7156 22006 13973 -15320 -14342 6086 4648 -6984
1302 -6984 4003 16302 -3123 -24843 -8273 18623 11377 -10382 -7753 5781 -2001 -11921 -309
1315 -309 13022 1086 -12539 -2015 10337 -1443 -15497 -3869 13743 9010 -5581 -6203 -1355
1328 -1355 -4082 -2741 10500 15198 -696 -15719 -10497 5588 11865 6516 -183 -2934 -3861 -3778 -1
1343 -1 6730 8119 903 -5961 -578 6244 -847 -9734 81 16691 8844 -12117 -11894 3116 1839
1358 1839 -5989 8215 19287 -6116 -31188 -9857 23348 13113 -13068 -3934 11452 -8186
1370 -8186 -24213 5281 29302 332 -27066 -618 22954 -6993 -29247 5122 31462 -193
1382 -193 -25913 1804 18045 -14289 -23758 22604 39402 -11982 -40558 1039 28985 -1437
1394 -1437 -15148 20109 22953 -26689 -33946 20885 37189 -11386 -26318 16030 22990 -23170 -27050
1407 -27050 23239 29429 -16979 -20128 22674 14874 -33691 -22032 35173 31948 -22549 -27610 11578
1420 11578 7730 -22645 -2351 36482 10744 -38744 -24296 22480 16684 -15553 -4636 20894
1432 20894 756 -28085 -7081 22417 7136 -15793 671 18738 -3279 -25754 -7081 20089
1444 20089 13146 -4549 -2678 1035 -10555 -12376 10238 24964 8476 -14369 -13950 -180 6360
1457 6360 5985 6450 5960 -2179 -9834 -7432 3115 8338 2727 -2622 1403 3315 -6464 -14029 -2223
1472 -2223 15642 12814 -4960 -10072 -3829 -5604 -7811 8687 23470 2337 -27338 -18085 11203
1485 11203 11196 -6644 11 13176 -5234 -26245 -3795 25226 7499 -19501 -910 22771 -2730
1498 -2730 -29821 -2080 29243 7610 -18157 2565 17354 -15272 -28619 15679 40363 -1421
1510 -1421 -32505 -2836 18947 -6677 -14015 21734 26368 -19814 -31344 12704 27171 -9979
1522 -9979 -18385 16702 19493 -19924 -24189 14052 17815 -13650 -11077 21048 11077 -29191 -22850
1535 -22850 21205 24494 -9973 -13976 8023 198 -22136 -3533 28978 13148 -24825 -18526 12635
1548 12635 8721 -13577 -2703 18885 3515 -20341 -5737 16750 2910 -15302 3177 22953
1560 22953 2731 -21160 -7244 13194 5713 -3605 7715 9711 -12390 -19197 6553 21272 4704
1573 4704 -10095 -2499 2162 -5093 -2341 10646 8608 -6514 -7700 3170 3974 -4866 -4184 4148
1587 4148 4827 -1086 -3952 -4475 -5997 -2694 5347 7767 439 -8236 -9161 -3293 4977 8841 3480 -5979
1603 -5979 -8323 -3054 2422 3658 3077 349 -4108 -4808 834 3922 -691 -3694 1496 6102 2046
1618 2046 -3884 -2947 943 1823 3581 6885 3038 -7658 -9040 3254 11614 4838 -3945 -3628 -1993
1633 -1993 -3007 569 8239 4989 -7485 -8103 4059 6605 -3404 -5766 3254 3504 -4409 -2637 4439
1648 4439 -2155 -10914 -750 12484 2871 -12853 -8263 4877 2440 -3844 3561 6014 -8001 -13408
1662 -13408 4914 14910 -710 -11532 -51 7493 -2329 -5020 6589 6450 -7966 -6911 9851
1675 9851 9842 -8653 -10769 7165 11292 -2598 -5360 5306 2733 -8587 -1381 14713 7673 -12913
1689 -12913 -10983 8848 10213 -4686 -5543 5512 1681 -9864 -2083 12839 3699 -15108 -7360
1702 -7360 12667 7227 -11786 -7734 7659 2907 -9503 -324 11620 -1798 -17589 -2227 16907
1715 16907 5020 -14729 -7003 9324 2390 -8236 1535 10566 -3593 -14083 2070 16241 2417
1728 2417 -13634 -3912 11173 3904 -6782 37 7975 -2108 -9276 4131 13748 -549 -14127
1741 -14127 -2728 12924 5505 -8294 -3382 6683 178 -7940 2650 12095 -2074 -15608 -2599
1754 -2599 14481 4629 -12361 -6163 7961 1806 -8899 59 9545 -3391 -14962 85 14835
1767 14835 2145 -15401 -5697 10095 3401 -8157 -923 8152 -3195 -11649 2842 14939 -223
1780 -223 -15660 -3723 13059 5322 -8706 -2385 8120 -268 -9259 3448 13690 -746 -15250
1793 -15250 -858 15824 5585 -11283 -3873 9457 2241 -7748 2039 11065 -2776 -14396 1313
1806 1313 16021 2583 -14551 -5141 9916 2375 -8706 485 8426 -4107 -13015 2439 14625
1819 14625 -587 -15909 -3815 11942 3333 -9629 -2116 7231 -3164 -10361 3637 12631 -3020
1832 -3020 -15515 -1138 13780 3483 -10451 -2514 8104 -474 -6938 5021 11520 -3839 -13315
1845 -13315 2884 15385 1831 -11841 -2019 8974 780 -5864 3994 8195 -5135 -10472 5674
1858 5674 13769 -1665 -12239 -577 9626 857 -6071 1672 4512 -5714 -7386 6057 8796
1871 8796 -5550 -12175 220 8974 86 -6625 -571 2060 -3984 -3400 6028 5590 -6578 -9362 2384
1886 2384 8540 -126 -6109 -1635 1889 -847 -1136 3591 2254 -5092 -4477 4282 7382 -361 -5794
1901 -5794 -1390 4386 3614 921 835 35 -2977 -1801 4957 6555 -1100 -7308 -2160 5130 3896 -1311
1917 -1311 -1446 148 -1410 -2056 3121 4702 -2431 -6780 296 6126 1103 -5634 -3419 1533 -141
1932 -141 -1052 2252 703 -7042 -6487 4492 8491 -937 -7248 -2231 2023 -591 314 4660 1292 -7072
1948 -7072 -4451 6282 5877 -4704 -5219 3803 4349 -3043 -1887 4199 5 -5219 2153 10529 1907
1963 1907 -10730 -4070 8699 6285 -2903 103 4150 -4894 -9008 5649 13419 -1417 -12856 -1306
1977 -1306 9200 -1519 -8296 3951 8194 -6011 -9966 6717 9076 -9238 -11650 8754 13375
1990 13375 -7448 -13519 3418 6299 -7713 -3892 13181 5198 -18149 -12442 13577 13248 -8710
2003 -8710 -8191 8775 3201 -13193 -2627 17156 6142 -15350 -5583 15143 4553 -15648 -4685
2016 -4685 16579 7120 -12119 -3182 11130 -1736 -13702 4861 21450 1847 -20305 -6316
2028 -6316 13706 4468 -7547 4182 11106 -7837 -17661 3343 17003 28 -13786 748 10324
2041 10324 -4570 -13248 2416 11477 -1925 -8148 3166 6093 -9111 -11610 6506 14613 3
2054 3 -10739 -5286 268 -1355 704 7853 5422 -6724 -11217 -1087 8079 6269 -739 -2449 1309
2069 1309 736 -3518 -2481 5158 7240 -644 -3921 2360 2562 -7475 -5897 10816 14512 -4259 -15230
2084 -15230 -1458 7742 -1009 -2377 11898 8498 -15937 -17724 9800 18358 -4808 -12596 7056
2097 7056 8285 -14815 -14193 13564 15365 -12543 -13025 13250 9196 -20996 -15406 20724 19611 -14848
2111 -14848 -16615 11202 6603 -19136 -4472 28689 12325 -28448 -18997 19750 14272 -15918 -4538
2124 -4538 23208 3793 -28599 -7593 28072 9626 -22658 -2665 26128 1570 -29330 -3848
2136 -3848 28104 6829 -20006 784 19765 -8823 -27532 7848 33436 1632 -26775 -4265
2148 -4265 16087 -4871 -15556 12869 22565 -11394 -26785 3874 19853 -4672 -15296 8874
2160 8874 15404 -11186 -19555 5037 13868 -5535 -8508 10856 9651 -16118 -17939 8968 18170
2173 18170 -578 -8637 1265 913 -10156 -3680 15148 12699 -7581 -12692 836 6513 -881 -810
2187 -810 6705 5275 -5105 -6192 1151 4079 158 1072 5837 4129 -4493 -9148 -2729 7861 9128
2202 9128 1435 -4662 -4374 -3849 -3743 3065 11024 5575 -10067 -11857 1834 7405 -1798 -3541 5807
2217 5807 3582 -10487 -8626 6961 6779 -7282 -4302 11051 4122 -15238 -11109 11439 11704 -5450
2231 -5450 -4523 7313 -1608 -16013 -645 21403 8856 -15379 -9120 10123 3967 -9626 2764
2244 2764 16296 298 -16934 -1768 15408 1215 -13598 2599 17250 -802 -17185 -1801
2256 -1801 12787 -290 -8892 7545 12334 -10764 -19895 5236 18717 -158 -12361 1555 6149
2269 6149 -9988 -9766 12012 13712 -10351 -14705 6444 9892 -9104 -9088 10063 9193 -9903 -8395
2283 -8395 8086 3839 -11798 -3097 15628 7415 -14209 -9563 8710 6508 -4641 1600 10086
2296 10086 -3003 -14739 -209 15469 4740 -9677 -2105 7856 -355 -7555 3068 10077 -1482
2309 -1482 -8125 3138 9212 -3897 -10371 3151 11174 235 -8035 -800 2865 -4630 -3683 7881
2323 7881 7576 -7675 -11800 1458 8425 -28 -4669 1669 1541 -6161 -4408 5898 5235 -5816 -5829
2338 -5829 4387 5281 -4049 -6025 2179 4392 -1092 -1354 2652 192 -5553 -2181 7521 7515 -2735 -6879
2354 -6879 -454 4718 2019 -303 2027 1225 -3728 -3327 4388 6808 -1813 -6501 292 6985 627
2369 627 -5327 -346 4874 -326 -3839 2804 5158 -4952 -9227 2830 10358 -644 -10463 -2172
2383 -2172 5472 -1094 -5740 3636 6061 -6815 -10356 4682 11267 -2971 -10931 1696 9002 -2642
2397 -2642 -7769 3890 7027 -6410 -7995 7812 10283 -7509 -12110 6107 11735 -2980 -8374
2410 -8374 4527 7217 -6236 -6109 10379 9834 -9333 -10452 8261 11940 -5431 -9225 5627 7288
2424 7288 -7269 -5928 9455 6565 -10999 -8752 10264 9810 -8712 -10033 6004 7485 -6530
2437 -6530 -5244 7813 3850 -11462 -6607 10969 8131 -10462 -10270 6497 7744 -6606 -5958 6399
2451 6399 4052 -9168 -4705 10805 6825 -10784 -8767 9061 9427 -6369 -6631 6505 4902 -7194
2465 -7194 -3649 10588 5015 -10811 -7058 10975 9853 -7585 -7853 6865 6484 -6165 -3072 9481
2479 9481 3842 -10838 -5304 11389 7774 -10056 -8460 7216 6432 -6576 -4967 7105 2388 -10202
2493 -10202 -3739 11195 5349 -11819 -8147 8794 6511 -7151 -5443 5888 2251 -8655 -2790
2506 -2790 9892 3050 -11816 -5645 10130 6842 -7703 -5532 6503 3442 -6486 -1001 9181
2519 9181 1885 -9907 -2861 11149 5857 -8480 -5429 7005 4563 -5013 -1294 7091 644 -8552
2533 -8552 -519 10764 3887 -9213 -4651 7189 4823 -5205 -2329 4970 157 -6854 -237 8163
2547 8163 1229 -9991 -4209 7903 4006 -6359 -3879 3737 102 -5657 522 6885 -803 -9279
2561 -9279 -1628 8787 2847 -7692 -3389 4744 1161 -4073 1057 5204 -2319 -7643 1520 9209
2575 9209 1128 -7478 -2042 5637 1801 -2872 1549 4272 -3003 -4775 3686 7612 -1222 -6867 391
2590 391 5835 720 -3299 740 2317 -3119 -2476 4521 4932 -4707 -6625 2376 5816 -789 -3751 313
2606 313 517 -3705 -864 4913 1979 -6280 -4779 3465 3947 -2827 -3183 1378 314 -2831 355 4207
2622 4207 -792 -5749 27 6359 1997 -4579 -2461 2040 992 -447 2715 2555 -3351 -4932 3077
2637 3077 7119 1326 -3998 -617 2035 41 -210 2592 2270 -2807 -2752 3300 3997 -1841 -4444 739
2653 739 3798 1150 -2305 -1128 -701 -2125 -105 3643 2602 -4175 -5980 -649 4529 2266 -2160
2668 -2160 -2125 -915 -1878 -1795 2321 3816 -1511 -4917 -623 4262 556 -4493 -1269 4168 2318 -2627
2684 -2627 -1340 1601 -1114 -3557 2979 8008 281 -8963 -3522 7107 5343 -2512 -494 4388 -1682
2699 -1682 -7297 2186 11072 1435 -9926 -1759 9173 1059 -9314 165 10082 280 -9440 734
2713 734 8684 -4420 -11989 4713 15375 -1902 -15666 -1447 10415 -1763 -8539 6382 10642
2726 10642 -10106 -16437 6563 16060 -4431 -13380 5100 10658 -8358 -11796 9105 12495 -8349
2739 -8349 -11220 10064 10781 -12073 -12574 12513 15372 -7994 -11261 7764 6562 -10923 -4614 17213
2753 17213 10199 -15578 -12773 11460 11093 -7790 -4788 11713 3823 -14322 -5920 14048 6691
2766 6691 -11692 -4614 12197 3078 -14383 -5762 11891 5632 -8248 -2495 7288 -2811 -12625
2779 -12625 728 14847 4481 -11769 -7035 4111 939 -4320 2791 7832 -2011 -10493 -2509
2792 -2509 6803 3065 -3677 -671 4172 731 -5248 -3215 3165 4510 957 -3 1075 -923 -5432
2807 -5432 -3117 6668 10102 385 -8890 -4545 3667 2402 -588 4426 6299 -4847 -11070 940
2821 940 10871 1606 -7541 960 7913 -3378 -11551 1037 11346 -69 -8919 2212 7745 -7898
2835 -7898 -14098 6318 17023 -931 -14412 -1096 7407 -5755 -8103 11115 13877 -10315 -18026
2848 -18026 4805 13959 -4562 -10083 8826 10865 -11107 -13355 9291 12674 -8194 -8528 13286
2861 13286 10210 -15038 -13562 13112 14675 -7101 -7696 9567 2926 -15819 -5118 19318 10663
2874 10663 -14810 -10699 9659 4845 -10835 -623 15213 2255 -16175 -4579 13053 2132
2886 2132 -12396 344 14288 162 -15286 -4085 10040 1312 -7501 3984 9360 -6884 -14890
2899 -14890 1871 13962 2859 -7689 -797 3432 -5405 -5912 7502 10347 -3680 -8730 1434
2912 1434 5383 -2631 -4029 5128 6744 -2754 -4629 1180 1747 -2202 615 7560 4292 -5335 -6405
2927 -6405 995 3953 2646 2602 1550 -3821 -5680 -684 4606 3501 -206 -1909 -2290 -2139 -136 1724
2943 1724 286 -217 1150 43 -3016 -2632 216 1607 489 1826 1570 -3857 -6984 -382 6301 3187
2959 3187 -2398 -1876 -1032 -3469 -1851 5708 6452 -2907 -6281 795 4130 -1211 -2119 4236 3539 -3753
2975 -3753 -3234 3838 2020 -4966 -1028 8036 3914 -6462 -4917 3740 3369 -1509 1547 5485 -2308
2990 -2308 -9515 -400 9131 3162 -6316 -1995 3302 -2121 -5528 2867 6778 -3223 -7699 2300 6577
3005 6577 -4180 -7605 2793 7647 -2582 -6015 2561 3289 -6080 -3839 8744 6688 -8421 -8849
3019 -8849 4717 6000 -3701 -2369 6451 1442 -9015 -2265 10385 4410 -8225 -2831 8181 2921
3033 2921 -7054 -1099 8059 856 -6650 1431 8637 -1528 -9759 849 10426 1468 -7559 -1168
3047 -1168 5215 -1541 -5373 4078 7452 -3874 -9460 1069 8035 -362 -6571 405 4634 -2524
3061 -2524 -5519 1948 4858 -3610 -6548 2869 6591 -2765 -7824 647 5823 43 -4058 1129 3028
3076 3028 -3904 -4588 4737 6892 -2587 -7361 459 6212 835 -3878 1139 3793 -1886 -3531 3333
3091 3333 5512 -2180 -5599 1747 6829 737 -5153 -777 4411 487 -3111 1505 4211 -2360 -6158
3106 -6158 1827 7475 186 -7235 -1744 5258 1086 -4554 418 4648 -2155 -7104 1515 7457 -1279
3121 -1279 -8623 -697 7147 466 -6546 -459 5335 -1595 -6152 2616 7222 -2796 -8619 1483
3135 1483 8950 -88 -7142 191 5863 -1177 -5035 3484 6956 -3370 -7757 3042 8778 -812
3149 -812 -7760 785 6796 -476 -4916 2653 5450 -3281 -6395 3796 8103 -2434 -8308 1062 7204
3164 7204 -724 -5616 1575 4359 -3562 -5641 4013 6412 -4124 -8290 1788 7322 -1400 -6384
3178 -6384 796 4378 -3054 -4459 3840 5103 -4517 -7227 3220 7236 -1747 -6520 1074 4798 -1452
3193 -1452 -3522 3483 4333 -3819 -5222 4217 6742 -2189 -6182 1488 5543 -460 -3346 2143 3663
3208 3663 -2983 -3603 4402 5971 -3020 -6146 2067 5768 -708 -4456 1272 2975 -2671 -3015 3609
3223 3609 3724 -4297 -5877 3044 5353 -2015 -4905 882 2571 -2120 -2328 2786 1900 -4543 -4343 3142
3239 3142 4427 -2493 -4531 384 3167 -1007 -1828 1616 1420 -3198 -2201 3581 3870 -2487 -4008 1507
3255 1507 3922 35 -1891 1170 1579 -1906 -853 3640 2912 -2911 -3743 2206 4215 -621 -2702 377
3271 377 1110 -1406 -318 3183 1214 -4011 -2896 3009 3193 -2292 -3372 454 1191 -1635 -651 1892
3287 1892 -356 -3702 -1276 3399 2087 -3400 -3078 1250 1418 -1194 -750 1072 -1097 -3184 919 4516
3303 4516 681 -3885 -1577 2809 1528 -1291 530 1766 -1344 -2288 2455 3842 -988 -4212 1219
3318 1219 4530 3 -2698 802 1751 -1675 -1325 4216 3052 -4296 -4165 3108 4679 -1515 -2524 1379
3334 1379 571 -3380 -886 4668 1460 -5825 -3221 3884 2781 -4063 -2710 3348 874 -3544 -486
3349 -486 3747 -1046 -5601 73 6373 943 -6054 -2189 3779 938 -2666 1618 3861 -2694 -5945
3364 -5945 1426 6797 690 -4865 116 4459 -262 -3044 1985 4148 -1459 -3573 2434 4306 -2400
3379 -2400 -4975 1859 5732 253 -3515 -508 1516 -1828 -982 3838 3753 -3307 -5643 466 4015 909
3395 909 -1701 -276 605 -2016 -2347 1121 2336 -1125 -2902 -147 2024 -895 -3497 -1133 3416 2320
3411 2320 -1791 -2468 -226 -45 -1364 1081 4678 1347 -5468 -4532 3435 5221 -528 -2121 2244 955
3427 955 -4216 -1639 5631 4060 -4686 -2856 5378 3107 -6097 -3662 6732 5751 -4598 -3641 4274
3442 4274 1348 -7573 -1023 10590 4025 -10564 -6901 6537 4356 -5761 -1039 7961 -204 -11731
3456 -11731 -2422 10736 3032 -9626 -2162 9067 62 -11549 -1539 10493 1171 -8851 439
3469 439 8947 -3589 -12248 2491 13989 968 -11074 -783 7738 -2354 -7088 6502 11459
3482 11459 -4808 -12561 2695 10615 -1398 -7664 4686 8320 -5598 -8829 4997 8448 -3946
3495 -3946 -5814 6456 6303 -7858 -8661 5647 8866 -2257 -4757 3319 1352 -7911 -3691 8675
3509 8675 6197 -5987 -7248 1856 2802 -2895 -849 4953 1846 -5809 -3809 2855 2198 -2545 -636
3524 -636 3830 1656 -4465 -4062 746 3114 1596 1069 588 -2303 -3987 -1452 4014 5393 1289 -3204
3540 -3204 -3473 342 2174 1353 1585 2602 -257 -3855 -2359 3038 2966 -1443 -1090 3630 1061 -5403
3556 -5403 -4019 4083 4821 -1855 -1864 2107 -1240 -7108 -1396 8457 5025 -6418 -6170 2757 1394 -4581
3572 -4581 647 7445 335 -9913 -3241 7183 2089 -6673 -223 8481 80 -9136 -1440 7440
3586 7440 947 -5505 2641 7442 -4027 -11068 1775 10916 1297 -5940 890 4215 -4948 -6069
3600 -6069 6809 10082 -3954 -8739 2653 6470 -3571 -4735 6095 6331 -5460 -6549 4346
3613 4346 4531 -5624 -3512 7397 4757 -7344 -7145 4155 4268 -3468 -806 5497 -577 -9282 -3053
3628 -3053 8085 4492 -5758 -3003 3293 -877 -5525 769 6899 -339 -6365 162 4981 -1443
3642 -1443 -5415 2286 6443 -425 -4486 327 2566 -2685 -2009 5374 5037 -3845 -5524 1523 3696
3657 3696 -74 -403 3428 191 -4513 -1845 4291 3014 -2370 -1761 2186 336 -2806 -810 2253
3672 2253 978 -1140 99 1027 -2007 -3438 197 3428 1283 -1621 -2471 -1108 -689 548 2099 1479
3688 1479 -1985 -3494 -774 1453 1707 310 -750 -985 -512 -78 -61 95 408 741 241 181 648 -959
3706 -959 -1220 898 3360 1567 -2192 -2569 897 1327 528 1647 2314 -910 -3751 -63 4542 1762
3722 1762 -2952 -875 2200 -540 -3139 882 3859 -865 -3926 1374 4178 -2227 -5495 1099 5343
3737 5343 -469 -4554 543 2470 -3208 -3486 4117 5039 -4194 -6568 1862 5052 -2010 -4057 2768
3752 2768 2844 -4200 -3501 5097 4062 -4544 -4151 4800 4646 -4090 -3984 4159 3655 -3257 -2340 5072 2626
3769 2626 -5808 -3010 6710 4488 -4954 -4378 4424 3292 -4272 -1219 5394 1619 -6309 -2434 6294
3784 6294 2926 -6016 -3052 4933 2269 -4791 -1972 4331 550 -5643 -941 6197 889 -6800 -1955
3799 -1955 5274 2432 -4841 -2132 3733 299 -4265 33 5332 422 -6071 -1687 5095 2332 -4376
3814 -4376 -1869 3642 1600 -3131 -9 4462 318 -4607 -870 5565 1967 -4848 -2099 4121 2536
3829 2536 -3325 -908 3897 122 -4619 -599 5837 1291 -5800 -2165 4708 2355 -3643 -1650 3348
3844 3348 444 -4362 -460 4411 391 -5537 -2038 4844 2299 -4553 -2511 2993 933 -3629 -551
3859 -551 4144 -15 -5249 -1116 5255 2105 -4959 -2719 3794 1875 -3406 -737 3640 225 -4505
3874 -4505 -292 5550 1782 -5108 -2030 4511 2392 -3072 -1011 3770 371 -3513 664 5119 751
3889 751 -5342 -1297 4704 1793 -3824 -1355 2844 227 -3354 357 4033 -671 -5101 -573 4689
3904 4689 1051 -4540 -1664 2623 652 -3396 -47 3188 -1393 -4341 55 4408 -11 -4595 -1186
3919 -1186 3247 631 -2785 231 2403 -940 -3068 1619 4041 -505 -4227 -173 3997 712 -2482
3934 -2482 299 2375 -587 -1987 2007 3009 -1163 -3474 707 3973 367 -2316 150 1465 -443
3949 -443 -1137 1475 1628 -2077 -2459 1571 2770 -787 -2368 -18 1166 -396 -638 789 213 -1970
3965 -1970 -1607 1357 1908 -1393 -2654 -196 1500 -87 -799 490 -122 -1132 -634 1800 1064 -1384
3981 -1384 -1858 822 1831 -52 -777 274 217 -192 451 1640 408 -1429 -809 1485 2252 79 -1084
3998 -1084 312 395 -198 664 1094 -71 -1685 -889 1653 1545 -824 -1487 195 825 -698 -634 380 -516
4016 -516 -1875 -351 2232 616 -2856 -2102 1263 1403 -791 -532 259 -1102 -2707 287 3047 635
4032 635 -3072 -1457 2465 1449 -1981 -212 2402 265 -2423 971 3220 -484 -3797 803 4670
4047 4670 721 -3439 -138 3001 -99 -1945 2259 3707 -2014 -4391 1535 5447 -505 -3926 740
4062 740 3559 -2189 -3436 3045 3884 -3270 -4347 2914 4100 -3584 -4787 2844 4417 -2487 -4400
4077 -4400 2437 2007 -4503 -2926 5619 3802 -5824 -5306 3621 3818 -3265 -2188 3833 1565 -5597 -2143
4093 -2143 5598 2602 -4854 -2289 4893 2227 -4913 -1983 4572 2036 -3392 -101 4829 66 -5278
4108 -5278 -186 6159 2254 -4275 -2052 2680 726 -2267 1543 4308 -850 -5222 -706 3953 985
4123 985 -2620 -564 2168 -197 -2990 -555 2229 353 -1826 -172 1706 -684 -3358 -1774 2709
4138 2709 2601 -1010 -2492 -1410 -170 -647 434 2472 1209 -3008 -3469 631 3497 537 -1994 627
4154 627 2237 -1426 -3108 1330 4228 -515 -2386 1949 3625 -2426 -4944 2404 6302 -112 -4727
4169 -4727 488 2958 -2664 -3052 5145 5902 -3806 -7244 1967 5784 -1913 -4212 3737 4120 -5365 -5728
4185 -5728 4340 5353 -4395 -5002 4873 4267 -6988 -5737 5228 5755 -4265 -4255 4713 1637 -7805
4200 -7805 -3397 8726 5071 -6951 -5387 4776 2446 -5537 -910 7850 1808 -8635 -2774 7595
4214 7595 2354 -6278 -714 7205 1243 -7373 -1326 6911 1212 -5204 1565 6784 -2060 -7881 558
4229 558 8104 1566 -4902 -159 3205 -2688 -4561 3721 6512 -1402 -6017 260 3496 -1959 -3265
4244 -3265 2656 3317 -2785 -3863 1082 1780 -1885 -2077 3029 2499 -3387 -3984 386 2277 311 504
4260 504 1139 -903 -3551 -1424 2400 2998 175 -1236 -591 -858 -299 1343 1447 690 -316 -431 -923
4277 -923 -493 628 1074 870 1031 860 -1177 -2560 -200 3406 1964 -473 -649 -698 -1806 -1591 2583
4294 2583 3983 -987 -3873 -462 1719 -606 -1510 2075 2083 -2609 -3126 1236 1705 -2247 -1834 2878 2662
4311 2662 -3586 -4160 1643 2438 -1339 -331 3263 20 -5066 -1959 4943 3223 -2623 -2118 2327 -140
4327 -140 -3781 674 5166 740 -4567 -589 4006 171 -3788 1214 4863 -231 -4186 460 2911
4342 2911 -1917 -3037 3481 4739 -3063 -5610 1309 3785 -864 -1455 3030 1440 -5068 -3317 4094
4357 4094 3782 -3309 -2823 2795 1355 -4139 -1616 4076 1456 -3940 -1046 3579 52 -5158 -524
4372 -524 5050 1559 -3930 -1089 2725 -730 -2872 2247 4981 -1233 -4811 239 4079 621 -2502
4387 -2502 1553 3080 -2275 -3081 2362 3692 -1775 -2787 2197 2809 -2014 -3132 1860 2776 -1001 -1278
4403 -1278 1684 900 -3166 -2025 3290 3211 -2048 -3108 590 1155 -1320 -452 2003 410 -2731 -1844
4419 -1844 2023 1640 -1603 -1733 774 1228 -1193 -1269 706 862 -599 -489 1227 888 -1643 -1725 1234
4436 1234 2907 216 -1745 -674 1217 220 -452 1295 2078 -844 -2619 547 3013 260 -2581 -25
4452 -25 2588 171 -2124 220 2254 -115 -2282 624 2806 -1111 -3911 112 3599 241 -3060
4467 -3060 -466 1936 -1042 -2957 1380 3543 -1586 -4779 576 3891 -467 -3628 494 3318 -1336
4482 -1336 -3257 1595 3532 -1890 -4056 2096 4427 -1551 -3887 906 3576 -911 -2689 2055 2776
4497 2776 -2447 -3193 3240 4292 -2104 -3879 1619 3874 -1191 -2648 1958 2609 -2441 -2734 2995 3349
4513 3349 -2450 -3674 2275 3827 -1610 -3281 1421 2459 -2227 -2558 2539 2629 -3232 -3451 2433 3544
4529 3544 -2088 -3488 1450 2117 -1983 -2242 2212 2218 -2744 -2696 2867 2913 -2304 -3253 1794 2632 -1585 -2035
4547 -2035 2207 1861 -2414 -2040 2936 2670 -2685 -2721 1967 3222 -1207 -1953 1818 1758 -1895 -1371 2798
4564 2798 1888 -2584 -2536 2482 2694 -1578 -2184 1179 1724 -1569 -1435 2056 1380 -2826 -2335 2354 2485
4581 2485 -2307 -2444 1234 1767 -1455 -1334 1709 840 -2309 -1551 2293 1668 -2433 -2078 1380 1812 -1264
4598 -1264 -1276 1224 971 -1739 -482 2077 1184 -2102 -1558 1878 2139 -1164 -1477 886 1317 -919 -370
4615 -370 2066 1040 -1770 -1182 2294 1591 -1316 -1711 999 1536 -895 -626 1332 330 -1939 -924
4631 -924 2247 1193 -1966 -1508 1293 1081 -1031 -667 938 177 -1979 -74 1515 446 -2378 -1511
4647 -1511 1716 986 -1327 -882 879 -224 -1396 145 1718 -192 -2142 -270 2276 507 -1011
4662 -1011 -518 1032 -8 -594 702 1388 -782 -1603 731 2185 131 -1278 35 833 102 -447 680
4679 680 992 -1355 -1240 1256 1487 -1002 -1562 365 840 -538 61 740 -162 -1707 -241 1668 559
4696 559 -1387 -1213 721 61 -682 -283 936 -702 -1162 616 1422 -109 -1824 -345 1206 466 -1177
4713 -1177 -203 517 -378 -341 868 1473 -460 -1597 226 1798 599 -489 288 409 -461 -597 1176
4730 1176 1032 -357 -1222 294 1358 285 -1256 -335 1021 265 -358 131 480 -630 -753 631 1549
4747 1549 -103 -1953 -1242 701 673 -695 -553 288 -65 -1664 -282 1632 502 -1986 -1023 1495 931
4764 931 -1491 -1333 1487 776 -1453 -573 1858 231 -2341 -397 3375 1424 -2816 -1526 2243 1383
4780 1383 -1530 -111 3146 44 -3439 -404 3936 1556 -3306 -769 3241 350 -3551 -188 3833
4795 3833 194 -3526 465 4080 -578 -4918 374 4970 128 -4659 -193 3166 -1552 -3562 1973
4810 1973 4420 -2505 -5454 618 4206 -740 -3767 1366 3694 -2657 -3811 2274 3885 -2125 -3516
4825 -3516 2689 3606 -3156 -3888 2606 3877 -1509 -2223 2550 1972 -3535 -2177 4291 3711 -2390 -3089
4841 -3089 1856 2253 -1903 -1067 3465 1560 -3334 -1983 2857 1843 -2008 -975 2610 1085 -2795
4856 -2795 -1390 1416 1074 -1040 -122 1630 -178 -2878 -976 1974 1903 -466 -1540 -326 -373 -680 426
4873 426 1472 570 -1376 -2209 -295 929 553 -681 -319 1042 -19 -1780 -1063 1718 1634 -342 -165
4890 -165 1078 -356 -2762 18 3710 2115 -1884 -1879 1612 487 -1878 685 3786 417 -3991 -1151
4906 -1151 3378 1461 -2829 -259 3428 -26 -4228 -664 3827 25 -3351 317 4037 -1386 -5468
4921 -5468 94 4843 452 -3689 -80 2901 -2476 -4114 2733 5169 -1586 -5182 356 3538 -1698
4936 -1698 -2934 2836 3770 -2988 -4243 2202 3566 -2675 -2494 3725 3900 -3466 -3874 2513 3276 -1862
4952 -1862 -1161 3722 1161 -4407 -2316 4521 3412 -2576 -1807 2223 302 -3234 73 4159 948
4967 948 -3681 -1093 3079 -20 -3276 353 3390 -35 -3019 -457 1740 -1026 -1706 1949 2641 -1434
4983 -1434 -3802 -3 1765 227 -577 925 560 -2592 -2028 1973 2104 -925 -892 693 491 -1533 -361
5000 -361 1599 1175 -564 3 937 -525 -1455 416 2058 825 -574 -377 -262 -1026 392 2235 1692
5017 1692 -1134 -1464 -317 270 142 850 1016 -865 -1617 -392 994 -427 -493 589 284 -852 -984
5034 -984 382 -32 -600 516 1358 -66 -2006 -1222 1057 805 -590 433 133 -1653 -1861 1508 2016
5051 2016 -278 -1595 265 577 -1144 -588 1655 997 -1607 -792 1519 705 -2602 -499 3003 1135
5067 1135 -1865 -638 1317 -306 -1767 1300 3320 -509 -3282 -242 2562 162 -1824 1036 2364
5082 2364 -1768 -2607 1478 2789 -1620 -2376 1391 2147 -2105 -2713 1908 2057 -2166 -1571 2368 1185
5098 1185 -3370 -2409 3482 2323 -2422 -2282 2110 1237 -2289 -726 3485 967 -3828 -1193 3362 1300
5114 1300 -2556 -555 2796 815 -2508 -40 3244 116 -2612 325 3092 -173 -3229 -504 3338
5129 3338 547 -2323 43 2028 -611 -2308 826 3021 -174 -3141 -198 2227 125 -1893 122
5144 122 1894 -825 -2442 578 2164 -495 -2203 -103 2159 -99 -2396 -383 1720 407 -1454
5159 -1454 298 1237 -712 -2347 415 2618 568 -2283 -548 1450 545 -1260 -141 1845 102
5174 102 -1945 39 2693 469 -2168 -386 2325 1075 -1734 -619 1963 506 -1770 -91 2241
5189 2241 232 -2963 -578 2894 1084 -2511 -819 1640 378 -2025 -235 2443 -190 -3203 -599
5204 -599 2574 495 -2743 -652 2085 350 -2486 -492 1984 -60 -2240 -224 2991 269 -3057
5219 -3057 -479 2685 939 -2017 -279 1995 70 -2358 276 3095 -7 -2818 -168 2944 748
5234 748 -2501 -355 2331 18 -2281 382 2446 -320 -2748 233 3006 19 -2849 -402 1986
5249 1986 -141 -1621 198 2032 -485 -2642 362 2635 -261 -2676 -301 2052 101 -1860 -57
5264 -57 1887 -883 -2416 639 2353 -410 -2578 -113 1993 174 -1932 137 1397 -384 -1744
5279 -1744 905 2053 -724 -2332 455 2326 113 -1769 229 1731 -24 -979 762 1802 -665
5294 -665 -1760 507 2351 -528 -1728 35 1404 -281 -1135 516 897 -750 -1291 1087 1536 -472
5310 -472 -1673 349 1416 -81 -1561 -35 542 -807 -1295 558 1225 -978 -1630 266 1437 -328
5326 -328 -1346 224 373 -336 -661 574 726 -871 -1274 659 1696 -240 -1205 52 769 120 -201
5343 -201 757 641 -633 -446 837 1275 -504 -664 471 709 -273 -271 526 372 -883 -378 1405 976 -1156
5362 -1156 -1303 586 823 -307 -722 102 159 -716 -393 769 100 -1553 -806 872 401 -976 -619 649
5380 649 130 -647 101 1191 -253 -1278 67 1486 287 -944 -179 634 -91 -696 519 1060 -627
5397 -627 -1269 859 1549 -273 -1425 603 1215 -84 -404 1023 1008 -868 -741 1339 1620 -1104 -1324
5414 -1324 780 1424 -694 -677 996 424 -1889 -788 1199 697 -1737 -1338 1249 604 -1520 -926 1144
5431 1144 384 -1820 -412 1433 146 -2002 -537 1648 720 -1546 -1001 894 190 -999 308 1657
5447 1657 -171 -2204 -184 1707 486 -1123 -144 1030 -81 -961 455 1409 -107 -1111 253 1440
5463 1440 72 -1308 -53 1135 902 -381 -376 509 188 -592 227 1082 426 -1390 -1185 615 861 -213
5481 -213 -803 537 274 -1286 -582 742 657 -843 -1201 498 868 -1263 -1621 251 1367 -492 -1549
5498 -1549 208 688 -1402 -1205 1548 2042 -1315 -2301 698 2139 -575 -1470 1427 1371 -1813 -1800 2050
5515 2050 2535 -1576 -1898 2154 2076 -2133 -2149 2138 2215 -1902 -1469 2446 1266 -2905 -1415 3397 2293
5532 2293 -2740 -2179 1974 1061 -2666 -398 3544 673 -3788 -1441 3443 870 -3134 -1039 3237
5547 3237 112 -3582 -848 3104 476 -3054 244 3495 -742 -3663 -276 3631 472 -2913 75
5562 75 1948 -1179 -2577 1478 3382 -700 -3277 218 2638 -146 -1496 1444 2434 -1159 -2240 870
5578 870 1798 -791 -1611 1524 1866 -1557 -2161 603 1506 -420 -662 1163 556 -1748 -1658 1403 1928 -445
5596 -445 -1288 -205 -53 -544 -16 1075 708 -240 -748 -308 90 15 74 266 226 -130 -917 -882 -7 1107
5616 1107 290 48 -32 -437 -881 -680 1499 1776 -579 -1585 -216 1144 -283 -226 1377 1446 -1273 -1569
5634 -1569 1138 1393 -766 -986 1617 1376 -1581 -2078 934 1636 -1001 -581 1792 267 -3157 -1734
5650 -1734 2387 2068 -1577 -1320 1020 137 -2226 -5 2801 655 -2945 -1226 2438 591 -2610 -12
5666 -12 2656 39 -2977 -311 2098 -155 -2259 1110 3251 -905 -3344 -111 2730 -1 -1631
5681 -1631 1183 1698 -2111 -2044 2071 3070 -969 -2022 1319 1545 -1412 -1252 2100 1580 -1935 -1676 1994
5698 1994 727 -2010 -489 2636 1383 -2140 -1022 1372 -51 -1650 401 2510 -512 -2993 -822
5713 -822 1963 404 -1356 387 1203 -1445 -2215 801 1910 -597 -1686 690 1256 -1256 -1378 980
5729 980 1373 -317 -876 896 558 -1381 -362 1908 1411 -941 -878 573 453 -669 284 1710 262
5746 262 -1684 -566 1368 554 -514 -37 946 -125 -902 -199 745 81 -740 306 628 -349 -701 -436
5764 -436 552 271 252 -291 -565 -576 -117 379 631 -52 -744 -718 -172 170 591 -89 -488 383 265 -473 -410
5785 -410 639 366 -508 -241 814 -114 -1510 -389 1906 596 -1105 -601 919 104 -1156 682 1915
5802 1915 181 -2081 -447 1940 426 -1375 128 1646 -507 -1936 499 1880 -441 -2158 684
5817 684 2013 -617 -2667 405 1921 -621 -2017 1006 1447 -1608 -2212 1437 2494 -1568 -2353 786
5833 786 1695 -854 -1798 1466 1670 -1752 -2034 1761 1836 -1579 -1806 1507 1805 -1741 -1456 1765 1517 -1647
5851 -1647 -1199 2252 1460 -2580 -1518 1907 1963 -1158 -1197 1613 1138 -1781 -726 2059 1014 -1946 -1137
5868 -1137 1806 1147 -1534 -764 1600 1151 -1634 -762 1545 494 -1948 -1010 1466 830 -1943 -1346 1227
5885 1227 1007 -1037 -1090 1324 412 -1494 -772 1573 1013 -1695 -1113 1460 785 -1157 -918 1421 1049
5902 1049 -1173 -771 1649 946 -1403 -1015 1661 1539 -978 -1221 1063 1141 -1011 -452 1121 757 -1361
5919 -1361 -853 1352 1344 -1002 -1418 1274 665 -922 -563 1002 586 -1627 -1071 1523 1000 -1776 -919 900
5937 900 1292 -1119 -1028 757 536 -1313 -780 1237 755 -1775 -1096 1464 1242 -1204 -1146 726 413 -1283
5955 -1283 -803 1171 673 -1545 -757 1715 831 -1175 -982 1302 747 -749 -196 1245 511 -1432 -783
5972 -783 1445 935 -1474 -866 1330 782 -1013 -634 1424 277 -1345 -217 1691 438 -1210 -835
5988 -835 1216 429 -967 -536 821 210 -1064 -80 1115 63 -1565 -153 970 208 -1082 -641 732
6005 732 122 -1005 -78 1041 -52 -1118 121 1142 191 -1006 -231 965 271 -763 85 955 -191
6022 -191 -749 464 735 -161 -968 53 863 364 -553 31 181 -268 -648 388 897 -344 -699 -67 831
6041 831 -4 -556 -91 -146 -359 -494 273 162 -931 -643 485 756 -261 -670 50 207 -246 -105 441
6060 441 145 -607 -461 117 413 -189 -557 213 67 -93 -62 291 161 -355 110 825 237 -480 -293 407
6080 407 694 -48 -106 359 -70 -89 -6 638 640 -458 -592 699 558 -324 -428 480 55 -599 -289 692 228
6101 228 -940 -270 948 459 -1062 -579 376 -14 -879 -21 542 -273 -1550 -310 1336 372 -1581 -526
6119 -526 1064 224 -1052 310 1243 -231 -1188 175 1571 -459 -1709 539 1802 413 -1302 243
6135 243 1221 -412 -1372 769 1662 -677 -1492 571 1562 75 -1059 544 1167 -762 -1531 1093 1729
6152 1729 -1085 -1513 844 1687 -936 -1375 701 1234 -1039 -1512 1171 1054 -1729 -1366 1354 1526 -1433
6169 -1433 -1567 940 1032 -1244 -681 1465 1035 -1621 -1284 1167 774 -1020 -910 1141 988 -1127 -657
6186 -657 840 723 -1027 -133 1217 507 -1431 -569 1399 899 -515 -630 599 -8 -724 188 1176 852
6204 852 -958 -790 738 433 22 -532 383 231 -728 -404 235 457 -140 -455 155 774 -666 -1180 463
6223 463 1223 177 -1145 -230 326 -368 -804 596 1692 -231 -2039 -125 1505 474 -1281 457
6239 457 1340 -561 -1744 620 2009 266 -1474 938 1801 -862 -1988 401 2045 -204 -1856 650
6255 650 1207 -983 -1857 1849 2690 -1081 -2257 730 1763 -1071 -1100 1632 1494 -1812 -2018 1417 1607
6272 1607 -1661 -1692 1982 1651 -2057 -1755 1690 1322 -1542 -1162 1814 739 -2710 -1602 2458 1470 -1802
6289 -1802 -1198 1330 351 -2093 130 2558 649 -2363 -644 2060 437 -1804 -17 2305 229
6304 229 -1818 88 2106 -82 -1377 818 2010 -555 -2180 271 1441 17 -654 715 898 -1327
6320 -1327 -1189 1038 1545 -285 -1181 131 406 -1226 -643 483 544 -826 -427 430 71 -814 -261 705
6338 705 270 -555 -746 -372 -296 47 481 664 -472 -594 -148 11 540 399 347 -439 -810 -131 367 -135
6358 -135 -10 349 46 -369 -672 655 59 -491 439 911 -199 -782 -215 968 746 -216 18 279 -907
6377 -907 -1002 560 1401 -229 -1283 265 182 -755 -653 762 862 -701 -1128 679 331 -1253 -435 1336
6395 1336 688 -1373 -836 831 77 -814 112 1615 -28 -1997 -503 1469 457 -894 421 1497
6411 1497 -848 -1655 832 1893 -229 -1314 457 1336 -781 -1076 1068 1609 -741 -1085 1159 897
6427 897 -1511 -1108 1566 1380 -1320 -1429 968 499 -1529 -383 1909 294 -2122 -846 1795 837
6443 837 -1524 -211 1307 -135 -2149 225 1989 -272 -1671 168 1596 -561 -2037 -196 1996
6458 1996 -342 -1478 264 1276 -875 -1523 1022 1892 -763 -1695 399 1272 -596 -678 1397 1172 -1019
6475 -1019 -1023 981 1394 -704 -958 1151 705 -635 -1055 670 934 -721 -344 778 669 -852 -1037 1045
6493 1045 848 -362 -709 -18 493 -501 -309 643 425 -1066 -1050 336 508 -291 -915 -383 451 -163 -752
6512 -752 -21 610 190 -533 204 748 -136 -1147 235 1182 444 -769 -201 751 132 -609 341 1140 219
6531 219 -1699 -126 1120 479 -1159 -326 1344 196 -1572 -99 1797 31 -1095 144 1463 -29
6547 -29 -1721 -277 1424 9 -1151 90 1312 -540 -1545 70 1644 -559 -1958 -152 1417
6562 1417 -287 -1468 395 1289 -582 -1749 79 1840 -545 -1769 599 1796 -500 -1556 472
6577 472 1411 -384 -1205 716 1341 -851 -1368 795 1989 -429 -1618 777 1536 -482 -1359 927 1421
6594 1421 -974 -1335 695 1411 -711 -1720 698 1389 -589 -1315 701 1200 -757 -1379 1091 858 -920
6611 -920 -1612 584 1091 -889 -1201 686 670 -1068 -634 444 660 -922 -1124 431 939 -683 -922 650
6629 650 745 -581 -633 638 631 -1030 -494 1139 1133 -706 -800 643 1069 -702 -405 568 522 -703 -595 882
6649 882 658 -671 -863 720 763 -300 -593 494 703 -414 -606 810 471 -678 -875 986 748 -531
6667 -531 -890 155 429 -411 -753 412 128 -705 -670 328 517 -869 -717 286 536 -237 -369 524 345
6686 345 -774 -556 681 669 -618 -377 441 459 -166 -375 700 445 -513 -305 846 482 -272 -533 978
6705 978 714 -395 -557 602 299 -338 -265 622 24 -950 -147 647 616 -844 -328 540 267 -689 -296 255
6725 255 314 -1062 -305 579 106 -921 -557 380 286 -538 52 295 -629 -617 238 652 -299 -577 -53 609
6745 609 -12 -227 406 189 -110 -428 652 616 -339 -523 249 519 -123 -97 422 -27 -144 -160 413 792 -506
6766 -506 -247 622 274 -410 -61 418 208 -213 -133 712 -124 -623 -239 734 442 -853 -249 117 -274 -306
6786 -306 237 496 -129 -867 -150 752 175 -673 -345 470 -97 -388 -488 441 -208 -158 -76 806 74 -606 -180
6807 -180 756 386 -243 152 311 -189 -508 3 649 552 -529 88 559 407 -246 -126 429 230 -174 -353
6827 -353 237 54 -755 -41 712 587 -659 -672 645 374 -703 -184 531 -38 -1149 -227 1097 502 -664
6846 -664 -682 663 447 -808 -545 1062 421 -930 -405 1251 303 -1101 -460 1282 461 -1196 -438 1150
6864 1150 64 -1083 194 1510 121 -1302 -257 1490 549 -1369 -102 1297 282 -1342 -111
6879 -111 1645 -13 -1145 299 1699 -421 -1656 363 1825 -461 -1450 200 1164 -708 -1714 414
6895 414 1474 -522 -2032 248 1094 -723 -1362 1029 1015 -974 -1374 483 1418 -454 -1126 793 1131
6912 1131 -756 -1444 893 652 -338 -326 694 518 -804 -836 1025 858 -463 -756 282 580 -784 -242
6930 -242 728 535 -760 -401 634 683 -384 -91 259 355 -564 -722 -90 239 -187 131 601 198 -483 -868
6950 -868 -509 594 224 -333 -488 7 -102 -435 -64 574 293 -657 -376 280 212 -584 -455 610 165 -1021
6970 -1021 -618 653 828 -635 -80 794 34 -1357 -418 1518 574 -1010 -542 954 29 -1278 -9
6987 -9 1821 386 -1446 -121 1274 235 -1043 294 1489 -133 -1533 98 1482 -322 -1354 350
7003 350 1264 -217 -1660 55 1256 -212 -1306 502 983 -1015 -1310 587 1694 -477 -903 696
7019 696 569 -974 -1020 1526 1065 -1214 -1100 924 861 -1294 -705 1325 652 -986 -886 1113 614 -1036
7037 -1036 8 1815 -49 -1568 -141 1137 368 -709 94 951 -372 -1235 190 1232 183 -1089
7053 -1089 460 937 -575 -617 598 992 -679 -562 247 161 -634 -657 705 576 -912 -636 186 55 -544
7072 -544 427 953 -84 -1187 -79 610 109 -124 11 343 -646 -697 305 547 -336 -297 439 308 -201
7091 -201 -248 356 329 105 99 119 -675 -729 -336 809 128 -327 -24 -82 -232 267 348 313 -188 -310 -83 58 -252
7114 -252 -37 159 159 -626 -15 58 -138 -550 -35 380 -587 -678 111 287 -261 -86 573 453 -1126 -337 705
7135 705 703 -409 -265 662 -77 -771 -183 1261 169 -762 493 1108 -297 -554 348 1108 -166 -926 433
7154 433 993 -720 -1163 880 1206 -206 -1109 296 706 -706 -868 1168 954 -1240 -1176 920 1010 -1134
7172 -1134 -839 1120 767 -1451 -881 1133 319 -1331 -726 1380 261 -1577 -796 1199 546 -1210 -562
7189 -562 1185 211 -1516 -329 1209 313 -1436 -163 1463 214 -913 -123 1165 49 -1052 -61
7205 -61 1309 309 -1049 155 1353 -237 -1069 -19 927 250 -990 411 952 -132 -756 73 1400
7222 1400 -95 -886 -110 758 23 -718 124 649 -171 -802 -145 776 -94 -748 -546 680 -3 -671 -367
7241 -367 405 42 -726 -162 412 -313 -796 35 854 165 -599 69 639 198 -300 106 843 -96 -813 -135
7261 -135 786 662 -745 -290 708 388 -391 -116 856 150 -911 53 979 286 -836 -248 822 504 -872
7280 -872 -428 914 140 -1010 -144 1083 110 -1017 -351 716 187 -955 -622 815 324 -922 -273
7297 -273 696 -137 -1137 -481 1017 -154 -840 -223 901 42 -653 -114 899 66 -920 164 1281 161
7315 161 -812 63 1230 240 -719 278 1071 311 -881 74 1166 20 -1044 96 1057 -2 -862 -222
7333 -222 487 -210 -534 -114 819 -140 -839 189 717 108 -625 -95 663 -48 -648 286 588 -119 -881 88
7353 88 322 -449 -765 31 756 -111 -409 142 603 -142 -541 323 553 -370 -614 -32 493 -51 -394 278
7373 278 77 -278 -432 622 440 -206 -454 518 486 -92 -414 208 453 -40 -137 187 442 -561 -384 323
7393 323 486 -431 -300 25 18 -212 -388 242 229 -439 -517 70 334 -104 -398 313 -108 -105 64 176 44 -477
7415 -477 -151 185 60 -257 -357 324 402 -446 -200 240 171 -26 -217 496 378 -126 -122 569 281 -163 -153 231
7437 231 -28 -144 125 389 158 -450 217 689 389 -159 -192 570 35 -568 11 371 -207 -532 74 300
7457 300 -164 -405 -236 -25 -24 -630 -70 372 -163 -994 184 197 -229 -542 18 757 199 -558 41 519 47
7478 47 -275 556 469 -152 -396 206 541 -315 -574 252 383 -380 -53 633 486 -436 -284 590 797 -326
7498 -326 -483 487 653 -267 -204 661 312 -694 -174 714 486 -608 -310 383 324 -605 -247 557 179 -695
$$ [...]
8191e56
##END NTUPLES=NMR FID
##END=
