##TITLE=1H_LR-671-CR2-MK
 D2O, 8 sc, 
 16.10.2019
##JCAMPDX= 6.0         $$ Bruker NMR JCAMP-DX V2.0
##DATA TYPE= NMR FID
##DATA CLASS= NTUPLES
##ORIGIN= UXNMR, Bruker Analytische Messtechnik GmbH
##OWNER= root
$$ XWIN-NMR		Version 3.5
$$ Wed Oct 16 14:34:55 2019 Russian Standard Time (UT+4h)  she@DPX200
##.OBSERVE FREQUENCY= 200.1315
##.OBSERVE NUCLEUS= ^1H
##.DELAY= (6, 6)
##.ACQUISITION MODE= SIMULTANEOUS
##.ACQUISITION SCHEME= undefined
##.AVERAGES= 8
##.DIGITISER RES= 18
##SPECTROMETER/DATA SYSTEM= spect
##.PULSE SEQUENCE= zg30
##.SOLVENT NAME= D2O
##.SHIFT REFERENCE= (INTERNAL, D2O, 0, 15.7039)
##AUDIT TRAIL= $$ (NUMBER, WHEN, WHO, WHERE, WHAT)
$$ ##TITLE= Audit trail, XWIN-NMR		Version 3.5
$$ ##JCAMPDX= 5.01
$$ ##ORIGIN= Bruker BioSpin GmbH
$$ ##OWNER= she
$$ F:/spectra/data/she/nmr/H-F/1/audita.txt
$$ ##AUDIT TRAIL=  $$ (NUMBER, WHEN, WHO, WHERE, WHAT)
(   1,<2019-10-16 14:34:00.04 +0400>,<she>,<DPX200>,
      <created by zg, POWCHK disabled, PULCHK disabled
       configuration hash MD5:
       00 E9 B6 7A A2 85 ED C7 34 08 36 98 17 FE 4E 26
       data hash MD5: 16K
       D7 4E F6 1D F2 79 80 0E 0B 9A 47 63 39 68 B9 E0>)
$$ ##END=
$$ 
$$ hash MD5
$$ 0B AF 7D 02 DF AD 51 87 9F 08 8F AB 45 81 06 EA
##$RELAX= 
##$RELAX= 
##$RELAX= 
##$RELAX= 
##$RELAX= 
##$RELAX= 
$$ Bruker specific parameters
$$ --------------------------
##$DU= <F:/spectra>
##$EXPNO= 1
##$NAME= <H-F>
##$PROCNO= 1
##$TYPE= <nmr>
##$USER= <she>
##$AMP= (0..31)
100 100 100 100 100 100 100 100 100 100 100 100 100 100 100 100 100 100 
100 100 100 100 100 100 100 100 100 100 100 100 100 100 
##$AQSEQ= 0
##$AQ_mod= 1
##$AUNM= <au_zg>
##$AUTOPOS= <>
##$BF1= 200.13
##$BF2= 200.13
##$BF3= 200.13
##$BF4= 200.13
##$BF5= 200.13
##$BF6= 200.13
##$BF7= 200.13
##$BF8= 200.13
##$BYTORDA= 1
##$CFDGTYP= 0
##$CFRGTYP= 5
##$CHEMSTR= <none>
##$CNST= (0..31)
1 1 145 1 1 1 1 1 1 1 1 1 1 1 1 1 1 1 1 1 1 1 1 1 1 1 1 1 1 1 1 1 
##$CPDPRG= <>
##$CPDPRG1= <>
##$CPDPRG2= <>
##$CPDPRG3= <>
##$CPDPRG4= <mlev>
##$CPDPRG5= <mlev>
##$CPDPRG6= <mlev>
##$CPDPRG7= <mlev>
##$CPDPRG8= <mlev>
##$CPDPRGB= <>
##$CPDPRGT= <>
##$D= (0..31)
0 1.2 0 0 0 0 0 0 0 0.06 0 0.03 0 0 0 0 0.0002 0 0 0 0 0 0 0 0 0 0 0 0 
0 0 0 
##$DATE= 1571222039
##$DBL= (0..7)
120 120 120 120 120 120 120 120 
##$DBP= (0..7)
150 150 150 150 150 150 150 150 
##$DBP07= 0
##$DBPNAM0= <>
##$DBPNAM1= <>
##$DBPNAM2= <>
##$DBPNAM3= <>
##$DBPNAM4= <>
##$DBPNAM5= <>
##$DBPNAM6= <>
##$DBPNAM7= <>
##$DBPOAL= (0..7)
0.5 0.5 0.5 0.5 0.5 0.5 0.5 0.5 
##$DBPOFFS= (0..7)
0 0 0 0 0 0 0 0 
##$DE= 6
##$DECBNUC= <off>
##$DECIM= 24
##$DECNUC= <off>
##$DECSTAT= 4
##$DIGMOD= 1
##$DIGTYP= 9
##$DL= (0..7)
0 120 120 120 120 120 120 120 
##$DP= (0..7)
150 150 150 150 150 150 150 150 
##$DP07= 0
##$DPNAME0= <>
##$DPNAME1= <>
##$DPNAME2= <>
##$DPNAME3= <>
##$DPNAME4= <>
##$DPNAME5= <>
##$DPNAME6= <>
##$DPNAME7= <>
##$DPOAL= (0..7)
0.5 0.5 0.5 0.5 0.5 0.5 0.5 0.5 
##$DPOFFS= (0..7)
0 0 0 0 0 0 0 0 
##$DQDMODE= 0
##$DR= 18
##$DS= 0
##$DSLIST= <SSSSSSSSSSSSSSS>
$$ [...]
##$SUBNAM2= <"">
##$SUBNAM3= <"">
##$SUBNAM4= <"">
##$SUBNAM5= <"">
##$SUBNAM6= <"">
##$SUBNAM7= <"">
##$SUBNAM8= <"">
##$SUBNAM9= <"">
##$SW= 24.0689530833862
##$SWIBOX= (0..15)
0 0 2 0 0 0 0 0 0 0 0 0 0 0 0 0 
##$SW_h= 4816.95568400771
##$TD= 16384
##$TD0= 1
##$TE= 0
##$TE2= 300
##$TE3= 300
##$TEG= 300
##$TL= (0..7)
0 120 120 120 120 120 120 120 
##$TP= (0..7)
150 150 150 150 150 150 150 150 
##$TP07= 0
##$TPNAME0= <>
##$TPNAME1= <>
##$TPNAME2= <>
##$TPNAME3= <>
##$TPNAME4= <>
##$TPNAME5= <>
##$TPNAME6= <>
##$TPNAME7= <>
##$TPOAL= (0..7)
0.5 0.5 0.5 0.5 0.5 0.5 0.5 0.5 
##$TPOFFS= (0..7)
0 0 0 0 0 0 0 0 
##$TUNHIN= 0
##$TUNHOUT= 0
##$TUNXOUT= 0
##$USERA1= <user>
##$USERA2= <user>
##$USERA3= <user>
##$USERA4= <user>
##$USERA5= <user>
##$V9= 5
##$VALIST= <valist>
##$VCLIST= <CCCCCCCCCCCCCCC>
##$VD= 0
##$VDLIST= <DDDDDDDDDDDDDDD>
##$VPLIST= <PPPPPPPPPPPPPPP>
##$VTLIST= <TTTTTTTTTTTTTTT>
##$WBST= 1024
##$WBSW= 4
##$XGAIN= (0..3)
0 0 0 0 
##$XL= 0
##$YL= 0
##$YMAX_a= 209965
##$YMIN_a= -231808
##$ZGOPTNS= <>
##$ZL1= 120
##$ZL2= 120
##$ZL3= 120
##$ZL4= 120
##$ABSF1= 10
##$ABSF2= 0
##$ABSG= 5
##$ABSL= 3
##$ALPHA= 0
##$AQORDER= 0
##$ASSFAC= 0
##$ASSFACI= 0
##$ASSFACX= 0
##$ASSWID= 0
##$AUNMP= <proc_1d>
##$AZFE= 0.1
##$AZFW= 0.1
##$BCFW= 1
##$BC_mod= 2
##$BYTORDP= 1
##$COROFFS= 0
##$CY= 11.3945322036743
##$DATMOD= 1
##$DC= 2
##$DFILT= <>
##$DTYPP= 0
##$F1P= 20.1720416913024
##$F2P= 0.152960286110954
##$FCOR= 0.5
##$FTSIZE= 0
##$FT_mod= 4
##$GAMMA= 1
##$GB= 0.15
##$INTBC= 1
##$INTSCL= 1
##$ISEN= 128
##$LB= 0.24
##$LEV0= 0
##$LPBIN= 0
##$MAXI= 10000
##$MC2= 0
##$MEAN= 0
##$ME_mod= 0
##$MI= 1.114404
##$NCOEF= 0
##$NC_proc= 0
##$NLEV= 6
##$NOISF1= 3.799351
##$NOISF2= 2.8
##$NSP= 1
##$NTH_PI= 0
##$NZP= 0
##$OFFSET= 15.70392
##$PC= 1
##$PHC0= -9576.19
##$PHC1= 14.00093
##$PH_mod= 1
##$PKNL= yes
##$PPARMOD= 0
##$PSCAL= 0
##$PSIGN= 0
##$REVERSE= no
##$SF= 200.130013532006
##$SI= 16384
##$SIGF1= 3
##$SIGF2= 2
##$SINO= 400
##$SIOLD= 16384
##$SREGLST= <1H.CDCl3>
##$SSB= 0
##$STSI= 0
##$STSR= 0
##$SW_p= 3612.71676300578
##$SYMM= 0
##$S_DEV= 0
##$TDeff= 0
##$TDoff= 0
##$TI= <>
##$TILT= no
##$TM1= 0
##$TM2= 0
##$TOPLEV= 0
##$USERP1= <user>
##$USERP2= <user>
##$USERP3= <user>
##$USERP4= <user>
##$USERP5= <user>
##$WDW= 1
##$XDIM= 8192
##$YMAX_p= 0
##$YMIN_p= 0
$$ End of Bruker specific parameters
$$ ---------------------------------
##NTUPLES= NMR FID
##VAR_NAME=  TIME,          FID/REAL,        FID/IMAG
##SYMBOL=    X,             R,               I
##VAR_TYPE=  INDEPENDENT,   DEPENDENT,       DEPENDENT
##VAR_FORM=  AFFN,          ASDF,            ASDF
##VAR_DIM=   8192,          8192,            8192
##UNITS=     SECONDS,       ARBITRARY UNITS, ARBITRARY UNITS
##FACTOR=    0.0002076,     1,               1
##FIRST=     0,             0,               0
##LAST=      1.7004516,     0,               0
##MIN=       0,             -231808,         0
##MAX=       1.7004516,     209965,          0
$$ Real data points
##PAGE= N=1
##DATA TABLE= (X++(R..R)), XYDATA
$$ [...]
$$ plain form
1907 -361 99 217 252 -156 -10 -239 -92 211 184 426 96 156 209 -2 -17 149 119 135 190 403 484 287 -191
1930 -191 106 293 347 210 500 86 370 377 428 364 220 389 766 400 443 497 344 133 547 838 636 715 464
1953 464 513 606 205 296 457 611 488 687 446 475 76 119 246 676 374 601 293 251 294 312 268 296 489
1976 489 202 621 575 387 216 149 31 378 281 374 530 235 14 191 131 -58 63 296 294 539 286 138
1998 138 -66 199 237 -81 144 -193 77 69 -48 -3 -383 -41 172 9 81 -273 -314 -219 -89 -371 -83 -4 -220
2021 -220 -34 -160 -153 -29 -406 -371 -260 -260 -256 -294 -123 -323 -263 -526 -97 -174 -483 -134 -82 -572 -320 -501 -304 -493
2045 -493 -309 -111 -259 -462 -500 -457 -409 -123 -270 -338 -373 -265 -132 -475 -436 -654 -577 -190 -209 -275 -309 -341 -260 -379
2069 -379 -294 -166 -74 -381 -288 -377 -445 -336 -264 -275 -63 -43 -208 -59 -212 -260 -387 -226 -337 -141 -116 -59 -315 32
$$ packed form
1907c61M60J18L5m08J46k29J47L03k7K42l30O0N3k11j5J66l0J6N5K13Q1j97m78
1930a91K97J87N4j37K90m14K84PN1o4j44J69L77l66M3N4j53k11M14K91k02P9k51
1953D64M9R3m01R1J61J54j23J99k41K9l99M3J27M30l02K27l08m2M3J8m4K8J93
1976D89k87M19m6j88j71o7j18L47r7R3J56k95k21J77o0j89J21K33kK45k53j48
1998A38k04K65L8l18K25l37K70qj17M5l80L42K13j63P2l54m1R5J30k82K88P9k16
2021b20J86j26PJ24l77L5J11%Ml8J71k00O0k63M29p7l09L49N2m90K52j81J97j89
2045d93J84J98j48k03l8M3M8K86j47o8l5J08J33l43L9k18P7L87j9o6l4l2Q1j19
2069c79Q5J28R2l07R3q9o8J09P2j1K12K0j65J49j53m8j27J61j11J96K5N7k56L47
$$ plain form
2093 32 -60 -150 -2 -110 190 94 -306 28 -45 57 103 -11 -33 245 11 41 261 148 28 139 158 40 263
2116 263 23 200 177 165 186 267 191 -381 465 260 479 13 257 166 368 422 431 208 306 534 247 116 9
2139 9 393 388 372 271 381 269 173 238 233 592 235 554 79 722 16 407 152 218 252 436 406 277 363 251
2163 251 514 176 269 525 112 188 418 256 199 -20 205 3 472 241 -61 297 -47 -152 -127 335 51
2184 51 -15 387 187 7 40 -297 -352 93 -280 -34 -1 50 -102 31 -323 -225 162 184 46 -102 233 -126 -100
2207 -100 -99 -381 -156 -259 -68 -335 45 -280 -412 -121 96 74 -34 -155 -157 -69 -101 -638 -411 -153 -74 -104 -57
2230 -57 -231 -65 -578 -249 -277 -343 -211 -156 -283 -284 -318 -573 -311 -280 -41 -7 -255 -222 -140 -88 -222 -101 -187 -381
2254 -381 -302 -26 -342 -272 -280 -293 47 -98 24 9 -419 -96 -169 -570 -127 -38 73 -57 -39 -139 -68 -105 -496 -128
$$ packed form
2093C2r2r0J48j08L00r6m00L34p3J02M6j14k2K78k34L0K20j13j20J11J9j18K23
2116B63k40J77k3j2K1Q1p6n72Q46k05K19m66K44r1K02N4Rk23R8K28k87j31j07
2139IL84nj6j01J10j12r6O5nL59l57L19m75O43p06L91k55O6L4J84l0j29Q6j12
2163B51K63l38R3K56m13P6K30j62n7k19K25k02M69k31l02L58l44j05K5M62k84
2184E1o6M02k00j80L3l37n5M45l73K46L3N1j52J33l54R8L87K2j38j48L35l59K6
2207a00Jk82K25j03J91k67L80l25j32K91K17k2j08j21kQ8l2n37K27K58P9l0M7
2230e7j74J66n13L29k8o6J32N5j27jl4k55K62L1K39L4k48L3Q2N2j34J21q6j94
2254c81P9K76l16P0qj3L40j45J22j5m28L23p3m01M43Q9J11j30J8j00P1l7l91L68
$$ plain form
2278 -128 -278 -66 -11 -102 82 -252 -155 -224 -73 -192 -107 91 -15 69 55 -90 -279 59 273 152 18 -1 -49
2301 -49 -99 32 60 110 238 70 -100 310 297 97 224 269 -249 144 372 -182 315 284 203 223 203 165 25 129
2325 129 248 -13 4 243 331 292 97 410 428 -5 452 63 246 192 603 345 611 324 338 23 284 363
2347 363 318 473 111 436 175 336 231 470 271 132 158 404 443 100 43 -5 138 322 -76 -64 92 239
2369 239 -10 124 -101 129 -74 88 363 181 345 -64 115 -151 245 299 68 154 -59 17 -55 -25 16 59
2391 59 12 1 68 -80 154 36 143 218 35 7 -50 2 -248 -199 -184 -184 -216 -289 50 -76 77 42 -165 -145 -470
2416 -470 89 -234 -311 134 -1 -407 -194 -257 -331 -456 -130 57 -125 -349 -97 -13 -168 -173 -102 -86 -112 219 -183
2439 -183 -190 -147 -169 -370 33 46 -318 -107 -304 -27 -4 -63 -338 -314 -42 -39 -15 95 -19 114 94 -173 -318 -84
$$ packed form
2278a28j50K12N5r1J84l34R7o9J51j19Q5J98j06Q4j4j45j89L38K14j21j34j9m8
2301d9n0J31K8N0J28j68j70M10j3k00J27M5n18L93K28n54M97l1q1K0k0l8j40J04
2325A29J19k61J7K39Q8l9j95L13J8m33M57l89J83n4M11k58K66k87J4l15K61P9
2347C63m5J55l62L25k61J61j05K39j99j39K6K46L9l43n7m8J43J84l98J2J56J47
2369B39k49J34k25K30k03J62K75j82J64m09J79k66L96N4k31Q6k13P6p2L0M1M3
2391E9m7j1O7j48K34j18J07P5j83k8n7N2k50M9J5%l2p3L39j26J53l5k07K0l25
2416d70N59l23p7M45j35m06K13o3p4j25L26J87j82k24K52Q4j55nP1J6k6L31m02
2439a83pM3k2k01M03J3l64K11j97K77K3n9k75K4K72LK4J10j14J33k0k67j45K34
$$ plain form
2463 -84 39 9 184 -251 -314 -298 -52 -13 -13 277 -78 -84 173 96 -41 -147 43 -21 -114 -227 24 -24 83 -113
2487 -113 -177 91 -16 -30 28 -174 -42 -161 376 194 174 21 -313 -41 387 177 -88 151 76 50 -8 452
2509 452 117 137 171 202 -58 220 112 593 36 -309 58 378 564 383 97 32 231 -62 155 -12 -40 2
2531 2 344 37 -106 84 81 303 83 -50 58 167 297 350 26 88 67 18 134 265 134 107 -20 -91 -141 -5
2555 -5 110 -26 81 146 65 -128 229 104 -26 -115 115 253 0 31 210 225 58 -35 -7 -30 -56 -12 123 -60
2579 -60 -146 -302 -255 65 -38 -85 -298 -101 -190 -80 -114 -245 -145 -41 -107 -123 -88 -38 -124 -263 -332 272 142 -114
2603 -114 102 -309 -175 102 -244 -307 -28 -310 -31 -198 -82 -96 1 234 -132 -120 -126 -75 -326 3 -205 -326
2625 -326 -17 -212 -22 254 -160 -175 -166 175 -107 -228 -403 -23 -109 163 -83 -226 -131 213 -87 -80 -44 -117 -173
$$ packed form
2463h4J23l0J75m35o3J6K46L9%K90l55oK57p7j37j06J90o4r3j13K51m8J07j96
2487a13o4K68j07j4N8k02J32j19N37j82k0j53l34K72M28k10k65K39p5k6n8M60
2509D52l35K0L4L1k60K78j08M81n57l45L67L20J86j81k86o5J99k93K17j67k8M2
2531BL42l07j43J90lK22k20j33J08J09J30N3l24O2k1m9J16J31j31k7j27p1n0J36
2555eJ15j36J07O5q1j93L57j25j30q9K30J38k53L1J79J5j67r3K8k3k6M4J35j83
2579f0q6j56M7L20j03m7k13J97q9J10l4j31J00J04o6j6L5N0q6j39o9O04j30k56
2603a14K16m11J34K77l46o3K79k82K79j67J16j4R7K33l66J2oN1k51L29k08j21
2625c26L09j95J90K76m14j5RL41k82j21j75L80q6K72k46j43R5L44l00PL6p3n6
$$ plain form
2648 -173 -188 161 -113 -149 -191 33 -252 -296 18 22 -49 370 -175 -88 111 -138 -198 -235 -76 -67 154 -20 222 -75
2672 -75 -129 -114 37 19 259 109 153 277 274 451 15 169 40 -212 259 105 230 153 -31 320 152 -194 99
2695 99 -20 -177 87 81 260 -24 38 -110 206 51 186 73 117 84 149 -54 182 322 78 17 309 283 157
2718 157 -113 193 11 6 320 38 14 140 33 31 15 137 159 89 -105 227 172 -27 193 -76 35 -68 56
2741 56 -74 -37 -276 -185 18 47 -61 258 133 312 8 22 -150 405 153 -2 104 133 346 -139 -79 -235
2763 -235 -223 97 29 -114 51 35 -322 -148 106 -119 -16 63 87 -150 7 63 101 99 25 -116 33 -2 -311 -93
2787 -93 -243 115 -6 -21 -224 -37 -179 -268 0 -226 197 -254 26 -222 -151 -121 -150 -53 91 -60 -11 -72 -226
2810 -226 -46 5 -130 -82 -90 -258 -42 30 -64 -16 157 136 -101 -41 23 -87 -181 -283 -254 -77 -24 -89 -170 -7 -5 -15
$$ packed form
2648a73j5L49k74l6m2K24k85m4L14Mp1M19n45Q7J99k49o0l7J59RK21j74K42k97
2672g5n4J5J51j8K40j50M4J24lJ77m36J54j29k52M71j54J25p7j84L51j68l46K93
2695I9j19j57K64oJ79k84O2j48L16j55J35j13M4l3O5k03K36J40k44o1K92k6j26
2718A57k70L06j82nL14k82k4J26j07kj6J22K2p0j94L32n5j99K20k69J11j03J24
2741E6j30L7k39R1K03K9j08L19j25J79l04J4j72N55k52j55J06K9K13m85O0j56
2763b35J2L20o8j43J65j6l57J74K54k25J03P9K4k37J57N6L8kp4j41J49l5l09K18
2787i3j50L58j21j5k03J87j42q9K68k26M23m51K80k48P1L0k9R7J44j51M9o1j54
2810b26J80N1j35M8qj68K16P2r4M8J73k1k37O0O4j10r4j02K9J77N3o5q1J63Kj0
$$ plain form
2836 -15 179 172 -266 -222 60 6 -123 -159 -250 418 -108 28 -234 45 156 -315 -92 -146 93 33 46 5 33 -354
2860 -354 -103 -128 81 138 -153 -166 114 -180 226 -131 -37 63 207 161 357 -86 230 -131 -111 75 97 75 -73
2883 -73 268 -130 -124 310 215 -64 194 9 -164 229 -96 181 -258 288 -233 236 -41 -74 28 118 -134 158
2905 158 277 -155 -13 -113 -338 42 73 230 307 283 83 -137 27 -88 280 -104 -136 70 127 -58 -190 243
2927 243 108 12 138 144 191 -303 -15 -86 99 -112 47 306 241 57 -33 39 -122 -96 143 105 187 74 182 212
2951 212 -143 -124 78 -408 42 64 -111 73 103 74 -185 99 -44 -102 -104 -196 166 -133 -80 -351 -326 -28 -207
2974 -207 -293 -250 -81 -100 -117 170 138 36 132 -195 -170 30 -93 243 134 -548 -134 -199 -190 -104 -74 -295 -11 -97
2998 -97 100 80 -105 -220 181 -85 -20 -91 82 -138 -428 28 -105 -245 21 -49 -125 279 -24 -247 -151 120
$$ packed form
2836a5J94pm38M4K82n4j29l6r1O68n26J36k62K79J11m71K23n4K39o0J3m1K8l87
2860c54K51k5K09N7k91j3K80k94M06l57R4J00J44m6J96m43L16l61K0J86K2k2j48
2883g3L41l98OM34r5k79K58j85j73L93l25K77m39N46n21M69k77l3J02R0k52K92
2905A58J19m32J42j00k25L80L1J57P7k4k00k20J64j15L68l84l2K06N7j85j32M33
2927B43j35r6J26OM7m94K88p1J85k11J59K59o5j84r0P2j61K6K39l8Q2j13J08L0
2951B12l55J9K02m86M50K2j75J84L0k9k59K84j43n8kr2L62k99N3k71K5K98j79
2974b07q6M3J69j9j7K87l2j02R6l27K5K00j23L36j09o82M14o5RQ6L0k21K84q6
2998i7J97k0j85j15M01k66O5p1J73k20k90M56j33j40K66p0p6M04l03k23R6K71
$$ plain form
3020 120 106 -39 -140 -102 -1 -81 -89 -133 -59 -113 -72 85 -67 204 -25 -76 166 252 -367 -174 121 -113 -122 9
3044 9 37 218 264 -330 54 -162 248 -44 362 7 41 -11 111 384 -24 -201 21 -455 226 175 -203 -75
3066 -75 23 -85 48 216 200 -50 20 14 90 6 11 249 248 9 265 -18 -241 17 367 -85 -75 -30 -8 -65 42
3091 42 -40 71 127 190 -90 13 165 -117 5 203 336 80 303 333 -179 -121 -167 106 255 61 -11 -10 -201
3114 -201 -60 48 -3 260 137 170 -97 179 -220 471 462 29 308 194 58 -254 -38 101 -107 32 58 -144
3136 -144 233 176 -159 -75 21 -48 114 -125 -177 108 -97 -21 53 -46 194 -175 3 -225 -183 16 -235 59 90
3159 90 132 5 -112 52 -61 -44 9 -4 12 -132 18 -240 -3 -4 -156 202 -149 58 -91 -101 135 -115 -101
3182 -101 222 130 47 -58 190 -170 -13 139 64 -55 140 -40 148 -98 -104 -203 343 -194 78 80 129 -234 -174
$$ packed form
3020A20j4j45j01L8J01q0qm4P4n4M1J57j52K71k29n1K42Q6o19J93K95k34rJ31
3044IK8J81M6n94L84k16M10k92M06l55L4n2J22K73m08j77K22m76O81n1l78J28
3066g5R8j08J33J68j6k50P0oP6q4NK38jk39K56k83k23K58L50m52J0M5K2n7J07
3091D2q2J11N6O3k80J03J52k82J22J98J33k56K23L0n12N8m6K73J49j94p2Jj91
3114b01J41J08n1K63j23L3k67K76l99O91rm33K79j14j36l12K16J39k08J39K6k02
3136a44L77n7l35Q4R6o9J62k39n2K85k05P6P4r9K40l69J78k28M2J99k51K94L1
3159I0M2j27j17J64j13J7N3j3J6j44J50k58K37jj52L58l51K07j49j0K36k50J4
3182a01L23r2q3j05K48l60J57J52p5j19J95j80J88k46or9N46n37K72KM9l63O0
$$ plain form
3205 -174 237 -245 -77 103 -192 -267 -130 -133 -163 -83 -111 -156 -189 38 -44 -265 -100 225 -5 43 58 37 49 -102
3229 -102 -228 -195 7 178 34 27 178 29 -93 -104 -342 122 -10 -10 -279 130 12 263 -15 143 -48 115
3251 115 87 -155 13 278 -78 -137 39 303 -78 102 100 -32 -237 83 157 70 217 -210 147 278 47 70
3273 70 -91 81 114 204 14 -323 -77 81 -353 -191 -127 -137 -68 29 -142 137 213 99 -16 200 -124 -112 44
3296 44 -4 104 -95 334 80 -138 65 -212 -234 -70 31 95 -198 259 -121 203 113 253 238 224 36 -158
3318 -158 290 85 148 21 -105 -231 80 101 193 50 206 -35 -268 -1 -74 -121 335 -277 288 -14 206 -71
3340 -71 -154 71 8 -79 -90 -138 9 -48 168 -31 38 -35 -59 -39 40 59 -305 23 52 142 9 261 -62 -316 -40
3365 -40 -233 3 50 -232 -35 70 -42 146 -119 -67 -10 -112 34 -99 205 33 -142 145 72 133 -81 64
$$ packed form
3205a74M11m82J68J80k95p5J37ll0Q0k8m5l3K27q2k21J65L25k30M8J5k1J2j51
3229a02j26L3K02J71j44pJ51j49j22j1k38M64j32%k69M09j18K51k78J58j91J63
3251A15k8k42J68K65l56n9J76K64l81J80kj32k05L20P4q7J47m27L57J31k31K3
3273G0j61J72L3R0j90l37K46J58m34J62O4j0O9R7j71K79P6j14j15K16l24J2J56
3296D4m8J08j99M29k54k18K03k77k2J64J01O4k93M57l80L24r0J40j5j4j88j94
3318a58M48k05O3j27j26j26L11K1R2j43J56k41k33K67p3m7M56o12N65l02K20k77
3340g1q3K25o3q7j1m8J47n7K16j99O9p3k4K0P9J9l64L28K9R0j33K52l23k54K76
3365d0j93K36M7k82J97J05j12J88k65N2N7j02J46j33L04j72j75K87p3O1k14J45
$$ plain form
3387 64 36 73 228 142 -55 11 -304 -46 -202 25 -217 -156 -136 -158 209 157 -166 117 -49 -15 238 -94 51
3410 51 56 216 -126 163 72 -56 50 -126 -76 146 90 227 -43 -185 -50 7 205 -129 -72 -28 -54 -88 96 9
3434 9 205 245 -174 158 -78 -26 -121 312 -90 -18 -85 -101 -57 -125 -16 -81 23 -196 254 -119 -73 -146 13 178
3458 178 -40 -65 -37 86 -46 342 238 95 -432 -92 -34 35 163 96 119 245 -19 1 131 246 160 302 -52
3481 -52 57 313 120 -17 10 -191 -119 -87 -84 -37 2 -66 163 -80 6 -121 -102 87 63 127 -138 62 -76 -30 -129
3506 -129 1 -233 2 -1 -104 80 54 -56 -207 109 7 65 162 154 -71 -40 204 315 -47 51 -15 108 -143
3529 -143 -147 -1 50 81 -153 128 -186 -109 79 -239 24 244 -133 154 271 -5 27 61 90 -91 106 191 -43
3552 -43 -95 92 -33 -222 159 -26 47 -21 -320 167 102 33 -224 -78 -184 161 -75 107 166 15 -9 116 -73
$$ packed form
3387F4k8L7J55q6j97O6l15K58j56K27k42O1K0k2L67n2l23K83j66L4K53l32J45
3410E1NJ60l42K89r1j28J06j76N0K22n6J37k70j42J35N7J98l34N7M4k6l4J84q7
3434IJ96M0m19L32k36N2r5M33m02P2o7j6M4o8J09o5J04k19M50l73M6p3J59J65
3458A78k18k5K8J23j32L88j04j43n27L40N8O9J28o7K3J26k64K0J30J15q6J42l54
3481e2J09K56j93j37K7k01P2L2LM7L9o8K29k43Q6j27J9J89k4O4k65K00j38M6r9
3506a29J30k34K35lj03J84k6j10j51L16j02N8R7qk25L1K44J11l62R8o6J23k51
3529a43mJ46N1L1k34K81l14P7J88l18K63K20l77K87J17k76L2L4K9j81J97Q5k34
3552d3n2J87j25j89L81j85P3o8k99M87o5o9k57J46j06L45k36J82N9j51k4J25j89
$$ plain form
3575 -73 192 -249 -86 -157 -51 9 -38 113 -54 -411 92 38 167 -172 103 -22 112 182 45 234 -111 -52
3597 -52 35 39 19 -41 -55 7 -13 -34 35 -150 287 53 87 -163 -243 76 96 14 -92 198 -187 133 -57 131 36
3622 36 34 -71 122 -105 243 44 32 71 22 -40 228 -61 -63 75 -114 87 2 27 172 7 70 194 -107 102
3646 102 -71 -248 -129 -37 8 236 69 -9 341 -272 4 -315 -6 -12 29 255 -93 -324 -85 -121 -58 -106 -106 42
3670 42 -262 97 -64 11 -102 194 131 194 28 -173 -16 79 405 -103 -51 -46 117 -104 9 -113 -51 48 30 163
3694 163 -295 -11 225 220 109 118 -115 294 26 -283 -83 -108 90 348 -197 96 70 223 177 47 12 -143 -166
3717 -166 -72 -64 -239 -331 -9 -124 19 183 -43 301 233 196 62 -142 -60 127 258 228 80 -89 -263 38 212
3740 212 -117 171 13 -266 -306 347 -104 62 -106 -43 -8 132 -29 48 -2 115 67 -91 -117 132 176 135 33
$$ packed form
3575g3K65m41J63p1J06O0m7J51j67l57N03n4J29l39K75j25J34P0j37J89l45N9
3597e2Q7Mk0o0j4O2k0k1O9j85M37k34L4k50q0L19K0q2j06K90l85L20j90J88r5
3622C6kj05J93k27L48j99j2L9m9o2K68k89kJ38j89K01q5K5J45j65O3J24l01K09
3646A02j73j77J19R2M5K28j67p8L50o13K76l19L09oM1K26l48k31K39l6O3m8%J48
3670D2l04L59j61P5j13K96o3O3j66k01J57R5L26n08N2NJ63k21J13j22O2R9j8J33
3694A63m58K84K36nj11Rk33M09k68l09K00k5J98K58n45K93k6J53m6j30l5j55k3
3717a66R4Qj75r2L22j15J43J64k26L44o8l7j34k04Q2J87J31l0j48j69j74L01J74
3740B12l29K88j58k79m0O53m51J66j68O3L5J40j61P7n0J17m8j58k6K49M4m1j02
$$ plain form
3763 33 -236 71 17 0 -56 -224 57 174 172 211 10 170 54 -171 -395 282 -86 -223 -74 16 -2 85 -29
3786 -29 129 -216 -126 250 -214 -6 -68 96 136 -94 27 -133 -58 -205 -32 -116 -35 353 -155 -4 -32 69 -40
3809 -40 -200 -107 -221 -185 -56 178 182 -284 -171 221 96 1 -122 -181 53 -188 81 -99 -311 -259 293 98 -60
3832 -60 203 81 28 319 -52 269 -105 60 -306 79 19 -201 31 -97 206 76 65 -87 23 -167 -26
3853 -26 32 406 112 166 37 63 25 184 -108 82 -359 -250 -129 209 -121 -34 42 280 152 -209 -364 -268 91
3876 91 -135 -124 115 165 -106 141 -209 -24 -60 161 -173 232 -119 174 107 -363 311 -142 113 -1 32 -43
3898 -43 119 43 103 -117 -346 41 128 -73 -79 -1 -34 -275 305 -55 186 -3 197 127 -199 -45 347 51 25
3921 25 -1 -209 -37 29 142 8 -51 -144 -52 84 -43 -178 91 -97 76 62 222 -33 25 26 5 67 400 -256
$$ packed form
3763C3k69L07n4j7n6j68K81J17kL9k01J60j16k25k24O77l68j37J49R0j8Q7j14
3786b9J58l45R0L76m64K08o2J64M0k30J21j60P5j47J73q4Q1L88n08J51k8J01j09
3809d0j60R3j14L6J29K34Mm66J13L92j25r5j23n9K34k41K69j80k12N2N52j95j58
3832f0K63j22n3K91l71L21l74J65l66L85o0k20K32j28L03j30j1j52J10j90J41
3853b6N8L74k94N4j29K6l8J59k92J90m41J09J21L38l30Q7P6K38j28l61j55R6L59
3876I1k26J1K39N0k71K47l50J85l6K21l34M05l51K93o7m70O74m53K55j14L3p5
3898d3J62p6O0k20k29L87Q7k01oP8l3k41N80l60K41j89K00p0l26J54L92k96k6
3921B5k6k08J72O6J13j34n9r3R2J36j27j35K69j88J73j4J60k55N8Jk1O2L33o56
$$ plain form
3945 -256 -16 99 218 208 128 -10 81 -16 -29 153 -27 -64 321 233 17 147 -25 -193 104 -1 21 49 292
3968 292 -35 43 18 112 -173 140 209 160 -142 -107 239 -96 -63 64 18 -57 -5 80 -49 -95 -81 138 -173 -159 244
3993 244 -101 547 33 -20 9 190 155 -25 -214 -90 88 141 188 160 -28 5 176 -210 -84 152 67 14 -5
4016 -5 -112 -4 86 161 297 -260 -74 -74 -126 -70 133 -117 -26 214 35 -64 -56 -34 -146 -46 171 24 167 134 -90
4041 -90 -253 -297 -23 -95 -99 100 -29 -257 -143 -23 -148 176 133 -224 273 9 -110 167 71 26 -123 -174 -219
4064 -219 95 -169 -14 -185 107 -198 -41 -103 2 -228 -244 87 -323 -41 -293 -219 74 49 115 -85 67 -72
4086 -72 213 -21 -99 142 150 251 192 114 173 -4 -29 14 124 158 -278 24 -57 185 -52 -347 138 129 -43 -59 -134
4111 -134 -247 83 142 229 -362 103 167 -89 110 -21 76 -14 56 -175 -58 -77 -70 21 -287 -68 -90 -138 74 83 -29
$$ packed form
3945b56K40J15J19j0q0j38R1r7j3J82j80l7L85q8k16J30j72j68K97j05K2K8K43
3968B92l27P8k5R4k85L13O9m9l02L5L46l35L3J27m6p5N2Q5j29m6J4K19l11J4M03
3993B44l45O48n14n3K9J81l5j80j89J24J78N3M7k8j88L3J71l86J26K36q5n3j9
4016ej07J08R0P5J36n57J86%n2N6K03k50R1K40j79r9QK2j12J00K17j47J43l3k24
4041i0j63m4K74p2mJ99j29k28J14J20j25L24m3l57M97k64j19K77r6m5j49n1m5
4064b19L14k64J55j71K92l05J57o2J05k30j6L31m10K82k52P4K93k5O6k00J52j39
4086g2K85k34p8K41QJ01n9p8N9j77k5M3J10L4m36L02q1K42k37k95M85rj72j6p5
4111a34j13L30N9Q7n91M65O4k56J99j31R7r0P0k31J17j9PR1l08K19k2m8K12Rj12
$$ plain form
4136 -29 56 -72 -151 -49 23 -16 -131 293 -97 -78 -79 56 135 -160 -79 103 -89 302 144 -47 -206 128 88 -33
4160 -33 14 108 109 131 -80 61 267 72 -215 -15 -39 -17 -70 -87 88 76 116 47 227 -208 -2 98 57 98 -57
4185 -57 -116 46 -86 -391 0 -40 -115 -22 79 -68 -95 57 -42 -90 -245 -99 10 117 157 -161 96 236 -101
4208 -101 46 -264 -36 44 128 -143 -138 10 13 -56 78 -12 135 -166 78 -115 -27 35 -21 -133 -48 220 -181 -23
4232 -23 -76 -10 -208 295 1 -64 196 -21 11 -264 -185 -22 -56 218 1 172 -70 -91 -261 -25 79 -233 159
4255 159 -13 -203 13 184 48 -170 121 170 95 -78 -175 -93 193 -336 5 -31 137 -52 -485 -2 -141 -143
4277 -143 -147 -202 28 -74 -239 34 -97 180 -97 -95 -67 11 -113 -162 -122 135 -225 47 -79 147 54 116 -93 77
4301 77 -106 15 -181 -6 16 -87 395 -134 183 29 -77 -60 125 178 12 88 -285 7 -7 -207 -355 47
$$ packed form
4136b9Q5j28p9J02P2l9j15M24l90J9jJ35P9k95Q1J82j92L91j58j91j59L34m0j21
4160c3M7R4JK2k11J41K06j95k87K00k4K2n3j7J75j2M0o9J80m35K06J00m1M1j55
4185e7n9J62j32l05L91m0p5R3J01j47k7J52r9m8j55J46J09J07M0l18K57J40l37
4208a01J47l10K28Q0Q4k71NJ48Lo9J34r0J47l01K44j93Q8O2n6j12Q5K68m01J58
4232b3n3O6j98N03k94o5K60k17L2k75P9J63l4K74k17J71k42k1j70K36J04l12L92
4255A59j72j90K16J71j36k18K91M9p5j73r7Q2K86n29L41l6J68j89m33M83j39k
4277a43mn5K30j02j65K73j31K77k77KK8P8j24m9M0K57l60K72j26K26r3O2k09J70
4301G7j83J21j96J75K2j03M82n29L17j54j06J7J85N3j66P6l73K92j4k00j48M02
$$ plain form
4323 47 118 24 195 146 -21 73 -160 -159 28 113 333 188 -37 -364 189 68 -60 -119 -96 -93 -63 -148 20 -216 -43
4348 -43 -69 -134 1 49 -51 -158 -20 23 172 -85 355 -24 92 -40 -14 -202 67 -36 212 -240 189 -421
4370 -421 81 218 -163 74 -297 -10 280 90 -93 -49 -288 55 110 154 7 38 49 269 19 247 132 38
4392 38 -15 99 -8 -96 -193 74 55 159 41 -31 -4 -14 2 46 -7 41 -204 42 161 127 -179 76 319 14
4416 14 -166 281 9 23 -52 115 -122 72 -49 194 94 286 224 97 -27 80 192 45 -140 -141 5 -184
4438 -184 111 -35 141 158 -163 -75 73 44 45 98 97 -148 11 65 326 17 -60 -91 76 -166 31 249 -110 181
4462 181 -156 187 26 154 -194 132 260 -116 51 -30 -163 -193 75 40 114 58 94 -16 60 234 75 -24 139
4485 139 -67 231 120 -125 125 92 -138 -170 77 -68 -40 193 -259 -387 -41 131 -52 21 52 -115 76 -457
$$ packed form
4323D7P1r4J71m9j67R4k33JJ87Q5K20j45k25l27N53j21j28n9K3LL0q5J68k36J73
4348d3k6o5J35M8j00j07J38M3J49k57M40l79J16j32K6j88K69j03K48m52M29o10
4370d21N02J37l81K37l71K87K90j90j83M4k39L43N5M4j47L1J1K20k50K28j15r4
4392C8n3J14j07q8r7K67j9J04j18p2K7j0J6M4n3M8k45K46J19l4l06K55K43l05
4416A4j80M47k72J4p5J67k37J94j21K43j00J92o2j27j24J07J12j47j85jJ46j89
4438a84K95j46J76J7l21Q8J48k9JN3jk45J59N4K61l09p7l1J67k42J97K18l59K91
4462A81l37L43j61J28l48L26J28l76J67q1j33l0K68l5P4n6L6j10P6J74j59r9J63
4485A39k06K98j11k45K50l3k30l2K47j45K8K33m52j28L46J72j83P3L1j67J91n33
$$ plain form
4507 -457 -28 -44 -102 -49 72 -106 -53 -379 -207 154 195 87 125 212 -10 -146 -20 -175 140 240 217 270 -66
4530 -66 45 73 -104 180 -117 -114 -14 234 116 -47 395 121 374 49 114 109 105 128 -40 -40 -5 -79 208 14 -110
4555 -110 -34 64 131 -145 -84 -181 -89 106 -89 119 -127 -50 41 6 -71 -4 31 -355 163 -81 181 -93 -163 194
4579 194 -158 75 251 38 79 -17 9 -25 235 72 57 116 -212 178 -59 154 211 59 44 51 10 0 89 -39
4603 -39 154 -194 24 -62 146 21 -5 59 227 -79 32 -56 -117 143 -106 75 -125 -224 197 72 43 112 -99
4626 -99 251 -332 -89 43 -200 81 154 -142 -81 294 -190 28 7 -125 145 108 9 -209 -115 362 27 172
4648 172 -265 261 -66 -134 -105 -129 130 -91 141 0 44 98 -84 -173 257 -58 183 -83 -253 -190 242 118
4670 118 265 -64 106 144 186 -10 69 -208 122 122 -124 61 161 1 -176 -214 -2 132 -19 91 81 -293
$$ packed form
4507d57M29j6n8N3J21j78N3l26J72L61M1j08L8Q7k22j36J26j55L15J00k3N3l36
4530f6J11K8j77K84k97LJ00K48j18j63M42k74K53l25O5nmK3j68%L5p4K87j94j24
4555a10P6R8O7k76O1r7R2J95j95K08k46P7R1l5p7O7L5l86N18k44K62k74p0L57
4579A94l52K33J76k13M1r6K6l4K60j63j5N9l28L90k37K13N7j52j5Pm1j0Q9j28
4603c9J93l48K18q6K08j25k6O4J68l06J11q8o1K60k49J81k00r9M21j25k9O9k11
4626i9L50n83K43J32k43K81P3k96O1L75m84K18k1j32K70l7r9k18R4M77l35J45
4648A72m37N26l27o8K9k4K59k21K32j41M4N4j82q9M30l15K41k66j70O3M32j24
4670A18J47l29J70L8M2j96P9k77L30%k46J85J00j60j77l8K12J34j51J10j0l74
$$ plain form
4692 -293 -56 -126 -30 -220 163 190 -87 -20 88 -21 -22 -163 -164 -135 -163 161 104 28 136 174 -356 -389 241 -30 135
4717 135 13 170 -480 247 211 -233 -37 -56 62 -226 85 41 158 308 62 -27 -65 -147 48 0 -178 -126 23
4740 23 75 176 112 16 42 178 -169 -111 170 208 -105 -67 -337 -51 268 -117 51 -146 -211 -116 -50 -385 -40 -92
4764 -92 -113 -3 -81 -7 59 15 182 203 108 -112 174 183 41 -207 139 -77 43 -124 -236 -67 208 -69 -64 40
4788 40 -153 -121 -113 -100 -9 -200 105 15 105 -76 209 -279 -238 324 -18 174 -256 216 -64 40 -342 -75 -104
4811 -104 105 -92 132 109 8 -22 245 -41 -111 -62 -74 199 -160 -119 -188 217 -2 154 124 172 -186 114 -6
4834 -6 98 84 -244 332 174 228 -85 3 520 15 28 59 469 257 -196 155 -82 -118 175 171 -206 -62 -98 -123
4858 -123 64 195 75 150 -47 135 12 -2 -384 -116 -29 141 -181 -161 -7 -72 -25 12 -161 150 -58 59
$$ packed form
4692b93K37p0R6j90L83K7k77O7J08j09jj41jK9k8L24n7p6J08L8n30l3O30k71J65
4717A35j22J57o50P27l6m44J96j9J18k88L11m4J17J50k46q9l8q2J95m8j78N2J49
4740B3N2J01o4r6K6J36l47N8K81L8l13L8k70K86L19l85J68j97o5R5O6l35L45n2
4764i2k1J10p8P4O6m4J67K1r5k20K86Rj42k48L46k16J20j67j12J69K75k77NJ04
4788D0j93L2QJ3R1j91L05r0R0j81K85m88M1N62l42J92m30M72k80J04l82K67k9
4811a04K09j97K24k3j01l0K67k86p0M9j2K73l59M1o9M05k19J56l0M8l58L00j20
4834fJ04j4l28N76j58N4l13Q8N17n05J3L1M10k12m53L51k37l6K93ml77J44l6k5
4858a23J87J31j20P5j97J82j23j4l82K68Q7J70l22K0J54o5M7L7j73L11k08J17
$$ plain form
4880 59 111 -65 138 -114 -183 -151 -43 -425 -63 -293 -121 -490 42 130 -32 -38 -171 24 -89 -209 -361 276
4902 276 -115 -93 107 -100 -247 -33 -58 -121 159 -53 130 -90 203 -193 29 -199 -144 248 -129 -34 -68 63
4924 63 20 75 14 -78 -39 -16 -345 -25 -6 -161 39 -110 -58 26 180 4 -263 -96 -28 -120 115 101 18 124 14
4949 14 293 -122 224 -45 -11 84 165 -184 -59 78 116 -31 -201 5 18 153 -108 88 16 -63 -7 8 211
4972 211 35 -77 -313 125 69 -101 -98 146 -39 -261 95 184 339 121 -205 -5 0 32 -22 -213 240 207 -459
4995 -459 256 -189 -234 -175 103 -11 -67 4 -21 -155 45 209 34 -112 150 -124 -339 180 83 91 -113 69 -171
5018 -171 6 62 158 -18 -123 -148 -355 190 -72 70 -68 109 8 52 305 -22 120 41 -101 -77 -34 68
5040 68 77 77 -3 41 -153 -93 125 -28 308 94 -110 -199 22 68 30 -85 192 -136 -54 100 -151 124 -143 0
$$ packed form
4880E9N2j76K03k52o9L2J08l82L62k30J72l69N32Q8j62oj33J95j13j20j52O37
4902B76l91K2K00k07j47K14k5o3K80k12J83k20K93l96K22k28N5L92l77R5l4J31
4924F3m3N5o1r2L9K3l29L20J9j55K00j49N2Q4J54j76k67J67O8r2K35j4q3J06j10
4949A4K79m15L46k69L4R5Q1l49J25J37L8j47j70K06J3J35k61J96p2p9N6J5K03
4972B11j76j12k36M38n6j70LK44j85k22L56Q9J55k18l26K00NL2n4j91M53l3o66
4995d59P15m45m5N9K78j14n6P1k5j34K00J64j75j46K62k74k15N19r7Qk04J82k40
5018a71J77N6R6j76j05k5k07N45k62J42j38J77j01M4K53l27J42p9j42K4M3J02
5040F8R%q0M4j94O0K18j53L36k14k04q9K21M6l8j15K77l28Q2J54k51K75k67J43
$$ plain form
5064 0 -110 -118 -158 117 -84 -93 173 180 273 -55 -11 88 263 -112 103 83 172 24 112 -167 95 90 -204 -107 -38 114
5090 114 -167 139 -210 -92 -160 -118 109 161 -102 58 -3 -27 227 -80 -243 112 217 -35 69 229 91 -83
5112 -83 20 174 -281 188 -88 205 -235 -82 -131 7 -109 111 173 16 -84 -343 93 113 -157 -195 59 -131
5134 -131 -51 -136 198 18 84 54 -294 68 56 43 -36 61 158 -144 -82 235 135 -156 59 16 63 -9 18 58 -273
5159 -273 64 317 -128 162 -51 264 -12 80 71 214 -230 -30 265 -280 -84 174 349 -22 -15 -172 -192 -76
5181 -76 133 -46 142 138 17 -66 87 389 -107 151 -174 -203 -197 -74 -38 102 54 53 112 -33 -136 -37 135 -91
5205 -91 -300 -140 -25 -78 -143 -39 49 -168 364 316 -153 -72 137 105 260 95 28 109 233 -80 225 -159 11
5228 11 -124 307 -21 -119 53 97 137 203 392 -26 -9 -375 -99 -98 77 -87 -151 161 276 -38 2 -22 115 -103
$$ packed form
5064@j10qm0K75k01rK66PR3l28M4R9J75l75K15k0Q9j48Q8k79K62nk94R7O9J52
5090A14k81L06l49J18o8M2K27N2k63J60o1k4K54l07j63L55J05k52J04J60j38j74
5112h3J03J54m55M69k76K93m40J53m9J38j16K20O2j57j00k59M36K0k70l8K54j90
5134a31Q0q5L34j80O6l0l48L62j2j3p9R7R7l02O2L17j00k91K15m3M7p2K7M0l31
5159b73L37K53m45K90k13L15k76R2rJ43m44K00K95n45J96K58J75l71Pj57k0J16
5181g6K09j79J88mj21q3J53L02m96K58l25k9OJ23L6J40m8jN9j45j03R9J72k26
5205i1k09J60J15n3o5J04Q8k17N32m8m69Q1K09l2J55j65o7Q1J24l13L05l84J70
5228A1j35M31l28r8J72M4M0O6J89m18J7l66K76JJ75j64o4L12J15l14M0k4J37k18
$$ plain form
5252 -103 70 -115 86 397 -79 163 62 -37 -84 2 0 -72 -281 -151 -306 67 130 -51 -304 -16 60 157 109
5275 109 195 -58 -92 130 -11 -323 -67 186 149 116 125 -61 -28 -216 12 -302 176 -226 -100 192 30 -64 -174
5298 -174 6 11 17 -26 -91 -190 -7 310 161 40 105 -175 53 483 17 173 -117 -15 -81 -66 58 234 222 80
5322 80 447 -2 118 125 339 -164 -5 193 -56 12 59 -179 -138 212 -100 -85 -36 -27 120 105 176 21 98 234
5346 234 114 146 -259 -22 74 -93 25 -146 -28 275 43 89 -133 163 196 -152 153 118 -59 -53 74 106 113
5369 113 82 -64 -111 -20 -99 -164 -221 -84 59 98 121 -75 86 -189 -15 167 243 54 -109 97 -389 -53 -34
5392 -34 -14 137 182 -48 135 31 185 -208 51 173 -132 105 46 82 -90 92 -28 -266 71 76 34 -5 -66
5415 -66 63 67 130 22 -60 -41 -208 -194 -108 129 -176 46 226 -89 92 -5 184 -315 -62 -47 28 117 91 10 14
$$ packed form
5252a03J73j85K01L11m76K42j01r9m7Q6kp2k09J30j55L73O3j81k53K88P6R7m8
5275A09Q6k53l4K22j41l12K56K53l7l3Rj86L3j88K28l14M78m02J26K92j62r4j10
5298a74J80NOm3o5r9J83L17j49j21O5k80K28M30m66J56k90J02o6J5J24J76j2j42
5322H0L67m49J20PK14n03J59J98k49O8M7k38M1L50l12J5M9RJ47j5P1j55P7J36
5346B34j20L2m05K37R6j67J18j71J18L03k32M6k22K96L3l48L05l5j77OJ27L2P
5369A13l1j46m7R1p9o5n7J37J43L9K3j96J61k75J74J82P6j89j63K06m86L36J9
5392c4K0J51M5k30J83j04J54l93K59J22l05K37n9L6j72J82j20k38L37Nm2l9o1
5415f6J29MO3j08q2J9j67J4Q6K37l05K22J80l15J81r7J89m99K53J5P5Q9k6q1M
$$ plain form
5440 14 -195 -52 161 -43 -13 97 -133 160 -49 211 -441 -278 319 -247 49 160 -53 37 189 218 -13
5461 -13 -2 -154 -315 -12 255 194 43 -80 -19 -9 54 -129 -75 -111 359 -68 38 -173 -120 2 -276 315 -239
5484 -239 27 -21 183 -125 51 132 -72 -165 92 -44 76 -127 188 129 -43 158 118 68 23 100 188 91 -29
5507 -29 159 -34 95 -110 -236 269 -93 -27 -107 -17 -358 55 -24 -224 221 -100 -187 152 132 69 298 201 -121
5530 -121 -10 264 148 -214 26 -39 -96 96 -54 -130 -123 -10 22 8 199 130 263 18 25 40 -168 -69 87 -217
5554 -217 90 -1 -115 -57 -120 70 19 138 -71 74 104 139 -82 -189 171 -41 184 -69 -185 12 -148 -103
5576 -103 279 -23 -9 166 98 -46 -1 -84 -93 40 19 14 -167 -358 -114 -123 -27 -7 -46 -109 -148 -87 22 144 -112 160
5602 160 -4 -57 -174 -34 127 -286 112 -133 -130 -109 75 180 -135 207 -28 -105 -153 -172 -53 43 -132 110 -104
$$ packed form
5440A4k09J43K13k04L0J10k30K93k09K60o52J63N97n66K96J11k13R0J52K9k31
5461a3J1j52j61L03K67o1j51j23O1J0O3j83N4l6M70m27J06k11N3J22k78N91n54
5484b39K66m8K04l08J76Q1k04r3K57j36J20k03L15n9j72K01m0n0m5P7Q8r7j20
5507b9J88j93J29k05j26N05l62O6q0R0l41M13p9k00M45l21q7L39k0o3K29r7l22
5530a21J11K74j16l62K40o5n7J92j50p6PJ13L2j4J91o9J33k45PJ5k08R9J56l04
5554b17L07r1j14N8o3J90n1J19k09J45L0L5k21j07L60k12K25k53j16J97j60M5
5576a03L82l02J4J75o8j44M5q3rJ33k1nj81j91K44rR6K0l9o3l9O1J09J22k56K72
5602A60j64n3j17J40J61m13L98k45LK1J84J05l15L42k35p7m8j9J19R6j75K42k14
$$ plain form
5625 -104 -218 -99 47 304 172 56 282 106 -103 -189 21 -65 -145 -127 145 119 -10 7 115 2 -156 -63
5647 -63 -73 -181 -76 -48 221 120 4 -98 -35 87 -90 274 272 -70 37 -258 39 -16 -120 -176 301 5 34
5670 34 26 -121 140 211 184 46 -295 151 -100 -45 -21 144 -19 -3 254 -149 -161 -205 -44 -71 267 -188 208 -166
5694 -166 -344 76 96 97 -81 59 -269 -126 -101 -68 -130 355 0 -354 111 -165 94 20 -134 -12 -100 3 -162
5717 -162 122 -61 -47 -106 218 26 -124 69 179 -63 293 -426 -42 -76 -145 227 35 126 -126 -351 -35 -42
5739 -42 408 318 -129 11 118 -139 192 133 -128 -51 -116 -209 -188 -235 -35 164 -197 -129 -213 7 -55 189 -116 297
5763 297 47 33 111 317 -223 -101 172 -153 -247 -208 187 -259 21 -259 376 -233 19 99 64 113 50 -122 321
5786 321 5 -32 -13 137 50 -151 -158 -130 14 -302 -64 -64 -53 -25 -107 -96 -164 71 1 75 61 47 215 124 -208 -219
$$ packed form
5625a04j14J19J46K57j32j16K26j76k09q6K10q6q0J8K72k6j29J7J08j13j58R3
5647f3j0j08J05K8K69j01j16j02O3J22j77L64kl42J07k95K97n5j04n6M77k96K9
5670C4qj47K61P1k7j38l41M46k51N5K4J65j63J6K57m03j2m4J61k7L38m55L96l74
5694a66j78M20K0Jj78J40l28J43K5L3o2M85l55l54M65k76K59p4j54J22q8J03j65
5717a62K84j83J4n9L24j92j50J93J10k42L56p19L84l4o9L72j92R1k52k25L16p
5739d2M50r0m47J40J07k57L31n9k61P7o5r3K1m7K00J99l61O8q4K20o2K44l05M13
5763B97k50j4P8K06n40J22K73l25r4L9L95m46K80k80O35o09K52Q0l5M9o3j72M43
5786C21l16l7J9J50q7k01pK8J44l16K38%J1K8q2J1o8K35p0P4j4j4J68r1l32j1
$$ plain form
5812 -219 -193 209 109 73 -109 -44 145 56 -76 6 29 282 -69 -26 145 22 41 152 -131 153 254 -14 126
5835 126 63 -120 257 174 -457 165 -11 8 -278 -40 47 216 -56 51 182 163 11 28 -263 -230 167 -23
5857 -23 -77 -183 -283 -224 36 -263 192 -100 60 57 -1 150 127 107 -194 110 35 48 28 -25 11 -32 201 -85 67
5882 67 -50 255 -411 -35 134 -79 -219 81 -257 436 -81 -314 -261 -62 -355 -38 198 -323 209 -345 300
5903 300 51 70 -47 -95 216 219 24 331 -111 -178 -25 -65 46 41 -144 55 298 101 204 62 -132 95 -4
5926 -4 132 114 -129 131 -237 -146 190 27 54 147 84 -185 128 -200 -8 -250 -108 143 30 103 182 113 125 55
5950 55 17 17 -173 -92 206 -442 -201 305 -139 -223 236 50 -152 96 -120 -22 -64 -50 -121 213 -68 -20 256 -47
5974 -47 100 -67 51 -80 355 27 -11 -205 -219 117 66 148 343 200 -52 -41 -210 37 12 -94 -35 -38 -94 -9
$$ packed form
5812b19K6M02j00l6j82O5J89q9j32Q2K3K53l51M3J71j23J9J11k83K84J01k68J40
5835A26o3j83L77q3o31O22j76J9k86K38Q7J69k72J07J31j9j52J7k91L3L97j90
5857b3n4j06j00N9K60k99M55k92J60ln8J51k3k0l01L04p5J3k0n3L6m3K33k86J52
5882F7j17L05o66L76J69k13j40L00l38O93n17k33N3J99k93L17K36n21N32n54O45
5903C00k49J9j17m8L11Lj95L07m42o7J53m0J11nj85J99K43j97J03j42j94K27r9
5926dJ36j8k43K60l68R1L36j63K7R3o3k69L13l28J92k42J42K51j13P3P9o9J2p0
5950E5l8%j90Q1K98o48K41N06m44q4M59j86k02K48k16R8m2J4p1L34k81M8K76l03
5974d7J47j67J18j31M35l28l8j94j4L36n1Q2J95j43k52J1j69K47k5j06N9ln6Q5
$$ plain form
5998 -9 -154 -105 -147 -134 77 -42 -146 209 48 -234 245 282 160 58 128 -225 67 -160 -123 -55 230 -103 69
6021 69 86 37 74 22 -83 -151 170 -72 -73 -136 75 29 -110 -68 32 43 179 72 -307 45 125 -145 -308 -42
6045 -42 66 -80 23 -36 -88 207 81 144 89 -13 -15 142 451 254 105 -185 0 -150 -137 -197 -203 163 -152 321
6069 321 81 326 -47 -167 12 183 -81 -20 122 -157 6 -40 -164 -137 146 162 92 152 207 59 19 -40 26
6092 26 -56 -62 -184 -74 17 -104 36 -4 -22 186 53 -46 1 -113 191 59 -226 186 -43 -89 46 25 74 375
6116 375 164 -9 219 -285 113 -53 -232 211 78 -35 107 232 96 -101 217 -31 -21 -79 318 -100 51
6137 51 32 -141 -102 -151 31 27 -39 77 266 44 186 100 364 -141 104 -117 -170 340 -8 -177 -244 -217 195 166
6161 166 -263 -68 14 179 -145 48 -58 -62 -35 -112 -159 -146 -123 -62 190 -328 193 -27 -78 8 -141 16 53 18
$$ packed form
5998ij45M9m2J3K11j19j04L55j61k82M79L7j22j02P0l53K92k27L7O8K85l33J72
6021F9J7m9L7n2j05o8L21k42jo3K11m6j39M2J00J1J36j07l79L52Q0k70j63K66
6045d2J08j46J03n9n2K95j26O3n5j02kJ57L09j97j49k90J85j50J3o0oL66l15M73
6069C21k40K45l73j20J79J71k64O1J42k79J63m6j24K7K83J6p0O0N5j48m0n9O6
6092B6q2oj22J10R1j21J40m0j8K08j33r9M7j14L04j32k85M12k29m6J35k1M9L01
6116C75k11j73K28n04L98j66j79M43j33j13J42J25j36j97L18k48J0n8L97m18J51
6137E1j9j73L9m9J82mo6J16J89k22J42q6K64n05K45k21n3N10l48j69o7K7M12k9
6161A66m29J95Q2J65l24J93j06mK7p7m7J3K3O1K52n18N21k20n1Q6j49J57L7l5
$$ plain form
6185 18 -29 52 -43 64 -121 393 -87 313 212 -18 71 337 301 31 -15 9 35 -122 35 -171 128 -5 98
6208 98 156 -46 -128 305 8 40 -115 323 -147 91 -40 -78 -269 -57 52 -4 48 310 56 -78 -137 -126 -362
6231 -362 -40 -172 -21 36 302 -44 -173 -101 -106 -116 -172 2 -12 -210 -367 89 5 -148 27 -5 212 -295 -65
6254 -65 182 54 -11 22 88 -112 -47 15 82 102 -69 103 52 213 -415 -8 218 133 -116 47 76 124 30 222
6278 222 23 215 -59 -270 -74 -200 125 -200 123 303 228 -90 -6 -102 -139 85 46 8 -200 -1 67 -88
6300 -88 -130 201 93 125 329 30 -27 -114 -98 -5 90 -326 -67 -52 -81 -70 -112 -208 -148 28 92 -176 58 58 38 -243
6326 -243 49 52 243 -84 93 33 43 -53 89 -36 -90 37 41 -203 170 5 88 -203 2 -171 -82 39 -93
6349 -93 12 92 164 52 79 106 -204 -217 -177 -80 31 198 55 14 -83 -263 120 -133 -143 -34 -183 -14 -32 151
$$ packed form
6185A8m7Q1r5J07j85N14m80M00j01k30Q9K66l6k70m6K4K6j57J57k06K99j33J03
6208I8N8k02q2M33k97L2j55M38m70K38j31l8j91K12J09n6N2K62k54j34n9J1k36
6231c62L22j32J51N7K66l46j29P2nj0n6J74j4j98j57M56q4j53J75l2K17n07K30
6254f5K47j28o5L3O6k00O5O2O7K0j71J72n1J61o28M07K26q5k49J63K9M8r4J92
6278B22j99J92k74k11J96j26L25l25L23J80p5l18Q4r6l7K24l9l8k08J99O8j55
6300h8m2L31j08L2K04k99n7q7J6R3R5m16K59J5k9J1m2r6O0J76O4k68K34%k0k81
6326b43K92LJ91l27J77o0J0r6J42j25n4J27Mk44L73j65Q3k91K05j73Q9J21j32
6349i3J05Q0P2j12K7K7l10j3M0R7J11J67j43m1r7j80L83k53j0J09j49J69j8J83
$$ plain form
6373 151 14 56 -114 -24 -207 77 61 117 -114 -112 -109 -44 121 -166 49 39 -149 42 263 64 -76 -89 -2 -98
6397 -98 -210 -22 -12 -174 101 -42 -217 9 -23 59 27 -24 -67 -68 -171 -99 -109 385 169 -44 -430 113 -257 -77
6421 -77 -27 23 0 221 90 -228 -209 178 -206 -169 141 -45 -102 232 -242 -281 -114 -75 101 137 90 -18 -50 64
6445 64 -89 -188 -334 55 11 189 85 -21 166 167 78 -36 -8 43 -24 -100 251 -2 -4 -68 72 75 -47 -85 287
6470 287 78 -78 2 68 -81 50 26 -35 -101 -6 -341 201 33 -258 194 -51 90 -87 109 143 -136 158
6492 158 -21 8 72 -8 101 -13 -447 -195 -83 -44 -120 96 -206 3 7 -146 153 -10 -57 265 122 -83 62
6515 62 -200 150 184 -65 -138 53 -130 -147 -106 235 73 125 -182 -17 370 -135 53 9 -59 120 -73 -157 10
6538 10 133 237 129 -62 -129 -4 83 60 -115 241 -6 -171 30 245 -193 16 58 65 50 290 -176 -338 80
$$ packed form
6373A51j37M2j70R0j83K84j6N6k31KLO5J65k87K15j0j88J91K21j99j40j3Q7r6
6397i8j12J88J0j62K75j43j75K26l2Q2l2n1m3jj03P2j0M94k16k13l86N43l70J80
6421g7N0N0k3K21j31l18J9L87l84L7L10j86n7L34m74l9J67L9J76L6m7j08l2J14
6445F4j53r9j46L89m4J78j04j06J87Jq9j14K8N1o7p6L51k53ko4J40Lj22l8L72
6470B87k09j56Q0O6j49J31k4o1o6R5l35N42j68k91M52k45J41j77J96L4k79K94
6492A58j79K9O4q0J09j14m34K52J12L9p6K16l02K09Mj53K99j63m7L22j43k05J45
6515F2k62L50L4k49p3J91j83j7M1L41j62N2l07J65L87n05J88m4o8J79j93q4J67
6538A0J23J04j08j91o7J25Q7k3j75L56k47j65K01K15m38K09M2Pj5K40m66j62M18
$$ plain form
6561 80 67 -43 -138 -143 25 149 -32 -177 -119 6 -39 -92 109 -209 284 -38 391 201 -88 -40 35 -106 -79 -155
6585 -155 0 102 284 13 33 84 -188 192 61 -47 102 120 -41 -111 -23 143 -119 -203 -122 180 -2 60 -103
6608 -103 50 87 -29 117 -91 153 -57 74 -18 162 -92 -60 -71 24 103 -19 19 160 6 -51 69 55 -163
6631 -163 148 91 -65 -6 222 -80 -360 84 87 -209 76 172 -119 124 369 -166 -275 35 44 -156 120 60 43
6654 43 126 25 156 -97 -23 -149 63 -30 14 77 -301 -78 164 -6 -282 -293 -79 -190 12 216 76 -27
6676 -27 -229 -125 79 180 -171 -186 -33 198 -167 40 65 -137 143 41 -38 -65 354 102 -93 -181 62 -208
6698 -208 -79 -344 -147 -186 -2 48 3 274 -121 74 -22 -50 -142 166 93 88 -86 10 199 -60 -165 -95 -16 105
6722 105 49 -109 -189 224 243 85 248 -105 15 59 -112 -63 -242 187 -64 91 115 128 -122 -24 50 206 39
$$ packed form
6561H0j3j10r5nJ68J24j81j45N8J25m5n3K01l18M93l22M29j90k89M8P5j41K7p6
6585a55J55J02J82k71K0N1k72L80j31j08J49J8j61p0Q8J66k62q4Q1L02j82O2j63
6608a03J53L7j16J46k08K44k10J31r2J80k54L2j1R5P9j22L8J41j54n7J20j4k18
6631a63L11n7j56N9K28l02k80M44Lk96K85R6k91K43K45n35j09L10Rk00K76o0j7
6654D3Q3j01J31k53P4j26K12r3M4O3l78K23K42j70k76j1K14j11K02K04j40j03
6676b7k02J04K04J01l51j5J53K31l65K07K5k02K80j02p9k7M19k52j95q8K43k70
6698b08J29k65J97l9J84N0m5K71l95J95r6k8r2L08p3nj74R6J89k59j05P0P9J21
6722A05n6j58q0M13J9j58J63l53J20M4j71M9j79M29k51J55K4J3k50R8P4J56j67
$$ plain form
6745 39 19 99 167 -196 -73 128 -145 112 -45 0 80 -25 -50 311 -300 -30 -288 214 -89 -85 19 260 6
6768 6 -78 317 -43 61 44 -112 42 204 198 42 331 -23 -126 193 69 127 -25 277 -221 5 -60 146 -199
6791 -199 -57 -176 -258 116 39 -335 -73 184 25 198 -124 -146 22 310 311 110 -57 -44 -178 47 40 186 33
6814 33 82 178 55 -61 33 -25 -12 308 -203 -97 -24 115 85 188 234 70 -102 33 218 -104 17 24 -28 78
6838 78 122 -217 -39 -19 65 -239 -63 76 180 278 -71 105 194 -118 -105 -165 -73 -148 -260 160 -177 -124 165 -112
6862 -112 -323 65 -45 76 126 -38 117 -91 -78 197 -120 -68 90 243 10 -7 107 79 26 58 -283 -81
6884 -81 -252 431 172 -44 74 135 -173 -173 -108 26 -190 -201 129 219 18 6 350 -48 79 -6 49 55 -169 -26
6908 -26 53 79 -159 100 60 58 25 99 243 -205 -33 -232 -117 -62 -60 -36 4 -89 -209 -159 113 113 26 28 -20 -293 60
$$ packed form
6745C9k0Q0O8l63J23K01k73K57j57M5Q0j05k5L61o11K70k58N02l03MJ04K41k54
6768Fq4L95l60J04j7j56J54J62oj56K89l54j03L19j24N8j52L02m98K26o5K06l45
6791a99J42j19q2L74p7l74K62K57j59J73l22k2J68K88Jk01j67J3j34K25pJ46j53
6814C3M9R6j23j16R4n8J3L20n11J06P3J39l0J03M6j64j72J35J85l22J21Pn2J06
6838G8M4l39J78K0Q4l04J76J39J04R8l49J76Q9l12J3o0R2p5j12M20l37N3K89k77
6862a12k11L88j10J21N0j64J55k08J3K75l17N2J58J53k33j7J14k8n3L2l41K02
6884h1j71O83k59k16J18O1l08%O5J34k16j1L30R0k01j2L44l98J27q5N5Ok24J43
6908b6P9K6k38K59m0kl3P4J44m48J72j99J15N5KK4M0r3j20N0K72%q7Km8k73L53
$$ plain form
6935 60 53 227 -15 2 129 -34 -30 -106 189 21 22 97 -188 142 -141 -105 -147 -133 197 -95 -92 -246 -134 -142 168 222
6961 222 109 -39 -15 -99 138 -137 -99 1 145 -31 40 -148 -89 92 212 25 210 -104 -74 -301 -69 59
6983 59 -223 -74 -171 -46 17 -49 -31 336 71 204 280 86 -23 -29 -106 -82 -321 -12 101 -196 86 -58 303
7006 303 -160 1 -176 54 12 -126 -82 15 249 119 -166 10 15 -9 97 -138 -74 -30 -80 -24 228 -238 97
7029 97 25 -194 -145 -141 -193 482 131 277 -153 -134 148 159 -133 44 63 -253 28 34 -75 -186 -22 75 107 -94
7053 -94 81 -14 -147 3 106 129 225 190 -163 -170 -91 34 254 12 185 196 -179 28 20 45 189 -53 -25 -233
7077 -233 69 172 91 42 103 51 -153 -80 167 64 -77 135 -52 -129 179 74 91 -220 -49 78 -11 54 -164
7100 -164 -270 60 3 -125 -205 179 -342 209 -165 90 158 -32 221 -192 289 -175 203 161 -125 -56 6 -125
$$ packed form
6935F0pJ74k42J7J27j63Mp6K95j68JP5k85L30k83L6m2J4L30k92Lj54J12qL10N4
6961B22j13j48K4q4K37k75L8J00J44j76P1j88N9J81J20j87J85l14L0k27K32J28
6983E9k82J49r7J25O3o6J8L67k65J33P6j94j09op7K4k39L09J13k97K82j44L61
7006C03m63J61j77K30m2j38M4R7K34j30k85J76Nk4J06k35O4M4n0N6K52m66L35
7029I7p2k19M9Mn2O75l51J46m30J9K82J1k92J77J9l16K81Oj09j11J64R7L2k01
7053i4J75r5j33J50J03K3R6l5l53pP9J25K20k42J73J1l75K07qK5J44k42K8k08
7077b33L02J03q1m9O1n2k04P3K47j03j41K12j87p7L08j05J7l11J71J27q9O5k18
7100a64j06L30n7j28q0L84n21N51l74K55O8j90K53m13M81m64L78m2k86O9O2j31
$$ plain form
7122 -125 -188 190 161 1 150 -137 68 -49 -95 -131 -69 -13 -43 -416 72 22 -154 -78 73 -144 -89 -28 -16 -81
7146 -81 110 266 142 13 -175 -123 -253 -58 -334 177 -67 -65 71 -225 44 27 50 116 -170 78 -137 -71 -78
7169 -78 -116 177 -49 -174 -82 -25 138 -84 -18 174 233 -389 80 -300 11 200 87 34 202 -286 436 360 -14
7192 -14 179 -104 -145 -346 -297 -88 -38 1 90 181 -97 381 100 120 382 159 -131 -48 -117 292 54 148 19 166
7216 166 -187 15 147 10 43 -316 83 342 88 -124 -112 187 59 11 63 103 -139 24 -222 -146 33 -56
7238 -56 21 135 125 -75 -133 35 131 258 -25 -287 165 15 213 -370 -158 16 -24 -109 -87 -147 239 203 78
7261 78 11 -144 31 176 54 82 -223 109 -283 -57 178 11 181 251 94 -101 -20 102 -313 139 25 122
7283 122 -36 295 85 -3 169 -453 -13 84 32 -70 -160 37 211 39 261 -208 123 226 -28 -258 -112
$$ packed form
7122a25o3L78k9j60J49k87K05j17m6l6O2N6l0l73M88n0j76P6J51k17N5O1J2o5
7146h1J91J56j24j29j88N2j30J95k76N11k44KJ36k96K69j7K3O6k86K48k15O6p
7169g8l8K93k26j25R2N7J63k22O6J92N9o22M69l80L11J89j13n3J68m88P22p6l74
7192a4J93k83m1k01M9K09N0L9Q9R1k78M78k81K0K62k23k90Q3o9M09k38R4j29J47
7216A66l53K02J32j37L3l59L99K59k54k12J2K99j28m8N2M0k42J63k46P6J79q9
7238e6P7J14j0k00n8J68R6J27k83k62M52j50J98n83K12J74m0q5K2o0L86l6j25
7261G8o7j55J75J45j22K8l05L32l92K26K35j67J70P0j57j95Q1J22m15M52j14R7
7283A22j58L31k10q8J72o22M40R7n2j02r0J97J74j72K22m69L31J03k54k30J46
$$ plain form
7304 -112 -105 -219 74 46 43 124 46 -4 179 149 -61 -61 146 142 42 231 66 322 -101 49 115 89 -16 441 20
7329 20 -104 -49 -153 263 -90 -71 -250 139 -50 -27 24 391 42 -35 133 -195 -68 -102 -243 -167 68 -244 220
7352 220 -48 43 -290 -24 -79 -38 -95 -16 -177 190 203 -96 15 -161 -117 28 285 -142 -74 87 58 34 75 64
7376 64 -286 67 -188 -91 168 106 -268 -42 33 -62 -62 -82 -44 224 78 -2 -174 104 14 -164 -58 -36 116 -25
7400 -25 -86 -8 -26 -142 62 -25 -70 -24 -87 -78 -216 -77 -15 -344 249 192 27 264 63 -46 220 -59 -317 -241
7424 -241 161 -169 -132 -83 -148 198 91 112 -23 -109 -67 -8 -245 39 261 13 106 -29 33 39 191 -193 -99 -159
7448 -159 -7 102 27 122 271 37 -93 55 -81 -215 143 -239 55 77 -127 -39 -44 143 -73 168 -122 -221
7470 -221 108 344 10 -232 83 23 182 -25 -67 -145 111 129 121 -86 23 -96 -63 125 -230 -74 -40 -107 -325
$$ packed form
7304a12Pj14K93k8lQ1p8n0J83l0k10%K07mj00J89j65K56m23J50O6k6j05M57m21
7329B0j24N5j04M16l53J9j79L89j89K3N1L67l49p7J68l28J27l4j41P6K35l12M64
7352B20k68R1l33K66n5M1n7P9j61L67J3k99J11j76M4J45K57m27O8J61k9k4M1j1
7376F4l50L53k55R7K59o2l74K26P5r5%k0L8K68j46q0j72K78r0j78J06K2J52j41
7400b5o1P8j8j16K04q7m5M6o3Rj38J39O2l29N93n7j65K37k01j09K66k79k58P6
7424b41M02l30L7M9o5L46j07K1j35q6M2N9k37K84K22k48R3j35O2OJ52l84R4o0
7448a59J52J09p5R5J49k34j30J48j36j34L58l82K94K2k04Q8nJ87k16K41k90r9
7470b21L29K36l34k42L15o0J59k07m2p8K56J8qk07J09j19L3J88l55J56L4o7k18
$$ plain form
7493 -325 37 35 61 -71 96 -226 207 -64 -136 10 -56 58 46 218 -13 -94 -75 -39 -93 -95 420 -219 -37 95
7517 95 -6 -10 68 0 -93 130 370 -192 2 198 147 -52 -25 -222 -8 -174 -116 125 -233 -166 183 4 217
7540 217 26 208 -66 -161 61 -43 -49 -116 92 -372 -170 -80 242 53 -30 28 134 -18 -56 145 -100 138 -118
7563 -118 -90 48 -262 109 455 100 -290 89 -54 -178 -81 62 -47 -131 -28 65 85 23 -221 298 -38 -130
7585 -130 -170 -128 285 219 -34 96 -15 -103 396 6 134 48 54 23 133 -236 -224 3 84 225 -97 14 -37 153
7609 153 -61 -74 -154 -109 128 -116 -133 -54 34 7 -74 127 20 -266 110 272 -116 -4 152 339 142 -52 -109
7632 -109 -108 108 -283 26 66 -181 35 235 -112 54 -259 17 -9 -23 -29 -28 190 -95 23 -42 -40 154 -73 53
7656 53 2 -38 -168 -43 -37 -76 91 247 48 194 84 -231 -103 22 40 17 187 -110 -105 75 -224 -15 -117
$$ packed form
7493c25L62kK6j32J67l22M33k71p2J46o6J14j2J72k31q1J9L6n4kN15o39J82J32
7517I5j01mP8o8r3K23K40n62J94J96n1j99K7j97K14j66N8K41l58O7L49j79K13
7540B17j91J82k74r5K22j04oo7K08m64K02R0L22j89q3N8J06j52l8K01k45K38k56
7563a18K8J38l10L71L46l55l90L79j43j24R7J43j09q4J03R3K0o2k44N19l36r2
7585a30m0M2M13o6k53J30j11q8M99l90J28q6Ol1J10l69J2K27Q1J41l22J11n1J90
7609A53k14j3q0M5K37k44j7P9Q8k7q1K01j07k86L76J62l88J12J56J87j97j94n7
7632a09JK16l91L09M0k47K16K00l47J66l13K76k6j4oJK18k85J18o5KJ94k27J26
7656E3n1m0j30J25Ol9J67J56j99J46j10l15J28J25J8k3J70k97NJ80k99K09j02
$$ plain form
7679 -117 -2 -21 -249 -423 -190 -79 18 -201 30 -91 -75 215 -140 100 -136 40 11 104 75 -116 351 -206
7701 -206 61 -109 78 145 -199 320 -47 171 -222 76 30 -278 -164 125 -49 52 25 -267 69 30 -184
7722 -184 128 -26 -127 98 -242 -33 1 -52 -28 54 -54 130 -273 -102 -66 93 27 174 78 -69 18 -277 -265
7745 -265 -253 -19 93 -91 -178 193 -522 187 117 106 -228 -92 -78 181 -203 85 -7 46 -72 22 -133 -205 -246
7768 -246 127 -70 -194 291 10 -111 -153 -273 -140 64 -121 -184 -105 -125 -172 406 3 18 45 74 230 57 195
7791 195 -160 74 93 215 181 209 -99 -118 -143 154 -254 -84 -2 185 43 -147 84 -257 -356 -192 -159 191 -18
7814 -18 -302 -27 -46 71 -133 -44 119 0 49 -115 94 -79 -16 164 13 186 -25 -8 -123 -215 -195 72 -46
7837 -46 82 -156 -66 -130 35 -196 -188 -183 42 480 -21 44 -251 -232 -5 37 172 -1 324 223 -189 -240 73 -11
$$ packed form
7679a17J15j9k28j74K33J11R7k19K31j21J6K90l55K40k36J76k9R3k9j91M67n57
7701b06K67j70J87O7l44N19l67K18l93K98m6l08J14K89j74J01k7k92L36l9k14
7722a84L12j54j01K25l40K09L4n3K4Q2j08J84m03J71L6J59o6J47r6j47Q7k95J2
7745b65J2K34J12j84q7L71p15P09p0j1l34J36J4K59l84K88r2N3j18R4j55p2m1
7768b46L73j97j24M85k81j21m2j20J33K04j85o3P9k0m7N78m03J5K7K9J56j73J38
7791A95l55K34J9J22l4K8l08j9k5K97m08J70Q2J87j42j90K31l41r9J64L3L50k09
7814a8k84K75j9J17k04Q9J63j19M9j64K09j73O3J80j51J73k11J7j15r2K0K67j18
7837d6J28k38R0o4J65k31QNK25M38n01O5k95J9K27M2J35j73L25j01m12n1L13q4
$$ plain form
7861 -11 77 48 37 -78 192 -295 0 -36 -66 26 291 -86 -94 -279 24 182 -73 163 -36 -21 -65 -35 -45 -219
7885 -219 23 -9 50 112 21 135 21 -37 2 -184 -236 215 60 171 167 65 -35 276 -382 -39 -103 -157 39 131
7909 131 196 -64 20 -163 -218 89 120 -86 124 -115 131 -124 -102 168 144 226 -358 116 -67 22 294 168 174
7932 174 -314 -171 -265 169 -112 -180 -5 130 20 209 -87 156 214 270 -33 99 7 -57 293 -171 53 275
7954 275 190 -58 -90 -193 225 4 45 22 305 146 106 43 273 46 112 147 -7 126 -40 272 79 195 77
7977 77 -79 -24 -166 -49 -334 73 -18 36 -83 -8 62 -229 95 -20 -97 191 84 -154 101 -303 -150 125
7999 125 -153 -175 127 -44 -107 -75 93 -82 -348 -123 95 -38 30 262 -15 -175 165 -206 -5 95 -106
8020 -106 -314 -45 33 43 -9 -208 -25 273 252 61 -203 247 11 151 10 -82 49 153 7 -57 -278 -72
$$ packed form
7861a1Q8k9j1j15K70m87K95l6l0R2K65l77qj85L03J58k55K36j99J5m4L0j0j74
7885b19K42l2N9O2r1J14j14n8L9j86n2M51j55J11mj02j00L11o58L43o4n4J96R2
7909A31O5k60Q4j83n5L07L1k06K10k39K46k55K2K70k4Q2n84M74j83Q9K72j26O
7932A74m88J43r4M34k81o8J75J35j10J89k96K43N8N6l03J32r2o4L50m64K24K22
7954B75q5k48l2j03M18k21M1k3K83j59m0o3K30k27O6L5j54J33j66L12j93J16j18
7977G7j56N5j42J17k85M07r1N4j19P5P0k91L24j15p7K88j07k38K55m04J53K75
7999A25k78k2L02j71o3L2J68j75k66K25K18j33O8K32k77j60L40l71K01J00k01
8020a06k08K69P8J0n2j99J83K98k1j91k64M50k36J40j41r2J31J04j46o4k21K06
$$ plain form
8042 -72 57 -33 -46 5 228 27 13 162 24 189 74 -26 -296 134 -42 -16 162 -289 15 -354 109 214
8064 214 54 3 205 -129 -156 -216 350 73 -108 25 -44 28 -149 -70 -129 124 -220 -12 144 -8 72 35 91
8087 91 125 105 -171 -72 -144 214 -203 144 85 165 -58 182 476 -265 -67 -231 -159 -132 87 -108 26 108 -56
8110 -56 88 110 -215 -119 -159 2 -96 -24 140 230 -15 128 -27 83 118 301 -137 112 33 101 -174 -151 -294 -143
8134 -143 95 -83 11 -58 1 40 -47 -159 138 87 72 -56 -289 -33 114 96 267 -149 3 -333 55 207 -3
8157 -3 -227 34 58 9 7 -372 41 81 -268 -218 113 -91 139 -162 124 161 -35 110 144 -17 -150 77 126 158
8181 158 43 -89 99 -49 41 153 -19 97 -215 -14
$$ packed form
8042g2J29r0j3N1K23k01j4J49j38J65j15j00k70M30j76K6J78m51L04l69M63J05
8064B14j60n1K02l34k7o0N66k77j81J33o9P2j77P9n9K53l44K08J56j52Q0l7N6
8087I1L4k0k76R9p2L58m17L47n9Q0k23K40K94p41J98j64P2K7K19j95J34Q2j64
8110e6J44K2l25R6m0J61r8P2J64R0k45J43j55J10L5J83m38K49p9O8k75K3j43J51
8134a43K38j78R4o9N9L9q7j12K97n1j5j28k33K56J47j8J71m16J52l36L88J52k10
8157ck24K61K4m9kl79M13M0l49N0L31k04K30l01K86L7j96J45L4j61j33K27M9L2
8181A58j15j32J88j48R0J12j72J16l12K01
8191a4
$$ Imaginary data points
##PAGE= N=2
##DATA TABLE= (X++(I..I)), XYDATA
$$ plain form
0 0 0 0 0 0 0 0 0 0 0 8 -8 8 -8 8 -16 16 -16 21 -24 32 -32 40 -48 50 -60 66 -79 89 -98 114 -128 141 -162
33 -162 178 -199 221 -246 275 -303 335 -374 412 -459 506 -561 623 -692 772 -866 971 -1097
51 -1097 1250 -1440 1682 -1999 2443 -3104 4203 -6360 12261 -62994 -231808 -213791 -117991 18854
65 18854 101908 123262 73098 -13342 -119487 -197581 -210994 -127430 11464 126779 137960 43832
77 43832 -94812 -192929 -210494 -153730 -63707 26802 86191 89988 20114 -100469 -207849 -231629
89 -231629 -153965 -21683 82415 103492 42559 -54499 -140694 -187503 -181014 -117648 -15469 78760
101 78760 106917 43451 -77592 -181508 -206737 -147063 -46424 39533 78228 63383 3962
112 3962 -81399 -158668 -184589 -133027 -24716 78207 112561 62207 -35913 -121878 -155006 -130717
$$ packed form
0@%%%%%%%%%Qj6J6j6J6k4L2l2L7m5N6o4P2q8R8j10J26j45J68j87K12k42K69l03
33a62L40l77M20m67N21n78O38p09P86q71R65j067J184j315J464j638J837k068
51a097K347k690L122l681M442n547P307j0563J8621p5255j68814J8017R5800J36845
65A8854Q3054K1354n0164q6440j06145p8094j3413Q3564J38894J15315J1181r4128
77D3832j38644r8117j7565N6764R0023R0509N9389L797o9874j20583j07380k3780
89b31629P7664J32282J04098K1077o0933r7058q6195m6809O489O3366J02179R4229
101G8760K8157o3466j21043j03916k5229N9674J00639Q5957L8695j4845n9421
112C962q5361p7269k5921N1562J08311J02923L4354n0354r8120q5965l3128K4289
$$ plain form
124 -130717 -66604 11294 77367 100830 61846 -28185 -121237 -158374 -115498 -18198 74106 112672
136 112672 87044 21440 -49615 -100347 -111800 -73943 4627 88224 129823 101322 17054 -71258
148 -71258 -110794 -84942 -15870 58566 107044 113908 78785 13077 -55658 -91564 -68962 5867
160 5867 91316 138306 121674 57276 -16109 -61365 -62674 -23348 39595 101513 133863 116917
172 116917 53732 -22690 -68222 -55875 6115 79737 126737 127216 87475 28559 -24569 -50596
184 -50596 -34736 20377 89353 134591 128017 72737 1361 -45663 -46292 -7172 49597 97831 119438
197 119438 104177 56398 -5620 -50044 -49881 -3013 65373 113643 116462 76586 18783 -28445
209 -28445 -46779 -31466 10785 63060 101568 103769 63378 -213 -51378 -61001 -26389 29773
$$ packed form
124a30717O4113P7898O6073K3463l8984r0031r3052l7137M2876R7300R2304L8566
136A12672k5628o5604p1055n0732j1453L7857P8570Q3597M1599k8501q4268q8312
148g1258l9536K5852O9072P4436M8478O864l5123o5708o8735l5906K2602P4829
160E867Q5449M6990j6632o4398p3385m5256j309L9326O2943O1918L2350j6946
172A16917o3185p6422m5532J2347O1990P3622M7000M79l9741n8916n3128k6027
184e0596J5860N5113O8976M5238o574n5280p1376m7024o29L9120N6769M8234K1607
197A19438j5261m7779o2018m4424J63M6868O8386M8270K819l9876n7803m7228
209b8445j8334J5313M2251N2275L8508K201m0391o3591n1165r623L4612N6162
$$ plain form
221 29773 75467 90493 71627 29737 -18522 -53527 -58558 -27293 26925 74111 86739 55544
233 55544 -291 -50007 -68670 -51324 -11306 32313 61669 63029 32879 -17656 -64030 -80128
245 -80128 -55622 -5041 41905 59905 41558 -535 -44560 -72983 -74090 -47555 -4408 35694
257 35694 50539 28738 -19257 -66501 -87742 -72733 -33152 8798 33238 31543 5980 -34720
269 -34720 -72296 -88210 -71860 -29169 16313 38613 25446 -14451 -57925 -82852 -80480 -54295
281 -54295 -17102 16434 30013 15844 -22243 -64947 -88600 -79461 -41868 1834 27387 25094
293 25094 -1331 -37556 -67615 -78231 -64233 -30115 8930 32307 26640 -5572 -46770 -73603
305 -73603 -72433 -45697 -7991 22237 32783 19263 -12135 -46788 -67507 -62109 -31743 8324
$$ packed form
221B9773M5694J5026j8866m1890m8259l5005n031L1265N4218M7186J2628l1195
233E5544n5835m9716j8663J7346M0018M3619K9356J360l0150n0535m6374j6098
245h0128K4506N0581M6946J8000j8347m2093m4025k8423j107K6535M3147M0102
257C5694J4845k1801m7995m7244k1241J5009L9581M1950K4440j695k5563m0700
269c4720l7576j5914J6350M2691M5482K2300j3167l9897m3474k4927K372K6185
281e4295L7193L3536J3579j4169l8087m2704k3653R139L7593M3702K5553k293
293B5094k6425l6225l0059j0616J3998L4118L9045K3377n667l2212m1198k6833
305g3603J170K6736L7706L0228J0546j3520l1398l4653k0719N398L0366M0067
$$ plain form
317 8324 36486 38016 14183 -21100 -49513 -58305 -43191 -12176 22356 42505 39123 12250 -23395
330 -23395 -48568 -49537 -26683 8170 37547 47667 35687 7386 -23329 -41765 -37756 -11803 22967
343 22967 49500 53415 33602 1668 -25865 -35291 -22323 6077 36662 55531 53149 30670 -1538
356 -1538 -25233 -28701 -9586 22144 50221 60213 48975 22376 -6129 -22428 -18689 2950 33052
369 33052 56414 60988 44267 15184 -11118 -21041 -10175 15078 43104 59014 56612 35589 6929
382 6929 -14786 -19057 -3350 24382 49182 58983 49031 24387 -2460 -18401 -15549 4170 31000
395 31000 51280 54390 39321 12167 -11993 -21719 -12246 10406 34621 48631 45581 26868 1245
408 1245 -18696 -23689 -10988 13313 36094 45437 35965 13223 -11488 -26022 -23752 -6921 15934
$$ packed form
317H324K8162J530k3833l5283k8413q792J5114L1015L4532K0149l382k6873l5645
330b3395k5173r69K2854L4853K9377J0120j1980k8301l0715j8436M009K5953L4770
343B2967K6533L915j9813l1934k7533r426J2968K8400L0585J8869k382k2479l2208
356a538k3695l468J9115L1730K8077R992j1238k6599k8505j6299L739K1639L0102
369C3052K3362M574j6721k9083k6302r923J0866K5253K8026J5910k402k1023k8660
382F929k1715m271J5707K7732K4800R801r952k4644k6847j5941K852J9719K6830
395C1000K0280L110j5069k7154k4160r726R473K2652K4215J4010l050j8713k5623
408A245j9941m993J2701K4301K2781R343r472k2742k4711j4534K270J6831K2855
$$ plain form
421 15934 34156 37439 24850 1229 -21767 -32255 -24960 -4218 18546 31777 28584 10987 -12338
434 -12338 -30360 -34321 -23047 -2234 17864 26576 19190 -688 -23574 -37251 -35920 -20463 887
447 887 17249 20027 8540 -11891 -31973 -41099 -35253 -17264 3165 15943 13939 -972 -22132
460 -22132 -38903 -42425 -31873 -12552 5716 14177 8232 -8954 -29320 -42209 -40855 -26963 -7022
473 -7022 8174 11711 1859 -15919 -33554 -42063 -36805 -21058 -2003 10487 10405 -2801 -21557 -36446
487 -36446 -39740 -30369 -13300 3445 12164 7766 -6343 -24266 -36023 -35997 -23703 -5106 10023
500 10023 14596 6022 -10507 -26166 -33509 -28399 -14272 2891 14689 15538 4539 -12141 -25712
513 -25712 -29312 -20784 -4702 11474 19150 15826 2868 -12650 -23208 -23200 -12271 4054 17959 22871
$$ packed form
421A5934J8222L283j2589k3621k2996j0488P295K0742K2764J3231l193j7597k3325
434a2338j8022l961J1274K0813K0098Q712p386j9878k2886j3677J331J5457K1350
447H87J6362K778j1487k0431k0082r126N846J7989K0429J2778k004j4911k1160
460b2132j6771l522J0552J9321J8268Q461n945j7186k0366j2889J354J3892J9941
473g022J5196L537r852j7778j7635q509N258J5747J9055J2490q2j3206j8756j4889
487c6446l294R371J7069J6745Q719m398j4109j7923j1757K6J2294J8597J5129
500A0023M573q574j6529j5659p343N110J4127J7163J1798Q49j0999j6680j3571
513b5712l600Q528J6082J6176P676l324j2958j5518j0558QJ0929J6325J3905M912
$$ plain form
527 22871 15958 1296 -13395 -20376 -16505 -2904 13132 23761 24239 14748 -15 -12542 -16334
540 -16334 -9036 5972 20524 28340 24688 12503 -1440 -11373 -11011 -1222 13124 25389 29665 23747
554 23747 10772 -3026 -10288 -6891 4920 19807 29323 29618 20148 7087 -4186 -7891 -2227 10107
568 10107 23600 31153 28367 16951 2476 -6706 -7008 2436 15741 26118 29190 23422 11923 -238
582 -238 -7224 -5523 4687 18386 27677 27712 18324 5431 -5216 -8131 -2723 7713 18727 24669
596 24669 22722 13743 584 -9305 -10746 -2158 10308 20364 22480 15941 5077 -5510 -11310 -9625
610 -9625 -1894 9680 18077 19286 11286 -1812 -12457 -15455 -9460 1028 10638 14549 11824 3970
624 3970 -6501 -14901 -16847 -10559 768 10483 13671 7325 -3801 -13840 -18441 -15440 -8340 465
$$ packed form
527B2871o913j4662j4691o981L871J3601J6036J0629M78r491j4763j2527l792
540a6334P298J5008J4552P816l652j2185j3943r933L62R789J4346J2265M276n918
554B3747j2975j3798p262L397J1811J4887R516K95r470j3061j1273l705N664J2334
568A0107J3493P553k786j1416j4475r182l02R444J3305J0377L072n768j1499j2161
582b38o986J701J0210J3699R291L5r388j2893j0647k915N408J0436J1014N942
596B4669j947q979j3159r889j441Q588J2466J0056K116o539j0864j0587n800J685
610i625P731J1574Q397J209q000j3098j0645k998N995J0488R610L911k725p854
624C970j0471q400j946O288J1327R715L188o346j1126j0039m601L001P100Q805
$$ plain form
638 465 7321 8711 3013 -7756 -18303 -22042 -17103 -6417 3543 7461 3639 -4268 -13267 -19312 -20147
653 -20147 -15622 -6372 2468 6362 1936 -8070 -18405 -22440 -19376 -11290 -2917 2254 2461 -2151 -10234
668 -10234 -18224 -21967 -19017 -9391 266 5128 2269 -6040 -14479 -19131 -18908 -13874 -6070 1024 4332
683 4332 1751 -5904 -15036 -20069 -17782 -9787 -394 4967 4178 -1257 -7855 -13738 -16078 -13564 -6621
698 -6621 2131 7273 6215 -591 -9021 -14278 -13330 -8107 -509 5323 7569 5747 92 -7399 -11641
713 -11641 -11269 -4797 4304 10146 10503 5054 -1888 -7145 -8338 -5799 171 6759 11274 11423 6176 -1356
729 -1356 -6922 -7144 -1735 5878 11334 12993 10262 5211 -502 -4315 -3665 949 8124 13848 15061 10747
745 10747 4011 -1800 -3390 -125 5241 11003 14305 14151 10131 3910 -1398 -2710 1073 7682 13870
$$ packed form
638D65O856J390n698j0769j0547l739M939J0686R960L918l822p907q999o045q35
653b0147M525R250Q840L894m426j0006j0335m035L064Q086Q373N171K07m612q083
668a0234p990l743K950R626R657M862k859q309q439m652K23N034P804P094L308
683D332k581p655r132n033K287P995R393N361p89n435o598n883k340K514O943
698f621Q752N142j058o806q430n257R48N223P598N832K246j822n655p491m242
713a1641L72O472R101N842L57n449o942n257j193K539N970O588M515J49n247p532
729a356n566k22N409P613N456J659k731n051n713l813O50M614P175N724J213m314
745A0747o736n811j590L265N366N762L302j54m020o221n308j312L783O609O188
$$ plain form
760 13870 15712 12567 7597 2085 -804 -346 3318 8727 13648 15011 11848 6027 274 -2334 272
775 272 5340 10527 13522 12317 8760 3641 -572 -2386 -288 5287 10744 13044 11004 5053 66
790 66 -3134 -2206 1400 5966 9318 10536 8198 3127 -2173 -4938 -3519 807 6549 8847 8002 3636
806 3636 -439 -4496 -5718 -3758 206 4524 7325 6308 1108 -4262 -7901 -7038 -3525 1021 4001
821 4001 4468 2281 -1557 -6028 -8920 -8599 -4395 630 4041 3334 -839 -5434 -8981 -9308 -7447 -4079
837 -4079 -471 1534 1464 -2316 -7323 -10931 -10914 -7462 -2968 701 1020 -1402 -5176 -8504 -10398 -10198 -7532
854 -7532 -3153 468 1272 -1916 -7105 -10616 -11345 -8755 -4923 -1438 -78 -602 -2875 -6716 -10215 -10725
870 -10725 -8035 -3477 808 1476 -1008 -4799 -7916 -9272 -8292 -5638 -2422 915 1906 -453 -4165 -7862
$$ packed form
760A3870J842l145m970n512k889M58L664N409M921J363l163n821n753k608K606
775B72N068N187K995j205l557n119m213j814K098N575N457K300k040n951m987
790F6l200R28L606M566L352J218k338n071n300k765J419M326N742K298q45m366
806C636m075m057j222J960L964M318K801j017n200n370l639Q63L513M546K980
821D001M67k187l838m471k892L21M204N025L411p07m173m595l547l27J861L368
837d079L608K005p0l780n007l608J7L452M494L669L19k422l774l328j894K00K666
854g532M379L621Q04l188n189l511p29K590L832L485J360n24k273l841l499n10
870a0725K690M558M285O68k484l791l117j356R80K654L216L337R91k359l712l697
$$ plain form
886 -7862 -8905 -6693 -2490 1097 2463 1572 -1164 -3829 -6408 -6961 -4675 -590 2624 4156 2412 -1237
902 -1237 -4694 -5778 -4581 -1414 1818 4279 4632 2958 -334 -3378 -4616 -3022 737 4578 6422
917 6422 5186 2402 -364 -2262 -2264 -372 2975 6091 7297 6156 3201 -569 -2168 -1003 1856 5256
933 5256 7231 7412 5915 2916 311 -1283 161 3490 6790 8761 7927 5282 2028 -44 51 1840
949 1840 4541 7231 8349 7292 4425 1514 -193 310 2732 5877 7990 8247 6486 3336 857 15
965 15 704 3157 6183 7605 7417 5185 1951 -394 -426 1138 3994 6122 6825 6046 3456 649 -1070
982 -1070 -833 955 3966 5724 6086 3945 1290 -839 -1978 -1214 955 3503 4790 4455 2169 -547
998 -547 -2886 -2706 -1202 512 2728 3433 2474 157 -2308 -3929 -3768 -2003 375 2213 2410 689 -1794
$$ packed form
886g862j043K212M203L587J366q91k736k665k579n53K286M085L214J532j744l649
902a237l457j084J197L167L232K461L53j674l292l044j238J594L759L841J844
917F422j236k784k766j898kJ892L347L116J206j141k955l770j599J165K859L400
933E256J975J81j497k999k605j594J444L329L300J971q34k645l254k072R5J789
949A840K701K690J118j057k867k911j707N03K422L145K113K57j761l150k479q42
965A5O89K453L026J422j88k232l234k345l2J564K856K128P03p79k590k807j719
982a070K37J788L011J758L62k141k655k129j139P64K169K548J287l35k286k716
998e47k339J80J504J714K216P05r59k317k465j621J61J765K378J838J97j721k483
$$ plain form
1015 -1794 -3889 -4787 -4011 -1788 80 1372 870 -614 -3306 -5114 -5637 -4335 -2201 -207 665 -408
1031 -408 -2281 -4609 -5947 -5671 -4614 -2047 -546 -332 -1096 -3427 -5646 -6487 -5680 -3484 -1474 -577 -691
1048 -691 -2327 -4272 -6183 -6605 -5028 -3099 -891 -383 -1220 -3022 -4744 -5861 -5615 -4376 -2372 -586
1064 -586 -404 -1240 -2922 -4922 -5386 -5043 -3024 -852 332 -105 -1241 -3020 -4248 -4914 -3980 -1740 194
1081 194 1249 353 -877 -2750 -3883 -3698 -2322 -336 1144 1501 881 -856 -2602 -3013 -2159 -673 1322
1098 1322 2209 2385 1154 -592 -1810 -2298 -1079 911 2591 3347 3122 1369 -281 -954 -988 351 1991
1115 1991 3520 3790 3070 1697 71 -510 191 1726 3579 4423 4396 3134 1517 594 300 969 2550
1132 2550 3787 4755 4738 3207 1496 338 665 1757 3432 4537 4660 3803 2652 1279 809 1169 2206
$$ packed form
1015a794k095q98P76K223J868J292n02j484k692j808n23J302K134J994Q72j073
1031d08j873k328j338K76J057K567J501K14p64k331k219q41Q07K196K010Q97j14
1048f91j636j945j911m22J577J929K208N08q37j802j722j117K46J239K004J786
1064e86J82q36j682k000m64L43K019K172J184m37j136j779j228o66R34K240J934
1081A94J055q96j230j873j133J85J376J986J480L57o20j737j746m11Q54J486J995
1098A322Q87J76j231j746j218m88J219J990J680P56k25j753j650o73l4J339J640
1115A991J529K70p20j373j626n81P01J535J853Q44k7j262j617r23k94O69J581
1132B550J237R68j7j531j711j158L27J092J675J105J23q57j151j373m70L60J037
$$ plain form
1149 2206 3901 4861 4668 3639 2073 895 539 1060 2699 3996 4333 3680 2815 1402 473 259 1181
1166 1181 2927 3624 3888 3078 1424 492 -570 300 1122 2214 3161 2925 2198 567 -401 -1029 -310 796
1184 796 2336 2471 2005 853 -533 -1207 -1484 -565 330 1531 1560 766 -309 -1860 -2410 -2233 -750 220
1202 220 815 874 122 -1211 -2341 -2535 -2339 -1300 -203 450 -117 -1318 -2465 -3083 -3547 -2292 -1178 -439
1220 -439 -144 -557 -1749 -2817 -3366 -3267 -2397 -1248 -723 -545 -1366 -2581 -3514 -3828 -3013 -2321 -1458 -830 -1054
1239 -1054 -1727 -3066 -3515 -3724 -2761 -1653 -1071 -514 -936 -2076 -3172 -3554 -3446 -2486 -1303 -621 -573 -1237
1257 -1237 -2299 -2608 -3157 -2628 -1480 -701 -76 -398 -1240 -1974 -2613 -2500 -2135 -1064 4 392 -138 -826
1275 -826 -1728 -1916 -1987 -1244 -81 828 845 187 -651 -1426 -1267 -719 173 919 1385 1010 450 26 -648 -722 -377
$$ packed form
1149B206J695R60j93j029j566j178l56N21J639J297L37o53q65j413r29k14R22
1166A181J746O97K64q10j654r32j062Q70Q22J092R47k36p27j631r68o28P19J106
1184G96J540J35m66j152j386o74k77R19Q95J201K9p94j075j551n50J77J483R70
1202B20N95N9p52j333j130j94J96J039J097O53n67j201j147o18m64J255J114P39
1220d39K95m13j192j068n49R9Q70J149N25J78q21j215r33l14Q15O92Q63O28k24
1239a054o73j339m49k09R63J108N82N57m22j140j096l82J08R60J183O82M8o64
1257a237j062l09n49N29J148P79O25l22q42p34o39J13L65J071J068L88n30o88
1275h26r02j88p1P43J163R09J7o58q38p75J59N48Q92P46M66l75n60m24o74p4L45
$$ plain form
1296 -377 708 1653 2061 1538 501 13 -197 -36 625 1256 2206 2091 1756 807 388 251 442 1300 2038
1315 2038 2389 2425 1868 1206 768 528 1164 1765 2189 2639 2388 1795 1305 865 1041 1739 2216 2606 2700 2443
1335 2443 1584 871 802 1326 1762 2078 2866 2484 2026 1450 658 871 1134 1576 2240 2490 2215 1657 923 479
1355 479 520 1164 1363 1995 1853 1618 1004 254 138 259 688 1432 1924 1302 758 629 -379 -243 63 646
1375 646 1025 1288 932 308 -229 -984 -614 -408 392 702 782 228 -356 -990 -1448 -1163 -638 -182 253 362
1395 362 -293 -687 -1348 -1584 -1104 -740 -125 -505 -59 -727 -1377 -2033 -1956 -1455 -1325 -336 -178 -475 -1328 -1876
1415 -1876 -2126 -1922 -1454 -1106 -680 -800 -1102 -1584 -2133 -2312 -2176 -1442 -973 -751 -1032 -1218 -1904 -2137 -2026 -1638
1435 -1638 -1347 -953 -641 -1079 -1334 -1893 -2177 -1749 -1374 -943 -619 -587 -663 -1362 -1618 -1767 -1531 -1010 -441 -21
$$ packed form
1296c77J085R45M08n23j037m88k10J61O61O31R50j15l35r49m19j37J91Q58P38
1315B038L51L6n57o62m38k40O36O01M24M50k51n93m90m40J76O98M77L90R4k57
1335B443q59p13o9N24M36L16P88l82m58n76p92K13K63M42O64K50k75n58p34m44
1355D79M1O44J99O32j42k35o14p50j16J21M29P44M92o22n44j29j008J36L06N83
1375F46L79K63l56o24n37p55L70K06Q00L10Q0n54n84o34m58K85N25M56M35J09
1395C62o55l94o61k36M80L64O15l80M46o68o50o56P7N01J30R89J58k97q53n48
1415a876k50K04M68L48M26j20l02m82n49j79J36P34M69K22k81j86o86k33J11L88
1435a638K91L94L12m38k55n59k84M28L75M31L24L2p6o99k56j49K36N21N69M20
$$ plain form
1455 -21 -223 -992 -1089 -1501 -976 -582 -382 -27 -12 302 -547 -891 -1305 -1211 -402 192 438 54 -24 -438 -704 -708
1477 -708 -466 282 706 806 859 374 -218 -585 -358 293 506 740 1055 600 509 286 -115 189 535 1141 1089
1498 1089 1413 1106 608 97 419 803 828 1127 1417 1450 749 826 285 405 1014 1528 1493 1690 1443 964 700
1519 700 420 729 1359 1323 1434 1615 906 771 671 506 730 910 1497 1487 1510 1155 874 385 751 776 982
1540 982 1449 1397 1293 905 630 200 306 665 1130 1312 1071 776 780 41 257 116 555 901 804 1135 591
1561 591 79 62 -149 129 399 473 741 412 243 -343 -363 -359 -156 392 415 -1 185 -114 -524 -810 -642 -301
1583 -301 -3 175 1 -573 -911 -718 -721 -759 -585 -51 40 -268 -723 -936 -1157 -1018 -969 -797 -95 -586 -372 -785
1605 -785 -930 -1253 -1306 -836 -531 -674 -752 -793 -1316 -1420 -1386 -855 -767 -1025 -556 -697 -917 -1253 -1152 -930 -1255 -845
$$ packed form
1455b1k02p69r7m12N25L94K00L55J5L14q49l44m14R4Q09N94K46l84p8m14k66m
1477g08K42P48M24J00N3m85n92l67K27O51K13K34L15m55r1k23m01L04L46O06n2
1498A089L24l07m98n11L22L84K5K99K90L3p01P7n41J20O09N14l5J97k47m79k64
1519G00k80L09O30l6J11J81p09j35j00j65K24J80N87j0K3l55k81m89L66K5K06
1540I82M67n2j04l88k75m30J06L59M65J82k41k95Mp39K16j41M39L46r7L31n44
1561E91n12j7k11K78K70P4K68l29j69n86k0MK03N48K3m16J86k99m10k86J68L41
1583c01K98J78j74n74l38J93ll8J74N34R1l08m55k13k21J39M9J72P02m91K14m13
1605g85j45l23n3M70L05j43p8m1n23j04L4N31Q8k58M69j41k20l36J01K22l25M10
$$ plain form
1627 -845 -683 -434 -735 -922 -1329 -1111 -1415 -1081 -637 -412 -358 -529 -1106 -1247 -1189 -757 -510 -81 -348 -441 -435 -723
1649 -723 -1167 -898 -571 -148 219 -274 -381 -593 -559 -843 -685 -263 191 -5 62 -176 -4 -356 -114 -425 42
1670 42 328 382 206 -27 -65 -125 -302 222 342 624 934 492 381 48 2 -97 200 868 668 782 844 320
1692 320 332 247 -90 626 694 1047 607 463 252 487 579 441 883 1030 1097 721 738 606 235 666 746 951
1714 951 1168 630 1026 558 450 166 694 730 1073 618 920 661 591 482 534 590 798 952 639 723 520 485
1736 485 252 388 679 952 925 765 710 339 628 60 423 471 448 498 481 508 32 -143 -24 271 312 478 286
1759 286 341 228 94 -225 -29 243 313 128 25 112 7 -335 -391 -370 -304 -117 170 160 -402 -496 -531 -329 -575
1782 -575 -371 -154 -297 -399 -624 -228 -511 -759 -258 -606 80 -207 -528 -411 -904 -847 -643 -401 -438 -425 -441
$$ packed form
1627h45J62K49l01j87m07K18l04L34M44K25N4j71n77j41N8M32K47M29k67r3Ok88
1649g23m44K69L27M23L67m93j07k12L4k84J58M22M54j96O7k38J72l52K42l11M67
1670D2K86N4j76k33l8o0j77N24J20K82L10m42j11l33m6r9K97O68k00J14O2n24
1692C20J2q5l37P16O8L53m40j44k11K35R2j38M42J47O7l76J7j32l71M31Q0K05
1714I51K17n38L96m68j08k84N28L6L43m55L02k59p0j09N2N6K08J54l13Q4k03l5
1736D85k33J36K91K73k7j60n5l71K89n68L63M8k3N0j7K7m76j75J19K95M1J66j92
1759B86N5j13j34l19J96K72P0j85j03Q7j05l42n6K1O6J87K87j0n62r4l5K02k46
1782e75K04K17j43j02k25L96k83k48N01l48O86k87l21J17m93N7K04K42l7J3j6
$$ plain form
1803 -441 -526 -463 -641 -476 -502 -435 -366 -294 -626 -458 -572 -732 -732 -755 -568 -430 -449 -328 -716 -685 -815 -603 -452 -418
1827 -418 -541 -500 -290 -530 -569 -584 -610 -414 -261 -320 -141 -631 -413 -652 -911 -355 -294 145 -4 -386 -402 -409 -220
1850 -220 -420 -208 -135 219 -153 31 88 -102 -53 -25 136 70 303 129 174 -41 59 96 332 209 237 150 161
1873 161 208 88 234 167 191 365 642 474 110 52 197 385 282 213 276 258 225 356 38 324 384 352 483
1896 483 538 606 240 478 262 112 377 595 633 603 537 311 284 218 256 743 738 598 222 524 618 659 364 636
1920 636 273 501 527 802 348 346 307 282 17 309 488 283 594 488 256 443 359 374 340 332 582 488 378 66
1944 66 138 82 186 -41 258 393 222 91 91 -112 5 92 266 -182 262 -146 -66 2 23 -29 26 -235 109 -35
1968 -35 -165 -14 -231 -397 -162 -179 -195 -14 -267 -415 -340 -384 -239 -362 -174 -372 -107 -281 -588 -508 -207 -299
$$ packed form
1803d41q5O3j78J65k6O7O9P2l32J68j14j60%k3J87J38j9J21l88L1j30K12J51L4
1827d18j23M1K10k40l9j5k6J96J53n9J79m90K18k39k59N56O1M39j49l82j6pJ89
1850b20k00K12P3L54l72J84N7j90M9K8J61o6K33j74M5k15J00L7K36j23K8q7J1
1873A61M7j20J46o7K4J74K77j68l64n8J45J88j03o9O3j8l3J31l18K86O0l2J31
1896D83N5O8l66K38k16j50K65K18L8l0o6k26k7o6L8M87nj40l76L02R4M1k95K72
1920F36l63K28K6K75m54kl9k5k65K92J79k05L11j06k32J87q4J5l4qK50r4j10l12
1944F6P2n6J04k27K99J35j71j31%k03J17Q7J74m48M44m08Q0O8K1n2N5k61L44j44
1968c5j30J51k17j66K35j7j6J81k53j48P5m4J45j23J88j98K65j74l07Q0L01r2
$$ plain form
1990 -299 -459 -236 -219 -165 -300 -452 -312 -649 -532 -464 -327 -509 -602 -135 -424 -388 -599 -256 -765 -477 -399 -432
2012 -432 -276 -252 -739 -293 -524 -368 26 100 -159 -187 -585 -395 -238 -143 -145 -128 -135 -801 -334 -248 -260 -346 -210 -61
2036 -61 -590 -286 -205 -155 -224 -258 -50 -124 -111 -149 -189 -233 -161 -54 -123 126 241 267 -38 -148 111 54 222 163 184
2061 184 148 393 274 -66 23 73 160 221 182 92 193 130 442 232 65 80 474 356 190 259 197 441 165 143
2085 143 -10 13 334 396 402 156 352 163 167 322 492 495 327 252 492 210 239 153 29 295 507 213 353 341
2109 341 381 304 222 248 385 756 493 395 182 202 334 442 206 178 492 272 349 168 100 282 -25 75 313
2132 313 -35 145 164 107 -14 182 131 189 195 -33 192 131 28 -220 123 33 -27 38 105 -159 -111 -94 -162 -232 -61
2157 -61 -236 -1 -66 -168 -266 -277 50 -13 -66 -378 72 -155 -286 -447 -150 -215 -20 -354 -276 -275 -159 -90 -18 -64
$$ packed form
1990b99j60K23J7N4j35j52J40l37J17O8J37j82r3M67k89L6k11L43n09K88P8l3
2012d32J56K4m87M46k31J56L94P4k59k8l98J90J57R5kJ7po66M67Q6j2q6J36J49
2036f1n29L04Q1N0o9l4K08p4J3l8m0m4P2J07o9K49J15K6l05j10K59n7J68n9K1
2061A84l6K45j19l40Q9N0Q7O1l9r0J01o3L12k10j67J5L94j18j66O9o2K44k76k2
2085A43j53K3L21O2Ok46J96j89MJ55J70Lj68p5K40k82K9q6j24K66K12k94J40j2
2109C41M0p7q2K6J37L71k63r8k13K0J32J08k36k8L14k20P7j81o8J82l07J00K38
2132C13l48J80J9n7j21J96n1N8Ok28K25o1j03k48L43r0o0O5O7k64M8J7o8p0J71
2157f1j75K35o5j02r8j1L27o3n3l12M50k27j31j61K97o5J95l34P8JJ16O9P2m6
$$ plain form
2181 -64 -631 -221 -53 -485 -294 -568 -361 -372 -52 -302 -86 -3 -220 -89 -333 -266 -468 -344 -211 -40 -298
2202 -298 -200 -354 -353 -326 12 -260 -310 -205 -272 30 -389 -386 -173 -193 10 -154 -176 -396 -217 -190 -175 -132 -222 -36 -13
2227 -13 -142 88 -241 -34 -516 137 44 146 -13 294 112 -30 158 -331 -88 -48 139 18 58 212 7
2248 7 54 147 45 307 -55 225 125 -149 222 -61 203 85 -39 493 84 41 24 63 -109 59 250 343 239
2271 239 375 150 42 -67 430 115 -29 574 551 423 205 125 116 23 190 429 282 244 184 74 403 152
2293 152 83 208 296 199 261 133 384 31 246 207 296 203 284 381 127 -16 412 90 111 -8 222 9 -131
2316 -131 197 -21 238 11 57 37 333 233 24 296 69 -133 293 14 90 78 -37 211 -136 160 44
2337 44 32 73 111 43 25 -53 -145 -90 -220 -102 -30 -126 -67 -123 47 11 -128 -31 -140 -287 -162 -159 -362 -253 -323 -162
$$ packed form
2181f4n67M10J68m32J91k74K07j1L20k50K16Q3k17J31k44O7k02J24J33J71k58
2202b98R8j54JK7L38k72n0J05o7L02m19LK13k0K03j64k2k20J79K7J5M3r0J86K3
2227a3j29K30l29K07m82O53r3J02j59L07j82j42J88m89K43M0J87j21M0J54k05
2248GM7R3j02K62l62K80j00k74L71k83K64j18j24N32m09m3j7L9j72J68J91R3j04
2271B39J36k25j08j09M97l15j44O03k3j28k18q0rr3J67K39j47l8o0j10L29k51
2293A52o9J25Q8r7O2j28K51l53K15l9Q9r3Q1R7k54j43M28l22K1j19K30k13j40
2316a31L28k18K59k27M6k0K96j00k09K72k27k02M26k79P6j2j15K48l47K96j16
2337D4j2M1L8o8j8p8r2N5j30J18P2r6N9n6J70l6j39R7j09j47J25Lk03J09p0J61
$$ plain form
2363 -162 -195 38 -308 37 -67 -357 -132 -66 -108 -68 -16 -161 3 -129 -216 -22 -244 -556 -235 -220 -107 -209
2385 -209 -254 -249 266 221 -51 24 -200 -332 -269 -268 -279 -219 -319 -253 59 -131 -165 -187 -223 157 -9 119 155 -104 29
2410 29 -214 -347 154 -148 99 -149 -307 -453 -152 -116 -237 -247 -146 -267 -231 -85 21 -212 -292 -33 110 282
2432 282 -148 63 53 -142 176 -114 -50 -145 -128 -83 -232 12 -83 -27 37 -31 103 160 82 -221 293 192 98 89 53
2457 53 50 47 -28 24 207 131 345 57 -136 30 116 -18 242 -28 603 142 120 -128 20 72 32 415 285 104
2481 104 -80 176 -3 175 70 265 229 57 319 -137 40 -57 165 328 177 8 102 122 225 241 52 201
2503 201 96 211 -63 208 309 -2 148 233 -191 248 344 151 247 -151 28 300 27 -221 110 503 -201
2524 -201 98 6 -269 23 -113 49 62 66 62 -199 -170 24 -210 -192 107 87 216 -222 -149 -115 -197 -203 83 -248 8
$$ packed form
2363a62l3K33l46L45j04k90K25O6m2M0N2j45J64j32q7J94k22l12L21J5J13j02
2385b09m5NN15m5k72P5k24j32O3Jj1O0j00O6L12j90l4k2l6L80j66J28L6k59J33
2410B9k43j33N01l02K47k48j58j46L01L6j21j0J01j21L6J46J06k33q0K59J43J72
2432B82m30K11j0j95L18k90O4r5J7M5j49K44r5N6O4o8J34N7p8l03N14j01r4rl6
2457E3llp5N2J83p6K14k88j93J66Q6j34K60k70O31m61k2k48J48N2m0L83j30j81
2481A04j84K56j79J78j05J95l6j72K62m56J77r7K22J63j51j69R4K0J03J6j89J49
2503B01j05J15k74K71J01l11J50Q5m24M39R6j93R6l98J79K72k73k48L31L93p04
2524b01K99r2k75K92j36J62J3Mmk61K9J94k34J8K99k0J29m38P3L4q2oK86l31K56
$$ plain form
2549 8 -82 -13 -2 -44 -138 154 124 -187 -150 -72 61 -191 -373 -227 11 -88 57 187 2 -81 -244 -160 -131 -184 -88
2574 -88 100 -20 -320 144 -212 -224 -234 -409 -50 -407 -119 -226 -324 -211 -386 -56 -169 -246 -289 -188 94 -45
2596 -45 0 -219 45 142 -254 -41 -253 -174 2 -3 -196 -70 -29 -83 -397 -157 -141 -57 -63 -131 -111 -78 51 156 -4
2621 -4 -27 -179 -278 148 41 -21 124 -42 22 -194 212 -104 -17 87 86 67 -583 68 134 224 417 87 251 267
2645 267 271 -132 371 98 -242 -86 32 71 -23 123 -22 13 94 134 -107 -158 103 234 -9 30 304 304 288 45
2669 45 371 -109 34 -155 63 8 64 -136 -149 145 194 49 -256 1 -50 437 -190 -10 -45 273 101 206
2691 206 326 174 62 85 288 75 42 56 -58 -75 190 283 207 -116 -30 -46 262 -12 213 -53 -189 23 25
2714 25 -67 152 135 290 41 77 189 96 -208 28 6 214 144 -80 43 -98 -260 -129 -110 -294 -156 150 114
$$ packed form
2549Hr0O9J1m2r4K92l0l11L7P8J33k52j82J46K38r9J45J30j85q3j63Q4K9n3R6
2574h8J88j20l00M64l56j2j0j75L59l57K88j07r8J13j75L30j13p7m3J01K82j39
2596d5M5k19K64R7l96K13k12P9J76nj93J26M1n4l14K40J6Q4oo8K0L3J29J05j60
2621dk3j52r9M26j07o2J45j66O4k16M06l16Q7J04jj9o50O51O6R0J93l30J64J6
2645B67Mm03N03k73l40J56J18L9r4J46j45L5Q1M0k41n1K61J31k43L9K74%j6k43
2669D5L26m80J43j89K18n5N6k00j3K94M9j45l05K57n1M87o27J80l5L18j72J05
2691B06J20j52j12K3K03k13l3J4j14j7K65R3p6l23Q6j6L08k74K25k66j36K12K
2714B5r2K19j7J55k49L6J12r3l04K36k2K08p0k24J23j41j62J31J9j84J38L06l6
$$ plain form
2737 114 -84 -148 -151 -70 -58 224 37 50 -139 10 -318 190 37 -15 -91 -375 -133 -55 58 24 10 -51 -485 96
2761 96 97 -92 84 81 -55 -117 84 -360 -276 -279 -76 -211 8 48 -45 110 -89 34 -46 -118 169 -64 -114 0 -332
2786 -332 70 103 156 103 -87 -161 -249 -259 -88 -268 145 21 -34 226 -274 -189 20 -360 -121 10 -108 75 -17
2809 -17 -156 32 295 80 104 52 -188 -129 -212 -92 138 32 -49 23 -234 -70 -214 -40 -224 74 -83 -72 -49
2832 -49 208 110 -74 98 -6 -62 117 179 -184 293 75 -121 -25 96 43 52 -84 -101 387 207 2 -95 128
2855 128 -128 -261 176 172 146 372 94 250 105 25 168 -17 49 61 379 317 367 -88 -3 41 80 -126 141 392
2879 392 96 -49 59 -60 -123 -7 101 -238 -73 73 -200 174 214 161 66 125 74 -167 341 -285 221 13
2901 13 -25 11 102 -108 63 35 -297 76 -410 156 -19 -95 219 126 96 42 -293 -75 -35 -91 31 -57 46 90
$$ packed form
2737A14j98o4lQ1J2K82j87J3j89J49l28N08j53n2p6k84K42P8J13l4j4o1m34N81
2761I6Jj89J76lj36o2K01m44Q4lK03j35K19M0r3J55j99J23q0p2K87k33n0J14l32
2786c32M02L3N3n3j90p4q8j0J71j80M13j24n5K60n00Q5K09l80K39J31j18J83r2
2809a7j39J88K63k15K4n2k40N9q3J20K30j06q1P2k57J64j44J74j84K98j57J1K3
2832d9K57r8j84J72j04n6J79O2l63M77k18j96R6J21n3Rj36j7M88j80k05r7K23
2855A28k56j33M37mk6K26k78J56j45q0J43j85O6J2L18o2N0m55Q5M4L9k06K67K51
2879C92k96j45J08j19o3J16J08l39J65J46k73L74M0n3r5N9n1k41N08o26N06k08
2901A3l8L6R1k10J71k8l32L73m86N66j75p6L14r3l0n4l35K18M0n6J22q8J03M4
$$ plain form
2925 90 -62 89 231 -86 137 142 94 -155 -200 29 -231 -71 40 -112 -194 175 -105 -151 29 128 -382 -304 92
2948 92 -204 58 -192 5 -11 -47 -104 84 7 30 -337 -122 -101 -276 -37 -167 -102 -53 84 -55 -63 -113 108 82
2972 82 199 -16 -9 -2 87 -105 -84 -167 148 -233 -207 -235 -67 -174 -40 -33 -51 174 -270 124 -184 395 -182 -97 -232
2997 -232 -100 -94 -224 102 -30 149 60 72 -33 -116 -36 123 -45 -96 24 -8 224 181 61 38 105 -46 307 -96
3021 -96 -25 -92 159 33 35 291 121 86 371 -8 -172 248 -32 -39 154 69 -76 -123 116 -200 142 -74 1 106
3045 106 -46 98 224 155 222 193 61 219 -86 224 -16 -2 -265 92 -174 159 479 61 81 42 4 -46 114
3068 114 -153 339 73 1 25 58 -96 -299 107 96 -96 65 206 36 -94 295 -314 -83 215 228 231 144 70
3091 70 -187 -86 299 -84 -27 -68 -37 -49 -37 75 119 163 -37 242 128 -1 22 375 -51 -357 -61 -275 174
$$ packed form
2925I0j52J51J42l17K23Nm8k49m5K29k60J60J11j52q2L69k80m6J80R9n10P8L96
2948I2k96K62k50J97j6l6n7J88p7K3l67K15K1j75K39j30O5M9J37j39qn0K21k6
2972H2J17k15PPQ9j92K1q3L15l81K6k8J68j07J34Pj8K25m44L94l08N79n77Q5j35
2997b32J32Oj30L26j32J79q9J2j05q3Q0J59j68n1J20l2K32m3j20k3O7j51L53m03
3021i6P1o7K51j26KK56j70l5K85l79j64M20k80pJ93q5j45m7K39l16L42k16P5J05
3045A06j52J44J26o9O7k9j32J58l05L10k40J4k63L57k66L33L20m18K0l9l8n0J60
3068A14k67M92k66p2K4L3j54k03M06j1j92J61J41j70j30L89o09K31K98J3Lq7p4
3091G0k57J01L85l83N7m1L1j2J2J12M4M4k00K79j14j29K3L53m26l06K96k14M49
$$ plain form
3114 174 199 195 11 293 86 41 235 274 40 15 23 -146 207 -138 33 -55 -5 -228 18 -161 -76 -177 137 85
3138 85 112 -48 -106 -15 -15 77 -112 209 40 -275 401 45 71 86 -41 57 -198 -39 -87 -25 -94 179 -249 -162 -171
3163 -171 16 -55 -52 152 -121 101 -21 -125 -32 -68 182 305 -40 -61 40 90 -216 -109 43 -48 -95 152 139
3186 139 206 4 46 226 75 -284 231 -60 -135 -124 -2 -110 1 -26 -136 -16 264 -185 -22 -270 -96 41
3208 41 394 95 59 -76 -260 -29 98 -53 9 301 -259 -130 -9 305 153 174 311 175 160 174 97 164 55
3231 55 -176 124 79 198 46 -32 112 -148 214 485 -36 93 41 140 -7 345 68 -96 135 184 -248 186
3253 186 -446 -177 198 -41 -109 -42 -201 374 151 -131 181 -92 182 173 -199 237 -4 -125 445 238 227 -346
3275 -346 160 56 205 -21 202 -175 335 162 24 -37 -67 -113 -189 82 67 -31 233 -102 -60 -59 119 164 78 -186
$$ packed form
3114A74K5mj84K82k07m5J94L9k34k5Qj69L53l45J71q8N0k23K46j79Q5j01L14n2
3138H5K7j60n8R1%R2j89L21j69l15O76l56K6J5j27R8k55J59m8O2o9K73m28Q7r
3163a71J87p1LK04k73K22j22j04R3l6K50J23l45k1J01N0l06J07J52r1m7K47j3
3186A39O7k02M2J80j51l59N15k91p5J1J22j08J11k7j10J20K80m49J63k48J74J37
3208D1L53k99l6j35j84K31J27j51O2K92n60J29J21L14j52K1J37j36j5J4p7O7j09
3231E5k31L00m5J19j52p8J44k60L62K71n21J29n2R9j47L52k77j64K31M9m32M34
3253A86o32K69L75k39o8O7j59N75k23k82L12k73K74rl72M36k41j21N70k07j1n73
3275c46N06j04J49k26K23l77N10j73j38o1l0m6p6K71j5r8K64l35M2JJ78M5q6k64
$$ plain form
3299 -186 -54 4 -168 127 128 96 66 -230 -107 87 -121 260 27 104 170 31 -10 174 167 204 31 -17 298 10
3323 10 284 -29 44 20 -143 274 66 -242 -56 -141 -176 -85 -76 198 121 -183 -14 -387 25 71 -325 -137 -235 29
3347 29 17 10 -409 -112 -52 58 -247 288 164 236 140 -73 23 -64 37 113 -219 -74 -21 69 -174 185 -5 6
3371 6 -53 -28 -42 -248 28 -235 -54 106 160 67 99 -213 -41 -64 48 77 -111 103 -121 -95 262 128 140 76
3395 76 -206 -21 -93 -342 168 68 -29 93 -156 239 -48 -54 162 -111 131 -99 31 3 121 46 22 -141 -27
3418 -27 50 14 105 130 172 -15 -37 80 -87 288 -38 -144 -99 -137 -40 61 -197 -15 -89 315 -59 -40 -63 -125 290
3443 290 -46 202 -153 15 -54 -43 176 -155 141 -230 100 93 -100 -146 190 -107 297 210 -29 -151 3 -5 79
3466 79 49 -13 159 110 -245 17 -173 0 -250 73 182 105 172 160 -40 -142 33 182 123 -150 101 -17 242
$$ packed form
3299a86J32N8j72K95Jl2l0k96J23J94k08L81k33P7O6j39m1J84pL7j73m8L15k88
3323A0K74l13P3k4j63M17k08l08J86q5l5R1RK74p7l04J69l73M12M6l96J88r8K64
3347B9j2pm19K97O0J10l05N35j24P2r6k13R6q7J01P6l32J45N3R0k43L59j90J1
3371Fn9K5j4k06K76k63J81J60N4r3L2l12J72k3J12K9j88K14k24K6L57j34J2o4
3395G6k82J85p2k49N10j00r7J22k49L95k87oK16k73K42k30J30k8J18p5k4j63J14
3418b7P7l6R1K5M2j87k2J17j67L75l26j06M5l8R7J01k58J82p4M04l74J9k3o2M15
3443B90l36K48l55J68o9J1K19l31K96l71L30pj93m6L36k97M04q7k39j22J54qQ4
3466G9l0o2J72m9l55K62j90J73k50L23J09p7O7j2k00j02J75J49n9k73K51j18K59
$$ plain form
3489 242 76 -295 159 -27 193 119 17 53 149 28 -63 190 -75 175 -74 216 162 -71 -391 2 19 188
3511 188 -281 214 216 120 -49 -60 -109 -147 -18 18 -20 91 -51 -145 136 18 -131 65 2 -51 131 115 258 13
3535 13 11 136 -293 -183 -258 33 -76 -50 -40 -111 75 65 315 -14 69 203 129 222 15 93 70 116 103 -216 -85
3560 -85 -122 -79 -151 -21 -132 88 25 -51 66 -67 -190 -249 26 -52 250 116 -370 218 300 140 244 -110 189
3583 189 -132 -24 260 -194 -5 -65 -55 -41 10 151 -1 -49 35 -27 -107 -68 -21 128 -52 -209 332 -10 -52 74
3607 74 68 13 166 -270 87 -141 -52 -105 335 142 24 -21 316 51 -114 -36 -337 -88 101 -21 20 -50 -143 102
3631 102 -5 -129 151 108 183 -16 210 61 -86 54 -37 -192 -220 -133 -156 172 185 -133 -250 -193 175 -63 -105
3654 -105 -220 -26 -109 144 44 -185 -86 37 138 60 269 66 185 45 124 133 54 -79 -80 -102 124 -33 -106 126
$$ packed form
3489B42j66l71M54j86K20p4j02L6R6j21r1K53k65K50k49K90n4k33l20L93J7J69
3511A88m69M95Kr6j69j1m9l8J29L6l8J11j42r4K81j18j49J96o3n3J82j6J43k45
3535A3kJ25m29J10p5K91j09K6J0p1J86j0K50l29Q3J34p4R3k07P8k3M6j3l19J31
3560h5l7M3p2J30j11K20o3p6J17j33j23n9K75p8L02j34m86N88Q2j60J04l54K99
3583A89l21J08K84m54J89o0J0J4N1J41j52m8Q4o2q0L9M7J49j80j57N41l42m2J26
3607G4on5J53m36L57k28Q9n3M40j93j18m5L37k65j65P8l01K49J89j22M1p0r3K45
3631A02j07j24K80m3P5j99K26j49j47J40r1j55k8Q7k3L28J3l18j17N7L68k38m2
3654a05j15J94q3K53j00k29R9J23J01p8K09k03J19j40P9Rp9j33jk2K26j57p3K32
$$ plain form
3678 126 146 -191 120 -55 4 -133 -261 14 112 178 108 99 63 35 -212 -193 -49 -22 94 -57 -448 226 22 17
3702 17 -216 326 69 -61 -121 175 -31 92 151 -243 397 -19 350 -11 -37 -32 132 42 -38 244 -210 -286 -113
3725 -113 -105 -83 -160 53 245 -157 -24 -139 -72 -222 -125 -185 58 -65 -36 -58 165 132 87 199 3 96 8 -263
3749 -263 -254 -100 167 271 -6 132 -48 50 -255 169 -66 -51 -2 250 -63 263 -106 179 -219 12 65 25
3771 25 -64 -263 76 6 185 -112 -29 -83 -17 292 127 128 72 -190 -79 9 -12 87 152 22 -33 89 20 13 -47 -33
3797 -33 -107 -96 57 -53 1 -355 -69 83 -157 172 148 31 152 -146 -79 -88 131 -278 69 -61 241 -1 291
3820 291 -105 110 -189 228 -17 -134 -15 -207 125 47 194 -172 -152 175 139 -48 -85 107 -86 -61 152 167
3842 167 -311 -134 59 -81 -33 32 -56 63 -185 -154 122 51 -263 -183 108 188 130 433 127 20 -247 -221 -43
$$ packed form
3678A26K0l37L11j75N9j37j28K75R8O6p0rl6k8k47J9J44K7J16j51l91O74k04n
3702A7k33N42k57j30o0K96k06J23N9l94O40m16L69l61k6NJ64r0q0K82m54p6J73
3725a13QK2p7K13J92m02J33j15O7j50R7o0K43j23K9k2K23l3m5J12j96R3q8k71
3749b63RJ54K67J04k77J38j80R8l05M24k35J5M9K52l13L26l69K85l98K31N3m0
3771B5q9j99L39p0J79k97Q3n4O6L09j65Jn6k62J11Q8k1R9O5j30n5J22o9po0J4
3797c3p4J1J53j10N4l56K86J52k40L29k4j17J21k98O7rK19m09L47j30L02k42K92
3820B91l96K15k99M17k45j17J19j92L32p8J47l66K0L27l6j87l7J92j93K5K13J5
3842A67m78J77J93j40M8O5q8J19k48L1K76p1l14Q0K91Q0n8L03l06j07k67K6J78
$$ plain form
3865 -43 -44 6 -149 -66 -23 -174 5 -256 78 107 -144 249 -152 -269 169 371 19 -164 -167 52 -85 -41 186
3888 186 295 243 -31 79 216 -34 34 43 26 125 135 -177 -135 62 128 -321 80 110 -117 -195 -44 94 -73 125
3912 125 -20 150 -179 -38 98 -174 -33 -48 -115 -265 -48 65 172 1 -155 -273 -138 123 -273 33 -197
3933 -197 123 22 119 -116 259 -39 98 -141 -5 -59 -73 56 18 78 -99 -112 134 -101 107 -46 69 90
3955 90 143 17 6 86 -175 -149 -4 352 -240 237 -62 149 -481 -158 167 120 61 61 44 76 43 -15 -59 20 -185
3980 -185 -206 -263 18 4 68 245 -162 31 -131 85 131 33 -81 64 -144 -123 15 -134 236 -77 3 34 -185
4003 -185 1 36 160 85 137 269 -154 18 -45 24 114 46 -61 68 -62 -44 -189 4 -58 -132 30 -220 73
4026 73 133 -21 -85 41 -74 -31 195 62 -3 160 -255 63 219 -135 -118 1 -52 -185 49 -136 -270 9
$$ packed form
3865d3jN0j55Q3M3j51J79k61L34K9k51L93m01j17M38K02l52j83lK19j37M4K27
3888A86J09n2k74J10J37k50O8Rj7R9J0l12M2J97O6m49M01L0k27p8J51J38j67J98
3912A25j45J70l29J41J36k72J41j5o7j50K17J13J07j71j56j18J35K61l96L06k30
3933a97L20j01R7k35L75k98J37k39J36n4j4J29l8O0j77j3K46k35K08j53J15K1
3955I0N3j26j1Q0k61K6J45L56n92M77k99K11o30L23L25m7n9%j7L2l3n8m4P9k05
3980a85k1n7K81j4O4J77m07J93j62K16M6r8j14J45k08K1J38j49L70l13Q0L1k19
4003a85J86L5J24p5N2J32m23J72o3O9R0o8j07J29j30J8j45J93o2p4J62k50K93
4026G3O0j54o4J26j15M3K26j33o5J63m15L18J56l54J7J19n3j33K34j85j34K79
$$ plain form
4048 9 -96 -195 198 -199 25 -13 354 53 116 242 -299 -6 -163 282 -115 117 250 -105 47 -78 167 107
4070 107 25 -25 -155 -45 44 277 259 -45 -56 -411 202 -40 25 4 304 153 108 -26 41 300 -128 80 291
4093 291 -57 -124 -118 84 -2 -8 -109 -69 -303 92 -104 54 257 -12 -26 75 -129 -74 -203 47 39 24 148 -62
4117 -62 -337 -131 196 -199 -10 -550 -253 -245 -102 135 217 269 -54 -82 -68 344 -165 -333 211 208 -129 -92 -81 78
4141 78 -272 140 243 -223 -209 -69 -297 -178 57 84 397 -91 274 118 -15 -112 86 157 -104 -174 -30 -3
4163 -3 -94 84 -122 196 -103 -165 -164 261 33 104 -53 41 -94 95 29 44 209 -87 -40 279 101 93 152 35 137
4188 137 22 226 141 289 -310 21 23 3 51 -162 -56 -192 68 269 -196 -50 -38 21 57 -25 21 117 3 134
4212 134 50 -106 -84 -35 36 167 17 161 19 -109 76 272 43 31 -97 9 -92 -22 93 73 70 37 -102
$$ packed form
4048Ij05r9L93l97K24l8L67l01O3J26n41K93j57M45l97K32J33l55J52j25K45o0
4070A07q2n0j30J10Q9K33j8l04j1l55O13k42O5k1L00j51m5j34O7K59m28K08K11
4093B91l48o7OK02q6oj01M0k34L95j96J58K03k69j4J01k04N5j29K50qj5J24k10
4117f2k75K06L27l95J89n40K97QJ43K37Q2N2l23k8J4M12n09j68N44ll37L7J1J59
4141G8l50M12J03m66J4J40k28J19K35K7L13m88L65j56j33r7J98P1k61p0J44K7
4163cr1J78k06L18k99o2JM25k28P1j57R4j35J89o6J5J65k96M7L19j78qN9j17J02
4188A37j15K04q5J48n99L31Kk0M8k13J06j36K60K01m65J46J2N9L6q2M6R6j14J31
4212A34q4j56K2M9P1J31j50J44j42j28J85J96k29j2j28J06j01P0J15k0ll3j39
$$ plain form
4235 -102 49 1 -18 -179 -92 -66 115 131 125 -22 -51 39 -76 -103 -201 -135 143 -57 11 74 134 -66 -217 -3 -140
4260 -140 -47 77 -122 163 314 -106 27 -142 -43 92 -86 111 179 88 126 216 -7 -225 -4 20 -49 -141 -79
4283 -79 10 -70 -56 59 -75 300 -141 -33 142 -221 -130 69 98 -248 0 107 4 -77 87 305 -64 -302
4305 -302 -10 19 192 68 -35 4 167 -101 -343 142 75 -3 164 -3 6 12 87 -194 103 -24 -221 116 -33
4328 -33 -23 7 -174 -30 225 -376 -77 102 10 -152 41 -65 75 -14 -162 150 89 171 171 -172 -237 -203 14 -23
4352 -23 260 -42 55 212 -91 128 117 -280 -45 -113 210 232 -226 20 -174 -123 110 137 -71 134 229 58 -142
4375 -142 238 39 -238 228 -149 145 -69 389 108 124 105 75 129 85 85 -39 -137 -171 -4 168 133 131 -226 123
4399 123 -35 -45 -43 -81 173 -153 -73 -139 85 189 -191 162 28 40 -257 119 -20 91 -46 -286 16 -110
$$ packed form
4235a02J51m8j9j61Q7K6J81J6oj47k9R0j15k7r8O6K78k00O8O3O0k00j51K14j37
4260a40R3J24j99K85J51m20J33j69R9J35j78J97O8r1L8R0k23k18K21K4o9r2O2
4283g9Q9q0J4J15j34L75m41J08J75l63R1J99K9l46K48J07j03q1J64K18l69k38
4305c02K92K9J73j24j03L9J63k68k42M85o7p8J67j67ROP5k81K97j27j97L37j49
4328c3J0L0j81J44K55o01K99J79r2j62J93j06J40q9j48L12o1Q2%l43o5L4K17l7
4352b3K83l02R7J57l03K19j1l97K35o8L23K2m58K46j94N1K33K7k08K05R5j71k00
4375a42L80j99k77M66l77K94k14M58k81J6j9l0N4m4%j24r8l4J67J72l5kl57L49
4399A23j58j0Kl8K54l26Q0o6K24J04l80L53j34J2k97L76j39J11j37k40L02j26
$$ plain form
4421 -110 -103 -11 134 59 212 -252 -162 61 -123 172 54 83 -14 39 -3 -57 -32 157 69 89 226 97 140 -43 156
4446 156 91 -25 -217 290 179 -126 167 -26 122 -59 232 82 -146 47 -206 180 172 -176 164 -108 231
4467 231 -140 139 140 -132 272 -71 354 -39 182 1 65 36 140 230 136 304 -74 -86 253 143 -323 -59
4489 -59 -257 39 14 -407 -35 34 -149 27 20 -271 -153 -90 17 -259 -121 33 43 -248 -106 108 13 23 -38
4512 -38 -244 71 140 -193 -184 56 37 68 -27 208 -108 29 105 69 -181 21 -40 99 186 16 96 -46 45 -115
4536 -115 28 234 105 38 295 50 -39 1 66 -147 241 -156 263 -113 198 214 184 391 65 -86 -51 51
4558 51 305 99 -30 -124 -99 107 -422 -83 -216 8 86 -225 -187 86 205 -1 122 60 4 13 22 -238 -28 -204
4582 -204 -155 255 17 -188 -98 -80 93 104 168 149 -51 -115 144 -13 49 150 30 -42 -90 -461 -32 46 -50 87
$$ packed form
4421a10PR2J45p5J53m64R0K23j84K95j18K9r7N3m2n4K5J89q8K0J37j29M3j83J99
4446A56o5j16j92N07j11l05K93j93J48j81K91j50k28J93k53L86ql48L40k72L39
4467B31l71K79Jk72M04l43M25l93K21j81O4k9J04R0r4J68l78j2L39j10m66K64
4489e9j98K96k5m21L72O9j83J76pk91J18O3J07k76J38J54J0k91J42K14r5J0o1
4512c8k06L15O9l33RK40j9L1r5K35l16J37P6l6k50K02o1J39Q7j70Q0j42R1j60
4536a15J43K06j29o7K57k45q9M0O5k13L88l97M19l76L11J6l0K07l26j51L5J02
4558E1K54k06j29r4K5K06n29L39j33K24P8l11L8K73J19k06J23o2n6RRk60K10j76
4582b04M9M10k38k05R0J8J73J1O4j9k00o4K59j57O2J01j20p2m8l71M29P8r6J37
$$ plain form
4606 87 61 371 361 -81 151 178 145 38 126 251 -116 177 -103 -336 340 -291 -57 172 212 191 -15 -40 -180
4629 -180 195 -13 -132 59 131 -45 144 55 -105 -62 -298 -100 -22 169 -100 -74 -64 -201 -224 10 291 -62
4651 -62 -230 47 116 -17 -251 204 -14 46 46 -49 153 -93 -91 156 115 184 74 -220 177 -128 134 84 274 85
4675 85 -314 -353 36 451 -16 -201 35 -7 158 -27 284 -191 -22 13 152 -271 -133 183 -112 146 -283
4696 -283 133 -277 151 102 16 54 111 199 75 -181 -54 -124 243 123 -8 65 -107 77 -167 200 175 -55 -186
4719 -186 4 29 -72 24 -190 -148 65 119 57 -22 -235 70 77 127 -6 -36 324 -148 -99 -100 -6 -234 -9 338 192
4744 192 -82 -133 156 71 -332 104 73 218 83 -32 -58 62 -24 -152 -4 115 -34 207 -156 234 -11 -154
4766 -154 11 -1 -144 181 104 18 111 224 -83 -8 94 323 -196 -268 32 120 140 292 -136 9 237 211 24
$$ packed form
4606H7k6L10j0m42K32K7l3j07Q8J25l67K93k80k33O76o31K34K29M0k1k06k5j40
4629a80L75k08j19J91P2j76J89q9j60M3k36J98P8J91k69K6J0j37k3K34K81l53
4651f2j68K77O9j33k34M55k18O0%r5K02k46KK47m1O9j10k94L97l05K62n0J90j89
4675H5l99l9L89M15m67j85K36m2J65j85L11m75J69L5J39m23J38L16k95K58m29
4696b83M16m10M28m9q6L8N7Q8j24k56J27p0L67j20j31P3j72J84k44L67k5k30j31
4719a86J90K5j01R6k14M2K13N4o2p9k13L05PN0j33l0L60m72M9jR4k28K25L47j46
4744A92k74n1K89q5m03M36l1J45j35j15k6J20q6j28J48J19j49K41l63L90k45j43
4766a54J65j2j43L25p7q6R3J13l07P5J02K29n19p2L00Q8K0J52m28J45K28k6j87
$$ plain form
4789 24 -254 -118 -307 41 -19 174 -150 -13 -40 -320 -13 -47 113 -66 27 78 -162 -23 -31 -101 -104 33 -16 123
4813 123 -230 -233 56 -78 81 -229 -106 -42 -233 204 65 208 -38 99 153 -28 120 -66 -10 -131 112 123
4835 123 -182 96 -109 362 75 -159 152 -18 50 30 -190 100 -3 78 191 -84 -70 174 59 111 169 30
4857 30 -175 86 -128 381 212 -311 229 -385 143 -32 -276 -46 -104 179 -123 -66 -92 189 61 -114 52
4878 52 83 180 -84 48 -400 167 -191 -138 95 -19 -36 -74 -239 -14 -92 13 120 -208 238 123 -252 8
4900 8 14 -203 -109 -128 179 -60 -222 -4 -25 58 79 -154 -148 -59 -139 -131 57 87 90 -30 60 253 -216 71 -83 -154 -161
4927 -161 179 -152 -25 99 -151 256 -32 -84 21 -267 233 201 137 -51 118 -199 14 223 -203 -164 189
4948 189 13 124 58 87 -256 -45 -123 89 462 310 -249 93 -146 -10 -19 -202 -34 -89 213 -31 43 15 7
$$ packed form
4789B4k78J36j89L48o0J93l24J37k7k80L07l4J60j79R3N1k40J39qp0lJ37m9J39
4813A23l53lK89j34J59l10J23O4j91M37j39J43k46J37N4j81J48j86N6j21K43J1
4835A23l05K78k05M71k87k34L11j70O8k0k20K90j03Q1J13k75J4K44j15N2N8j39
4857C0k05K61k14N09j69n23N40o14N28j75k44K30n8K83l02N7k6K81j28j75J66
4878E2L1R7k64J32m48N67l58N3K33j14j7l8j65K25p8J05J07l28M46j15l75K60
4900HOk17R4j9L07k39j62K18k1Q3K1k33OQ9q0QJ88L0Lj20R0J93m69K87j54p1p
4927a61L40l31J27J24k50M07k88n2J05k88N00l2o4j88J69l17K13K09m26L9L53
4948A89j76J11o6K9l43K11p8K12L73j52n59L42k39J36rj83J68n5L02k44P4k8q
$$ plain form
4971 7 16 192 -286 103 -190 149 132 390 27 155 63 132 -170 90 -225 18 -40 -10 -218 96 156 -44 130
4994 130 -120 -67 -63 -175 -174 118 -76 135 345 -40 -114 50 122 -94 -31 63 125 -174 -10 255 -67 -49 -105 346
5018 346 144 250 -57 -41 74 309 79 -52 -125 -94 -103 171 -73 20 138 -92 -75 139 42 -91 -157 257 -274
5041 -274 -28 114 -104 4 -100 45 -79 -13 -161 -60 271 -39 -268 135 4 6 9 51 5 169 110 -129 90
5064 90 -398 257 243 13 -229 94 -161 -324 -105 211 -84 210 -115 -174 41 -210 17 256 -198 -176 -109 2
5086 2 96 151 -154 -4 -15 90 -314 260 -8 168 201 -175 325 -92 150 -225 92 -22 104 -108 -91 -257
5108 -257 -38 50 61 96 56 -169 28 199 -9 -45 307 -109 -159 -70 -66 24 -30 -228 -22 -27 92 -217 -235 55 30
5133 30 -33 415 -20 -57 -29 -311 110 -75 -180 257 -37 -198 -133 88 76 -242 31 20 -85 -47 69 -98 119
$$ packed form
4971GRJ76m78L89k93L39j7K58l63J28r2O9l02K60l15K43n8L0k08L14O0k00J74
4994A30k50N3Mj12JK92j94K11K10l85p4J64P2k16O3R4O2k99J64K65l22J8n6M51
5018C46k02J06l07J6J15K35k30j31p3L1rK74k44R3J18k30J7K14r7j33o6M14n31
5041b74K46J42k18J08j04J45j24O6j48J01L31l10k29M03j31KLM2m6J64n9k39K19
5064I0m88O55j4k30k42L23k55j63K19L16k95K94l25n9K15k51K27K39m54K2O7J11
5086BR4N5l05J50j1J05m04N74k68J76L3l76N00m17K42l75L17j14J26k12J7j66
5108b57K19Q8J1L5m0k25J97J71k08l6L52m16n0Q9MR0n4j98K06nJ19l09j8K90k5
5133C0o3M48m35l7K8k82M21j85j05M37k94j61O5K21j2l18K73j1j05L8J16j67K17
$$ plain form
5156 119 78 143 -30 -123 -119 -203 -57 219 131 -202 55 35 22 -189 100 191 -55 238 215 -21 151 6 258 -60
5180 -60 46 -159 -150 154 91 -59 -245 12 -370 -80 -171 -181 242 -207 134 202 -412 -51 368 15 216 57
5202 57 11 -121 -189 -212 186 36 -159 -254 -153 35 -167 -61 -23 95 -206 2 28 -220 288 -54 217 -215
5224 -215 -34 33 -465 -257 -208 276 -101 -65 10 54 91 -41 -63 62 353 -52 -176 -41 -78 -21 -93 127 -62
5247 -62 -71 71 -198 141 252 -17 101 186 125 2 25 -92 104 17 -176 139 -52 50 -11 -11 41 -319 309 -46
5271 -46 -20 67 237 290 122 -110 -154 117 116 66 -208 -329 150 -279 -91 13 -6 165 -392 1 -76 37 197
5294 197 -340 -292 -8 143 -6 30 9 -74 237 -154 62 117 -129 165 -14 -90 98 52 -133 -201 -203 -72 139
5317 139 -62 -69 41 -84 -84 -122 -6 5 -59 178 306 -220 -145 -8 93 124 -135 25 75 63 -209 24 322 -199
$$ packed form
5156A19m1O5j73r3Mq4J46K76q8l33K57k0j3k11K89R1k46K93k3k36J72j45K52l18
5180f0J06k05RL04o3j50j86K57l82K90r1j0M23m49L41O8o14L61M19l53K01j59
5202E7m6j32o8k3L98j50j95r5J01J88k02J06L8J18l01K08K6k48N08l42K71m32
5224b15J81O7m98K08M9M84l77L6P5M4L7j32k2J25K91m05j24J35l7N7p2K20j89
5247f2rJ42k69L39J11k69J18Q5o1j23K3j17J96q7j93L15j91J02o1%N2l60O28l55
5271d6K6Q7J70N3j68k32m4K71jn0k74j21M79m29J88J04j9J71n57L93p7J13J60
5294A97n37M8K84J51j49L6k1q3L11l91K16N5k46K94j79p6J88m6j85o8kJ31K11
5317A39k01pJ10j25%l8J16J1o4K37J28n26P5J37J01L1k59J60N0j2k72K33K98n21
$$ plain form
5341 -199 212 132 234 188 32 76 -57 -87 43 119 106 2 7 128 109 -116 235 -119 -176 44 34 -124 187 -106
5365 -106 -107 365 -187 170 -81 39 -184 86 2 -40 196 12 74 149 -4 31 11 -98 144 -23 -216 -34 -203
5388 -203 -44 -27 -144 -39 -34 67 -361 -20 254 -100 -109 -258 105 -22 73 19 -75 -128 -189 -47 274 141 171 14
5412 14 -54 179 57 4 -58 -142 -18 -92 369 178 60 61 -3 6 76 -146 354 -286 9 -90 -146 161 271 -100 237
5437 237 -24 -168 115 -65 196 -203 30 105 128 -99 -206 -26 285 -266 158 60 -87 130 105 -131 -55 -44
5459 -44 -86 -131 -79 222 5 220 -75 -242 -18 25 -140 77 101 311 84 84 -23 125 198 67 65 60 -91 -119 -103
5484 -103 -208 292 211 -149 -88 123 46 5 -105 -20 117 -3 -161 22 127 29 332 217 166 97 24 -48 198
5507 198 155 -319 -49 -67 331 50 -155 82 77 -25 27 -177 17 238 135 -45 6 136 -109 114 -24 44
$$ packed form
5341a99M11q0J02m6j56M4j33l0J30P6j3j04NJ21j9k25L51l54n7K20j0j58L11k93
5365a06jM72n52L57k51J20k23K70q4m2K36j84O2P5j53L5k0j09K42j67j93J82j69
5388b03J59J7j17J05NJ01m28L41K74l54rj49L63j27R5n4r4n3o1J42L21j33L0j57
5412A4o8K33j22n3o2q4J24p4M61j91j18Jo4RP0k22N00o40K95r9n6L07J10l71L37
5437B37k61j44K83j80K61l99K33P5K3k27j07J80L11n51M24r8j47K17k5k36P6J1
5459d4m2m5N2L01k17K15k95j67K24M3j65K17K4K10k27%j07J48P3j31knj51k8J6
5484a03j05N00q1l60O1K11p7m1j10Q5J37j20j58J83J05r8L03j15n1o9p3p2K46
5507A98m3m74K70j8L98k81k05K37nj02N2k04J94K21j03j80N1J30k45K23j38O8
$$ plain form
5529 44 117 -105 -163 247 63 227 -268 -186 38 22 80 -299 42 409 -2 -12 -26 -192 133 85 -77 135 -314
5552 -314 204 -114 -160 -116 -80 -88 -191 103 -257 315 -99 72 -79 -47 189 -223 31 104 -212 10 -246 -103
5574 -103 28 -163 -35 89 63 -100 -125 -147 111 -22 -65 331 -101 29 143 -37 72 -109 -140 253 197 66
5596 66 -1 -4 83 -451 -35 -84 68 132 3 160 -372 107 -216 -360 121 -13 -143 -95 -134 -73 -102 -295 4 101
5620 101 185 -131 209 84 -69 11 -207 -79 -145 74 29 -406 -129 177 210 8 245 340 -65 79 123 27 116
5643 116 -55 249 -55 -199 -182 -26 62 -175 -114 166 28 -83 -284 -91 213 185 46 129 -77 -52 106 239
5665 239 -65 161 182 93 49 -235 87 -112 185 -138 -236 168 222 154 -139 64 -323 58 20 78 -128 31 31
5688 31 -57 -113 61 3 73 81 -179 95 -173 -34 111 -184 39 102 70 70 128 -17 -378 -24 151 -70 -268 70
$$ packed form
5529D4P3k22n8M10j84J64m95Q2K24j6N8l79L41L67m11j0j4j66L25m8j62K12m49
5552c14N18l18m6M4L6qj03K94l60N72m14J71j51L2K36m12K54P3l16K22k56J43
5574a03J31j91J28J24k6j63k5k2K58j33m3L96m32J30J14j80J09j81l1L93n6j31
5596F6o7lQ7n34M16m9J52O4j29J57n32M79l23j44M81j34j30M8l9O1k9j93K99R7
5620A01Q4l16L40j25j53Q0k18J28o6K19m5m35K77L06L3k02K37R5m05J44M4r6Q9
5643A16j71L04l04j44J7J56Q8k37O1K80j38j11k01J93L04k8j39Q3k06K5J58J33
5665B39l04K26K1q9m4k84L22j99K97l23r8M04N4o8k93K03l87L81l8N8k06J59%
5688C1q8n6J74n8P0Qk60K74k68J39J45k95K23O3l2%N8j45l61L54J75k21j98L38
$$ plain form
5712 70 5 66 161 282 -40 -105 -93 -109 -46 33 -61 -30 -24 77 169 -129 44 304 -289 21 383 -44 -132 93 84 -47
5738 -47 204 21 -177 101 -18 375 -15 -161 -77 -268 -137 178 -238 67 94 30 256 135 -163 91 -142
5759 -142 17 71 25 -30 -63 11 202 306 273 42 75 242 -4 -66 143 -133 83 156 -115 -36 44 -69 -274 112
5783 112 -20 97 187 112 133 5 -229 -1 180 195 -221 -319 -56 130 293 -245 -183 138 -137 82 -64 -174
5805 -174 -59 53 29 -26 26 -107 -12 135 -148 227 43 4 -164 -18 60 101 278 154 22 -120 132 102 -148
5828 -148 -90 122 -45 -87 -2 -37 28 -225 96 69 113 -168 -27 97 -266 -41 -193 -62 131 49 97 -140 -49
$$ packed form
5712G0o5O1R5J21l22o5J2j6O3P9r4L1OJ01R2k98J73K60n93L10L62m27q8K25rj31
5738d7K51j83j98K78j19L93l90j46Q4j91J31L15m16L05K7o4K26j21k98K54k33
5759a42J59N4m6n5l3P4J91J04l3k31L3J67k46o2K09k76K16P3k71P9Q0j13k05L86
5783A12j32J17R0p5K1j28k34K28J81J5m16r8K63J86J63n38O2L21k75K19j46j10
5805a74J15J12k4n5N2j33R5J47k83L75j84l9j68J46P8M1J77j24j32j42K52l0k50
5828a48N8K12j67m2Q5l5O5k53L21k7M4k81J41J24l63K25j52J31J93q2M8k37R1
$$ [...]
8191A79
##END NTUPLES=NMR FID
##END=
