##TITLE=1H_LR-669H-CR3
 D2O, 8 sc, 
 7.6.2019
##JCAMPDX= 6.0         $$ Bruker NMR JCAMP-DX V2.0
##DATA TYPE= NMR FID
##DATA CLASS= NTUPLES
##ORIGIN= UXNMR, Bruker Analytische Messtechnik GmbH
##OWNER= root
$$ XWIN-NMR		Version 3.5
$$ Fri Jun  7 14:11:29 2019 Russian Standard Time (UT+4h)  she@DPX200
##.OBSERVE FREQUENCY= 200.13155
##.OBSERVE NUCLEUS= ^1H
##.DELAY= (6, 6)
##.ACQUISITION MODE= SIMULTANEOUS
##.ACQUISITION SCHEME= undefined
##.AVERAGES= 8
##.DIGITISER RES= 18
##SPECTROMETER/DATA SYSTEM= spect
##.PULSE SEQUENCE= zg30
##.SOLVENT NAME= D2O
##.SHIFT REFERENCE= (INTERNAL, D2O, 0, 15.7039)
##AUDIT TRAIL= $$ (NUMBER, WHEN, WHO, WHERE, WHAT)
$$ ##TITLE= Audit trail, XWIN-NMR		Version 3.5
$$ ##JCAMPDX= 5.01
$$ ##ORIGIN= Bruker BioSpin GmbH
$$ ##OWNER= she
$$ F:/spectra/data/she/nmr/H-F/1/audita.txt
$$ ##AUDIT TRAIL=  $$ (NUMBER, WHEN, WHO, WHERE, WHAT)
(   1,<2019-06-07 14:09:27.93 +0400>,<she>,<DPX200>,
      <created by zg, POWCHK disabled, PULCHK disabled
       configuration hash MD5:
       00 E9 B6 7A A2 85 ED C7 34 08 36 98 17 FE 4E 26
       data hash MD5: 16K
       AA 63 77 0F AE 97 40 3B E2 D5 41 A0 D2 6F C4 95>)
$$ ##END=
$$ 
$$ hash MD5
$$ 1D B1 B2 F2 45 8F 3B 20 09 9A 6D 96 C1 5A 51 A5
##$RELAX= 
##$RELAX= 
##$RELAX= 
##$RELAX= 
##$RELAX= 
##$RELAX= 
$$ Bruker specific parameters
$$ --------------------------
##$DU= <F:/spectra>
##$EXPNO= 1
##$NAME= <H-F>
##$PROCNO= 1
##$TYPE= <nmr>
##$USER= <she>
##$AMP= (0..31)
100 100 100 100 100 100 100 100 100 100 100 100 100 100 100 100 100 100 
100 100 100 100 100 100 100 100 100 100 100 100 100 100 
##$AQSEQ= 0
##$AQ_mod= 1
##$AUNM= <au_zg>
##$AUTOPOS= <>
##$BF1= 200.13
##$BF2= 200.13
##$BF3= 200.13
##$BF4= 200.13
##$BF5= 200.13
##$BF6= 200.13
##$BF7= 200.13
##$BF8= 200.13
##$BYTORDA= 1
##$CFDGTYP= 0
##$CFRGTYP= 5
##$CHEMSTR= <none>
##$CNST= (0..31)
1 1 145 1 1 1 1 1 1 1 1 1 1 1 1 1 1 1 1 1 1 1 1 1 1 1 1 1 1 1 1 1 
##$CPDPRG= <>
##$CPDPRG1= <>
##$CPDPRG2= <>
##$CPDPRG3= <>
##$CPDPRG4= <mlev>
##$CPDPRG5= <mlev>
##$CPDPRG6= <mlev>
##$CPDPRG7= <mlev>
##$CPDPRG8= <mlev>
##$CPDPRGB= <>
##$CPDPRGT= <>
##$D= (0..31)
0 1.2 0 0 0 0 0 0 0 0 0 0.03 0 0 0 0 0 0 0 0 0 0 0 0 0 0 0 0 0 0 0 0 
##$DATE= 1559902167
##$DBL= (0..7)
120 120 120 120 120 120 120 120 
##$DBP= (0..7)
150 150 150 150 150 150 150 150 
##$DBP07= 0
##$DBPNAM0= <>
##$DBPNAM1= <>
##$DBPNAM2= <>
##$DBPNAM3= <>
##$DBPNAM4= <>
##$DBPNAM5= <>
##$DBPNAM6= <>
##$DBPNAM7= <>
##$DBPOAL= (0..7)
0.5 0.5 0.5 0.5 0.5 0.5 0.5 0.5 
##$DBPOFFS= (0..7)
0 0 0 0 0 0 0 0 
##$DE= 6
##$DECBNUC= <off>
##$DECIM= 24
##$DECNUC= <off>
##$DECSTAT= 4
##$DIGMOD= 1
##$DIGTYP= 9
##$DL= (0..7)
0 120 120 120 120 120 120 120 
##$DP= (0..7)
150 150 150 150 150 150 150 150 
##$DP07= 0
##$DPNAME0= <>
##$DPNAME1= <>
##$DPNAME2= <>
##$DPNAME3= <>
##$DPNAME4= <>
##$DPNAME5= <>
##$DPNAME6= <>
##$DPNAME7= <>
##$DPOAL= (0..7)
0.5 0.5 0.5 0.5 0.5 0.5 0.5 0.5 
##$DPOFFS= (0..7)
0 0 0 0 0 0 0 0 
##$DQDMODE= 0
##$DR= 18
##$DS= 0
##$DSLIST= <SSSSSSSSSSSSSSS>
##$DSPFIRM= 0
$$ [...]
##$SUBNAM2= <"">
##$SUBNAM3= <"">
##$SUBNAM4= <"">
##$SUBNAM5= <"">
##$SUBNAM6= <"">
##$SUBNAM7= <"">
##$SUBNAM8= <"">
##$SUBNAM9= <"">
##$SW= 24.9336996594482
##$SWIBOX= (0..15)
0 0 2 0 0 0 0 0 0 0 0 0 0 0 0 0 
##$SW_h= 4990.01996007984
##$TD= 16384
##$TD0= 1
##$TE= 0
##$TE2= 300
##$TE3= 300
##$TEG= 300
##$TL= (0..7)
0 120 120 120 120 120 120 120 
##$TP= (0..7)
150 150 150 150 150 150 150 150 
##$TP07= 0
##$TPNAME0= <>
##$TPNAME1= <>
##$TPNAME2= <>
##$TPNAME3= <>
##$TPNAME4= <>
##$TPNAME5= <>
##$TPNAME6= <>
##$TPNAME7= <>
##$TPOAL= (0..7)
0.5 0.5 0.5 0.5 0.5 0.5 0.5 0.5 
##$TPOFFS= (0..7)
0 0 0 0 0 0 0 0 
##$TUNHIN= 0
##$TUNHOUT= 0
##$TUNXOUT= 0
##$USERA1= <user>
##$USERA2= <user>
##$USERA3= <user>
##$USERA4= <user>
##$USERA5= <user>
##$V9= 5
##$VALIST= <valist>
##$VCLIST= <CCCCCCCCCCCCCCC>
##$VD= 0
##$VDLIST= <DDDDDDDDDDDDDDD>
##$VPLIST= <PPPPPPPPPPPPPPP>
##$VTLIST= <TTTTTTTTTTTTTTT>
##$WBST= 1024
##$WBSW= 4
##$XGAIN= (0..3)
0 0 0 0 
##$XL= 0
##$YL= 0
##$YMAX_a= 271361
##$YMIN_a= -381568
##$ZGOPTNS= <>
##$ZL1= 120
##$ZL2= 120
##$ZL3= 120
##$ZL4= 120
##$ABSF1= 10
##$ABSF2= 0
##$ABSG= 5
##$ABSL= 3
##$ALPHA= 0
##$AQORDER= 0
##$ASSFAC= 0
##$ASSFACI= 0
##$ASSFACX= 0
##$ASSWID= 0
##$AUNMP= <proc_1d>
##$AZFE= 0.1
##$AZFW= 0.1
##$BCFW= 1
##$BC_mod= 2
##$BYTORDP= 1
##$COROFFS= 0
##$CY= 11.3945322036743
##$DATMOD= 1
##$DC= 2
##$DFILT= <>
##$DTYPP= 0
##$F1P= 18.9103706918063
##$F2P= -1.10871071338519
##$FCOR= 0.5
##$FTSIZE= 0
##$FT_mod= 4
##$GAMMA= 1
##$GB= 0.15
##$INTBC= 1
##$INTSCL= 1
##$ISEN= 128
##$LB= 0.24
##$LEV0= 0
##$LPBIN= 0
##$MAXI= 10000
##$MC2= 0
##$MEAN= 0
##$ME_mod= 0
##$MI= 1.114404
##$NCOEF= 0
##$NC_proc= 0
##$NLEV= 6
##$NOISF1= 3.799351
##$NOISF2= 2.8
##$NSP= 1
##$NTH_PI= 0
##$NZP= 0
##$OFFSET= 15.70392
##$PC= 1
##$PHC0= -8498.115
##$PHC1= 6.200191
##$PH_mod= 1
##$PKNL= yes
##$PPARMOD= 0
##$PSCAL= 0
##$PSIGN= 0
##$REVERSE= no
##$SF= 200.130013532006
##$SI= 16384
##$SIGF1= 3
##$SIGF2= 2
##$SINO= 400
##$SIOLD= 16384
##$SREGLST= <1H.CDCl3>
##$SSB= 0
##$STSI= 0
##$STSR= 0
##$SW_p= 3612.71676300578
##$SYMM= 0
##$S_DEV= 0
##$TDeff= 0
##$TDoff= 0
##$TI= <>
##$TILT= no
##$TM1= 0
##$TM2= 0
##$TOPLEV= 0
##$USERP1= <user>
##$USERP2= <user>
##$USERP3= <user>
##$USERP4= <user>
##$USERP5= <user>
##$WDW= 1
##$XDIM= 8192
##$YMAX_p= 0
##$YMIN_p= 0
$$ End of Bruker specific parameters
$$ ---------------------------------
##NTUPLES= NMR FID
##VAR_NAME=  TIME,          FID/REAL,        FID/IMAG
##SYMBOL=    X,             R,               I
##VAR_TYPE=  INDEPENDENT,   DEPENDENT,       DEPENDENT
##VAR_FORM=  AFFN,          ASDF,            ASDF
##VAR_DIM=   8192,          8192,            8192
##UNITS=     SECONDS,       ARBITRARY UNITS, ARBITRARY UNITS
##FACTOR=    0.0002004,     1,               1
##FIRST=     0,             0,               0
##LAST=      1.6414764,     0,               0
##MIN=       0,             -381568,         0
##MAX=       1.6414764,     271361,          0
$$ Real data points
##PAGE= N=1
##DATA TABLE= (X++(R..R)), XYDATA
$$ [...]
1918i12M0J365L81k4j03n23m46k58o93P87J063N56n14r51o88j1P2L05J139M11
$$ -912 -872 493 874 850 747 224 -222 -480 -1173 -386 677 1233 719 -232 -920 -931 -859 -554 585 996
1938I96l98o52j36p00J39k37J029J016k29p50m20j18k07l98M31J516L38n99q13
$$ 996 598 -54 -190 -890 -751 -988 41 1057 828 78 -342 -460 -667 -1065 -634 882 1220 621 -192
1957a92r74L57Q73nJ40P43jp80p33j72L33N45k4K58L25r0o32q14L22K5J073J85
$$ -192 -1166 -809 64 59 199 942 941 161 -572 -744 -411 134 110 368 693 603 -29 -843 -521 -496 577 762
1979G62K19o55n91o36J31M02L30M51k40K11j81j130m26P70P64N13k98k51J49k76
$$ 762 981 326 -265 -901 -770 -368 -38 413 173 384 203 -927 -1353 -583 181 694 396 145 294 18
1999A8q02l44K74J359P14n60n61q03K64j41M35Q46j57M28n08k65n57j30J78O87
$$ 18 -784 -1128 -854 505 1219 659 98 -705 -441 -582 -147 699 542 970 462 197 -360 -490 -312 375
2019C75P79l84r86L39%k03m60k28J423P34p41j168n00N22M87Q7J12J31K91j042
$$ 375 1154 770 -216 123 123 -80 -540 -768 655 1389 648 -520 -1020 -498 -11 76 188 319 610 -432
2039d32j65Jl5O03L14j59qq8m88j69j68M60j8P12N25o66n46q47J91P84M28n5K74
$$ -432 -597 -596 -631 -28 286 127 119 31 -457 -626 -794 -334 -352 360 885 219 -327 -1174 -983 -199 229 174 448
2062D48L62l95o08o25M19R74L60j72L5l52n32k54M6J46O33N22j50l61n50o03J66
$$ 448 810 415 -193 -818 -399 575 935 763 798 446 -86 -340 -294 -148 485 1007 857 496 -54 -657 -491
2083d91O71L31L27m93k62l53M77r06n2Q55K84J20k20l43o4m38j03k13J389L90
$$ -491 180 511 838 345 83 -270 207 -699 -751 104 388 508 288 -55 -119 -557 -660 -873 516 906
2103I06p19p69o6K08j05M95OO46j25j24j269N25p0J67M36L57j9Q1m53o39L42J6
$$ 906 187 -582 -648 -440 -545 -50 -44 602 477 353 -916 -391 -461 -294 142 499 480 561 108 -531 -189 -173
2125a73J70M55L67p2q61l20l6N44J00j26N84o3kj104p2M54N09J08l22J89k2Q4
$$ -173 -3 452 819 747 -114 -434 -470 74 174 48 632 569 567 -537 -609 -155 354 462 140 329 307 391
2147C91q56j96K70O24N24q1n63l92l35K57L30M38j65r6K2j61j66n94J51L16P12
$$ 391 -465 -661 -391 233 757 676 113 -279 -614 -357 -27 411 246 150 172 11 -155 -749 -598 -282 430
2168D30M7m31j95J05M8q65L57J189N39p23l83p78P5O97j80J62L34m8J22k68m60
$$ 430 477 46 -149 -44 4 -861 -504 685 1224 501 118 -660 -585 112 -68 94 428 380 502 234 -226
2189b26m9q9L16O32p6m73l93j02K00p4Q0J52O85J6q72r57M87N37L55M6l50N14
$$ -226 -275 -364 -48 584 508 35 -358 -460 -260 -334 -254 -102 583 599 -273 -1230 -743 -206 149 195 -155 359
2211C59j35k79n62k2N21K52lL24j47l86l43N9L38k8M15K45k46l14n91K34K96M72
$$ 359 224 -55 -617 -639 -118 134 131 455 308 -78 -421 -362 -24 -52 363 608 362 48 -543 -309 -13 459
2233D59pl0k86L28j76o09m18R32N95n9k14l88M8k29j58j58P18K28m73N4m22k3
$$ 459 452 422 136 464 288 -321 -739 193 788 729 515 127 175 -54 -212 -370 348 576 103 157 -265 -288
2255b88p3J94L36oL4k47j31M1l67J81j82N44L26l25n47j04J91Q1J4M67K31j82
$$ -288 -361 -167 169 163 197 -50 -181 -140 -507 -326 -508 36 362 37 -510 -614 -423 -342 -328 139 370 188
2277A88p8o34k10Q54q2K51j20J43L6m42l97N03J53j73J35K06n5J1n01L3q0N15
$$ 188 110 -524 -734 120 38 289 169 312 348 -94 -491 12 165 -8 127 333 278 289 -212 -179 -259 256
2299B56L54j4r7l55l03J35k6P37l77k94K73O0l01m26r3L11P00m84j9k33N83p89
$$ 256 610 596 499 144 -159 -24 -50 687 310 16 289 349 48 -378 -471 -160 540 56 37 -196 387 -402
2321d02l24K91L82K96N3p79J12r4LL05K39p0J27l87J3jM4k27K10M65J76k98k28
$$ -402 -726 -435 -53 243 296 -483 -371 -465 -462 -157 82 12 139 -248 -235 -236 -192 -419 -209 256 432 134 -94
2344i4j37J01j02N3M88L30l19j92m81J08L79j2n0K76k12k98K7l4q6M26k69J71
$$ -94 -231 -130 -232 -179 309 639 320 128 -353 -245 134 122 72 348 136 -162 -135 -169 -255 171 -98 73
2366G3K19N0m42l48qL38lK01J77N20p71o00J72M89M86n35R2P0J72k64n94l7N36
$$ 73 292 342 -100 -448 -456 -118 -121 80 257 777 6 -594 -422 67 553 18 110 180 352 88 -506 -543 -7
2389gL31k87J23K02j6m36m74M17N18k7J48m23J7j97l2P7J57J14j92J99j79o7k85
$$ -7 324 37 160 362 346 -90 -564 -147 371 344 492 69 86 -111 -143 -66 91 205 13 212 33 -34 -319
2412c19K08m6M95k15j90j80L25k42l38J96K06R96o83n86k07M9Q23l30l56L14K77
$$ -319 -111 -157 338 123 -67 -247 78 -164 -502 -306 -100 896 213 -373 -580 -531 292 -38 -394 -80 197
2433A97j51n3j05k84J36M72m23O02k29K0l00l5K70k14K37M84j51o35j82j2N88
$$ 197 46 -7 -112 -396 -260 212 -211 391 162 182 -118 -153 117 -97 140 624 473 -162 -344 -356 232
2454B32L87l38m10M37L41p1r41L10J79J27K98j84k28Jl28k44K09K69J21j25J0
$$ 232 619 281 -129 308 649 578 -363 -53 126 253 551 367 139 140 -188 -432 -223 46 167 42 52
2475E2l0j88p3L87J10j84l08l6P72l68p47p0O02L11J50k52l45JK61l94P0K45K85
$$ 52 22 -166 -239 148 258 74 -234 -270 502 134 -613 -683 -81 230 380 128 -217 -216 45 -349 -279 -34 251
2498B51J55n74q8K1M1M51Q5l93K23k75rJ86k80j14L41K38J17k41N9l95L24K1j24
$$ 251 406 -168 -256 -235 -194 257 342 -51 172 -103 -112 74 -206 -320 21 259 376 135 194 -201 123 144 20
2521B0N74j81K4n37q3J08J61J47k42P6K21j74j80J8k79L51J10n23M07K64l07k32
$$ 20 594 413 437 -100 -183 -75 86 233 -9 67 288 114 -66 -48 -327 24 134 -389 18 282 -25 -257
2543b57l0K24J08J1k3J94k09j39k21L87n5R3r8p5Jm2L11k73J94M7p9J32n1k3j09
$$ -257 -287 -63 45 56 33 227 18 -121 -342 45 -10 83 -15 -90 -89 -131 180 -93 101 148 69 201 150 127 18
2568A8k95Q4j63P99k95k32l76L43K63k0j43j03O1NJ98j11k28N3J52M24k68n1k11
$$ 18 -277 -193 -356 443 148 -84 -460 -117 146 126 -17 -120 -59 -54 144 33 -195 -142 10 434 166 115 -96
2591i6K20J11l12K49j69N44m07L2q81O07K04L32m89k90N56j6l10R8k56L14J33
$$ -96 124 235 -77 172 3 547 140 172 -709 -102 102 434 -55 -345 211 195 -115 -17 -273 41 174
2612A74J49l46j29j18L71k2Q4N6j66K51J63l51m26R0K22K41L40n89J48j63n3N
$$ 174 323 -23 -152 -270 101 79 163 219 53 304 467 116 -310 -220 2 243 583 -6 142 -21 -74 -69
2634f9m13J33O49%r5k32m44M00n8K66l57K10K05m43J66n4k53M60k3P6m36J23L49
$$ -69 -482 -349 300 300 205 -27 -471 -71 -129 137 -220 -10 195 -248 -82 -136 -389 71 48 124 -312 -189 160
2657A60K45q29K69j15K18M05k04m80r4K56L21o2j86K49o8r6N6J10j06L6j24ML3
$$ 160 405 -424 -155 -270 -52 353 149 -331 -425 -169 152 90 -96 153 85 -11 45 155 49 85 -39 -35 -2
2680bOK48k97J08k51N9M20j34R1m67K50N7J1k06%J08RK0k05m7O8M18j49k71K62
$$ -2 4 252 -45 63 -188 -129 291 157 248 -219 31 88 99 -107 -107 1 10 30 -175 -222 -154 264 115 -156 106
2705A06q6j08j54l9J71M99m86M64k82p1k49nJ61l9oL04j94O7Lr5P6o7J15Q2L66
$$ 106 20 -88 -242 -281 -110 389 -97 367 85 14 -235 -240 -79 -118 -124 180 -14 53 56 -39 37 -30 85 167 533
2730E33n57k09J56J46P7J5L24n57K22n66O23k63j74K30J02K98j77j75L13k34j1
$$ 533 -24 -233 -77 69 146 161 485 -72 150 -416 207 -56 -230 0 102 400 223 48 361 127 116
2751A16k93qK78j00Jj40J49O4j99N3N0Q5M11l92j46j81L04J40k4O8m25j32J19
$$ 116 -177 -185 93 -7 -6 -146 3 67 -132 -79 -29 56 467 75 -71 -252 52 192 168 236 -189 -321 -202
2774b02K39K23j85j72J34n7K98m43J10Q7n1O3J74m23L32K20o32p3K74K57pQ2k15
$$ -202 37 260 75 -97 37 -20 278 -165 -55 32 -19 44 218 -205 127 347 -285 -358 -84 173 166 248 33
2797C3j96K43P1j68J64l05M3O9j22L77k03j82L19M93o84j45M86j26j48j79K77
$$ 33 -163 80 151 -17 147 -158 -115 -46 -168 209 6 -176 143 636 -48 -193 293 167 19 -160 117
2818A17q8J68j16k05k7j32K13J64l5j61n1J44n2J08k14oK63J82OK98p55J94P1
$$ 117 29 197 81 -124 -151 -283 -70 94 59 -102 -153 -9 -61 47 -167 -173 90 272 278 576 -179 15 86
2841H6J30J0l02J25l5J7j12j19M00l84p1J17P0j33j31P9j94M48j92K0J68N1j82
$$ 86 216 226 -76 49 14 31 -81 -200 200 -184 -255 -138 -68 -201 -332 -253 -447 1 -191 -171 -3 48 -134
2864a34q2k63L50j56J59J1o1L6K8j99K07O6J72j95J08O2k10jK09j92K73j55j46
$$ -134 -216 -479 -129 -285 -126 -115 -176 -140 -112 -311 -104 -38 134 -61 47 109 -101 -102 107 -85 188 33 -113
2887a13J28k29K65k05R2M85k48j86P2n5L6l04O40q3l4m17K77k96M07k53l37j3
$$ -113 15 -214 51 -154 -62 423 175 -11 61 6 42 -262 378 295 261 -156 121 -175 232 -21 -358 -371
2909c71M55J21k68j26R9J36K48l11rQ2L9Mq7m03K10jJ82N0k86L59j26k57J20j24
$$ -371 84 205 -63 -189 -90 46 294 -17 -26 56 95 99 12 -391 -181 -182 0 50 -236 123 -3 -260 -140 -264
2933b64O7J15K57r2q0n3j03P2L2N08l85l77K45J20P9j42j00J49J18q3k05J89j37
$$ -264 -197 -82 175 83 3 -50 -153 -81 -49 459 74 -303 -58 62 141 -1 -101 48 166 83 -122 67 -70
2956g0o4K13M2l21J44O7j00J7K62j54j20K31o45N92j36j39K64q8R1l40K99P4j04
$$ -70 -134 79 121 -200 -56 11 -89 -72 190 36 -84 147 -498 94 -42 -181 83 -5 86 -254 45 119 15
2979A5l37J01L1L08j5Q4j67J09l70R7J29O0m3r5J36k87K87J18j27K50o45K25L63
$$ 15 -322 -221 -190 118 103 187 20 129 -241 -144 -15 45 2 -93 43 -244 43 161 34 284 -361 -136 227
3002B27P2j08j86k61L26J4J0k8J15J72n38J2J57q4J67j3p0oj54K30K4J0j43K4
$$ 227 299 191 5 -256 70 84 94 66 181 353 -185 -173 -16 -100 67 54 -16 -22 -176 54 78 88 -55 -31
3026c1K28k85J9j66K66j82M58j01k19l66M91j15m3P0J55q8j19j04r1J91P9J61
$$ -31 197 -88 -69 -235 31 -151 307 206 -13 -379 112 -3 -46 24 179 91 -28 -132 -223 -32 47 208
3048B08k08K47k25j83K14R9l4Q0k21N22m41J10m12J52K26r2j36j55O10k98L92
$$ 208 0 247 22 -161 53 152 118 198 -23 499 58 168 -244 -92 134 42 -94 -249 361 63 455
3069D55m32k7j99K03K39l22k8M3K14k84j58Q4R5K58K43m67J87l43M89o5o5j49
$$ 455 23 -4 -203 0 239 -83 -111 -68 146 -138 -296 -212 -117 141 384 -83 104 -239 250 185 120 -29
3091b9J04N8rj50j55K63L1J86k56K36k38j16L41l15j04J02L85P6l56r7j62L34
$$ -29 75 133 124 -26 -181 82 113 299 43 279 41 -75 266 -49 -153 -51 334 410 54 -43 -205 129
3113A29K57m73L81k09lkj60K59j73K28l40j20L01r9K38p2l37J16O6J29L9j53j03
$$ 129 386 -87 294 85 82 80 -80 179 6 234 -106 -226 75 -24 214 142 -195 -79 -13 116 155 2 -101
3136a01o0K34Nj26k61J8K04Q1r8J21k15K00j58OJ61K43o8k08J22j97K39k1O1k4
$$ -101 -161 73 78 -48 -309 -291 -87 -6 -104 17 -198 2 -156 -150 11 254 186 -22 100 -97 142 121 182 158
3160A58m38L18K48l20k9q9J41J47N9m05J23P6o9K29N4l12J06j87L93j51j16J07
$$ 158 -280 38 286 -34 -63 -152 -11 136 195 -210 -87 -11 -80 149 203 -109 -3 -190 203 52 -64 43
3182D3j08J4K4R5j57L02j81j25M71m65k2rJ54p3K13k64l04N22r0p5P3k14J81L59
$$ 43 -65 -51 -27 68 -89 213 32 -93 378 -87 -109 -118 36 -37 176 -88 -392 130 40 -35 38 -176 5 364
3206C64n77K79k70R2K79j33j28J49k49O36m74J36k36K74J96o55M28j32j90P51
$$ 364 -213 66 -204 -112 167 34 -94 55 -194 442 -32 104 -132 142 338 -317 111 -21 -211 540
3226E40m39m3l23L58J6l26M31l26j10P54j47m29j63L13K20n75M13n78L46L22l0
$$ 540 101 58 -265 93 109 -217 214 -112 -222 532 385 -44 -207 106 326 -249 164 -414 -68 254 224
3247B24m73L82j23J18O3n22O3M64n7j5r6n6j51J99K12j23O9j26J03J14l74R9J07
$$ 224 -249 133 10 128 191 -331 -268 196 139 124 28 -28 -179 20 232 109 178 52 155 269 -105 -6 101
3270A01o2l17L2q3O64j27k40K16m35J49K25Q7j26np6N52l91j10l9J22J13n6n13
$$ 101 39 -278 -246 -329 335 208 -32 184 -251 -102 123 210 84 79 3 555 164 54 15 137 250 194 -319
3293c19K87k0J93k83O4J67l07L63l67R3K83rj60J30N3m45M33J00k14p5n7j0L00
$$ -319 -32 -52 141 -142 -78 89 -218 145 -222 -129 154 145 -15 115 168 -277 156 256 42 -33 -90 -100 200
3316B00k17k16L70J22J54n26r6K9J65J76r3n8P9Q2J8k34K09k38M1L80l82P9Ml
$$ 200 -17 -233 137 259 413 -113 -209 -180 -15 161 68 10 89 171 189 -45 164 -74 -33 347 -35 44 48 45
3340D5J31l40L26n4q3k20K10j86K43l6Q4j35k66L37k46L09M4j22l11J02J63m8
$$ 45 176 -164 162 108 25 -195 15 -171 72 36 120 -15 -281 56 -190 119 163 41 -270 -168 -5 -53
3362e3J41j26N5k4P9j49l4k33N56p3n2j72N1j22K31o9P1m2j29J64k90N2K80j73
$$ -53 88 -38 17 -7 72 -77 -111 -344 212 139 87 -85 -34 -156 75 6 77 35 -94 70 -220 -168 112 -61
3386f1j30k4Q0L00j47R1K29m11J93p7j2K2J4j02r3p8J66K14j82N5O0J37j66J3
$$ -61 -191 -215 -135 165 18 109 338 -73 120 43 31 53 67 -35 -128 -206 -40 174 -8 47 107 244 78 91
3410I1mm47K17J20j90M68l77N8N7O8q1J17J67n24K63J4k1o3qK52r1l6J38l05M19
$$ 91 87 -360 -143 -23 -213 255 -122 -64 -7 61 -20 97 264 -260 3 17 -4 -67 -75 177 86 50 188 -117 302
3435C02n24L24Po8j56k04M41k55k3J03PM5n3K67m50K33J04n7k1J11j9j48K57k09
$$ 302 -222 102 109 41 -115 -319 122 -133 -156 -53 -46 -1 -54 213 -237 -4 100 43 22 133 114 -34 223 14
3459A4j25N1j28J95k3O6k29J98k17K21k03K03K95l56J30l6L1k18J13J16k9k07
$$ 14 -111 -60 -188 7 -16 50 -179 19 -198 23 -180 23 318 -38 92 56 87 -131 -18 98 69 -138
3481a38J11j89M62k79j24L40o9J25l01j28L12k84J55L3j00j92M04Q8m07J65J1
$$ -138 -27 -216 246 -33 -157 183 114 239 -62 -190 122 -162 -7 26 -74 -266 138 226 -181 -16 -5
3502eM34n70J14J20j49K17Nk77J95j11P6n0M3m10J25L70j36j70K47k16K49j50
$$ -5 429 -141 -27 93 -56 161 166 -111 84 -27 49 -1 42 -368 -243 127 -9 -179 68 -148 101 -49
3524d9K87k72j53J13M49l48K9KM7r3Q1Qj80J41l01J80L69k06N5q2k4L6n1J86k78
$$ -49 238 -34 -187 -74 375 27 56 58 105 12 93 101 -79 62 -239 -59 310 104 159 77 53 89 38 224 -54
3549e4p8K94j87J40k93K32l27J52L34j41r9j81N13l93J31J26q0j05m0M6L43n03
$$ -54 -132 162 -25 115 -178 54 -273 -121 213 72 -27 -208 305 -88 43 169 89 -16 -56 -10 333 -170
3571a70J32J55k61J87l90K47j46M02l1J02j55k6O7l4r2o8j93K22j11K76l03J13
$$ -170 -38 117 -144 43 -347 -100 -246 156 125 227 72 46 113 79 -13 -81 -274 -52 -163 113 -190 -77
3593g7j37P3K33j04M2N6j57J31J32l34K16O9j25K88Pk62J20p5L6o0M4j56L08R9
$$ -77 -214 -141 92 -12 30 86 -71 60 192 -142 74 143 18 306 313 51 171 96 132 72 116 -40 268 367
3617C67l63M3R8j51jJ68r4J02j32Q5qn14K62L05k41K5p7n5K65O1r7j83L78L0m51
$$ 367 4 47 145 -6 -7 161 67 169 37 122 114 -400 -138 167 -74 -49 -126 -181 84 145 48 -135 243 273 -178
3642a78L09m08K30J45m1k35K89k23n4J78k88J63J90J3q1K30o7j07J65j97j22o5
$$ -178 131 -277 -47 98 57 -178 111 -112 -166 12 -276 -113 77 90 9 239 172 65 230 33 -89 -154
3664a54kJ72J5J05j43p6J28J72k88o0j27L32Ll4j74N13l86O7j7m1K22k10o8L35
$$ -154 -156 16 31 136 -7 -83 45 217 -71 -131 -258 74 77 43 -131 382 -4 63 46 5 227 17 -51 284
3688B84n85K55k44L35J39l61L6r6L00J28j77J62j89J71k88l16M94K5J2M3o09N57
$$ 284 -301 -46 -290 45 184 -177 -141 -237 63 191 14 176 -13 158 -130 -446 48 73 85 128 -481 76
3710G6N8k63QL54j79J65q2l60L33j47K83J7m52NK72N8j38k07L02j58K77m52J01
$$ 76 134 -129 -121 233 54 219 137 -223 110 -37 246 263 -189 -184 88 146 8 -199 103 -55 222 -230 -129
3733a29j46J43j0L38j42K10l61j57J36K63j56J58j77M19m86O0J15k0p0J83k08
$$ -129 -275 -132 -142 196 54 264 -97 -254 -118 145 -11 147 -30 389 -97 -37 78 58 -12 171 -37
3754c7J39o8j26nR1J43j79j27R1K77j77K23l05K60l53L80N2m0m52J49k59N82j72
$$ -37 102 34 -92 -97 -6 137 -42 -169 -78 199 22 245 -60 200 -153 227 279 239 -213 -64 -323 259 87
3777H7J01r0l34M22Jl24J47j23K28m26M48j62Q6R6l39N2K07j36j99M26l07K43
$$ 87 188 98 -236 186 187 -137 10 -113 115 -311 137 -25 61 157 -182 -130 77 -59 -258 168 -139 104
3799A04k2R0n27K97K6k0R5J72m66K50J93k50J94j85J05o0o6L5j48K22J51j47j73
$$ 104 82 172 -355 -58 -32 -52 43 215 -251 -1 192 -58 136 -49 56 -4 -70 -35 -183 39 190 43 -130
3822a30r8K75R3l3r4K05m35L68k32Q3q3Q1p0J46N6k88K50k68J2M83n15K34j04
$$ -130 -228 47 140 107 13 218 -217 151 -81 2 -81 0 -70 76 132 -156 94 -174 -162 321 -194 40 -64
3845f4j98L58Q4Pl07m8R0N5j06K45J50l92J05L5Rjj36L42m06K62l18J2K09P7k92
$$ -64 -262 96 180 187 -120 -168 -78 -23 -129 116 266 -126 -21 14 23 22 -114 228 -178 84 -234 -222 -13 64 -228
3870b28J24k09L25k48M59k01l21K80O4P2j46K3j37K53k10l23K45j45L95m3j19
$$ -228 -104 -313 12 -236 223 22 -299 -19 45 117 -29 -6 -143 110 -100 -423 -178 -323 72 29 -90
3891i0j90L91KJ06l14J98j53Q2j53k65J51M01M3J00k75j05J5J35q3J79l65L86
$$ -90 -280 111 113 219 -95 103 -50 32 -121 -386 -235 166 209 309 34 -71 -56 79 -4 175 -190 196
3913A96M0R3m68R7k1J63L7l05M63r1j70k21O2K21r8k17J37K15P0p4J79j18j67
$$ 196 236 329 -139 -42 -63 100 137 -168 295 204 34 -187 -125 96 -2 -219 -82 133 203 129 308 190 23
3936B3k54k9L83j55Q5pM4l61L94m2j9j80J56J44K5l07J86P2k41p9J44J32j61Q6
$$ 23 -231 -260 123 -32 53 46 90 -271 123 81 62 -118 38 182 207 -100 86 158 -83 -162 -18 114 -47 39
3960C9j43J80l65M55k74K04j81K65k0j37L13k93rJ83n52K34L17j45k47L51k18
$$ 39 -104 76 -289 166 -108 96 -85 180 160 23 336 43 34 217 -335 -101 216 71 -176 175 -43
3981d3j04O4J97k69L8L09l82L47l31P9okJ64p8l2J83j48K48k63R1J3J63J27m50
$$ -43 -147 -83 114 -155 -117 192 -190 157 -174 -95 -101 -103 61 -17 -49 134 -14 234 -29 62 75 238 365 -85
4005h5mJ41m1k53K93k89K46j06J89j53J12K49m02k82L03K45J40m06Q9k71L80K2
$$ -85 -89 52 11 -242 51 -238 8 -98 91 -62 50 299 -103 -385 -82 163 303 -103 -14 -285 95 117
4027A17l09P7J64k17P0j8K00j51j08J44j70Q2m0O0J9K04k27lK68L3j94J76k76
$$ 117 -192 -115 49 -168 -98 -116 84 -67 -175 -31 -201 -119 -159 -99 -80 124 -103 -106 162 195 1 177 -99
4050i9J32j85J060r81N5Q1o7j83J61J15o6l75L56J39k0j35j32L67j85M9p5K01
$$ -99 33 -152 908 -73 -18 63 -4 -187 -26 89 23 -352 4 143 123 -12 -144 223 38 87 12 213
4072B13Qm84K51l7j30N68j87k16J14J76m90M74l08J16J10l30J89k18J44K18J8
$$ 213 221 -263 -12 -49 -179 389 202 -14 100 276 -214 260 -48 68 178 -152 37 -181 -37 181 199
4093A99j47k31J94j26k73K08l6K17o6P2j78K1L06m30L56k16Q8J52j48j8J71l64
$$ 199 52 -179 15 -111 -384 -176 -212 5 -61 11 -167 -146 160 -270 86 -130 -42 110 -38 -56 115 -249
4115b49N35l32K36j23k32K53k1j17j29pK27j40K59r9l1K0j33j58J48J8k47L51
$$ -249 286 -46 190 67 -165 88 67 -50 -179 -186 41 -99 160 61 30 50 -83 -241 -93 -75 -322 29
4137B9n6L6k56K78j26j9j56K22p3L24k54J79k65J17k24p4L18K24k36R2Q2k48j03
$$ 29 -27 9 -247 31 -95 -114 -270 -48 -121 203 -51 128 -137 -20 -244 -318 0 224 -12 80 162 -86 -189
4160a89J61K02l65M92l56K65J63o84K99j50J55K13J05r4n0l96J01J82r9LK9J3
$$ -189 -28 174 -191 301 -55 210 373 -311 -12 -162 -7 206 311 217 167 -229 -128 54 -45 -42 -13 0
4182@J00P3l76J38j42J68oJ40n8m0j50n0L84k39o4j60K31n2N0M1j23M12m87K8
$$ 0 100 173 -203 -65 -207 -39 -45 95 37 -3 -153 -203 181 -58 -122 -282 -51 -103 -53 -12 -135 277 -210 -182
4206a82J9K18k28k5J11J2k57J66K00o8N1P3K8j24j05L19M1J02o78j07O04P3m91
$$ -182 -163 55 -173 -198 -87 -75 -332 -166 34 -34 17 90 118 -6 -111 208 249 351 -327 -434 170 243 -248
4229b48K96j44K31j15l85O39k86J32j65p6K0M90k70l74K59j2L43k06j95L15l71
$$ -248 48 -96 135 20 -365 274 -12 120 -45 -121 -101 389 119 -255 4 -8 335 129 -66 249 -122
4250a22K50qk31m1K78p9P3p56M77J98J20j42k7R8J3m59L65K01m12M3J18j65J56
$$ -122 128 120 -111 -152 126 47 120 -636 -159 39 159 17 -10 88 101 -358 7 208 -204 -161 -43 -208 -52
4273e2j05L14n5o7J38j03J4N8q4J25k15L1l8L3j07p2K11L6j11j00J59k17L5J54
$$ -52 -157 157 102 35 173 70 84 142 58 183 -32 -1 -39 -6 -113 -185 26 62 -49 -149 10 -207 -172 -18
4297a8L3l54O12j55k76J48J07j16R5k39J87K12j47k27L09m58K95K66l82n2K17
$$ -18 15 -339 273 118 -158 -10 97 -19 76 -163 24 236 89 -138 171 -287 8 274 -108 -160 57
4318E7j94J82O7j88n0K61p4K29k00m3r3K7j21R7k9J83j0k52j21J15J28jO4m5J9
$$ 57 -137 45 112 -76 -126 135 61 290 90 47 -46 -19 -140 -43 -72 111 101 -151 -272 -157 -29 -30 34 -11 8
4343HJ15J72j41j3j38k90M45l1r8l7j87L3j21K03Qj84J89K05l06J60j37Q7K45
$$ 8 123 295 154 141 3 -287 158 127 29 -8 -195 -162 -283 -80 -72 -256 -67 138 -168 -8 -145 -58 187
4366A87j19j30J38j10k12J96O6j64o4L74q1j64K6l6K80l06L48m40K77j06j17L38
$$ 187 68 -62 76 -34 -246 -50 16 -148 -212 162 81 -83 -57 -93 187 -119 229 -211 66 -40 -157 181
4388A81k06j23J35J84l15L85k60l7r4k2K31k14K0J37k4M74p72L79L4k29J84R4
$$ 181 -25 -148 -13 171 -144 241 -19 -56 -150 -172 59 -155 -135 2 -22 452 -320 59 93 -136 48 142
4410A42l43L39p2l89L57j81J44K32L7j14k15J34k20L22K65k48j37l18N4L79l19
$$ 142 -201 138 66 -323 34 -147 -3 229 266 152 -63 71 -149 173 438 190 53 -265 -211 168 -151
4431a51N0M34k11j43K20k40K76l17K16j77L1J94k32J41K7j68j02J94M2j01j02
$$ -151 -101 333 122 -21 199 -41 235 -82 134 -43 -12 182 -50 91 118 -50 -152 42 84 -17 -119
4452a19L10l65L43jk91o4K35J91m09L76Q3l29rr0L9J23j89M39n51L31K6k09J53
$$ -119 191 -174 169 168 -123 -187 48 239 -170 206 289 -40 -49 -139 -100 23 -166 273 -278 53 79 -130 23
4475B3j5N5M4K11o03J83J31K1j19K85j66n6L9L6k02Q5J69k30J90K47J30m23k68
$$ 23 8 63 107 318 -285 -102 29 50 -69 216 50 -6 33 69 -133 -48 121 -109 81 328 458 35 -233
4498b33M23l71o5M0L90M1l90O7op1L79n03K63M5P6p8L06m40J4J8J25J43m6p0r9
$$ -233 190 -181 -246 -206 184 225 -165 -98 -104 -175 204 -299 -36 9 85 7 313 -127 -113 -95 30 173 127 57 -42
4523d2K05k35J32j21l3j77J64j97M08q7l30L19n54N41rM4J0q9r7J82o5l0M2J5
$$ -42 163 -72 60 -61 -94 -271 -107 -304 104 17 -313 6 -548 -7 -16 28 38 -51 -148 34 -31 -61 -19 -4
4547dj88K13j23J19O0l35K33j84j23L64p5nK17r1j48K95k22k19M74m0N2k87j43
$$ -4 -192 21 -102 17 77 -258 -25 -209 -332 32 -43 -48 169 78 -70 225 3 -216 258 218 270 -17 -160
4570a60o8L43j18K18l45L46J5n3j60l5O4oj2k15J32J89l35K93J9m0j98O9J02j81
$$ -160 -228 115 -3 215 -130 216 231 178 18 -17 47 41 29 -186 -54 135 -200 93 112 72 -126 -57 45 -136
4594a36P3K11j75J49k48j09K10k9k7J32O4k20j0J31l5N2j0o8o6K31j89j42R1L13
$$ -136 -63 148 -27 122 -126 -235 -25 -54 -81 51 115 -105 -115 16 -19 33 23 -45 -111 120 -69 -211 -120 193
4618A93l30J78l4Jj07P8Q0j85R2l1l9mN0K19m32L19m0J68Rl19K8J99j06J60k86
$$ 193 -137 41 7 8 -99 -21 59 -126 -34 -65 -104 -108 -58 161 -271 48 8 176 185 -134 -106 93 -13 147 -139
4643a39J42j59K8K86l80L33j42J11o8J0kJ2k97nL44p9j31n6J21K60k43J9j59n2
$$ -139 3 -156 -128 158 -222 111 -31 80 12 22 20 32 -265 -270 74 -5 -136 -192 -71 189 -54 -35 -194 -246
4667b46K1J64J33N9j16k07L84J8m42L0r8J79J33J12K1k24j86K21j06J87J83j38
$$ -246 -225 -61 72 131 15 -192 192 210 -232 -202 -300 -121 12 124 145 -79 -265 -44 -150 37 220 82
4689H2j6R7k20K38l34J94J01J0j31J7k71L60L4o6l23K29P1l9L9m95K55M75k75
$$ 82 66 163 -57 181 -153 41 142 152 21 38 -233 127 161 95 -228 1 72 33 72 -423 -168 307 32
4712C2r5j69M8N5L94k10m7J23k09K08k63L87l84j29K54N9k93J38J18m75N85q1
$$ 32 -63 -232 -184 -129 265 55 8 131 -78 130 -133 254 -130 -259 -5 54 -239 -101 17 -458 127 46
4734D6J20k30j07q8L8J0J38K58j59k75J35K44P1j09l91k23N08P3j10j60K94k27
$$ 46 166 -64 -171 -259 -221 -211 -73 185 26 -249 -114 130 201 92 -299 -522 -14 59 -51 -211 83 -144
4756a44J30J55m04rL45k39J80L8J49J68l36j15J31k14K31j86K8J1q0L75k99K63
$$ -144 -14 141 -263 -272 73 -166 14 52 201 369 33 -82 49 -165 66 -120 -92 -81 -161 214 -85 178
4778A78k41M23m35K24k76K48r3L0j19m2L87n33K91j66J86n9J12m65K02L55l1j52
$$ 178 -63 360 -75 149 -127 121 28 58 -61 -103 284 -249 42 -124 62 3 115 -350 -148 207 176 24
4800B4k04L48k79k53K89J69k39j92K68l2j95j79M87o8mk66L43p6K36k16Q8j10
$$ 24 -180 168 -111 -364 -75 94 -145 -337 -69 -101 -296 -475 12 -56 -60 -326 17 -59 177 -39 49 -61
4822f1J02L0J1k36o0Q0O1K9M8k89L27l29L67n3N4r5L13r4lK2k60p7J64q8J52J2
$$ -61 41 71 82 -154 -214 -134 -73 -44 4 -285 42 -287 80 27 81 -14 299 205 202 224 -36 -113 51 -37 115 127
4848A27k50J0J90m8k82L27r4p9J57k10L9J00M8j70O3R5j70P6L85m86k3N02k44
$$ 127 -123 -113 77 29 -253 74 -20 -99 58 -152 -113 -13 35 -135 -72 23 -147 -71 314 -172 -195 307 63
4871F3K05l9m03K34O9J17k47J1j10K14K42k17l21K40n9J43l7k6O8k09R5j75J81
$$ 63 268 229 -174 60 129 246 -1 10 -100 114 356 139 -182 58 -1 142 105 79 147 -62 33 -142 39
4894C9k95K33j89J63j77L93k39J79J43j25k73J74P3k42J07J76j95PK23l56N17
$$ 39 -256 -23 -212 -49 -226 167 -72 107 250 125 -148 26 99 -143 -36 140 -55 -48 175 -181 336
4915C36o12L63M7k98K04j75K00k14K89j33J09j58J52o7p0j73N36j89j66J33k69
$$ 336 -276 87 134 -164 40 -135 65 -149 140 7 116 -42 110 43 -27 -200 336 147 -19 114 -155
4936a55K60j69O6J1K73n37K51J22l7j21K70q1m35N62m31L92l91L01k7J05j90K24
$$ -155 105 -64 2 13 286 -251 0 122 85 -36 234 153 -282 280 -151 241 -150 151 124 229 39 263
4958B63j58k67J07j33K26j68l9J90oR1j51J50R5k40J87Q8j92j88J65o6o6L36m9
$$ 263 105 -162 -55 -188 38 -130 -169 21 15 106 -45 105 200 -40 147 235 43 -145 20 -46 -112 224 175
4981A75l27P6q2Q4O0O5j12Q5k53L79k9j52K37k88k1n9L52j09m62J50K71M29n47
$$ 175 -152 -76 -158 -74 -14 51 -61 24 -229 150 121 -31 206 -82 -103 -162 190 81 -381 -231 40 469 -78
5004g8J22J00k03j07J58J86j84L0j67j13K99j16P2M02l21k83QJ11j1J14j56J79
$$ -78 44 144 -59 -166 -8 178 -6 24 -143 -256 43 -73 -1 401 80 -203 -195 -84 -95 19 -137 42
5026D2j58p0j1k5L75k36j50J87j72J74J38j5J2n7j43K99j06k13L7J51Q4K4K26
$$ 42 -116 -186 -197 -222 153 -83 -233 -46 -218 -44 94 79 91 34 -109 190 84 -129 -92 59 143 167 393
5049C93l34L40o32L37l22J23P4j2K87l19R0R6j78K67l54Q0j20K18jJ79k39O6j00
$$ 393 59 399 -233 104 -218 -95 -21 -33 254 -65 25 121 -57 210 -144 -64 -184 34 33 212 -27 39 -61
5072f1J03R5l46K99j15L61l09m34L11J12mQ1j88J14J56j01j21L55k11j15QK3p9
$$ -61 42 137 -209 90 -25 336 27 -407 -96 16 12 93 -95 19 175 74 -47 308 97 -18 -10 13 -66
5095f6r8K7M36l65j38J54L34K6j90l45J88Q9J12l4k00P2J27j69K84j27j36N9o6
$$ -66 -164 -137 299 -66 -204 -50 284 310 120 -225 -37 52 164 130 -70 2 129 -40 244 117 -19 40 -26
5118b6J54j54K7p7J99l42L50N8j06l44J68J03L7j09J7J02j25J49L34n02K9J7L36
$$ -26 128 -26 1 -76 123 -219 131 189 83 -261 -93 10 47 -62 -45 57 -68 81 415 -87 -58 -41 295
5141B95jl74K76k72N9Q6j79O7p3k02K82O1L3j06J09j22N7j22J41k51J47J54j36
$$ 295 294 -80 196 -76 -17 69 -110 -43 -116 -318 -36 25 58 -48 61 -61 -4 -126 15 -236 -89 65 -71
5164g1r0O25o81J88M39m20j47K99j17j21R4m5r1QK09M5k79R8k67L64M5j73m4P9
$$ -71 -161 464 -217 -29 410 -10 -157 142 25 -96 -2 -47 -138 -130 79 124 -155 -57 -324 40 85 -88 -132 -53
5188e3r3M09l30Q5N5K10q2l56O8m0J99K4n7m4J81j61o9q6K15j08J47K37l37k0
$$ -53 -146 263 -67 18 73 283 201 -155 -87 -127 72 96 39 -5 176 15 -54 -140 75 -33 114 351 14 -6
5212fn6P5k05J96J13k52L46k57R7r8K2M35m60L8m5J84l33J35n7l31O25l88O6K28
$$ -6 -62 13 -192 4 117 -135 211 -46 51 -47 -25 410 -50 -12 -57 127 -206 -71 -128 -459 166 -222 -156 72
5236G2L54l97J53nj31Q0m1o5j40K62o4k85nJ39J76k18j3J79J83k79L83k77o3k63
$$ 72 426 29 182 177 46 126 85 20 -120 142 78 -207 -212 -73 103 -115 -128 51 234 -45 338 61 -2 -265
5260b65P2J97m1l1k17m0L30k1L34o18M92j33k70J29K42k58o7J49r8K68j18j39
$$ -265 -193 4 -37 -68 -285 -325 5 -16 318 -300 192 59 -211 -82 160 -98 -165 -16 -114 154 36 -103
5282a03J81j42K0K48j16q6j68pJ35r5J03K5j6q9J79M48l62l0l10P1K29k39K13
$$ -103 78 -64 -44 204 88 2 -166 -173 -38 -133 -30 -5 -21 -110 69 517 155 125 -185 -114 115 -124 89
5305H9J07j62j56K88J73k45k12J41Np1k7L23j06J36m2m75K23M1O5R2j51J28j02
$$ 89 196 34 -122 166 339 94 -118 23 28 -43 -70 253 147 283 241 -234 -11 30 95 187 36 164 62
5328F2k75K11j44J01q4Q7j07J07M16j26l45L39j74RJ04j93K77j72j34l1j63L11
$$ 62 -213 -2 -146 -45 -129 -42 -149 -42 374 248 -97 242 68 77 181 -12 265 93 -41 -72 -235 76
5350G6j1k22q9Q9M12j95m05N22o3l55L91j17k24K24j85r7K40r2n7J6K68j59M5
$$ 76 65 -157 -246 -157 255 60 -345 177 114 -241 150 33 -191 33 -152 -249 -9 -101 -158 -142 126 -33 12
5373A2P6j43K11m66L61j23K08J14l7l8k11J0L5J04n20K83M0RJ87j89L73l25Q6
$$ 12 88 -55 156 -310 51 -72 136 250 213 175 -36 -26 9 113 -407 -124 -84 -75 112 -77 296 -29 57
5396E7k70M11Ml43Rk4M00m34K2J15K04l24r5L06l3j41Q1J60k30J10N1k34L73k88
$$ 57 -213 198 202 -141 -132 -156 244 -190 -168 -53 151 -173 -268 38 5 -136 -55 105 -125 -15 36 -198 175 -113
5420a13j24J99k12M93r7J59l00j8J05o1J35q1K5k74P0n1M1M1j67M35j55j79K17
$$ -113 -237 -38 -250 243 146 305 5 -13 92 31 166 85 110 -164 -94 -145 -104 -63 -230 205 50 -129 88
5443H8K6r5j09n4Q5j66P0J58J02k97M62k50K9p3L1J68j07m1j57L4N56l78j75K63
$$ 88 114 19 -90 -144 -59 -225 -155 3 105 -192 270 20 49 -24 7 175 68 27 -130 -96 460 82 -93 170
5467A70k30m9K63k13P3KK35j85j45J48J67j91j69K57j36J8q1l56M45k22P3J18
$$ 170 -60 -109 154 -59 14 16 251 66 -79 69 236 45 -124 133 -3 15 -66 -422 23 -199 -126 -8
5489hl6j55K77j43M4J69k1k46J34J05j03J40l7k35p2J60K77l39L6K66l91o0j09
$$ -8 -44 -199 78 -65 -21 148 127 -119 15 120 17 157 120 -115 -187 -27 250 -89 -53 213 -178 -238 -347
5512c47M39k59K24n9k4K32k89N7k9Q2K0j35J36r9l33K81k94M01K24j49k95K73
$$ -347 92 -167 57 -2 -26 206 -83 -26 -55 27 47 -88 48 -51 -384 -103 -397 4 228 79 -216 57
5534E7m0J46k69k1oN0K93j69q8K40j21p4J95r7M5J3j80q0J85L6l43L71k04j10
$$ 57 17 163 -106 -127 -133 -83 210 41 -47 193 72 -2 193 96 141 154 -26 -106 79 115 -228 143 -61 -171
5558a71M74n03M2Mn7K70Q1l58Q9oK73l01O9K00j67j65J42j63K02M7K2l02L87k27
$$ -171 303 -200 -158 -154 -211 59 140 -218 -129 -135 138 -163 -94 106 -61 -226 -84 -247 -45 2 24 -278 109 -118
5582a18P3K42l80K84j4L25m16o7j29O2M3L74k54j93J64k03L49j12K31j23l63L56
$$ -118 -45 197 -183 101 87 412 -4 -71 -200 -138 -95 279 25 -168 -4 -207 142 30 261 138 -225 131
5604A31j37J25kk16K26K0l52j99L48K52j32k44N22m50k6R6k94K34Q3J76k75K62
$$ 131 -6 119 117 -99 127 147 -205 -404 -56 196 64 -180 342 -108 -134 -38 -332 -98 -15 161 -114 148
5626A48j02k14L73j75l65L13K17j50q0K35l28R6K2K92l93M14k24R8l09L53o2k4
$$ 148 46 -168 205 30 -335 -22 195 45 -35 200 -128 -32 -10 282 -111 303 79 177 -132 221 159 135
5648A35lNk26J79j91O3K84k75L12O0l84n7J36J2j1L07k49k31J40%o6m9P6K65m5
$$ 135 132 137 -89 90 -101 -38 246 -29 283 343 -41 -98 38 50 39 346 97 -134 6 6 -60 -109 -33 232 187
5673A87r3m1j85O7m4R0J78K56l40J92l50k58K26J53o0r3K13j18M4J62k14r8J33
$$ 187 94 53 -132 -65 -109 -19 159 415 75 267 -83 -341 -115 38 -22 -115 98 -20 24 186 -28 -126 7
5696GP4j38J63l23K08K90l87J7J7l7J3k33K84m9K37k34J59l05L38j31J7nk25M
$$ 7 81 -57 106 -217 -9 281 -106 -89 -72 -109 -96 -329 -45 -94 143 -91 68 -237 101 -30 -13 -18 -243 -239
5720b39j11K28K2j0L04l68J4p0M57j11k07J92j03K15km10J72l3o2M82o13L69K
$$ -239 -350 -122 -100 -110 194 -174 -160 -230 227 116 -91 101 -2 213 211 -199 -27 -60 -122 360 -253 116 118
5743A18jo9J77k98J92lj17k3K30p5o3J02j34o8M5j2J3k32K69l4j4J00k71J08n8
$$ 118 117 48 225 -73 119 116 -1 -24 206 131 68 170 36 -32 13 1 14 -218 51 17 3 103 -168 -60 -118
5768a18J48j62K55r4J11K56q5l76J25O0O1m00N0L2q0J42q3K38k7N0j54k32K32
$$ -118 30 -132 123 29 140 396 311 -65 60 120 181 -219 -169 -137 -217 -75 -158 80 53 103 -51 -283 -51
5791e1KPK08k31o6J32l49M35l8J01k01K56K39k50m8n2J7PJ73m49K03p5l0j25J63
$$ -51 -49 -42 166 -65 -131 1 -348 87 49 150 -51 205 444 194 146 94 111 118 291 -158 45 -30 -60 -185 -22
5816b2n8j54L70j83j12M32P0l19q4L1J32j49K42k30K95j72j6O3j96j3J9K8Q2J19
$$ -22 -80 -234 136 -47 -159 273 343 24 -60 -29 103 -46 196 -34 261 89 73 136 -60 -73 -54 -26 56 175
5840A75k34J00J55k31K87k69N9j38K02l56K56N8j23J62k95qj33M57l38N6K57j02
$$ 175 -59 41 196 -35 252 -17 42 -96 106 -250 6 64 -59 103 -192 -200 -333 124 -214 -158 99 -3
5862cm9J13J2j36j66J67K22m9k27L68k57j75O30o84N65m30p2M33k90P2k68J19
$$ -3 -52 61 73 -63 -229 -62 160 111 -116 252 -5 -180 450 -234 331 -99 -171 262 -28 44 -224 -105
5884a05K5J44O2j41L28m98K34J17P8k36J64l00J61J40k20pJ43j27J5J51l96N47
$$ -105 -80 64 126 -15 313 -185 49 166 244 8 172 -128 33 173 -47 -54 89 -38 -23 128 -268 279
5906B79j08k94J41p2L1j64J45J53P2m03M93l58O8J31k58J12k99J24K57R9j42Q6
$$ 279 171 -123 18 -54 -23 -187 -42 111 183 -220 273 -85 -17 114 -144 -32 -331 -207 50 149 7 93
5928I3l08M11r4j40JP9o6p8O43o21R0R3l79J01J15N8K61l02q3K24j03m1j71k9
$$ 93 -215 196 102 -38 -37 42 -24 -102 541 -80 10 103 -276 -175 -60 -2 259 -43 -126 98 -5 -46 -217 -246
5952b46J75R1n1L5K9l9Qj6K75m94K15J03l39K83l6j8j98J20M00k81j92L70m65
$$ -246 -71 20 -31 4 33 -6 2 -14 261 -233 -18 85 -254 29 -7 -25 -223 -103 297 16 -176 194 -271
5975b71L01J01l39N47k92m7k7p7J35K78j12j10j17M3K78k37k22L29j25J0P1r0
$$ -271 30 131 -208 339 47 0 -27 -104 31 309 197 87 -30 13 291 54 -168 161 36 46 117 27
5997B7j88K7J61R8MPj95J08k3j13L22p2j18k30P3L79j80m66N38kql29J56K04k41
$$ 27 -161 -134 27 125 129 136 -59 49 26 -87 235 163 45 -185 -112 267 87 -379 159 157 149 -180 -24 180 -61
6022f1Q4J08om56L04l36J15M07k04r2J02l59M50J80l86M9J23p9J77j45Q7R3l60
$$ -61 23 131 125 -331 -27 -363 -248 159 -45 -137 -35 -394 56 236 -150 -101 22 -57 120 -25 62 155 -205
6045b05K87j56J69m4k54J07O9j54J69o8P7M8K5J09l32J05L0k06L89n4j50M4Q2
$$ -205 82 -74 95 51 -203 -96 -27 -181 -12 -80 -3 45 70 179 -153 -48 -18 -224 165 111 -39 5 87
6068H7l5q1K42k68J02K22k51J90j47l4k45M95l64r0L79n5l79K79K21l58J30j71
$$ 87 52 -29 213 -55 47 269 18 208 61 27 -218 277 -87 -177 202 147 -232 47 268 -90 40 -131
6090a31J26JJ79k88K17j11j47L21k62q0L60J72l93q1j41L54j69L29k70J40l41
$$ -131 -5 -4 175 -113 104 -7 -154 167 -95 -175 185 357 -36 -117 -258 96 -73 256 -14 126 -215
6111b15J29L13m77O6J06K86l62o6J03L3K20N2n02K7K39n1J83R4N2o4L9k88J91
$$ -215 -86 227 -250 -184 -78 208 -154 -220 -117 -84 136 188 -314 -287 -48 -99 84 178 230 166 205 -83 108
6134A08n5N0R4j12Q5j59n3O7p0K66l87K09p7k2K3J55k93j9P4K14q9l60K19K80
$$ 108 53 103 197 85 170 11 -42 25 -45 221 -166 43 -34 -56 -33 122 -171 -190 -116 98 9 -351 -132 148
6158A48o1l4j57L44l28j13M23j05L6k60J04L29l38j53J0L70j16l49L79k35J50
$$ 148 87 53 -104 240 -88 -201 222 117 153 -107 -3 326 -12 -165 -155 215 99 -250 129 -106 44
6179D4K03j94r9l9J21p9K1J29P5j0k08q7L45j19k81J18J63j9j04K76k85l4l00
$$ 44 247 53 -46 -85 36 -43 -22 107 182 172 -36 -123 222 103 -178 -60 103 84 -20 256 -29 -63 -363
6202c63L25J06qj6L3j25JM2J68k63j2p3J73K0j48L92j90q4j23J73l61N71j21r8
$$ -363 -38 68 60 44 77 -48 -47 -5 163 -100 -112 -185 -12 8 -140 252 62 -22 -145 28 -333 238 117 19
6226A9K7J21l49j08M31k34O3rK63m41k2k9K17R0j65O3K19k19J21Q8k25K10l24
$$ 19 46 167 -182 -290 141 -93 -30 -39 224 -217 -239 -268 -51 39 -126 -63 156 -63 58 146 -79 131 -193
6249a93J47K37Jl13K81k47k66O01k44j23j48J51J45j29J17j69K62n51K91J05J13
$$ -193 -46 191 192 -121 160 -87 -353 248 4 -119 -267 -116 29 -100 17 -152 110 -441 -150 -45 68
6270F8L5JK7m39L89l15J17J15pr2N9J17j83j9r7K24o8J77j93R9L26P4k24k69j7
$$ 68 103 104 131 -308 81 -234 -117 -2 -9 -101 -42 75 -108 -127 -224 0 -68 109 -84 15 341 415 191 -78 -95
6295i5J49L4k08J37Q6%l75M6L21ML4k55M34k61j5m0J00J1k63J5L38k7j60k46L12
$$ -95 54 88 -120 17 103 103 -272 -226 95 99 133 -122 312 51 36 -4 96 107 -156 -141 197 170 10 -236 76
6320G6j62k8l8Q2RJ0K01J26m55K37l55M07K92l52k38K75o1K7j5M8k12k5K7Q9k01
$$ 76 -86 -114 -152 -70 -61 -51 150 276 -179 58 -297 110 402 50 -188 87 26 53 38 86 -126 -151 -124 -35 -236
6345b36K57K91n29J05L92n5m36K36J16l17L31l70M39k3l83K96o6J0j72R5P7L3
$$ -236 21 312 -217 -112 280 225 -211 25 141 -176 155 -215 224 201 -182 114 48 58 -114 -19 58 91
6367I1j83K2J23j37J12N4j9J59p1j27j24L62l01K26j1k04L8j50k34O05r3j87K12
$$ 91 -92 -70 53 -84 28 82 63 222 151 24 -100 262 -39 187 176 -28 10 -140 -374 231 138 -49 163
6390A63k81K96k22O7P3k75J25k7K18m8j84R1j63K6N05k02l40J32m2j21M70l52
$$ 163 -118 178 -44 23 96 -179 -54 -81 137 89 -95 -4 -167 -141 364 162 -178 -46 -88 -209 261 -91
6412i1K1J05L3M0O7k19K31j29R8q4j41k39M94j57j9l74L45oj07l4J66l7l0K15
$$ -91 -70 35 68 108 175 -44 187 58 156 72 -69 -308 186 29 10 -364 -19 -25 -132 -166 0 -37 -67 148
6436A48r2Q8m2k24J71L3k03J08K05J6j84M8j13K85l19J77p2J14R8j08J55k08k34
$$ 148 56 144 102 -122 49 82 -121 -13 192 208 24 72 -41 244 -75 102 30 144 242 134 289 81 -153
6459a53R6j06K88l6K57n07j32L60o7j07K42j14j28J36o3M5j37Q0N2k66J12J63
$$ -153 -57 -163 125 89 346 -161 -293 67 0 -107 135 21 -107 29 -34 11 -126 -46 6 -260 -148 15
6481A5J45nl59J4K18j61K12r7m5J29k52N19l64N2J41m41K55M3j00OJ12j51O8o
$$ 15 160 155 -204 -190 28 -133 79 -18 -63 66 -186 333 -31 21 162 -279 -24 19 -81 -75 37 -114 -46 -52
6505e2k5J12o3K01k03p1O4j03J78p8K32k42L2l86M21j64K26Q8r4j6j23j89L48
$$ -52 -77 35 -28 173 -30 -101 -37 -140 38 -40 192 -50 -18 -404 17 -147 79 167 73 57 -66 -255 93
6528I3J37m24J80j11L6K59l61K38j71J76j16K29K1j22j88n9J72J69k03j71Q8J85
$$ 93 230 -194 -14 -125 -89 170 -191 47 -124 52 -64 165 186 64 -124 -183 -11 158 -45 -216 -128 57
6550E7k85J22p6J12J11k18j4K54j00P9M3P3Oj78l9P5j84k22L53K85k71j16qJ18
$$ 57 -228 -106 -182 -70 41 -177 -191 63 -37 42 85 158 164 -14 -53 22 -162 -384 -31 254 -17 -133 -141 -23
6574b3m7q0K02j42J33M1j41J1j47K09J94l14kK84j62R0m52N85n00L23l18M37j89
$$ -23 -70 -150 52 -90 43 84 -57 -46 -193 16 210 -104 -106 178 16 106 -346 239 -261 62 -256 181 -8
6597hj46J70N7L0n3pM9k19L9J81m01K85k5j03LK60j17%n2k4K25j99j57J78J94
$$ -8 -154 16 73 103 50 43 92 -127 -88 93 -308 -23 -48 -151 -148 112 -5 -5 -57 -81 144 -55 -212 -34 160
6622A60L3j41j16P7j70J80L34m03N1P2j86K04j87L8k69L21J21L8l19J17J54J41
$$ 160 193 52 -64 13 -157 23 357 -46 5 77 -109 95 -92 -54 -323 -2 119 157 -162 -45 109 250
6644B50l00j24K61p0J20m21J22o2J76M5OJ00p0J31p06M03l10K55l0M88j75K11
$$ 250 -50 -174 87 17 137 -284 -162 -224 -48 -3 3 103 33 164 -542 -139 -449 -194 -224 264 89 300
6666C00j39j29R6pO4l34M24k63R7k86K01j12k31K61N2N2n03M46L41n00K34Rk19
$$ 300 161 32 128 121 185 -149 275 12 109 -177 24 -88 -319 -58 -6 46 -457 -11 330 -170 64 73 -146
6689a46M01l7J67j15j71J2J76m75K51k00k1L5L02k70L60m05J13k22R1L22m40J51
$$ -146 255 218 385 270 99 111 287 -188 63 -137 -158 -123 179 -91 269 -136 -23 -245 -154 168 -272 -121
6711a21L1L35j05%Q8L5n80J46K46j12P4j82L00l74J93R4K08m09K99k36J16J44
$$ -121 -90 245 140 140 228 263 -317 -171 75 -37 37 -145 155 -219 -26 68 276 -133 166 -70 46 190
6733A90o8j53P9j06Q9m5K36l77Q7O9k7J69l64L57j43n6J54o9n1P9r8J33l3k44
$$ 190 122 -31 48 -58 31 -14 222 -155 -68 1 -26 143 -221 136 -7 -63 91 22 -29 50 -48 85 52 -192
6757a92J37O2j48J12l2O5P7j32J0R7m8q1K67l13L77j53j57L33l51j21J25j83J7
$$ -192 -55 7 -141 -29 -61 4 81 -51 -41 56 8 -73 194 -119 258 105 -52 281 -70 -191 -66 -249 -232
6780b32K94J08l29J17P8Km5J83p9l2P8j10k09L28j42m5J39j84Q7L5r4J03r3j34
$$ -232 62 170 -159 -42 36 38 -7 176 97 65 143 33 -176 152 10 -35 104 -80 7 42 -52 51 -42 -176
6804a76K73jj58j72M97j19k72L31m70L49nk99M86k88k3j6J46k03P1m01J34M28
$$ -176 97 96 -62 -234 263 144 -128 203 -267 82 77 -222 264 -24 -47 -63 83 -120 -49 -450 -316 112
6826A12n0q5J02m6j17J2L13m55J74M9J63l35O7PK66k8k68L04r6q3q5K65J8J98
$$ 112 62 -23 79 33 -84 -72 241 -214 -40 9 172 -163 -96 -89 177 149 -119 185 89 6 -79 186 204 402
6850D02o61K50L78m31lJ79J4j35M1r3K34j30Nj8k74M47k56j5L7L35l10j48o4L36
$$ 402 -259 -9 369 -62 -65 114 128 -7 34 -59 175 45 50 32 -242 205 -51 -66 -29 306 -4 -152 -216 120
6874A20j0m8k22M5J46j55m8J33M1qJ19k1l04K67nj43J58L5j58J33K3k77Q6J57
$$ 120 110 62 -160 -115 31 -124 -172 -39 2 -6 113 92 -212 55 50 -93 65 100 -58 75 98 -179 -93 64
6898F4K43l51L47k35j42N1Q9j22J5j2PK47j60j30j76L09J15mj64l06K22KN1K08
$$ 64 307 -44 303 68 -74 -23 66 -56 -41 -53 -46 201 41 -89 -265 44 159 155 -9 -315 -93 -91 -40 168
6922A68o9j16j13J79p5P1j04L11k67l05J30K52l21J05K33J0j53L99m12J6J28n9
$$ 168 99 -17 -130 49 -26 45 -59 252 -15 -320 -190 62 -259 -154 79 89 -64 335 -77 -61 67 8
6944Hk87M54l96M98n1m09J26R2P5O8j50K30j46l36J83mL69m06j43mQK39K12k96
$$ 8 -279 175 -221 277 226 -183 -57 35 110 178 28 258 112 -224 -41 -45 324 -82 -225 -229 -221 18 230 -66
6968f6n0M1J86j24J96j81K74j88j58J19q4R1mj93N6K7j42J05q3Rm8L03j42K82
$$ -66 -116 -75 111 -13 183 2 276 88 -70 49 -35 56 52 -141 -85 -58 -200 -95 -178 -169 -217 86 -56 226
6992B26j30j1J9j20M0K0l03R1N8J3J29k5J61o2J87k14j01qj65J6J74J0q9k26L63
$$ 226 96 85 104 -16 24 44 -259 -168 -110 -97 32 7 168 106 293 79 -22 -30 -195 -179 -5 5 -84 -310 53
7017E3j26L2N6J27j16N2j46N0l27L33m03J47j12K91k4K2N6p1l6m7K15k58K97k36
$$ 53 -73 -41 15 142 26 78 -68 -18 -345 -12 -415 -268 -380 -89 -113 -91 -35 -106 -142 -189 26 -232 65 -171
7041a71Ql8K36J5K05j7m4l70K04M0N6l16J95j20K37j37Qn9K72j10k07qN8L19k79
$$ -171 -163 -201 35 50 255 238 194 -176 28 68 124 -192 3 -117 120 -17 -9 -68 204 94 -113 -121 -63 256 -23
7066b3k3J14J9p4j99j11K16J97m13J20m5K84j44L09l97K61l0k29N21m12K14q3
$$ -23 -46 68 87 13 -186 -297 -81 116 -297 -177 -222 62 -82 227 -170 91 61 -168 353 -59 155 72
7088G2l88N27k95l1J43j24r6K11O1m1k0l1J15m2l66L10NJ12p2k08qJ87J11j00
$$ 72 -316 211 -84 -115 28 -96 -192 19 80 39 19 -12 103 61 -305 5 10 122 50 -158 -166 21 132 32
7112C2kK1J67n81N87l66K23n72P28N5m77L22j76J89r4L7j7J25k63J78K06k56J06
$$ 32 30 51 218 -363 224 -142 81 -491 237 292 -185 137 -39 150 56 93 76 201 -62 116 322 66 172
7135A72r1k8p8K47l45L00j47M7j81J59k35J57J21l47J0K44K9J33j28j59K39r3
$$ 172 81 53 -25 222 -123 177 30 77 -104 55 -180 -23 98 -249 -239 5 34 167 39 -120 119 26
7157B6j1k30J09K42l01j46L49J52k72QR4k63J81P4j09L95k14J2Kj15J40o3j63
$$ 26 15 -215 -106 136 -165 -311 38 190 -82 -74 20 -243 -62 12 -97 298 84 96 98 -17 123 60 -103
7180a03J60q8J10j52K16n6j85J05J05j07j81K4K26k63L37o8k39M56j17J27o07
$$ -103 57 -31 79 -73 143 87 -98 7 112 5 -176 -152 74 -189 148 80 -159 297 180 307 -300
7201c00L01L3K77k36o3L32l36J74k1j32J3L20n06J00k1L92r6k12K8n6k21Q4M38
$$ -300 1 34 311 75 12 344 8 182 161 29 42 362 -144 -44 -65 327 231 19 47 -9 -230 -146 292
7224B92J39l84K68l76K42k27n0K6r3J34k88P1N4j19j01N71j56P7N7l59L69r7o2
$$ 292 431 47 315 -61 181 -46 -96 -70 -163 -29 -317 -246 -192 -311 -412 159 3 80 137 -222 147 50 -12
7247a2J15l36K30k72N37k80q0M93l26j62L7o7J69j96L27q2k6r5o6j24L84j12J62
$$ -12 103 -233 -3 -275 262 -18 -98 395 69 -93 -56 -123 46 -150 177 95 69 -26 -92 -216 168 56 218
7270B18k25J86k03K88nk0l10j29K20j41K81l55%O0J61j3J1l3l3P0k23L53k93k09
$$ 218 -7 179 -24 264 259 239 -71 -200 20 -121 160 -195 -195 -135 26 13 24 -9 -42 28 -195 158 -135 -344
7294c44M12J90k10j53L41k58J75k8k03k24K01O39j095P67M7l26K12O3l97K63n1
$$ -344 68 258 48 -105 236 -22 153 125 -78 -302 -101 538 -557 210 257 -69 143 206 -191 72 21
7315B1l71L46k58L02j74L92l27L44m50K04l18M16l5l44M24p2j88J08N4P6k03M7
$$ 21 -350 -4 -262 40 -134 258 -69 275 -175 29 -289 127 92 -252 172 100 -88 20 74 150 -53 -6
7337fK19k70J3l59N91j20O3k97J73j71n2J09L58k49j40J35n2J57m4q7J98P7l29
$$ -6 213 -57 -44 -403 188 68 131 -166 7 -164 -216 -107 251 2 -138 -3 -55 102 58 -29 169 246 -83
7360h3L8R2L40m52K54j57l02L45Q9k40m3Q5m5j4K18oo9j03m2J92p6N0k85L00k83
$$ -83 -45 47 387 -65 189 32 -270 75 164 -76 -119 -34 -79 -93 125 119 50 -53 -95 97 21 71 -214 86 -197
7385a97K30r0j52L2N3J52J70j02j80L31k07l10P8J24j4N9L63n2n27K31j55K28
$$ -197 33 -57 -209 -177 -124 28 198 96 -84 247 40 -270 -192 -68 -82 -23 340 288 -239 -8 -163 65
7407F5m0J44j95L7q4N0R6K10m19j74K06j07O0O0K14K42k72j25K14j4k19o5K4j12
$$ 65 25 169 -26 11 -73 -23 73 283 -136 -310 -104 -211 -151 -91 123 365 93 -32 182 168 -51 -116 -92 -204
7431b04J49K7n9j23M9J36k8k5J00mK72k50kk84K83j26k7L91j99P1k02J72j92M1
$$ -204 -55 -28 -87 -210 -161 -25 -53 -78 22 18 290 40 38 -246 37 -89 -116 275 76 147 -55 117 -75 -34
7455c4J19K65m65J38P5j89R9P9k10J13J47q4M1j33K17j87N5N6j84J14K56m28J13
$$ -34 85 350 -115 23 98 -91 8 87 -123 -10 137 53 94 -39 178 -9 46 102 -82 32 288 -140 -27
7478b7Ol6k18K56K39j19L7j98j06j13K0O75n17O4o0m0J90l46J2L56K29j72J78
$$ -27 -21 -57 -275 -19 220 101 138 -60 -166 -279 -259 416 -101 -37 -97 -137 53 -293 -281 75 304 132 310
7501C10k87M4K0l5k69J51k17M70k47p5o7M1J82l19K83k2j03L7O3L36r5k21q9j49
$$ 310 23 67 87 52 -217 -66 -283 187 -60 -135 -202 -161 21 -298 -15 -37 -140 -103 -40 296 201 -20 -109 -258
7525b58L06j22J60l05M20j55k16J35J23m9j56j51L05m99L56j66L77Q9l56L84j68
$$ -258 48 -74 86 -219 201 46 -170 -35 88 39 -117 -268 37 -462 -106 -272 105 194 -162 222 54
7546E4K17l4j34k15J79J13l53L98j97k12L61l07o6M19n9k60K64j14q1n4L67m66
$$ 54 271 237 103 -112 67 180 -173 225 28 -184 177 -130 -196 223 164 -96 168 54 -27 -81 286 -180
7568a80L35n2j03k50N28k27J19k51j2K26j36j17l2L5J67j98M69l76p3j22J5J33
$$ -180 155 103 0 -250 278 51 170 -81 -93 133 -3 -120 -152 -117 50 -148 321 -55 -128 -250 -235 -102
7590a02K52l24K47Q5r4K88m51J72k05Q6R9o1n2j3L48J13l58J95m15L09J28m42
$$ -102 150 -174 73 158 64 352 -99 73 -132 -46 53 -8 -60 -73 275 388 30 225 -190 119 247 -195
7612a95M57m17J31l41M88O1O3j80j87J38j97K74l04K05p8Q9J19Ll76L42M2J69
$$ -195 262 -155 -24 -365 123 184 247 67 -120 18 -179 95 -209 -4 -82 7 126 129 -247 95 137 306
7634C06k84J24R6m28J51M2kj94K46j87K7K5J60N3k34P0k8J11q5J03k02L30n4k86
$$ 306 22 146 242 -186 -35 7 5 -189 57 -130 -103 -78 82 135 -99 -29 -57 54 -31 72 -130 200 146 -140
7658a40L01k04K0J51l06M33k30Q9k11L7R2k06K77m1J29j87J51l32rJ7j0J17J70
$$ -140 161 -43 -23 128 -178 255 25 114 -97 -60 32 -174 103 62 191 4 155 -177 -186 -169 -179 -62 108
7681A08k88M96l63K43m58L42l63J67J56j9J14L43k59r3R5n12L27J86n3k94J08
$$ 108 -180 316 -47 196 -262 80 -283 -116 40 21 135 478 219 126 221 -291 36 222 169 -125 -17
7702a7K35k21k61M71k92M27m62J01n9j97J76N2J36lk81J62k6K85q1l63j04J97
$$ -17 218 -3 -264 207 -85 342 -120 -19 -78 -275 -99 -47 89 86 -195 -33 -59 226 145 -218 -322 -125
7724a25p4Q3n9J7J31R5l9k30J31J49J74l27pj40M40k70o2O9K29j31J01k82K44
$$ -125 -199 -116 -175 -158 -27 68 29 -201 -70 79 253 -74 -81 -221 219 -51 -113 -44 185 54 155 -127 117
7747A17N0j28k29J91L6J39k67J62K4j92L3j49M20m17J1K90j48Kn24O18o31P16
$$ 117 167 39 -190 1 37 176 -91 71 95 -97 -64 -213 207 -210 -199 91 -57 -55 -579 39 -592 124
7769A24Mk34m6o1Pj1K68r3J80k94M74k04n4j12J78J3l50L68k36j20L83k60j25
$$ 124 128 -106 -152 -213 -206 -217 51 -42 138 -156 318 114 60 -52 126 139 -211 157 -79 -199 184 -76 -201
7792b01l8K62o5RN2K1J17J12m48K03j8j7J37k78L13J01j59k9OJ60l78K26j03R9
$$ -201 -239 23 -42 -33 19 40 157 269 -179 24 6 -11 126 -152 161 262 103 74 80 240 -138 88 -15 84
7816H4l78J42J59L13n06J72Q2j00R7M2k53K07j69K92m79J85L91m03p2K35j72j56
$$ 84 -294 -152 7 320 -186 -14 68 -32 65 107 -146 61 -108 184 -295 -110 281 -122 -194 41 -131 -287
7838b87J95N0J54K14j67j38R1j38K14m3l89L60k55K01j05J54l4J84j03k08O1n7
$$ -287 -92 -42 112 326 159 21 112 -26 188 145 -244 116 -139 62 -43 111 77 261 158 -50 11 -46
7860d6k01J97PR9j90J92q1K01l3k72K05R2j73j87K89j38l1J21j26J23k54J92j61
$$ -46 -247 -50 -43 56 -134 58 -23 178 145 -127 78 170 -3 -190 99 -39 -70 51 -75 48 -206 -14 -175
7883a75K22R8Oj24k83m0M00o3j24M3K08l76L17L2p2k63K61J52k84k1K99l08J34
$$ -175 47 145 151 27 -256 -296 104 41 -83 -40 168 -208 109 141 69 -194 67 219 -65 -86 213 -95 39
7906C9Rl6j84N11n18J36n5O5K65l19j64J23m1M70l20k82M46j97Ok16J93L8j71
$$ 39 48 12 -172 339 -179 -43 -98 -33 232 -87 -251 -128 -169 301 -19 -301 145 -52 -46 -262 -69 -31 -202
7929b02J70k3N6k80J82M7L08l17OJ88j07O9Lj67K04k43K64j00j54J85j01j18J11
$$ -202 -32 -55 1 -279 -97 -50 258 -59 -53 135 28 97 100 -67 137 -106 158 58 -96 89 -12 -130 -19
7952a9K64j42m4j67J00L12k50M4m4O4l77K34r1p9J13m9J96r7o9M4Q0M0O0n4ro3
$$ -19 245 103 59 -108 -8 304 54 98 54 118 -259 -25 -116 -195 -82 -131 65 -32 -101 -57 23 63 123 69 60 -3
7978cJ25k16K44o8Lj25p1K31k1Rj22j68K56m5r0N07n63r0J53N3R8k49K00k4Q1
$$ -3 122 -94 150 82 85 -40 -111 120 99 108 -14 -182 74 29 -61 446 -117 -207 -54 -1 97 -152 48 24 105
8003A05k72J24M2J20J27l19L93p5k13j39L4J06p2J5k6l5K20k36k6J01nJ56k60
$$ 105 -167 -43 -1 119 246 -73 320 245 32 -107 -73 33 -39 -24 -50 -85 135 -101 -127 -26 -31 125 -135
8026a35J90K4J29l06j75M1r0N11n4l25K23J43j21mj30K16j96J26k32J63K8O0j00
$$ -135 55 79 208 -98 -273 -232 -322 189 135 -190 33 176 55 51 -79 137 -59 67 -165 -2 26 86 -14
8049a4n1Pk8J23l03L18k55M05j47J5J05q0J0n8k26R9M9M9n0j38J74k1k1j13l8
$$ -14 -65 -58 -86 37 -266 52 -203 202 55 70 175 95 105 47 -179 -80 -31 18 -32 -170 4 -17 -38 -151 -189
8074a89K12o8M61l24j34M2P3k59J20l7J95k82k38M17L7r4L39l57K7J64l98N14
$$ -189 23 -45 416 92 -42 0 73 -186 -66 -103 92 -190 -428 -11 26 -68 271 -86 -59 105 -293 221
8096B21m78M6N67n77J40j32J46L91k49L0k22Q5j54K68N8J28m60Q8L04m9J06k81
$$ 221 -257 -211 356 -221 -81 -213 -67 324 75 105 -117 -32 -186 82 140 268 -192 -104 200 151 257 -24
8118b4O7j27J87m17K23Q2J70k51O0l2j04J31M4j66Q6k11K98j16j56J55J88l64
$$ -24 43 -84 103 -314 -91 -9 161 -90 -30 -62 -166 -35 9 -157 -71 -282 16 -100 -256 -101 87 -277
8140b77J69P2L78j59L7j42k10K46k83K42j69O0j57J64n3kp5J79J39j75k88L63
$$ -277 -108 -36 342 183 220 78 -132 114 -169 73 -96 -36 -193 -29 -82 -84 -159 20 159 -16 -304 59
8162E9J58l35Q6J45%J87n2m6k34j69K11R5j0p8p0K21k09k2L42m46M7RJ45p3J55
$$ 59 217 -118 -32 113 113 300 248 202 -32 -201 10 105 95 17 -53 168 -41 -63 279 -167 -120 -111 34 -39 116
8187A16k87L99k2m25
$$ 116 -171 228 206 -219
8191b19
$$ Imaginary data points
##PAGE= N=2
##DATA TABLE= (X++(I..I)), XYDATA
0@%%%%%%qJ1j1J6j6K4l2L2m0M8n6P2q6J02j20J36j60J84k08K40k72L10l53L98
$$ 0 0 0 0 0 0 0 -8 3 -8 8 -8 16 -16 16 -24 24 -32 40 -46 56 -64 72 -88 96 -112 128 -144 166 -187 211
30B11m50N06n66O32p05P89q78R74j082J197j325J469j626J799j993K212k459K735
$$ 211 -239 267 -299 333 -372 417 -461 513 -569 628 -697 772 -854 945 -1048 1164 -1295 1440
48A440l054L427l863M387n028N834o885Q316j0394J3696j9791L4811j40638k63826
$$ 1440 -1614 1813 -2050 2337 -2691 3143 -3742 4574 -5820 7876 -11915 22896 -117742 -381568
62c81568J39431K16834J59188M1192K0336p1773j85305k06490k6997J59616K12692
$$ -381568 -242137 -25303 133885 175077 195413 123640 -61665 -268155 -295152 -135536 77156
73G7156J22681K0162q3667j67099j83414o3686J04051J97332J59300N7045o3450
$$ 77156 199837 219999 136332 -30767 -214181 -277867 -173816 23516 182816 239861 176411
84A76411j62596j90140r0717P7122J87077J65623O7247l9137j26382j74630j26754
$$ 176411 13815 -176325 -267042 -189920 -2843 162780 230027 190890 64508 -110122 -236876
95b36876J8253J64884J92159J01004k6990j22810j63125j27456j1710J21236J75552
$$ -236876 -218623 -53739 138420 239424 212434 89624 -73501 -200957 -212667 -91431 84121
106H4121J21495J3666q6502j53078j56307o2082R3061J92522J53975K1166r6090
$$ 84121 205616 219282 132780 -20298 -176605 -238687 -145626 46896 200871 222037 125947
117A25947j41700j26584o3582M0891J42646J65633P8581n6899j48162j47840p2227
$$ 125947 -15753 -142337 -205919 -165028 -22382 143251 221832 164933 16771 -131069 -203296
128b03296L0217J16428J47945J03368m148j20359j68074j11779J1953J20601J49861
$$ -203296 -173079 -56651 91294 194662 190514 70155 -97919 -209698 -197745 -77144 72717
139G2717R9061O362q5671j39333j24097l4418Q5119J56477J27426K5405p8833
$$ 72717 171778 178140 92469 -46864 -170961 -205379 -120260 36217 163643 189048 110215
150A10215j28623j14966n2035M2771J29517J46373O6931n5068j33751j27931o1348
$$ 110215 -18408 -133374 -185409 -142638 -13121 133252 200183 145115 11364 -116567 -177915
161a77915K7820J07785J39408Q8867k2313j18263j37754p9177J2618R3270J29013
$$ -177915 -150095 -42310 97098 185965 163652 45389 -92365 -171542 -158924 -65654 63359
172F3359R8106R219q8323j34649j01903j5390P7430J26918J09315L2111o5207
$$ 63359 161465 170684 82361 -52288 -154191 -169581 -92151 34767 144082 176193 110986
183A10986j26574j15969l9743N9404J23254J15831M5013m8062j10875j13193n7638
$$ 110986 -15588 -131557 -171300 -111896 11358 127189 172202 124140 13265 -99928 -157566
194a57566K8027J02329J24219P3785k5042j08618j21332o4363J6738Q0754J08182
$$ -157566 -129539 -27210 97009 170794 145752 37134 -84198 -148561 -131823 -51069 57113
205E7113Q8889J3889q3264j34510r5479K406Q4383J08885P9592K0550n3620j09849
$$ 57113 146002 159891 76627 -57883 -153362 -150956 -66573 42312 121904 142454 88834 -21015
217b1015j06273l4158N9866J12316R7340L2886m4110r8050j02536m9185L3959
$$ -21015 -127288 -161446 -101580 10736 108076 140962 96852 -1198 -103734 -152919 -118960
228a18960R7580J04596N4431k2449q8870j08061o6194J7351R0323J07702O3843
$$ -118960 -21380 83216 137647 115198 26328 -81733 -147927 -130576 -40253 67449 131292
239A31292j0750p4544r8406p2891o213O7699J03980Q0749J2607o0077r8639q3302
$$ 131292 120542 45998 -52408 -125299 -131512 -63813 40167 120916 133523 73446 -25193 -108495
251a08495k1274N3791R7525Q5072K8648m0428q8127r1821m3376L5475R5467R4891
$$ -108495 -129769 -75978 21547 106619 135267 94839 6712 -85109 -128485 -93010 2457 97348
263I7348L7052l5025p9431q1958m9269R307P0314R6187O2386j1643p6558r2280
$$ 97348 134400 99375 19944 -62014 -111283 -101976 -31662 64525 126911 115268 38710 -53570
275e3570n7348K102N7515Q6504O9671J1968n7444r3286p3635j2398N1519Q4509
$$ -53570 -110918 -108816 -51301 35203 104874 116842 59398 -33888 -107523 -119921 -68402 16107
287A6107P2171K1612m1582q1767p6382k8478L3947P5914P7444L6982k3711p3079
$$ 16107 88278 109890 68308 -13459 -89841 -118319 -84372 -8458 68986 105968 82257 9178
299I178q0783m2825J9824O8804P9990M7737q412o1562q1862n5445N173O2090Q0986
$$ 9178 -71605 -114430 -94606 -25802 54188 101925 93513 31951 -49911 -105356 -100183 -38093 42893
312D2893N4801P79n0576p4754o0108j1276M4599P5645O4426J7319l7507p1714
$$ 42893 97694 98473 47897 -26857 -86965 -98241 -53642 22003 86429 103748 66241 -5473
324e473o7777k5632L1625P1091O9353K9646k4489o5419p2049l7543J8732O5670
$$ -5473 -73250 -98882 -67257 3834 73187 102833 78344 12925 -59124 -96667 -77935 -12265
336a2265P2440L7136j6452n6500o6404m4310J723N0330P1465N1360n73n0009o9110
$$ -12265 60175 97311 80859 24359 -42045 -86355 -84632 -34302 37163 88523 87950 37941 -31169
349c1169n0191p488L9073O6278N8102J5953l7481o8888n9889j7063L3450O3582
$$ -31169 -81360 -88848 -49775 16503 74605 90558 53077 -15811 -75700 -92763 -59313 4269
361D269N9468K3067k5384o0116o0451k7737J9318N4911O1231L4965j2010n2830
$$ 4269 63737 86804 61420 1304 -59147 -86884 -67566 -12655 48576 83541 71531 18701
373A8701o4082l8033Q867M8560O0874M1836N43m3396o4863m7481j986M4408O0612
$$ 18701 -45381 -83414 -74547 -25987 34887 76723 77266 33870 -30993 -78474 -80460 -36052 24560
386B4560M4667O512l3250n6826n0058j5020L0203N7611N1242J7711k4350n2220
$$ 24560 69227 75739 42489 -14337 -64395 -79415 -49212 8399 59641 77352 53002 782
398G82n2988k4698J8175N1890N5850K7994j4455m8294n5157l2730R469M6780N6697
$$ 782 -52206 -76904 -58729 -6839 49011 77005 62550 14256 -40901 -73631 -64162 -17382 39315
411C9315L3593p236m0387n1102l7063l545L4776N5536M2685M082l4482n0833m0117
$$ 39315 72908 65672 25285 -25817 -62880 -66425 -31649 23887 66572 70654 36172 -14661 -54778
424e4778j1079K3635M9371M7989J7305k4876n1610m7595j7182K0757M5419M6366
$$ -54778 -65857 -42222 7149 55138 72443 47567 -4043 -51638 -68820 -48063 -2644 43722
436D3722K1929j4308m3412m7441k6483Q938L9608M8925L0824n687l8627m8482
$$ 43722 65651 51343 7931 -39510 -65993 -57055 -17447 31478 62302 56615 17988 -30494
448c0494l1295J550L1126M5781L7158P736k9986n1038m0795m853L0872M5584L5383
$$ -30494 -61789 -60239 -29113 16668 53826 61562 31576 -19462 -60257 -65110 -34238 11346 46729
461D6729R971j8977m0686m1874j8083J8362M3427M3322J8887j4761l9180m1820
$$ 46729 56700 37723 -2963 -44837 -62920 -44558 -1131 42191 61078 46317 7137 -34683
473c4683k1720R982L5670M2642K6741l262l3655m6258l1250L010L5940M4747K7175
$$ -34683 -56403 -46421 -10751 31891 58632 55370 21715 -24543 -55793 -52783 -16843 27904 55079
486E5079k472k7261l6803l2202r804K1389M3764L8882Q242k5561m0991l3510j1038
$$ 55079 52607 25346 -11457 -43659 -53463 -32074 11690 50572 58814 33253 -7738 -41248 -52286
499e2286J5835L5208L7683J8232j3105l7735m0998j9584J2164L6802L8593J8698
$$ -52286 -36451 -1243 36440 54672 41567 3832 -37166 -56750 -44586 -7784 30809 49507
511D9507r422l0761l5623k2821Q78K6585L9558K9616P48k8624l9789k7279r52
$$ 49507 40085 9324 -26299 -49120 -48242 -21657 17901 47517 48265 19641 -20148 -47427 -48379
524d8379K3239L4918K9807R455j8919l7995l3924r526J9910L6245L1835J1254
$$ -48379 -25140 9778 39585 49040 30121 -7874 -41798 -51324 -31414 4831 36666 47920
536D7920j4746l2222l2115j4432J0442K9171L3132J9876n260k9597l6102k1950
$$ 47920 33174 952 -31163 -45595 -35153 -5982 27150 47026 41766 12169 -23933 -45883
548d5883O302K8744L3183K0429l95k2176l3893k7388l567K4105L6216K5661J148
$$ -45883 -39581 -10837 22346 42775 42380 20204 -13689 -41077 -44644 -20539 15677 41338 42486
561D2486k0089k9774k5329r363J3489L1212L1070J1064j4729l0122k9052j3114
$$ 42486 22397 -7377 -32706 -42069 -28580 2632 33702 44766 30037 -85 -29137 -42251
573d2251R132K7712L1961J6897p967k8221l1531j7432O363K4534L0211J8731j807
$$ -42251 -33119 -5407 26554 43451 35484 7263 -24268 -41700 -35337 -10803 19408 38139 36332
586C6332k1815l0517k1878j159J9837L0678K3848L032j8686k9301k3256o296J3450
$$ 36332 14517 -16000 -37878 -39037 -19200 11478 35326 38358 19672 -9629 -32885 -39181 -25731
599b5731K7392K7977J1277j3498l0801k7685r035J2927K5033K4869J3520o267
$$ -25731 1661 29638 40915 27417 -3384 -31069 -40104 -27177 -2144 22725 36245 29978
611B9978k4062k8481j5196N372K3480K7123J7342k147k0712k8057j8947Q45J9276
$$ 29978 5916 -22565 -37761 -32389 -8909 18214 35556 33409 12697 -15360 -34307 -33462 -14186
624a4186K5964K0422M534j4851k8946k5644m921K0142K8828J9373J877j1672j9639
$$ -14186 11778 32200 36734 21883 -7063 -32707 -37628 -17486 11342 30715 32592 20920 1281
637A281k2197j2916O336K5772K8263J2038j1620k4418k3177j0579N237J7953K4423
$$ 1281 -20916 -33832 -27496 -1724 26539 38577 26957 2539 -20638 -31217 -25980 -8027 16396
650A6396J6944j333k0060k8379j8565K765K1047K5889J4527j681j4980k1069j7883
$$ 16396 33340 32007 11947 -16432 -34997 -32232 -11185 14704 29231 27550 12570 -8499 -26382
663b6382o208J1216K4497K3749O549j5275k4871j9487n391R923J9777K1506J1245
$$ -26382 -32590 -21374 3123 26872 33421 18146 -6725 -26212 -31603 -21680 -1903 19603 30848
676C0848o953k1268k3839j1585O571K1149K3645J2689o300j9935j9925j0823J099
$$ 30848 23895 2627 -21212 -32797 -26226 -5077 18568 31257 24957 5022 -14903 -25726 -24627
689b4627J3193K0508J8797M090j6534k6200j7444N40J6935J9658J3571N111p834
$$ -24627 -11434 9074 27871 31961 15427 -10773 -28217 -27677 -10742 8916 22487 27598 19764
702A9764j9501k2251r486J1840K4135K0069L949j1016j7289j6273q825L293J5671
$$ 19764 263 -21988 -31474 -19634 4501 24570 28519 17503 214 -16059 -24884 -21591 -5920
715e920K0235J3413k693j8255k1969j2751M107J5907J9303J2388M82j2744k0612
$$ -5920 14315 27728 25035 6780 -15189 -27940 -23833 -7926 11377 23765 24247 11503 -9109
728i109j6080j785J4160K0427J5209J773j1787j7594j5021n337Q010J7709J7578
$$ -9109 -25189 -26974 -12814 7613 22822 24595 12808 -4786 -19807 -25144 -17134 575 18153
741A8153P825p122j7576j8341r162N964J7449J8356R761n006j6062j7598j0071
$$ 18153 25978 18856 1280 -17061 -26223 -20259 -2810 15546 25307 20301 4239 -13359 -23430
754b3430J956J4065J8073J2615n53j4287j8255j1886n4J0834J6579J3781M197
$$ -23430 -21474 -7409 10664 23279 22726 8439 -9816 -21702 -21756 -10922 5657 19438 23635
767B3635r127j9036j6166l695J0253J6762J4417N814n990j6103j8032p763P749
$$ 23635 14508 -4528 -20694 -24389 -14136 2626 17043 22857 16867 764 -17268 -25031 -17282
780a7282J7781J5218N976m463j2822j5637j0369J969J3630J7717J0512j692j2395
$$ -17282 499 15717 21693 17230 4408 -11229 -21598 -19629 -5999 11718 22230 20538 8143
793H143j6050j1643m21J0676J6217J3203K348r919j7382j4190k908J0925J6386
$$ 8143 -7907 -19550 -19971 -9295 6922 20125 22473 12554 -4828 -19018 -21926 -11001 5385
806E385J2136K475p234j2946j3519o935L873J4391J6396P720n546j4904j4627
$$ 5385 17521 19996 12762 -184 -13703 -20638 -16765 -2374 14022 21742 16196 1292 -13335
819a3335p037K952J1713J5532R788k047j2206j5378j0135O97J1282J5443J0761
$$ -13335 -20372 -17420 -5707 9825 19613 17566 5360 -10018 -20153 -19456 -8174 7269 18030
832A8030m62j0260j3148j0132k243O490J3547J3354N148p164j5443j3419l154
$$ 18030 17568 7308 -5840 -15972 -18215 -11725 1822 15176 20324 13160 -2283 -15702 -18856
845a8856P304J2170J1727O291k962j1899j5355q206N107J3750J3360N378l576
$$ -18856 -11552 618 12345 18636 15674 3775 -11580 -19786 -14679 -929 12431 17809 14233
858A4233r134j1403q879o17Q895J3360J0678O64q905j3678j0979j337Q177J2631
$$ 14233 5099 -6304 -15183 -15800 -6905 6455 17133 17797 8892 -4786 -15765 -17102 -8925 3706
872C706J0466K939o450j2342j2493m445O527J3170J1484L167n408r926j0558o380
$$ 3706 14172 17111 10661 -1681 -14174 -18619 -12092 1078 12562 15729 10321 395 -10163 -16543
886a6543J898J0234J3231P930k721j1125j1586p573J208Q450J2978R113kr113
$$ -16543 -14645 -4411 8820 16750 14029 2904 -8682 -16255 -15047 -6597 6381 15494 15492 6379
900F379j2497q735q16P754J2348J0184J027o947j1349r066k411M237R948J1519
$$ 6379 -6118 -14853 -15669 -7915 4433 14617 15644 8697 -2652 -11718 -14129 -9892 56 11575
914A1575N448m523j2130j1294m567M546R367J0586O231j445r896j2464p539K766
$$ 11575 17023 12500 370 -10924 -15491 -10945 -1578 9008 15239 13794 3898 -8566 -16105 -13339
928a3339J0096J0816O393j558p315j0466p726j406P009J0880R039K000o308j1664
$$ -13339 -3243 7573 13966 12408 5093 -5373 -13099 -14505 -7496 3384 12423 14423 8115 -3549
942c549r453k188O512J0323Q950L434m001j0016j0773m813M923J0839R983L375
$$ -3549 -13002 -15190 -8678 1645 10595 14029 10028 12 -10761 -15574 -10651 188 10171 13546
956A3546m178p469q719n212M93P451J1166P131j341q096j0374o694K90P095J0038
$$ 13546 9368 1899 -6820 -12032 -11539 -4088 7078 14209 12868 4772 -5602 -12296 -12006 -4911 5127
971E127O930Q70o450r380q393j610N497J0375Q177J736n806r239o166l332K473
$$ 5127 12057 12927 6477 -2903 -11296 -12906 -7409 2966 11143 12879 7073 -2166 -8332 -11664 -9191
986i191P031R432N418k681r232r595m073K667P195Q302N776m52o983j0046o348
$$ -9191 -2160 7272 12690 10009 777 -8818 -12891 -10224 -3029 5273 11049 10597 3614 -6432 -12780
1001a2780J228P925Q292N823k68n319p756o840j186M661Q291P424K207l640q762
$$ -12780 -11552 -3627 4665 10488 10220 4901 -2855 -9695 -10881 -6220 2071 9495 11702 8062 -700
1016g00p932k623M497P646P228L515k295p396q948m211K486Q142P901L323k344
$$ -700 -8632 -11255 -6758 888 8116 11631 9336 1940 -7008 -11219 -8733 -591 7310 10633 8289
1031H289n322p005n602n08N695Q617O375n37o049p794n579j244M022P919P076
$$ 8289 2967 -4038 -9640 -10148 -4453 4164 10539 10002 3953 -3841 -9420 -10664 -6642 1277 8353
1046H353K293m659q351p200j895M386P706O894J702l343n770n952l582M00N817
$$ 8353 10646 5987 -2364 -9564 -11459 -7073 633 7527 9229 5886 116 -5836 -9418 -9018 -3201
1061c201R015N538k287p490p227l531J631M713O772N393J229n257r145n753N50
$$ -3201 5814 11352 9065 1575 -5652 -9183 -7552 -2839 3933 9326 10555 5298 -3847 -9600 -9050
1076i050O219P048M301L51l699n508o124k231K266O717P288L298l565p858p109
$$ -9050 -2831 4217 8518 8869 5170 -338 -6462 -8693 -6427 290 7578 10876 7311 -547 -7656
1091g656k084L515N655N290L229j57n182q133n741J953P466P572K040k138m240
$$ -7656 -9740 -6225 -570 4720 7949 7792 2610 -5523 -11264 -9311 -1845 5727 7767 5629 1389
1106A389m655l748k089L478O947O677J139m466p561n394l95M190O071M925J987
$$ 1389 -3266 -7014 -9103 -5625 1322 7999 9138 4672 -2889 -8283 -8678 -4488 1583 6508 8495
1121H495k492n326o558k996K536P069O636J116k819n135m024k522m5L400O300
$$ 8495 6003 677 -5881 -8877 -6341 728 7364 8480 5661 526 -3498 -6020 -6065 -2665 3635
1136C635N100L13n908p283l874J000M604N543M026M01l887n867m488j309L263
$$ 3635 8735 9048 3140 -4143 -8017 -7017 -2413 3130 7156 7557 3670 -2197 -6685 -7994 -4731
1151d731N935N293J117l758n347m788r84J947M096M896L462p85n396o452l450
$$ -4731 1204 6497 7614 3856 -1491 -6279 -7263 -5316 -1220 3676 7138 6353 957 -5495 -8945
1166h945K200N495N353K479n37l705n642m302P06M346O138L006j2l528m352m341
$$ -8945 -6745 -1250 4103 6582 6045 2340 -3302 -7604 -6898 -2552 3586 6592 6580 3052 -1300 -5641
1182e641j115K895N551M709J396k781n206m753k291J993N832N301J789k839m524
$$ -5641 -6756 -3861 1690 6399 7795 5014 -192 -4945 -7236 -5243 589 5890 7679 4840 316
1197C16m879k238J322M645N111K607j584m112m244l154l65L166N733M420k98m285
$$ 316 -4563 -6801 -5479 -834 4277 6884 5300 1188 -3056 -6210 -6575 -3409 2324 6744 6446 2161
1213B161n499l095p2K636M550M703J549l178n794m172p28L057M780L774J356k230
$$ 2161 -3338 -6433 -6505 -3869 681 5384 6933 3755 -2039 -6211 -6939 -3882 898 4672 6028 3798
1229C798m055l677j689P60L375N407L673j268n508n380j610K001L164L912K599
$$ 3798 -257 -3934 -5623 -4863 -1488 3919 7592 6324 816 -4564 -6174 -4173 -1009 2903 5502
1244E502J147k927n824m466J46N262M897J879j241j972k896l124j754J265M287
$$ 5502 6649 3722 -2102 -6568 -6422 -1160 3737 5616 4375 2403 -493 -3617 -5371 -4106 181
1259A81M573J717k473n046m370j227K817M256K865J054p22k630m410l068N61M778
$$ 181 4754 6471 3998 -1048 -5418 -6645 -3828 428 3293 4347 3625 995 -3415 -6483 -5922 -1144
1275a144N196J403j862l589k432j626o13J462L392M663J387k913n574l119L45
$$ -1144 4052 5455 3593 4 -2428 -4054 -4667 -3205 187 4850 6237 3324 -2250 -5369 -5024
1290e024L127L887K386O09j479l109l608j531J237M125M118J400k876l377k279
$$ -5024 -1897 1990 4376 4985 3506 397 -3211 -4742 -3505 620 4738 6138 3262 -115 -2394
1305b394q62K89J248L316L219O24l148n171k617Q81L831K995J569j35j434l338
$$ -2394 -3256 -2967 -1719 1597 4816 5440 2292 -2879 -5496 -4615 -784 2211 3780 3645 2211 -1127
1321a127l469r10K469M267K218M27j572k896k892j383J184L231K853J639n17k631
$$ -1127 -4596 -5506 -3037 1230 3448 3875 2303 -593 -3485 -4868 -3684 -453 2400 4039 3522 891
1337H91l772k606J017L800L795J513j281k318l120j652o08K882L836K243k4k829
$$ 891 -2881 -5487 -4470 -670 3125 4638 3357 1039 -2081 -3733 -4341 -1459 2377 4620 4596 1767
1353A767k829j556r71J395K663L318J318k003l369l262o07J200L338L272J009
$$ 1767 -1062 -2618 -3589 -2194 469 3787 5105 3102 -267 -3529 -4136 -2936 402 3674 4683
1368D683j709l165k769j082O29K497L315J717j386k808k317r95j50P58L208L393
$$ 4683 2974 -191 -2960 -4042 -3413 -916 2399 4116 2730 -78 -2395 -3390 -3540 -2782 426 3819
1384C819M89k739m104k042P14K114K574K504P14j480l372l029m46K542L315J944
$$ 3819 4308 1569 -2535 -4577 -3863 -1749 825 3329 4043 2563 -809 -3838 -4284 -1742 1573 3517
1400C517J67j065k142k464j429O91K716K823J602m87k604l806j640Q69L596K047
$$ 3517 3684 2619 477 -1987 -3416 -2725 -9 2814 4416 3929 1325 -2481 -4121 -3252 344 2391
1416B391J179j36j939k344k881k50K402L636J514q31k009j756j660p81N41K226
$$ 2391 3570 3434 1495 -849 -3730 -3980 -1578 2058 3572 2741 732 -1024 -2684 -3465 -2924 -698
1432f98L227J207j625l140k719m86J634K423K320R32j250j784k044j368j9K360
$$ -698 2529 3736 2111 -1029 -3748 -4234 -2600 -177 2143 3075 1825 41 -2003 -3371 -3390 -1030
1448a030L254J427j164k349j603n09l14O54K185K878P50j937l379j749K99J718
$$ -1030 2224 3651 2487 138 -1465 -1974 -2288 -1634 551 3429 4179 2242 -1137 -2886 -2587 -869
1464h69J926J605R54j135k517k572j53J105K376J198R19k79k150k265j397Q69
$$ -869 1057 2662 3616 2481 -36 -2608 -2761 -1656 720 1918 2837 2558 408 -1857 -3254 -2385
1480b385J793J810J277j12j261k641k416O44K405J970R78k64q60j578k054r21
$$ -2385 -592 1218 2495 2383 1122 -1519 -3935 -3291 -886 1084 2062 1798 938 -640 -2694 -3615
1496c615J792K761J233n07o95j056j726j267P01K334K077J233p22k172k168j110
$$ -3615 -1823 938 2171 1664 969 -87 -1813 -3080 -2379 -45 2032 3265 2543 371 -1797 -2907
1512b907Q46J894K274Q36k79j877j862r25M5J269K308J515o78j961j085n65j028
$$ -2907 -2061 -167 2107 2943 2664 787 -1075 -2000 -1955 -686 1622 3137 2459 498 -587 -1152 -2180
1529b180K72J926K519Q75j506l140j282J60R71J631J108J099k16k440k108o34
$$ -2180 -1908 18 2537 3412 1906 -1234 -2516 -2356 -1385 246 1354 2453 2237 -203 -2311 -2945
1545b945Q90J817J432R02l93j395j774j057K22J065J905J549P28j487k299k387
$$ -2945 -2055 -238 1194 2096 1703 308 -1466 -2523 -2301 -1236 669 2218 2946 1459 -840 -3227
1561c227Q63K223J477L85J98k68j774k042p01J616K305J145k92o67r32j820m25
$$ -3227 -2364 -141 1336 1721 1919 1651 -123 -2165 -2866 -1250 1055 2200 1908 1241 309 -1511 -1936
1578a936p0J415J770J294m5j716k326j400P73J833K126J10n93n93j264j186n49
$$ -1936 -2006 -591 1179 2473 2428 712 -1614 -3014 -2241 -408 1718 1828 1235 642 -622 -1808 -2357
1595b357N98K698J500o82j719r38n18l21J15J178J871J290p69k408j589k09Q60
$$ -2357 -1759 939 2439 1757 38 -900 -1418 -1739 -1624 -446 1425 2715 1946 -462 -2051 -2260 -1400
1612a400J627J807L89q84j299j322q25Q47P54J504J226k00j657j481m59o6J025
$$ -1400 227 2034 2423 1539 240 -1082 -1907 -1060 -306 1198 2424 2224 567 -914 -1373 -1439 -414
1629d14R75J145J004r78k312j820L43J393J778K72K22l29j581j586k83P21J786
$$ -414 561 1706 2710 1732 -580 -2400 -2057 -664 1114 1386 1608 1279 -302 -1888 -2171 -1450 336
1646C36J052j86j43r69j065j279m7J552J486J019k94q85k026p81L79J407J359
$$ 336 1388 1202 1059 90 -975 -2254 -2301 -749 737 1756 1462 577 -1449 -2230 -1851 -444 915
1663I15M87l01o55q26j096p65J391J587J001j21j013n25n65o44n84J191K320P84
$$ 915 1402 1101 446 -380 -1476 -2241 -850 737 1738 1617 604 79 -486 -1130 -1714 -523 1797 2581
1681B581q09j972r35l67N73Q23J146Q47l38j011j486l84M7Q84J596P02l05j734
$$ 2581 1772 -200 -1135 -1502 -929 -106 1040 1887 1549 538 -948 -1332 -1285 -401 1195 1897 1592 -142
1699a42p11j27p2n2O97J550J074o95k362j691M30J843P12L96P6P8o65j651r79
$$ -142 -853 -980 -1052 -1104 -407 1143 2217 1522 -840 -2531 -2101 -258 454 850 926 1004 339 -1312 -2291
1718b291P72J708R38L41n03q59p40r16J61Q46P47J098J77l50j835j525K83J651
$$ -2291 -1519 189 1127 1468 965 106 -634 -1550 -1389 -543 204 1302 1479 1129 -706 -2231 -1948 -297
1736b97J204P95p48q04J57j082r77L40J728J412n2r98q60l25o93n01J514R00J143
$$ -297 907 1702 954 150 307 -775 -1752 -1412 316 1728 1676 678 -182 -507 -1200 -1701 -187 713 1856
1755A856l37j515j237l57r2J042J687P72r93r25l81m48j27J3J421J164L0j121
$$ 1856 1519 4 -1233 -1590 -1682 -640 1047 1819 826 -99 -480 -928 -1055 -1042 379 1543 1573 452
1773D52r77o84N48R7M12J052J037o05j601j142k13J159Q14O88N39m07p98j668
$$ 452 -525 -1209 -661 -564 -152 900 1937 1332 -269 -1411 -1624 -465 349 1037 1576 1169 371 -1297
1791a297m41R01R27N58N10k60n30q49p88J70N78J216J49J89q0j642o92k58J259
$$ -1297 -1738 -837 90 648 1158 898 368 -481 -1269 -1099 -521 695 844 1033 953 -689 -1381 -1639 -380
1810c80J162J1l00O8l95j050r99J160R52O78L7o45Ol04j237k53J127J027J211
$$ -380 782 793 493 561 166 -884 -1883 -723 229 907 944 299 305 1 -1236 -1489 -362 665 1876
1829A876m78j333r06q5L00O02P82N72m45m01l91q09l33M23J376O60o4j308k18
$$ 1876 1398 65 -841 -926 -626 -24 758 1330 885 484 93 -716 -1049 -626 750 1410 1346 38 -180
1848a80J48n32j67K13J344P95k42j809r84K83O74R54M5M83k82l56j362m34K43
$$ -180 -32 -564 -731 -518 826 1621 1379 -430 -1414 -1131 -457 497 542 1025 743 387 -975 -1409 -1166
1867a166P50N50M94K89q87r91k97N52p4L73N96R00o5j190j393M9J052P77L85l93
$$ -1166 -416 134 628 917 30 -961 -1258 -706 -780 -407 189 1089 1024 -166 -1559 -1510 -458 319 704 311
1887C11O4k65l10q57J37Q46J503j69n50l11n19n12l7K76J006M53K25m55q55p85
$$ 311 375 110 -200 -1057 -920 -74 1429 1260 710 399 -120 -632 -669 -393 613 1066 1291 836 -19 -804
1907h04O0O23R92N09n47m67m95K09o01m31O76J358K49j135l74k53k47N0K57O57
$$ -804 -744 -121 871 1380 833 366 -129 80 -521 -952 -276 1082 1331 196 -178 -431 -678 -628 -371 286
1927B86N46l39m90r69n01N32O18L64N82O2p82o76rJ6M13N67L90M42k16j359j83
$$ 286 832 493 3 -966 -1467 -935 -317 47 629 691 -91 -767 -776 -760 -347 220 610 1052 836 -523 -706
1948g06L5M86J51M55O94k92p14j240qQ93O85J95j3q5k63p46o91M56P44M84m7M
$$ -706 -671 -185 -34 421 1115 823 109 -1131 -1139 -246 439 634 621 536 273 -473 -1164 -708 36 520 473 477
1970D77j85k69p57k31K95J074M76l26n49m64k68p46J025J052K58l46l74j45J30
$$ 477 292 23 -734 -965 -670 404 880 554 5 -459 -727 -1473 -448 604 862 516 142 -3 127
1989A27r96%J079O45L47o40r76j22K62k42J16Q51P38mq55r71l86N48P54r0N17
$$ 127 -869 -869 210 855 1202 562 -414 -536 -274 -516 -400 451 1189 1185 330 -641 -1027 -479 275 185 702
2010G02m05P3l55o53L22l08O83J114m62l26j158L6M27j53k9K35J045L15j267j434
$$ 702 297 370 15 -638 -316 -624 59 1173 711 385 -773 -737 -310 -463 -492 -257 788 1103 -164 -1598
2030a598J18J011P91M0l55K26j35m77l23r8O52P34m3j48q3l47o73k5O19N06J97
$$ -1598 -1480 -469 322 362 7 233 98 -379 -702 -800 -148 586 543 395 312 -35 -708 -733 -114 392 589
2051E89M75n8q92p65l00L81J529J84q38M8l34L11n69l09N21P11K74o45k33l99
$$ 589 1064 1006 114 -651 -951 -570 959 1143 305 353 19 330 -239 -548 -27 684 958 313 80 -319
2071c19L15m11J13M39O12O9r30n02j75rL42O58M96k97n64k53qj50k9K51N96L89
$$ -319 -4 -415 -302 137 749 818 -112 -614 -789 -798 -456 202 698 401 -163 -416 -424 -574 -603 -352 244 633
2093F33n36o22k00J60N0K54K55P45J11q60p15j1K00M71L48R6J84j23q19k89M00
$$ 633 97 -525 -725 -565 -515 -261 -6 739 850 -10 -725 -736 -536 -65 283 379 563 440 -379 -668 -268
2114b68P17J40r9m4J68n50m88k1L53M35K18L80m22o90l37k42L73P64L71n49J67
$$ -268 449 589 490 446 614 64 -424 -445 -92 343 561 941 519 -171 -508 -750 -377 387 758 209 376
2135C76j61J2j077K46R36P7q4m04J52Q8n80m01K1Q14N20j1n64m61j8K56K26L08
$$ 376 215 227 -850 -604 332 409 325 -79 73 161 -419 -820 -799 15 535 524 -40 -501 -519 -263 -37 271
2157B71M60m29k29l93N25n98j86K39R21O1l52o13K34l5J67l88N67K01O64p46q48
$$ 271 731 302 73 -320 205 -393 -579 -340 581 642 290 -323 -89 -124 43 -345 222 423 1087 341 -507
2178e07m85O11N03K02L7m38L28m75R5o8j14kN97M63p71m43l6K09J34LL61J25L15
$$ -507 -992 -381 122 324 361 -77 251 -224 -129 -197 -311 -313 284 747 -24 -467 -503 -294 -160 -157 204 329 644
2201F44n19j034K6L41R34K42m26l9j42J73l47j62q6Q02K55m15j78o0k38k13L47
$$ 644 125 -909 -883 -542 392 634 208 169 27 200 -147 -309 -395 407 662 247 69 9 -229 -442 -95
2222i5N40L14Lj40l38l63k86Q6N32N37o11k68k15L52Q4l96j39Q14K69l29o64j00
$$ -95 445 759 762 622 284 -79 -365 -279 253 790 179 -89 -304 48 132 -264 -403 411 680 351 -313 -413
2244d13k48J38l4M40N61J1o11l52j70L24K10K35l20J16L32m98k85L34k7j12K38
$$ -413 -661 -523 -557 -117 444 455 -156 -508 -678 -354 -144 91 -229 -113 219 -279 -564 -230 -257 -369 -131
2265a31L26L33n78o04K85N10k38L29L09J62m61o63j28N77L56L35j89M5r0n08J84
$$ -131 195 528 -50 -654 -369 141 -97 232 541 703 242 -421 -549 28 384 719 530 575 485 -23 161
2286A61l82N28M0qn3jj91L9l64k04L64K93K95j69n62k83o5R4Q19L8k78j14p8k22
$$ 161 -221 307 347 339 286 285 94 133 -231 -435 -71 222 517 348 -214 -497 -562 -468 351 389 111 -3 -81 -303
2310c03M9l31L85L20J26j89l45M9O0k91J03L96O08j93m01m20j10%L39K3pL00l49
$$ -303 -254 -585 -200 120 246 57 -288 -239 -179 -470 -367 29 637 444 43 -377 -487 -487 -148 -125 -132 168 -181
2333a81o3N5L08p9K28r6L13k56l24l45R2K61K45j3L70K13l20r69q9N98M73m6k82
$$ -181 -244 -189 119 40 268 172 485 229 -95 -440 -348 -87 158 145 515 728 408 -561 -650 -52 421 375 93
2356I3q7J8o6j20j25N66J47j55R0j10k32k13j21m7P33N7m7N3m89m08P3J92K61
$$ 93 6 24 -42 -162 -287 279 426 271 361 251 19 -194 -315 -362 371 428 381 434 -55 -463 -390 -198 63
2379F3L18on88q7K55J0POK21J69j80j08J4k90j57o6L57K86K37n23l29n4K39M5
$$ 63 381 375 -213 -300 -45 -35 -28 -22 199 368 188 80 94 -196 -353 -419 -62 224 461 -62 -391 -445 -206 -161
2403a61K80l2P9l77K6O6k41R1K87k31L97m0l92k65M00J35m57M47L83K65n24n76
$$ -161 119 87 166 -211 -185 -119 -360 -269 18 -213 184 144 -248 -513 -113 22 -435 12 395 660 136 -440
2425d40l24R14L70l84r7pk3L20k36l67J81L38KJ59q6k06Q4J67l20k64M11Q9k05
$$ -440 -764 150 520 136 39 32 9 329 93 -274 -93 245 247 406 320 114 198 365 45 -219 192 281 76
2448G6N0k21o34O49L97P2k95k94J5M90m01n60J36O23N33n05k80J0q9K48l89K20
$$ 76 126 -95 -729 -80 317 389 94 -200 -185 305 -96 -656 -520 103 636 131 -149 -139 -228 20 -369 -149
2470a49L09Q6l53j53q9K66j66M51J31n20j59K20K60o2j4j07p7P47o5m06k44j72
$$ -149 160 246 -107 -260 -349 -83 -249 202 333 -187 -346 -126 134 72 58 -49 -126 621 556 150 -94 -266
2492b66K05n9M1K68K35O4l01l15j16M03K98j17q8j20j32k6m4L45l09pK36K61l22
$$ -266 -61 -120 -79 189 424 488 187 -128 -244 159 457 340 252 132 0 -26 -70 275 -34 -41 195 456 134
2515A34k49j64K5K58p1j5L21J22o53k06q6O00J68j45j67M43l81K35n73N2K07J08
$$ 134 -115 -279 -254 4 -67 -82 239 361 -292 -498 -584 16 184 39 -128 315 -66 169 -404 -352 -145 -37
2537c7K59l38J2J18m47L15K38k3O35r40j41M85j43J13q1p5K91n57j47M93j78J41
$$ -37 222 -116 -104 14 -433 -118 120 97 732 -208 -349 136 -7 106 25 -50 241 -316 -463 30 -148 -7
2559gk39K51M88l82l1R2j54k39J53k02N56O6k64j77k52O3K33K76j05Lk29K19q5
$$ -7 -246 5 493 111 80 172 18 -221 -68 -270 286 352 88 -89 -341 -278 -45 231 126 129 -100 119 34
2582C4q8n8J95m0L40o23L02k36O9K72m9KJ77J39l22m05q5K42L90p5l12J50K46
$$ 34 -54 -112 83 43 383 -240 62 -174 -105 167 118 120 297 436 114 -291 -376 -134 256 181 -131 19 265
2605B65m1k86l45L44L33K33k96n74J70J55K24m99J00L33m4P3l80j26LQ7L68K00
$$ 265 224 -62 -407 -63 270 503 207 -367 -197 -42 182 -317 -217 116 72 145 -235 -361 -358 -271 97 297
2627B97j05n59M16kJ8m30J76Q7K42P2m40J21j34K27K26j38J40k70M87m47j81J45
$$ 297 192 -367 49 47 65 -365 -189 -102 140 212 -228 -107 -241 -14 212 74 214 -56 431 -16 -197 -52
2649e2JK54J98m07p2k15N11p8q4m88M84J4J83k39j57R7J98P7m21L71k71L66l14
$$ -52 -51 203 401 -6 -78 -293 218 140 56 -432 52 66 249 10 -147 -50 148 225 -196 175 -96 270 -44
2672d4k23L51N3Q5l09J10k30M30l36J13m0l24K41o4L85J77o33j21O70K27o07M4
$$ -44 -267 84 137 222 -87 23 -207 223 -113 0 -40 -364 -123 -187 198 375 -258 -379 291 518 -89 -45
2694d5r0J54K21q33M67q8K19P6l4q2L7j81J52RK9K79j91J5J8k00J61n75O55m64
$$ -45 -135 19 240 -593 -126 -214 5 81 47 -35 2 -179 -27 -18 11 290 99 114 132 -68 93 -482 173 -291
2718b91N25q2l1o3k35J96K1M9J56k67m07N15J69j02j39k00J18M91j90k05J63k13
$$ -291 234 152 121 58 -177 19 40 89 245 -22 -429 86 255 153 14 -186 -68 423 233 28 191 -22
2740b2pr5J24J34j17k15l45O08j3m3j47l3J15J10j08k01O1J50N0M8R6J20k98L6
$$ -22 -29 -124 0 134 17 -198 -543 65 52 9 -138 -171 -56 54 -54 -255 -194 -44 6 54 150 270 -28 8
2764Hk49j45K93L9L28n30L08l38J87K29N6o3m32M91j41o1j22r2L42j45J5l5j22
$$ 8 -241 -386 -93 -54 274 -256 52 -286 -99 130 186 123 -309 182 41 -20 -142 -234 108 -37 -22 -57 -179
2787a79K22k60K96j3p2K60m2j77l43K36j20M97l02q5J59j86J64j30K72k03n3K92
$$ -179 43 -217 79 66 -6 254 212 35 -308 -72 -192 305 3 -82 77 -109 55 -75 197 -6 -59 233
2809B33L39m92k38J03K15M3l30K65J34l12k01NQ3K32L31k70j84L8LK17k5q9k98
$$ 233 572 80 -158 -55 160 203 -127 138 272 -40 -241 -236 -153 79 410 140 -44 -6 -3 214 189 100 -198
2832a98M05l02K27j54o4n0K68n1Q2m01J03L07k49O2n5L68k20j73J09m81L92n7
$$ -198 207 -95 132 -22 -86 -136 132 81 163 -238 -135 172 -77 -15 -70 298 78 -95 14 -467 -75 -132
2854a32N1l1J4j2M37j36l55k3Q6p5m3L82j0l76Q6P0J3j55K73M35l32K6q5Nr6J10
$$ -132 -81 -112 -98 -110 327 191 -164 -187 -101 -176 -219 163 153 -223 -137 -67 -54 -209 64 499 167 193 108 113 17 127
2880A27m24N64k83J84k05j41j95M29Q8k1L5J9l7j13j6n7K8K66j8m38J31m6k66
$$ 127 -297 267 -16 168 -37 -178 -373 56 144 123 158 177 140 27 11 -46 -18 248 230 -208 -77 -123 -389
2903c89L08j18J95o6K12k47L20k13k32J21O5L93j18l38j05L38k60M5J45j4j07
$$ -389 -81 -199 -4 -70 142 -105 215 2 -230 -109 -44 349 231 -107 -212 126 -134 -89 56 42 -65
2924f5o5J74o2k79K48J62p5K08j36P3K14j90j61k68M08m3O4l65K77J47k66p9K67
$$ -65 -130 44 -18 -297 -49 113 38 246 110 183 397 207 46 -222 186 143 207 -158 119 266 0 -79 188
2947A88j46k49K51O4k81J41K9l20L53K44k0o19J12K61J2J46k62J08N6J29j85P1
$$ 188 42 -207 44 108 -173 -32 -3 -323 30 274 254 -365 -253 8 20 166 -96 12 68 197 12 83
2969H3l71N84l55k6l2J59M3j84j24r2J82K35j15J01Ml48N32m26J12J04k3K20l61
$$ 83 -288 296 -59 -85 -117 42 85 -99 -223 -315 -133 102 -13 88 92 -256 276 -150 -38 66 43 263 -98
2992i8J80j98K3J93m9M4j94L7M6q6l14N41l57O48j37l58j69K71j0j06J75j45K47
$$ -98 82 -116 -93 100 51 95 -99 -62 -16 -102 -416 125 -232 416 279 -79 -248 23 13 -93 82 -63 184
3015A84l4m71L70l31J41J50j39Q0j34j1K17K38m09L1k55O88j89p5M5m10N60L7
$$ 184 150 -321 49 -282 -141 9 -130 -50 -184 -195 22 260 -149 -118 -373 315 126 51 96 -314 246 283
3037B83j56k43j34L98j72j07J30N3j10O2q1j3j21M93n6m48J68l34P25k35J30l05
$$ 283 127 -116 -250 148 -24 -131 -1 52 -58 4 -77 -90 -211 282 226 -222 -54 -388 337 102 232 -73
3059g3j26l7L66J7n15L76l2j05J13L6j28J55N5K3j99L3r6n1K33O7K73k87M9o2
$$ -73 -199 -236 130 147 -368 8 -24 -129 -16 20 -108 47 102 125 -74 -41 -137 -188 45 112 385 98 147 85
3083H5k11j24K75K43k7j70j86L03J46k25l30o4L68P3j52k75K10l0L34k34j62N7
$$ 85 -126 -250 25 268 241 71 -115 188 334 109 -221 -285 83 156 4 -271 -61 -91 243 9 -153 -96
3105i6J35Q4j19j26k7P8j76J93j88J97p5J98p4J10j51j37K18L9J21n70K36K90
$$ -96 39 123 4 -122 -149 -71 -247 -54 -242 -45 -120 78 4 114 -37 -174 44 83 204 -366 -130 160
3127A60j03o5J25k01M35l07j57LM18L3k55K29j88j86q3J62O8J31j81j13K23j53
$$ 160 57 -8 117 -84 351 44 -113 -110 308 341 86 315 127 -59 -142 20 88 219 38 -75 148 -5
3149ek5K4ok7L25J78o29J45P5Q9K4m00L49L6q2j55J99nk73J20j8J55N1p7j2J2
$$ -5 -30 -6 -12 -39 286 464 -165 -20 55 144 168 -232 117 153 71 -84 115 110 -163 -43 -61 94 145 68 56 68
3175F8p8j38J95J1l2K77l82J4J34q9l9R9J77k77J60k57j3M19r0l19J74K95k17
$$ 68 -10 -148 47 58 26 303 -79 -65 69 -20 -59 40 217 -60 100 -157 -170 249 159 -160 14 309 92
3198I2M6m0l09L02j66J87J85k13j4K75j11j61l69L44j11K00kK67k60j03k96K33
$$ 92 138 98 -211 91 -75 112 297 84 70 345 234 73 -296 48 -63 137 135 402 142 39 -257 -24
3220b4Rj19NJ43p5J58J19j65K2j3J77k22J17k49L46J22l29K7J50m4Q2n45K20M96
$$ -24 -15 -134 -129 14 -61 97 216 51 73 60 237 15 132 -117 229 351 22 49 199 155 237 -308 -88 408
3244D08o12M19l46j62N07k19m3k74L57L50j43m25L36l04K73j68N0J0m33P89m88
$$ 408 -204 215 -131 -293 214 -5 -48 -322 35 385 242 -183 153 -151 122 -46 4 14 -419 370 -118
3265a18J30k9j55M3J93J11j93n9P8K21l08j20o0O49n43L55j53k16K71K23p3l93
$$ -118 12 -17 -172 -129 64 175 -18 -77 1 222 -86 -206 -266 383 -160 195 42 -174 97 320 247 -146
3287a46J29n0j02k2J77Q0kK61q0j35K4k37J90m3l0J01M5J27j35k43M0J2j3J87
$$ -146 -17 -67 -169 -191 -14 66 64 325 245 110 134 -103 87 44 14 115 160 287 152 -91 -51 -39 -52 135
3311A35M4j69J42J68m47J6J70N1j35Jn3P5j27k7l2K87k65K82o2q7R0k37J23K71
$$ 135 179 10 152 320 -127 -111 59 110 -25 -24 -77 -2 -129 -156 -188 99 -166 116 54 -33 57 -180 -57 214
3335B14J01j05l35K3M12m22L95m39K31k60K63J13k8k07J06j9K2J43j98J29k21
$$ 214 315 210 -125 -102 310 -112 283 -156 75 -185 78 191 163 -44 62 43 65 208 10 139 -82
3356h2J37m06K06J06J8j78L95k30J8L8j71qO0OJ75j37R8J6Q6l26L26l5l2j2Rk21
$$ -82 55 -351 -145 -39 -21 -199 196 -34 -16 22 -149 -157 -97 -91 84 -53 45 61 147 -179 147 112 80 68 77 -144
3382a44L21J9l21K92j28l7j17J43j0k2j11K74k70J22J00k50K33j75J35J94j88
$$ -144 177 196 -125 167 39 2 -115 28 18 -4 -115 159 -111 11 111 -139 94 -81 54 248 60
3403F0j50K35j13Jj91qL6L92j94j34L16o15M17lR1r0j30j36K29j5j89j17N59j10
$$ 60 -90 145 32 33 -158 -166 -130 262 68 -66 250 -365 52 49 140 50 -80 -216 13 -2 -191 -308 251 141
3427A41k31K23l33J25L19j78n22J98K50j91L93k34k00L51k26M51m67K2K03l3q0
$$ 141 -90 133 -200 -75 244 66 -456 -258 -8 -199 194 -40 -240 111 -115 336 -131 -109 94 61 -19
3448a9p6J13q2J4K85k54J48o2q7K70l03Q5Q3j4j76j07J90J73j18j27JK37k33J48
$$ -19 -95 18 -64 -50 235 -19 129 67 -20 250 -53 32 115 101 -75 -182 8 181 63 -64 -63 174 -59 89
3472H9P4K94n88M9L31j10J19k41J38K3k70J81jk95L74o7q2k56j0N50k99K78l02
$$ 89 163 457 -131 -82 249 139 258 17 155 178 -92 89 88 -207 167 100 18 -238 -248 302 3 281 -21
3495b1J8k96M47l30M39k81K86m24j74L17%J05l9p0J43r5j1J07l22K78k96J39J14
$$ -21 -3 -299 148 -182 257 -24 262 -162 -336 -19 -19 86 47 -23 120 25 14 121 -201 77 -219 -80 34
3518C4J62j02l5j05J37K10l93K61k15J53j11NO2J65n76J81M71j65j11NJ18k05
$$ 34 196 94 59 -46 91 301 -92 169 -46 107 -4 1 63 228 -348 -167 304 139 28 33 151 -54
3540e4k24J65J83M7%o6m4l5J44j2m2P0j45j19L01j14l95p1M70j2oj54L13k90K66
$$ -54 -278 -113 70 117 117 51 7 -28 116 104 62 132 -13 -132 169 55 -340 -411 59 47 41 -113 200 -90 176
3565A76k64J55k0l2J27q1j43j74L51j78K94m37J54j00K83q1j99K1P5L01m28r4
$$ 176 -88 67 47 15 142 61 -82 -256 95 -83 211 -226 -72 -172 111 30 -169 -148 -73 228 -200 -294
3587b94J71J51l9O5k75L97l07O8L64n27K38J4j51O8o9M2q2K48j55N7J29K0j54
$$ -294 -123 28 -11 54 -221 176 -131 -63 301 -226 12 26 -125 -57 -126 -84 -166 82 -73 -16 113 133 -21
3610b1J94k75m7R0j8K13J4j65P9j65N8j29P6j92M34j76J47k91n0P9K9K29o0l07
$$ -21 173 -102 -149 -59 -77 136 150 -15 64 -101 -43 -172 -96 -288 146 -30 117 -174 -224 -145 -116 113 53 -254
3634b54M02L9k00j77q0N05n49L44j13oM00l27j63P8K55j04q1J04j60J23O2K8j34
$$ -254 148 187 -13 -190 -270 235 -314 30 -83 -89 311 -16 -179 -101 154 50 -31 73 -87 36 98 126 -8
3657hm9Q1P4j69J58L2j6k0j87J0j29JJ75J23q8k4J22J66k45l5l2K78k05n0o6J00
$$ -8 -57 24 98 -71 87 119 103 83 -104 -94 -223 -222 -47 76 -12 -36 86 252 7 -28 -60 218 13 -37 -103 -3
3683cM37l08k06p5j79N14j86J25nj72q5L62l6j16K60l07j35R1K03q01L26L05O1
$$ -3 434 126 -80 -155 -334 180 -6 119 114 -58 -143 219 183 67 327 20 -115 -24 179 -622 -296 9 70
3706G0j20k80K01L21k72K67k84j05J28J55L1l24J19J25l26K97M9l06L14k13K61
$$ 70 -50 -330 -129 192 -80 187 -97 -202 -74 81 112 -212 -93 32 -294 3 52 -254 60 -153 108
3727A08j63k23K88Kj83K59k60J95j48PR7o4N0J06Q0j67J32j22J12r8m8J87j28
$$ 108 -55 -278 10 12 -171 88 -172 23 -125 -118 -21 -85 -35 71 151 -16 116 -6 106 8 -40 147 19
3750A9M5j7K92m93M31k19q8r0l9K68K24M8l12k67J34o2O9k1q0M71n30K87l40J47
$$ 19 64 47 339 -154 277 58 -30 -120 -159 109 333 381 69 -198 -64 -126 -57 -78 -158 313 -217 70 -270 -123
3774a23K69j2k3m09M98j47j73K66K5k92K19k8k22M05m45j50L27J21k37L3M44k02
$$ -123 146 134 111 -298 200 53 -120 146 171 -121 98 70 -152 253 -192 -342 -15 106 -131 -98 346 144
3796A44l11K43M8k3j2N7l33L53l64J57j58J54k89K11K68j36K67l49L2rJ09j71
$$ 144 -167 76 124 101 89 146 -187 166 -198 -41 -199 -45 -334 -123 145 9 276 -73 -41 -50 59 -112
3818a12R6K91k98J10K7k71K86j50n2k79M25j22L0P0j69P9k1K06k1l16l5Q3M9N89
$$ -112 -16 275 -23 87 114 -157 129 -21 -73 -352 73 -49 -19 51 -118 -39 -60 146 125 -191 -226 -143 -94 495
3842D95o89M72o07L70j43K1K0N2L03k24N7k38R7p5j10J75N4r6j31L99k51j31J88
$$ 495 -194 278 -329 41 -102 -81 -61 -9 294 70 127 -111 -14 -89 -199 -24 30 -66 -197 202 -49 -180 8
3865Hn5L29l70K42q0L0k49L24r6J45M5l12M7k95K27k09P9L04q0J95L8k75J9K72
$$ 8 -47 282 -88 154 74 104 -145 179 83 228 273 -39 8 -287 -60 -269 -190 114 34 229 267 -8 11 283
3889B83k26L0K8k48P1J80j48j76J1K56j43r9m2K27J67k67J05J21j95K03J0j89
$$ 283 57 87 115 -133 -62 118 -30 -206 -195 61 -82 -181 -223 4 171 -96 9 130 -65 138 148 -41
3911d1L4J99m02L84l04O0M7k43M01k45K0N63m69k30J79J66J70n31Q05o25r1K08
$$ -41 -7 192 -210 174 -130 -70 -23 -266 135 -110 -90 473 4 -226 -47 119 289 -242 563 -62 -153 55
3933E5j71N0j73N49m28L30p9l38N11j97l1NK0k98L12j04Pj73J58J92M7m16L85
$$ 55 -116 -66 -239 310 -118 212 133 -205 306 109 78 83 103 -195 117 13 20 -153 5 197 244 -172 213
3956B13o7p1n9j21K18P0j18l1L79m67O3R5j62J14N2j40R6O6k01j6L24R9k78j50
$$ 213 146 75 16 -105 113 183 65 34 413 -54 9 104 -58 56 108 -32 64 130 -71 -87 237 336 58 -92
3980i2K36j83j00Q7K19m7l28J12J67l0O1lj18k65L64l3j55J37k17L74J07j48k46
$$ -92 144 -39 -139 -52 167 120 -208 -96 71 41 102 99 -19 -284 80 47 -108 29 -188 186 293 145 -101
4003a01K33o7Q2n6n20O11m7l09O0o0M13j19n89P06p4j44P6J08l22K04N5m57M22
$$ -101 132 65 147 91 -429 182 135 -174 -114 -174 239 120 -469 237 163 19 95 203 -119 85 140 -317 105
4026A05K58o22L06k22L32J3j33J6J51m3k97J43l6J42l39L19j76M5P7n3J43L5o33
$$ 105 363 -259 47 -175 157 170 37 53 204 161 -136 7 -29 113 -226 93 -83 -38 39 -14 129 164 -469
4049d69O47j64qJ64m72K49j42N0J45J95J50k0l99Q0j04J16j27kK07m9J85m08J91
$$ -469 178 14 6 170 -302 -53 -195 -145 0 195 345 325 -74 6 -98 18 -109 -111 96 47 232 -176 15
4072A5j95M6K77n6j47l1Q7J8k02P9J24j18J43j04J29K19m01J64L39m25l22L34
$$ 15 -180 -134 143 87 -60 -91 -4 14 -188 -109 15 -103 40 -64 65 284 -117 47 386 -39 -361 -27
4094b7M32k72r9M7k56J43J32P1k23r7J25K08k32L15j12j40j45J60k67n6J58J86
$$ -27 405 133 34 81 -175 -32 100 171 -52 -149 -24 184 -48 267 155 15 -130 30 -237 -293 -135 51
4116E1r6L1P2j15K56j77j73J57K0j04K89j64k36M26m33Q6L33j52l03j6O61l43
$$ 51 -45 -14 58 -57 199 22 -151 6 26 -78 211 47 -189 237 -196 -110 223 71 -232 -248 413 70
4138G0Nj72k7L72K3k74j05K12L1O4l40K17p3Q6k26J24R4K09k70k7J65k81M2J18
$$ 70 75 -97 -124 248 271 -3 -108 104 135 199 -141 76 3 89 -137 -13 81 290 20 -7 158 -123 -81 37
4162C7N4j63K42J34k18K44l56J56j10P6j04R8k61L5K83k4P9r1p8R3k06j31J82
$$ 37 91 -72 170 304 86 330 -26 130 20 96 -8 90 -171 -136 147 123 202 111 33 126 -80 -211 -29
4185b9O4k04m9J21J84J33j93l3Q5r3m3q4L2N2j87K5M25j59K37k90k89O83k91j41
$$ -29 35 -169 -218 -97 87 220 27 -6 79 -14 -57 -141 -109 -57 -244 -219 206 47 284 -6 -295 388 97 -44
4209d4j57P4M7K7J02l3J83l28J06N2j28J53l32J80k1P5P8J69k32O8K1m1j35K12
$$ -44 -201 -127 -80 -53 49 16 199 -129 -23 29 -99 54 -278 -98 -119 -44 34 203 -29 39 60 19 -116 96
4233I6j81O1rm3j7L59k42L40l42p2P4P5j01j8R3j3k15M25l48p2K59j48K25j01
$$ 96 -85 -24 -33 -76 -93 266 24 364 22 -50 24 99 -2 -20 73 60 -155 270 -78 -150 109 -39 186 85
4257H5r6q2o6j12K13J95j17J2O4k98P6K21k63P0J71O1N3k97L54l30M6K81n46K88
$$ 85 -11 -93 -159 -271 -58 137 20 32 96 -202 -126 95 -168 -98 73 134 187 -110 244 -86 -40 241 -305 -17
4281a7k76J64O6L8K4J38M0j54n5k1qJ2K27L1k43k87K29J3K94k45o5K20j57J34
$$ -17 -293 -129 -63 -25 -1 137 177 23 -32 -53 -61 -49 178 209 -34 -321 -92 -79 215 -30 -95 125 -32 102
4305A02l40M86m8j78j03J91M7j21lk45L71m92K80J08nm33P21n52L96l24Q4n2l2
$$ 102 -238 248 200 22 -81 110 157 36 33 -212 159 -333 -53 55 50 -383 338 -214 182 -142 -58 -110 -142
4328a42L25k67r7J14K30k32K50m42L36K06l32K10k55L27k21j91K47k52K80K07
$$ -142 183 -84 -181 -67 163 -69 181 -261 75 281 -51 159 -96 231 10 -181 66 -186 94 301
4348C01k11J06j30m10N50m62N05m49J32O5q8R0j35J4O8K33k39K52j71O4n4m0K7
$$ 301 90 196 66 -344 206 -256 249 -200 -68 -3 -91 -1 -136 -122 -54 179 -60 192 21 85 31 -9 18
4371A8k80O79m58N6J04J18kr5n97L69J69j91J2J61j78J66N8kj87O5j13J06J02
$$ 18 -262 417 -41 15 119 237 235 140 -457 -88 81 -110 -98 63 -115 51 109 107 -80 -15 -128 -22 80
4394H0L9j00Q6k50K63J23J0l29r2K96k43J45L08m42M6K4MK3n0K01j68J54k04k7
$$ 80 119 19 105 -145 118 241 251 -78 -170 126 -117 28 336 -106 -60 -36 -32 -9 -59 142 -26 128 -76 -103
4418a03M7L0o0r0K22j53J93q1J86k83J30k06K36j86m0K31k07J59kj77Q6o4J6K6
$$ -103 -56 -26 -86 -176 46 -107 86 5 191 -92 38 -168 68 -118 -158 73 -134 25 23 -154 -68 -132 -116 -90
4442i0o0K98k42K63m9n50L86K59j31n8J67P5l44k3P1R3j38J61n9R0j61j26L4J13
$$ -90 -150 148 -94 169 120 -430 -44 215 84 26 193 268 -76 -99 -28 65 -73 88 29 119 -42 -168 -134 -21
4466b1L62j16k42j06o3J63K33j27k58K83m08K96j08nK71L5k38M4j07K88o9j42
$$ -21 341 225 -17 -123 -186 -23 210 83 -175 108 -300 -4 -112 -117 154 189 -49 -5 -112 176 107 -35
4488c5O1K6M1J13J95n20L73k35r4J39n5O0J31l33L69o1j17j28K50l29j42K87p7
$$ -35 26 52 93 206 401 -119 254 19 -75 64 9 69 200 -133 236 175 58 -70 180 -149 -291 -4 -81
4511h1l00K66n4K60j03P9P2m10J63K55l48K82k86K19O8k88L36k78%J56q5J20L9
$$ -81 -381 -115 -169 91 -12 67 139 -271 -108 147 -201 81 -205 14 82 -206 130 -148 -148 8 -77 43 82
4534H2k03J97l7J1j41m0K02j6L40m75p2K05K38k31j96M76m44J46k95K05J26j79
$$ 82 -121 76 39 50 -91 -131 71 55 395 -80 -152 53 291 60 -136 340 -104 42 -253 -48 78 -101
4556a01Q3j00J10Rq5Q5o7J67j96J96k9J79j55k02J69K40l58p9O3J70L09k69J24
$$ -101 -18 -118 -8 1 -84 1 -66 101 -95 101 72 251 96 -106 63 303 -55 -134 -71 99 408 139 263
4579B63l28J5J5K1Q1O2o8L1K25l64J80R7k92K0J52j19L26n0m38K38l77L11j50
$$ 263 -65 -50 -35 -14 67 129 61 92 317 -47 133 230 -62 -42 110 -9 317 267 -171 67 -310 1 -149
4602a49O9J30K68m77l5R1N8o4J26k74M43L2k49o3j35K73k41J16j11L17j73J47
$$ -149 -80 50 318 -159 -194 -103 -45 -109 17 -257 186 218 -31 -94 -229 44 -197 -81 -192 125 -48 99
4624I9l53q8J17M67k43j2pl06M67k0r3l3KP8m16P8K95M1Pj12M9j41J23j58J52
$$ 99 -254 -342 -225 242 -1 -13 -20 -326 141 121 28 -5 -3 75 -341 -263 32 73 80 -32 17 -124 -1 -159 -7
4649gm4J78Kl35J26J6j94K59j20k09L75m3k30M7M26k35K4o7K71r9k39J78p8J79
$$ -7 -51 127 129 -206 -80 -64 -258 1 -119 -328 47 4 -226 -179 247 12 36 -31 240 141 -98 80 2 181
4673A81Q0l94J63l1J0J01j94J52MJ15j76l93M91k44L5K08J91m36Q8rJ07r5L76
$$ 181 261 -133 30 -1 9 110 -84 68 72 187 11 -382 109 -135 -100 108 299 -137 -49 -58 49 -46 330
4696C30l02j56J51O2R7%m3O2k60K37k68L82j09j65J88j27l77L80j72K8K39L3m15
$$ 330 28 -128 23 85 182 182 139 201 -59 178 -90 292 183 18 206 79 -298 82 -90 -62 177 210 -205
4719b05J94O4q9r2K84J36m59R5O6k8k90M57j01r9J06K29m91N36l86J29j43M6R1
$$ -205 -11 53 -36 -128 156 292 -167 -72 -6 -34 -324 133 32 -67 39 268 -223 313 -73 56 -87 -41 50
4742E0P6k17L35k77n6K26l62J80j70K87P5j94P5K8q7J19l07M67l10M6J43k6k13
$$ 50 126 -91 244 -33 -89 137 -225 -45 -215 72 147 -47 28 56 -31 88 -219 248 -62 -16 127 101 -112
4765a12R0oJ9j45K72o9K57m37K72K45k13K3m67N89k54j00j57K63kJ5p9J51n96
$$ -112 -22 -28 -9 -154 118 49 306 -131 141 386 173 196 -271 318 64 -36 -193 70 68 83 4 155 -441
4788d41M95j81R4L1J05j80n1j86J53K81J2j9p0J3j23K98k51J4K68j77j93M07j98
$$ -441 54 -127 -33 -2 103 -77 -128 -314 -161 120 132 113 43 56 -67 231 -20 -6 262 85 -108 299 101
4811A01l36K87Q1l8Lj31N2K5J21j48l4r7J53J69j59k07K02Q6k20J22O3j10k53
$$ 101 -235 52 133 95 98 -33 19 44 165 17 -17 -114 39 208 49 -158 44 130 -90 32 95 -15 -268
4834b68K18J6r6KJ95m8Q1m9nk46J59M03n30J13K72k79l3K97l14K94m37J98o1N02
$$ -268 -50 -34 -130 -128 67 19 100 51 46 -200 -41 362 -168 -55 217 -62 -95 202 -112 182 -255 -57 -118 384
4858C84p4l09L7l03L38n8j43P4q4J33J32m1j7J76l13J48J45k91L47L8l01j82K13
$$ 384 310 1 38 -265 73 15 -128 -54 -138 -5 127 86 69 245 -68 80 225 -66 281 319 18 -164 49
4881D9R7j78K59j17J71o2o2K57o83K86J04K04j11m59p9K65j21L60q9P8N9l7j87
$$ 49 146 -32 227 110 281 219 157 414 -269 17 121 325 214 -245 -324 -59 -180 180 91 169 228 191 4
4904Dj33P9r8K14J10l31pR8K47k89J93j78J85K56l58k74K50k35L10J19j27n9r5
$$ 4 -129 -50 -148 66 176 -155 -162 -64 183 -106 87 -91 94 350 -8 -282 -32 -267 43 162 35 -24 -119
4927a19L98k98j09J07J46j13j34R1P5pp6K3l82L27N2l96K40q1M11q1M8k50L48
$$ -119 279 -19 -128 -21 125 12 -122 -31 44 37 -39 -16 -398 -71 -19 -415 -175 -256 155 74 122 -128 220
4950B20k40p3J21k37R7J46Mj84K48J16M7n34J70N78m15J7k31K84j73J35j43J43
$$ 220 -20 -93 28 -209 -112 34 38 -146 102 218 265 -269 -99 479 64 81 -150 134 -39 96 -47 96
4972I6k64M98n99K3P6J17k4j73J35j74O09j97Qk26nM7K25k89J06j14L1L11l99
$$ 96 -168 330 -269 -246 -170 -53 -77 -250 -115 -289 320 123 131 -95 -100 -53 172 -117 -11 -125 -94 217 -182
4995a82K12N2L6j26M06k61j20r5K18k25L57k87k4J27k00k6R6j41L24j40k4K71
$$ -182 30 82 118 -8 398 137 17 -78 140 -85 272 -15 -39 88 -112 -138 -42 -183 141 1 -23 248
5017B48j24j88l6J23O9j13J29l67L89k56J87Q1k38J42J7J69J38p11L87k40M6J64
$$ 248 124 -64 -100 23 92 -21 108 -259 130 -126 61 142 -96 46 63 232 370 -341 46 -194 -148 16
5039A6j07J34J03j44p4m5p1L50k86J12K98l50j67J59J98k01J45j12k8K78k76J65
$$ 16 -91 43 146 2 -72 -117 -188 162 -124 -12 286 -64 -231 -72 126 -75 70 -42 -70 208 -68 97
5061I7J14j01J03n12J68KO1J93m05L17j31k8N3K70k17K60l47J21M2k16L7J44J71
$$ 97 211 110 213 -299 -131 -129 -68 125 -280 37 -94 -122 -69 201 -16 244 -103 18 60 -156 -119 25 196
5084A96j46r2M4j77K90n5j09j1J05J29l00J59j03j26R5J00m4K96l00J2k0Q6m5
$$ 196 50 -42 2 -175 115 60 -49 -60 45 174 -126 33 -70 -196 -101 -1 -45 251 -49 -37 -57 29 -16
5107a6j15J51k26K44k07J75j8l2J21l1p2J10k1o5K45l26K49J7j95M5r1J36j84
$$ -16 -131 20 -206 38 -169 6 -12 -44 77 46 -26 84 63 -2 243 -83 166 183 -12 33 -58 78 -106
5130a06K82n9r0m5O2j88L64o9j85J61j94J09j87J16k47J95N3j14K10L2j15K37
$$ -106 176 117 27 -18 44 -144 220 151 -34 127 -67 42 -145 -29 -276 -81 -28 -142 68 100 -15 222
5152B22k41k73N57l19K4K5J43l16J29j4J31L4L6j80K9k40K47k20J69J60j90J76
$$ 222 -19 -292 265 -54 -30 -5 138 -178 -49 -63 68 102 138 -42 -13 -253 -6 -226 -57 103 -87 89
5174H9l09J86l6K58l02K5L77k04j18l7Q1k01J54J03k28J84J61l27O9Q7O5K33k05
$$ 89 -220 -34 -70 188 -114 -89 288 84 -34 -71 10 -191 -37 66 -162 22 183 -144 -75 12 77 310 105
5197A05l45M16r6o8J18r5r0K38R8k38p5J46J6l00m0L31Q4k17n1j70M09l85O4J04
$$ 105 -240 176 80 12 130 35 -55 183 281 43 -32 114 130 -170 -210 121 205 -12 -63 -233 176 -209 -145 -41
5221d1L19j67N8k24j13K69j77Nj22L38o1k47L27j20j27L54m63J61j52N0J83P8
$$ -41 278 111 169 -55 -168 101 -76 -71 -193 145 84 -163 164 44 -83 271 -192 -31 -183 -133 50 128
5243A28k04R2K5L2l09K35M6o2j2L27l15j46J81k55K03ok09Q3J02K27k00Q4L09
$$ 128 -76 16 41 73 -236 -1 45 -17 -29 298 -17 -163 18 -237 -34 -40 -249 -166 -64 163 -37 47 356
5266C56k65j37Q3M3l63N39k03R0J36k72j96j0K54M0O3j95m4J63K40j14j87j54
$$ 356 91 -46 37 80 -283 256 53 143 279 7 -189 -199 55 95 158 -37 -81 82 322 208 21 -133
5288a33N9L92o04K73o9J3QJ91j07l3P8J0O5q2J2O3l8K00j54k05O6j31P5K70j13
$$ -133 -74 318 -286 -13 -82 -69 -61 130 23 -10 68 78 143 61 73 136 98 298 144 -61 5 -126 -51 219 106
5313A06k50K39o3l04K03J75J31l27ln2j87K96oJ09l5k83J37L66r8J51j97j09j27
$$ 106 -144 95 32 -272 -69 106 237 -90 -93 -145 -332 -36 -42 67 32 -251 -114 252 154 305 108 -1 -128
5336a28M2J87j80j64L10j60o3J83l06K97J67k85Q0Q0P6l26M78j90j43j91J68L5
$$ -128 -86 101 -79 -243 67 -93 -156 27 -279 18 185 -100 -20 60 136 -190 288 98 -45 -236 -68 -33
5358c3K30o0l35J76J42p1K33j07k16j05J58K38l30M7J53R8r1j41r3k05N3MlL42
$$ -33 197 137 -198 -22 120 49 282 175 -41 -146 12 250 -80 -33 120 218 127 -14 -107 -312 -259 -255 -258 84
5382H4k72K94m0k48K19R2l90M72k28m0k22L68J44P4m01O9p4K2k01M51k12k71J52
$$ 84 -188 106 66 -182 37 129 -261 211 -17 -57 -279 89 233 307 -94 -25 -99 -77 -278 173 -39 -310 -158
$$ [...]
8191A6
##END NTUPLES=NMR FID
##END=
