##TITLE=1H_LR-669-K1M-Et2O
 CDCl3,8 sc, 
 11.4.2019
##JCAMPDX= 6.0         $$ Bruker NMR JCAMP-DX V2.0
##DATA TYPE= NMR FID
##DATA CLASS= NTUPLES
##ORIGIN= UXNMR, Bruker Analytische Messtechnik GmbH
##OWNER= root
$$ XWIN-NMR		Version 3.5
$$ Thu Apr 11 14:20:49 2019 Russian Standard Time (UT+4h)  she@DPX200
##.OBSERVE FREQUENCY= 200.1315
##.OBSERVE NUCLEUS= ^1H
##.DELAY= (6, 6)
##.ACQUISITION MODE= SIMULTANEOUS
##.ACQUISITION SCHEME= undefined
##.AVERAGES= 8
##.DIGITISER RES= 18
##SPECTROMETER/DATA SYSTEM= spect
##.PULSE SEQUENCE= zg30
##.SOLVENT NAME= CDCl3
##.SHIFT REFERENCE= (INTERNAL, CDCl3, 0, 15.7039)
##AUDIT TRAIL= $$ (NUMBER, WHEN, WHO, WHERE, WHAT)
$$ ##TITLE= Audit trail, XWIN-NMR		Version 3.5
$$ ##JCAMPDX= 5.01
$$ ##ORIGIN= Bruker BioSpin GmbH
$$ ##OWNER= she
$$ F:/spectra/data/she/nmr/H-F/1/audita.txt
$$ ##AUDIT TRAIL=  $$ (NUMBER, WHEN, WHO, WHERE, WHAT)
(   1,<2019-04-11 14:19:51.01 +0400>,<she>,<DPX200>,
      <created by zg, POWCHK disabled, PULCHK disabled
       configuration hash MD5:
       00 E9 B6 7A A2 85 ED C7 34 08 36 98 17 FE 4E 26
       data hash MD5: 16K
       9F BF 3A 19 34 01 A0 50 7D 5A B9 D1 CC 96 83 4D>)
$$ ##END=
$$ 
$$ hash MD5
$$ D3 F5 EB E0 A2 CF 88 D0 D5 18 9A F7 4D 48 FC 74
##$RELAX= 
##$RELAX= 
##$RELAX= 
##$RELAX= 
##$RELAX= 
##$RELAX= 
$$ Bruker specific parameters
$$ --------------------------
##$DU= <F:/spectra>
##$EXPNO= 1
##$NAME= <H-F>
##$PROCNO= 1
##$TYPE= <nmr>
##$USER= <she>
##$AMP= (0..31)
100 100 100 100 100 100 100 100 100 100 100 100 100 100 100 100 100 100 
100 100 100 100 100 100 100 100 100 100 100 100 100 100 
##$AQSEQ= 0
##$AQ_mod= 1
##$AUNM= <au_zg>
##$AUTOPOS= <>
##$BF1= 200.13
##$BF2= 200.13
##$BF3= 200.13
##$BF4= 200.13
##$BF5= 200.13
##$BF6= 200.13
##$BF7= 200.13
##$BF8= 200.13
##$BYTORDA= 1
##$CFDGTYP= 0
##$CFRGTYP= 5
##$CHEMSTR= <none>
##$CNST= (0..31)
1 1 145 1 1 1 1 1 1 1 1 1 1 1 1 1 1 1 1 1 1 1 1 1 1 1 1 1 1 1 1 1 
##$CPDPRG= <>
##$CPDPRG1= <>
##$CPDPRG2= <>
##$CPDPRG3= <>
##$CPDPRG4= <mlev>
##$CPDPRG5= <mlev>
##$CPDPRG6= <mlev>
##$CPDPRG7= <mlev>
##$CPDPRG8= <mlev>
##$CPDPRGB= <>
##$CPDPRGT= <>
##$D= (0..31)
0 1.2 0 0 0 0 0 0 0 0 0 0.03 0 0 0 0 0 0 0 0 0 0 0 0 0 0 0 0 0 0 0 0 
##$DATE= 1554977990
##$DBL= (0..7)
120 120 120 120 120 120 120 120 
##$DBP= (0..7)
150 150 150 150 150 150 150 150 
##$DBP07= 0
##$DBPNAM0= <>
##$DBPNAM1= <>
##$DBPNAM2= <>
##$DBPNAM3= <>
##$DBPNAM4= <>
##$DBPNAM5= <>
##$DBPNAM6= <>
##$DBPNAM7= <>
##$DBPOAL= (0..7)
0.5 0.5 0.5 0.5 0.5 0.5 0.5 0.5 
##$DBPOFFS= (0..7)
0 0 0 0 0 0 0 0 
##$DE= 6
##$DECBNUC= <off>
##$DECIM= 24
##$DECNUC= <off>
##$DECSTAT= 4
##$DIGMOD= 1
##$DIGTYP= 9
##$DL= (0..7)
0 120 120 120 120 120 120 120 
##$DP= (0..7)
150 150 150 150 150 150 150 150 
##$DP07= 0
##$DPNAME0= <>
##$DPNAME1= <>
##$DPNAME2= <>
##$DPNAME3= <>
##$DPNAME4= <>
##$DPNAME5= <>
##$DPNAME6= <>
##$DPNAME7= <>
##$DPOAL= (0..7)
0.5 0.5 0.5 0.5 0.5 0.5 0.5 0.5 
##$DPOFFS= (0..7)
0 0 0 0 0 0 0 0 
##$DQDMODE= 0
##$DR= 18
##$DS= 0
##$DSLIST= <SSSSSSSSSSSSSSS>
$$ [...]
##$SUBNAM2= <"">
##$SUBNAM3= <"">
##$SUBNAM4= <"">
##$SUBNAM5= <"">
##$SUBNAM6= <"">
##$SUBNAM7= <"">
##$SUBNAM8= <"">
##$SUBNAM9= <"">
##$SW= 24.9337058887773
##$SWIBOX= (0..15)
0 0 2 0 0 0 0 0 0 0 0 0 0 0 0 0 
##$SW_h= 4990.01996007984
##$TD= 16384
##$TD0= 1
##$TE= 0
##$TE2= 300
##$TE3= 300
##$TEG= 300
##$TL= (0..7)
0 120 120 120 120 120 120 120 
##$TP= (0..7)
150 150 150 150 150 150 150 150 
##$TP07= 0
##$TPNAME0= <>
##$TPNAME1= <>
##$TPNAME2= <>
##$TPNAME3= <>
##$TPNAME4= <>
##$TPNAME5= <>
##$TPNAME6= <>
##$TPNAME7= <>
##$TPOAL= (0..7)
0.5 0.5 0.5 0.5 0.5 0.5 0.5 0.5 
##$TPOFFS= (0..7)
0 0 0 0 0 0 0 0 
##$TUNHIN= 0
##$TUNHOUT= 0
##$TUNXOUT= 0
##$USERA1= <user>
##$USERA2= <user>
##$USERA3= <user>
##$USERA4= <user>
##$USERA5= <user>
##$V9= 5
##$VALIST= <valist>
##$VCLIST= <CCCCCCCCCCCCCCC>
##$VD= 0
##$VDLIST= <DDDDDDDDDDDDDDD>
##$VPLIST= <PPPPPPPPPPPPPPP>
##$VTLIST= <TTTTTTTTTTTTTTT>
##$WBST= 1024
##$WBSW= 4
##$XGAIN= (0..3)
0 0 0 0 
##$XL= 0
##$YL= 0
##$YMAX_a= 273810
##$YMIN_a= -561644
##$ZGOPTNS= <>
##$ZL1= 120
##$ZL2= 120
##$ZL3= 120
##$ZL4= 120
##$ABSF1= 10
##$ABSF2= 0
##$ABSG= 5
##$ABSL= 3
##$ALPHA= 0
##$AQORDER= 0
##$ASSFAC= 0
##$ASSFACI= 0
##$ASSFACX= 0
##$ASSWID= 0
##$AUNMP= <proc_1d>
##$AZFE= 0.1
##$AZFW= 0.1
##$BCFW= 1
##$BC_mod= 2
##$BYTORDP= 1
##$COROFFS= 0
##$CY= 11.3945322036743
##$DATMOD= 1
##$DC= 2
##$DFILT= <>
##$DTYPP= 0
##$F1P= 18.9103706918063
##$F2P= -1.10871071338519
##$FCOR= 0.5
##$FTSIZE= 0
##$FT_mod= 4
##$GAMMA= 1
##$GB= 0.15
##$INTBC= 1
##$INTSCL= 1
##$ISEN= 128
##$LB= 0.24
##$LEV0= 0
##$LPBIN= 0
##$MAXI= 10000
##$MC2= 0
##$MEAN= 0
##$ME_mod= 0
##$MI= 1.114404
##$NCOEF= 0
##$NC_proc= 0
##$NLEV= 6
##$NOISF1= 3.799351
##$NOISF2= 2.8
##$NSP= 1
##$NTH_PI= 0
##$NZP= 0
##$OFFSET= 15.70392
##$PC= 1
##$PHC0= -8852.104
##$PHC1= 13.40026
##$PH_mod= 1
##$PKNL= yes
##$PPARMOD= 0
##$PSCAL= 0
##$PSIGN= 0
##$REVERSE= no
##$SF= 200.130013532006
##$SI= 16384
##$SIGF1= 3
##$SIGF2= 2
##$SINO= 400
##$SIOLD= 16384
##$SREGLST= <1H.CDCl3>
##$SSB= 0
##$STSI= 0
##$STSR= 0
##$SW_p= 3612.71676300578
##$SYMM= 0
##$S_DEV= 0
##$TDeff= 0
##$TDoff= 0
##$TI= <>
##$TILT= no
##$TM1= 0
##$TM2= 0
##$TOPLEV= 0
##$USERP1= <user>
##$USERP2= <user>
##$USERP3= <user>
##$USERP4= <user>
##$USERP5= <user>
##$WDW= 1
##$XDIM= 8192
##$YMAX_p= 0
##$YMIN_p= 0
$$ End of Bruker specific parameters
$$ ---------------------------------
##NTUPLES= NMR FID
##VAR_NAME=  TIME,          FID/REAL,        FID/IMAG
##SYMBOL=    X,             R,               I
##VAR_TYPE=  INDEPENDENT,   DEPENDENT,       DEPENDENT
##VAR_FORM=  AFFN,          ASDF,            ASDF
##VAR_DIM=   8192,          8192,            8192
##UNITS=     SECONDS,       ARBITRARY UNITS, ARBITRARY UNITS
##FACTOR=    0.0002004,     1,               1
##FIRST=     0,             0,               0
##LAST=      1.6414764,     0,               0
##MIN=       0,             -561644,         0
##MAX=       1.6414764,     273810,          0
$$ Real data points
##PAGE= N=1
##DATA TABLE= (X++(R..R)), XYDATA
$$ [...]
2363F62l14P93Q77L24o37n33k49o32L1O64J67k23M06Q48m61j234P8J032L1j154
2383D76j132J043J427q75j57N03M15p32j217k30R58O0m83L42M27k69O4k89p90
2402d59k50R1O41j42p44M22J158J56j195j035J51R73j051o37O16J037K69q10j78
2421i87M33m21p05j26k61O47K05M18l32k16m3j3o4r09j08Q57n7q2k59O09J096
2442c18q35j647N2R25N06j057L45K86R89j79l98m45j19K18J98k64j19N62N29L32
2462d39n04l93j23O95l42n06M05P08M62l01n9O51j79o22l23L03P3P36j29J57L09
2483E79J85J94r45m1OQ91j50m10J80Q15N88n85o29RN78p2o23M5Q10P95o38m47
2505A135J79N29l22j132P5Q62Q24j42n26L84M70K73j387q76O42P22L01n97o6N05
$$ y = [662, 348, 1141, 2018, 2342, 1705, 1172, 923, 291, 322, 986, 1153, 930, 1336, 2184, 1723, 489, 567, 1599, 1630, 476, -656, 387, 1814, 939, 782, 1285, 1700, 968, -249, -479, 479, 539, 56, 398, 825, 556, 620, 331, -459, -709, -618, 23, -119, -863, -441, 717, 873, -322, -1357, -1206, -233, -1284, -1921, -1305, -268, 1, -809, -987, -554, -975, -1680, -1806, -2067, -1420, -1215, -797, -1129, -1345, -1388, -1401, -1465, -2374, -2482, -1625, -1682, -1764, -2023, -1414, -318, -1153, -2800, -2748, -1823, -1317, -2374, -2029, -1743, -754, -933, -1331, -1776, -1895, -1677, -1479, -1743, -1862, -1300, -771, -439, -943, -1336, -1459, -764, -1106, -1612, -1207, -499, -37, -338, -397, 254, 75, -547, -870, -567, -494, 242, 113, 270, 579, 764, 958, 13, -28, -22, 869, 719, 309, 489, 1304, 1892, 1307, 678, 687, 1265, 1193, 570, 615, 1425, 2220, 1582, 1135, 1314, 1843, 1521, 389, 464, 1326, 2150, 2008, 1482, 1866, 2336, 2609, 1222, 346, 988, 1710, 2011, 1414, 1348, 1853]
2525A853J060r37j002j57M02M71p86j93N39J359q96o67m90L05p5k55m80O65Q44
2544A560l54m53j68K13n9m71m61n92O06J046m48m18k16Q41J18j323o48L14P34
2563a79k4j22mK93M67m25q59n69J45L6L70j22N5P74M25m07r26k00M09L00q98L0
2585a431P86Q39p12m71M72K31p32r25J47R13P71n82J26K70J58j24o38p9OL80K23
2606c72n20m4K18R29K94j297k93N56M60m97o59J062J250l37j116l11J043m00m69
2625e03k51O71J119l96o83M52mk44M07n06m57m53J426L46q85MP86N78j025j836
2645a454K49J765k52n76R4J271k05j269m4O26L95r36q9L14q0M3K04O17l67k45
2665F1j91K89j475m06J666J662j059j270J89R57j28k184MJ981P40q73j318R15
$$ y = [1853, 2913, 1976, 974, 817, 1219, 1690, 904, 711, 1250, 2609, 1713, 1046, 556, 861, 786, 531, 51, 716, 1560, 1206, 753, 585, 798, 739, 268, -193, -785, -179, 867, 419, 1, -215, 626, 744, -579, -1227, -913, -179, -203, -325, -329, -36, 431, 6, -853, -1422, -1277, -1241, -871, -993, -938, -164, 261, -146, -1072, -1272, -863, -563, -1461, -1431, -645, 194, -518, -989, -517, -286, -1018, -1943, -1796, -883, -112, -694, -568, -298, -140, -264, -902, -981, -975, -595, -372, -892, -936, -718, 211, 505, -792, -1085, -529, -69, -566, -1225, -163, 1087, 750, -366, -677, 366, -34, -503, -754, -83, 1036, 640, -43, 409, 405, 161, 568, 62, -395, -848, 578, 924, 39, 43, 829, 1407, 382, -1454, -1205, 560, 308, -268, -174, 1097, 892, -377, -421, 205, 600, -336, -425, -111, -191, -148, 56, 673, 306, 61, -130, 159, -1316, -1722, -56, 1606, 547, -723, -534, 423, 295, -1889, -1885, 96, 836, -37, -1355, -440]
2683d40O11o90l04N07l31m34j07K77L04o8R60M34j084j530K20J493j62r59P51
2702e52J434j54k235k33J831L43r68n95J135O23j528n91J621P45o01l27p7r3r82
2721a204N89J149L08o56L24J97j50j656Q7K101R11j753q15J478L70q94o44J478
2739A220Q21j378j342Q56R87k71j3J047P06j984r02J152J96o33K3K044N89k454
2757F64p95J392J410j443q46J291L35j318j063J625J755r92o75j00J91j118l88
2774g5J144J218n60o33O83l49j489l14J501R25j405q10R61R28j381j573K222J603
2792B596j844k483O70J549j1j037N70J451o41k051j14O88L36m81P32N48q82j118
2810a522M99Q56j106j22P42P59j448j550J710J531n01j397j2J298j130j852N33
$$ y = [-440, 171, -519, -823, -316, -647, -1081, -1188, -911, -607, -675, 285, 719, -365, -1895, -1675, -182, -344, -1303, -552, 882, 728, -1507, -1740, 91, 434, -534, -1129, 6, 629, -899, -1490, 131, 876, 275, -52, -129, -222, -1204, -615, 534, 842, 186, 510, 707, 557, -1099, -1012, 1089, 2000, 247, -568, 910, 1280, 386, -258, 1220, 2041, 663, -679, 177, 1164, 893, 880, 1927, 2633, 649, -253, 899, 1095, 462, 485, 2529, 3118, 664, -131, 1261, 2671, 1228, 382, 1673, 2008, 690, -373, 1252, 3007, 2015, 1340, 1240, 1431, 313, -75, 1069, 2287, 1727, 1094, 1777, 1428, -61, -375, 1126, 2051, 646, -164, 797, 1725, 344, -1229, 993, 2596, 752, -1731, -1061, 488, 477, -560, 10, 1461, 820, -1231, -1345, -657, -321, -802, -70, 478, -404, -1522, -1023, -167, -1273, -1395, -653, 106, -1342, -2892, -1182, 349, -152, -1549, -1561, -263, -1393, -3245, -2712]
2827b712K291M22j155m65Q09l84j084L81Q95O9r92O70P31q36p72R91J326r07j822
2846b544L72J247j11r75R19J600m60k087L00J084mp65N28J159l17q03j11Q77m04
2865d95p03N55J018n60j052N97J684o70o79L19Q46n56j670M18J649O91j287R0
2883A95Q65Mr84k12P57L05o24oJ180m60n62O08O42o57j025J94J405o07q36R31
2903A113J131n33j716j06J331J57j340r4J387L87q19m83R36Or65M8M21r6l84M76
2923H57M17l5r61L49Q03r18j265J37J725r1j375J92J255J07j508n34J149R9n68
2942a65o48Q56P21j69m00j64L47j215J71O11o12l85R81M71k90j050l03J638m86
2961i1j107l56J678L44j223l66J347M15j367o16O04N62k86l91M67N87l25l68J54
$$ y = [-2712, -421, 1, -1154, -1619, -810, -1194, -2278, -1897, -1002, -933, -1925, -1255, -524, -1360, -2132, -1141, 185, -722, -2544, -2172, -925, -1036, -2011, -1092, 508, 48, -2039, -1739, -655, -659, -1424, -896, 263, -54, -857, -968, -91, -495, -1198, -643, 375, -185, -1237, -640, 1044, 374, -305, 14, 860, 304, -1366, -948, 701, 1392, 105, 195, 1060, 1064, 80, -132, 625, 930, 306, 300, 1480, 1020, 458, 1066, 1708, 1051, 26, 220, 1625, 1018, 182, 1113, 2244, 1711, -5, -111, 1220, 1377, 37, -57, 1330, 1717, 898, 415, 1351, 1357, 392, 440, 861, 765, 381, 857, 1274, 1239, 278, 627, 1430, 512, -753, -616, 1109, 1018, -357, -165, 1090, 1197, -311, -845, 304, 403, -165, -813, 43, 764, 595, 195, 31, 378, -837, -666, -55, -667, -1052, -71, 400, 110, -940, -1243, 395, -91, -1198, -1554, 124, 468, -755, -1121, 226, 641, -726, -1342, -738, -176, -462, -853, -386, 201, -124, -492, -338]
2980c38Qm60J57N76J48q06J02J122K30j435l02J129K68j343l12J172R54q35k08
2999a73P79N11j140j167R23R31l27m37P25L1R7n27L36L43o89k61L38N39o78J58
3019C12N88L95q84n47P5Q45n69m5N31O44m4q94n2J05k27l54M33O43q72j48L68
3040C03Q36n10q87P70J6q15o08N81R84k58m05L20K32n58r47nQ67J10m64j2L34
3061a16M9o4k37J44j14k25m77J63LJ91L92K10k39m10j20j8l72n10J028Q22l55
3082b55p39n6M73J44q12j98K45O18j70n05K27R69l49j44q17P0J70K93K55k20l
3103h04M44O7l63m33K37P19n44n58Q19M34O5o03J12N28J67m58n69K15M33L81o61
3124c72M74L99Q7n47l2o2J18O53j61m99J70O59J21n41l33L35L93j90l90J84P52
$$ y = [-338, -330, -790, -633, -57, 91, -715, -613, 509, 739, -696, -998, 131, 399, -944, -1256, -84, 870, 35, -173, 606, 1117, -23, -1190, -267, 664, 337, -100, 625, 656, 753, 226, 562, 905, 216, -45, 293, 832, 154, 312, 900, 1295, 411, -136, -61, 784, 215, 170, 701, 1345, 1301, 407, 355, 460, 233, -121, 312, 955, 83, -65, 303, 1139, 629, -258, 512, 528, -287, -895, -314, 670, 412, 7, 327, 559, 1, -946, -951, -84, 26, -438, -450, -116, -67, -131, -368, -224, -338, -563, -1040, -877, -874, -683, -291, -81, -320, -730, -850, -868, -1240, -1750, -722, 100, -255, -994, -1050, -577, -433, -1245, -1443, -1198, -580, -750, -1255, -1028, -59, -408, -552, -1369, -1299, -1129, -836, -581, -801, -804, -360, -293, -656, -1089, -852, -133, -677, -1235, -416, 18, 83, -520, -408, 120, 287, -171, -740, -525, -92, 289, -372, 102, 501, 588, 41, 9, -53, 65, 718, 557, 58, 228, 887, 1008, 467, 134, 469, 862, 672, 282, 466, 1218]
3145A218q7k86k98J91J29l66M2M5N40k40l2l9J62P7J76n89j10L08L36j95n33L28
3167G77N92j99m61l93K17K15j8l44j15N28P02m59q13J11K76k30m70J7M48O1j36
3188C06J48n56J75K58l99m48j78N19L06K0k87o0M34l76m32j42R5P2p0n2M85K53
3210G1j22p46J7M6j59o3K03J79K00j96O2j28j19R8j13r6n1K96K67k65L5r9J13
3233e70L8k18m45M62L30pl27K26Q13k05l44n57K81N57l34k03J69Q6L60J58m57
3254a87j92K81j58J98l5J88JN38n97L79j05J18k73k20J4N49L60l27J16k71N35
3275I12m99n29j76P10K73ol50L7O6P09j27o08k03J3M99l13k53N28J39N2o53O6
3297B87K98j35n31J20J91O60m37l12J75Q6q6j98m36K77J0Rj35P7K45J31n7p23
$$ y = [1218, 1131, 845, 547, 738, 867, 501, 543, 588, 1128, 888, 856, 817, 979, 1056, 1232, 643, 533, 841, 1177, 982, 449, 777, 1369, 1170, 709, 316, 533, 748, 730, 386, 271, 799, 1501, 1042, 229, 340, 616, 386, -84, -67, 381, 442, 306, 454, -102, 73, 331, -68, -516, -694, -175, 131, 151, -136, -196, 238, -138, -570, -712, -617, -545, -615, -667, -182, 71, -51, -797, -780, -734, -893, -956, -753, -574, -374, -570, -508, -636, -755, -657, -770, -866, -917, -621, -354, -619, -584, -683, -570, -532, -750, -1195, -733, -403, -410, -737, -511, 302, 97, -247, -804, -523, 34, -300, -503, -334, -248, 112, 270, -187, -379, -98, -256, -58, -93, 95, 96, 634, 37, 416, 311, 429, 156, -64, -50, 499, 859, 532, 648, 377, 912, 413, -116, -292, 418, 691, 685, 335, 372, 438, 1147, 1020, 412, 209, 222, 721, 408, 155, 683, 822, 874, 221, 287, 585, 450, -81, 39, 230, 890, 453, 141, 316, 402, 316, 118, -318, -41, -31, -22, -157, -80, 165, 296, 239, -484]
3319d84l43M52L02m11M23K63L84n60p44l5L90K24m45j18K86L62m09J0j54K66N
3340c36j80q82J35J89L28P33p31L10Q4l57r7m15O59M52k52r7k64J91N7k92j44
3361i09L80K52k56l58N6N08L87j23J35l6m26k06k49j76J103K88j24l53l01L86
3381b2J40k31k6M37L05n3p16j46N50N57n0o54l0J59j44K59K45M03L30p49j24o0
3403C80j29O39j84p5J82K40l44j01P1L82ll37m1k67L7O41k66J06J78n3q8o44k87
3426C7M53L42L29j3k21j52n54Q4j28J20O11j25m01n27O36k02K79j04R5m52o3l14
3448b70k42O96R4K94o0n10l76k93L43j21m4Q44n3l05o12n6M20L2j82L39n51N5
3470e58m48K63N06%K21l61o79p9K0O35J08j37PK91j03p71n99J284N59j69j200
$$ y = [-484, -827, -375, -73, -484, -61, 202, 586, 26, -718, -753, -363, -139, -584, -702, -416, -54, -463, -453, -607, -341, -336, -516, -1398, -1263, -1074, -746, -13, -744, -434, -350, -707, -804, -1219, -560, -108, -360, -457, -721, -530, -473, -765, -909, -529, -277, -533, -891, -835, -327, 60, -63, 72, 36, -390, -596, -845, -1021, 82, 370, 246, -107, -408, -22, 118, -113, -139, 298, 603, 550, -166, -312, 238, 795, 745, 91, 61, 220, 76, 335, 580, 983, 1313, 564, 440, 380, 251, 890, 706, 631, 813, 1053, 709, 608, 679, 1061, 1058, 721, 680, 413, 450, 1091, 825, 931, 1109, 1056, 968, 324, 37, 490, 832, 1161, 1148, 927, 775, 221, 305, 177, 297, 908, 783, 382, -145, 491, 289, 568, 464, 559, 107, 44, -270, -512, 184, 278, 572, 512, 2, -374, -667, -324, -445, -489, 355, 302, -3, -615, -671, -251, -219, -401, -62, -613, -558, -1006, -743, -237, -237, -16, -377, -1056, -1135, -1115, -480, -372, -509, -502, -211, -314, -1085, -1684, -400, 159, -10, -1210]
3491a210L46L76K69l86k3L42J2l39m46P0N08L75L16N1l72k65o8R9J67k92O28L20
3513D78p80m25K48O45pp01N14L27l05o66O79K17O97m87k00k70j72K1K41L15L18
3534F87Q5k74J07q39J06L93N71n06k01j56J195q63K56Q5N12l43j115M8O17p7Q5
3555C73N4N72n41l55j44L78j87j79L03M11p78j5L10K52j13o50L48M59k30p70K36
3576b66O86M83j220K4K90l62n75L34N08n9J29k73m3N6p6K3J96k75n47p6J058m29
3598d14m06M08Q24o38j487O33Q87ok52k37O15J02p29lK50l7k19K07L36r3m77L16
3620d20N85j5n19o1K03l40o05O09J255k31r15j35P22L37j158J63R12K65n30n14
3640c92N99L76k70m51O11n8n79K25N15k24j02M19M81k47j431L30J079J2r25K27
$$ y = [-1210, -864, -488, -219, -605, -628, -286, -274, -613, -1059, -989, -481, -106, 210, 261, -111, -376, -444, -345, -178, -470, 158, 478, -302, -727, -479, 166, 159, -542, -28, 299, -6, -672, 7, 224, 921, 434, 234, -36, -208, -187, 54, 369, 687, 772, 498, 605, -234, -128, 265, 836, 330, 129, -27, 1168, 305, 561, 646, 1158, 815, -300, -252, 365, 288, 373, 427, 999, 458, 103, -41, 337, 150, -29, 274, 685, -93, -108, 202, 454, 341, -309, 39, 498, 268, -502, -266, 420, 903, -317, -293, -3, -365, -940, -606, -98, -157, -28, -301, -344, -288, -364, -341, -145, -420, -967, -1043, 15, -414, -820, -412, 412, -226, -1713, -1080, -193, -199, -451, -688, -73, 29, -700, -703, -453, -490, -709, -502, -166, -259, -736, -420, 165, 150, -369, -430, -227, -567, -1172, -563, 692, 461, -454, -589, 133, 470, -688, -525, 387, 652, 122, -392, 207, 583, 313, -138, 473, 415, -164, 61, 576, 352, 250, 669, 1150, 903, -528, -198, 881, 893, -32, 195]
3660A95J035l2r00l12J120L59r88M6R3L54m41m17Q77J31K40p08j52Q5m18J33R25
3681A225j57p63N07O43l74j074K69J095j23j068m12Q51M31m9q88M63L85q04q10
3700f53R25J36J06l22K14K00r54N5J20P0o59N80M74j47o32j21P70J40n62q66L66
3721g60O96l80o72N12Q05k84q91K86n3J69m96L44K20M3l33Nj03M0k24O56K1p60
3743a159m3P52L49o45l63N43O24n63j174P18N11M72n56k45Q63m39l08k68O89o63
3763i05L12K79r1k07N7P81j00n76k30Q17K03j074O7N73R90p18n50k31Q41Or45
3784g01M05L53M62j25j91J78J36k17J13m69j64L85O12l76k07J48K13L61m00n81
3804f5J26N29M3o88N71M00Ln76k77K07J29N1k81M34l67K39J01k3K92m82l41k01
$$ y = [195, 1230, 1198, 298, -14, 1106, 1465, 477, 523, 616, 970, 529, 112, 989, 1120, 1360, 652, 500, 585, 167, 300, 1225, 1068, 305, 812, 1455, 1081, 7, 276, 1371, 1248, 180, -232, 619, 1050, 1001, 113, 576, 961, 157, -653, 272, 408, 514, 192, 406, 606, -348, -293, -173, -103, -762, -182, 292, 145, -487, -608, 162, 302, -260, -1126, -760, -64, -444, -1116, -604, 201, -83, -974, -688, -741, -572, -1068, -724, -504, -461, -794, -789, -892, -852, -1076, -420, -399, -1159, -1202, -450, -101, -746, -1109, -566, 58, -505, -1679, -961, -450, 22, -534, -779, 84, -355, -663, -931, -242, -905, -593, -314, -405, -612, -555, 226, 126, -450, -680, 137, 340, -734, -667, -94, 896, 178, -372, -603, 238, 244, -701, -296, 57, 519, 394, 203, 381, 517, 300, 413, -56, -220, 165, 777, 401, 194, 342, 555, 916, 516, -65, 61, 590, 633, -55, 516, 916, 919, 343, 66, 273, 402, 453, 172, 606, 239, 478, 579, 556, 848, 366, 25, -176]
3826a76L8M03R0L57n18j12K60K72o18k80M34K22N9o18K49K72L00m66n51L9K69
3847g5J93k95r4r6M93j03n1j65j25J12r6j22l8M18J01jl37j36L88j99k65m9M26
3870a16J01O6l41K45j32M2l28Q2J44j9RK54k94L11j47q3l2r9Q6O74n74j15N84
3893C18m75M22q0k30JL22k2m80K62J97L13m14q0K94l9r2m12J93J32K43J65k7m64
3916D7N25J35%j057K63O12Ok46k94L53M38j18m92J3N03J19q78N76j35K21l90J55
3938C56k40L41M1jm10J98j2L88P7o82m9M67j06l03o09P27M03l43l63j78P66l57
3960A11j05n89P03j11J14k10p4J17J5K37m74l66K96K02o4m84j93P15L15j074l76
3981a295R80J57m26m78K56M56J45n86R7K72q0J80n71J04J53l43L88L58l44K3p3
$$ y = [-176, -138, 265, 355, 712, 194, 82, 342, 614, -4, -284, 150, 372, 431, -187, 62, 334, 634, 168, -383, -344, -75, 118, -177, -271, -367, 126, 23, -28, -193, -318, -206, -302, -424, -462, -44, 57, 56, -281, -417, -29, -228, -493, -542, -116, -15, 51, -290, -45, -177, -135, -463, -381, -237, -256, -247, 7, -287, 24, -123, -206, -238, -337, -251, 423, -151, -266, 318, -157, 265, 185, -45, -44, 278, 256, -224, 38, 235, 548, 134, 54, 348, 309, 217, -195, -2, 130, 373, 538, 511, 47, 572, 707, 707, -350, -87, 525, 531, 285, -9, 344, 782, 664, 172, 185, 688, 807, -71, 505, 370, 591, 201, 356, 116, 457, 498, 497, 87, 285, 273, 661, 738, 56, 7, 474, 368, 65, -544, 183, 586, 243, -120, -298, 468, 111, 6, -583, 120, 9, 123, -87, -161, -44, -29, 208, -266, -632, -336, -134, -198, -682, -875, -160, 155, -919, -1295, -315, -158, -584, -1062, -806, -350, -205, -791, -694, -422, -502, -322, -893, -789, -636, -979, -591, -233, -577, -554, -627]
4002f27M47o60l48P23L95m53n52N31O45l62p97N12N56r5r80M67L55N2n2l7K05
4023g5%o01M91K30k17K82M6M07o86m04L74Q38n91o73O08R63m57j144P54N46L18
4044A009r49L3L58K83p49qP90L5m16R4M54p01k32P55M97m66l24J71O11n64j013
4065c32L45J313j50j234j91J188M55j045j21O44M02p18p71Q22J85m79J18L51K76
4084A058j164J06R34k70q80N53Q90p72j218K00J533K8j525L29Q81j33j220k91
4102i61J285N93j080k65N03J09m83l28P80n1o34P8N36j00j141J86J396O7j766
4121a276J88J139K00j457Q8J769J44j689o19J257M44q25n95J054P80j081q82J067
4139b94L25p20k47R27K09j083m6J096L49j374M9J191J65j736m44J834O16j356
$$ y = [-627, -180, -840, -1188, -465, -70, -523, -1075, -544, 101, -261, -1058, -546, 10, -85, -1065, -598, -243, -191, -243, -280, -75, -75, -676, -185, 45, -172, 110, 156, 563, -123, -527, -153, 685, 94, -579, 29, 992, 535, -609, 145, 691, 1009, 60, 93, 451, 734, -15, -23, 767, 802, 386, 480, 934, 233, 1, 756, 1253, 787, 463, 634, 1245, 681, -332, 13, 1326, 1176, -58, -249, 939, 1394, 349, 228, 872, 1274, 556, -215, 607, 792, 313, 431, 782, 1058, -106, 0, 934, 664, -216, 337, 1227, 455, -763, -563, 970, 998, -527, -198, 683, 550, -670, -961, 324, 917, -163, -428, 75, 184, -299, -627, 153, 102, -532, -454, 82, -18, -1159, -973, 423, 490, -1276, -1088, 51, 251, -1206, -1118, 651, 795, -894, -1513, -256, 188, -637, -1232, -178, 602, -479, -1361, -294, 31, -689, -936, -9, 200, -883, -929, 167, 516, -858, -809, 382, 547, -1189, -1633, 201, 817, -539]
4157e39l45J138P29j457r37J100J106p93o08Q32O24p77p85J188L31r86n11R93
4175C03M94j408o7J812L77k078m49J545P96j383p77J094J800j613j264P52J324
4192A258r46o64Q17M71r39n63P44Q61o15n47R16L23j439o76J461R20j489p22J453
4211F24R85j607j296J264J418q13j733R29J337j001n91K17J036p63j012R01N73
4228D68q08m50J225O53j405q52Q36J190j013j296J324J470j464j597J154J635
4244A070p49k018Q03J689o32j603M67J480R8j631K51Q93l77q63Q46N57q47m98
4262a064Q87N27q12q80Q39J442j111j698Q37J793l02j826R13J551o41j483j69
4279a197J632j65q99K32R75j02j294N41P81l07p42P53Q09j077r58J087J288q26
$$ y = [-539, -884, 254, 983, -474, -1411, -311, 795, 2, -606, 226, 850, 73, -712, 476, 807, -179, -690, 303, 797, -611, -678, 1134, 1511, -567, -1016, 529, 1325, -58, -835, 259, 2059, 446, -818, -66, 1258, 312, -352, 465, 936, -3, -566, 178, 1039, 424, -123, 793, 1116, -323, -999, 462, 1382, -107, -829, 624, 1609, 2, -1294, -30, 1388, 575, -1158, -229, 1108, 107, -484, -267, 769, 6, -1006, -105, 468, -340, -790, 435, 1088, -317, -1169, -333, 857, -156, -1452, -128, 1342, -122, -1719, -565, 1070, 321, -1697, -894, 795, 163, -1440, -973, 507, 605, -1026, -775, 118, -259, -1122, -276, 281, -566, -1064, -177, 350, -462, -1342, -503, 939, -172, -1870, -1033, 760, 458, -1368, -455, 1096, 455, -1028, -1197, 435, 270, -629, -397, 578, 476, -818, -277, 504, 197, -545, 208, 1017, -60, -1018, 69, 1357, 531]
4297E31j222J79J744o33j574N07K119n41j303MJ295k07j125o9J401n2j266L22
4315A10J184m30n79l4Q50m11j334Q13J184m55j116N90J275m20j466k19J543n4
4333A031j265O3J087K28j300j68R72L35p68l94O25o9o15N0P38P8q44M9O79n39
4353b7r61M95J180J39j525k2J353J86j287n47J149L27r26n98O98N58p14k39J080
4372C19k56q49k12O77R8o09L29R13o19p66J49Q51M68j443n1J032L49j244o04J479
4392A1K29q49p39J005N21o30q75R11Q49n58m82M49N8o72j09R30j79o46K99P06
4412B29l22p91J10Q98O89j450l37Q85Q12j027k21N71O69o10p54L12N34k62L22
4431B57r9M83l48m93K19K76l31L48K78j28l17J22N58R1p17o42P54M24n25k80M50
$$ y = [531, -691, -512, 1232, 599, -975, -468, 1651, 1110, -193, -189, 1106, 899, -226, -295, 1106, 1054, -212, 110, 1294, 864, 285, 251, 1101, 690, -644, 169, 1353, 898, -218, 372, 1647, 1227, -239, -458, 1085, 1031, -234, -171, 916, 1144, -156, -324, 648, 983, 215, -179, 446, 377, -238, -188, 550, 628, -216, -167, 512, -27, -988, -493, 687, 826, -699, -721, 632, 818, -469, -1016, 133, 460, -466, -1064, -366, 192, -522, -761, 319, 63, -786, -998, -321, -223, -832, -503, 410, -209, -975, -826, 25, 493, -950, -1001, 31, 380, -864, -1468, 11, 240, -609, -1348, -343, 178, -452, -1327, -416, 433, -125, -607, -158, -100, -772, -881, 49, -130, -776, -477, 229, -93, -884, -774, 124, 813, -637, -974, -89, 723, -304, -525, 46, 715, 105, -649, -337, 197, -65, 257, 158, 641, 293, -200, 19, 295, -36, 312, 590, 462, 145, 267, 825, 916, 199, -443, 311, 735, 210, -70, 380]
4452C80N42l42j58n45O46Q8o43L2N50k19m8P5k36KN9N43l87J20m99L87J47l73
4474A21k33P67Q6n62m57L48L18l88k75L48j3M51q86K27j51K07k07j0M32j95J68
4495I6j52j3m31J63L86j21l90j32O62o1m41L8j66K91j37l49K13M77k38j36k69
4516g10L02O3J82l15j16K67J91l54k19K96P8K31R3n03k68N49K74m58k47L11L87
4537C4k0k24o5M52j25j80l25L52RK03m70J86j10N66j50j95k3K95j67J6J80j23
4559A16L90j24j94l85L85L97O5l08j66L94K36m41k16m1J81l7K02p60O74QJ60j63
4581C73k53L5J76J23m42J07N10k49Kj01M7J53k54j32o7M10K52p06J10RL31l41
4603I3M6j00L68k91q5N5K17nJ32l85l08J81j26K3J75m6m4N7R5l75O9j76L59k96
$$ y = [380, 922, 580, 422, -123, 523, 611, -32, 0, 550, 331, 283, 358, 122, 124, 183, 726, 339, 459, -40, 347, 494, 121, -112, 655, 741, 179, -278, 70, 388, 0, -275, 73, 60, 511, -375, -148, -299, -92, -299, -309, 123, -72, 96, -56, -69, -500, -337, 49, -72, -462, -594, 68, 7, -434, -396, -562, -271, -408, -757, -544, -67, -305, -441, -710, -408, -345, -163, -478, -594, -327, -136, -490, -709, -413, -335, -104, -11, -514, -782, -233, 41, -417, -664, -353, 34, 14, -210, -275, 177, 52, -128, -453, -101, -92, 111, -359, -173, -283, 283, 133, -62, -85, 210, 43, 59, 239, 116, 506, 382, 188, -197, 188, 585, 650, 342, 176, 570, 806, 365, 149, 108, 289, 252, 454, -306, 368, 376, 536, 373, 120, 155, 331, 454, 12, 119, 629, 380, 382, 281, 328, 481, 227, 95, 28, 438, 690, -16, 94, 103, 434, 93, 139, 39, 407, 116, 31, 86, 303, 298, 430, 45, -263, -82, -208, -185, -10, -56, -100, -43, 52, -323, -254, -430, -71, -367]
4627c67l20O4N01O6m46M55j61l28P4q6J48j17M05j62J19k96J15j58K95k40j85
4648f24M19K00n07Q7J41J00J55n64o7O13q4k8k90J94j07L9m5j66K12M29o70J83
4670c80K98l8j28J85r5l5P3R1l40J99O9K88kk36K03K34k25k58J72J2N6j50L03
4693B96l65J89QK80k65p1k5K73j15k60Q4M28J16m98K41K37k72r1m9R1P5O1m7m4
4717B77K16n60J84J6J53j2K39l68O4K03J3m1n3k90O3K20j46K28r9P3J71n18K9
4740F2K79l01K8k32O1J26J73k79k2L97k63l9k70Ok26L07M81k23j31K4r4L02r74
4763h08O19K97k97l71O7M26k36J34m7r1j26k9p0K93K50j41n35K57K42j38k05r9
4785f08K38K63k99L82m5j93k70K89K1k7j24L17J16k69M5L51j73l25J52L2L14m51
$$ y = [-367, -687, -623, -122, -56, -502, -47, -208, -536, -462, -548, -400, -517, -112, -274, -155, -451, -336, -494, -199, -439, -624, -205, -5, -512, -425, -284, -184, -29, -593, -660, -47, -131, -159, -449, -255, -362, -323, -368, -534, -322, 107, -563, -380, -82, -120, -248, -63, -158, -193, -120, -29, -369, -170, -101, 187, 185, -51, 152, 386, 161, -97, 75, 87, 143, -7, 296, -69, 120, 128, 408, 143, 72, 47, 320, 205, -55, 29, 457, 573, 75, 316, 553, 281, 190, 141, 232, 307, 368, 321, 277, 493, -67, 117, 133, 286, 274, 513, 145, 209, 412, 425, 384, 331, 41, 104, 324, 178, 406, 307, 380, 551, 33, 62, 341, 40, 68, -164, -103, 23, 196, -83, -105, 292, 29, -10, -280, -274, -500, -193, 288, 65, -66, -42, -136, 166, -808, -189, 108, -189, -560, -493, -67, -303, -169, -216, -307, -433, -462, -532, -239, 11, -130, -665, -408, -166, -304, -509, -608, -370, -107, -406, -24, -69, -262, -532, -243, -222, -249, -373, -56, 60, -209, -164, 187, 14, -311, -159, -127, 187, -264]
4807b64L7N18k60K93o18O09j32l49m5J29M42k43j71N1L41j96J2M9K99k10k75J1
4829B8L70jj90J93j16j3N4j6J96m07J55J31J50k70l8L03r0L2n57M09Q8k57J08
4852B62M40j93l32n7L52l04q5o9J8L11j9J16j82N9k03l12K55R0m30N4N33j25m56
4875b77j03K77j92O1j12J99j40J32m7jL44o46LK59J23j31j46J82K12j30l17J76
4897b74J87m65K3R2J81k22k32M82k3l5l36M11o1Rj79K78k99J24k16J92O02n47
4919c08k91L35J51l32l94N54M06j70o2l2m9k13J85K17j2k47j36K31K38k46k73
4940d48Q16J45p17j49K48L70p15K48M85J06k33m33L48J54k37n3L18K35m02j55
4960f9K90r3j07J00M79l33j82r2K07L42m60J97L51q1p12M6L29O37r13M90J49r6
$$ y = [-264, -227, 291, 31, 324, -294, 315, 183, -166, -211, -82, 360, 117, -54, -3, 338, 142, 154, 203, 502, 292, 17, 28, 398, 397, 207, 400, 284, 271, 325, 309, 505, 98, 253, 384, 534, 264, 226, 529, 439, 471, -86, 323, 411, 154, 262, 702, 509, 177, 120, 472, 168, 83, 14, 32, 343, 324, 440, 258, 317, 114, -198, 57, 147, -283, -229, 304, 179, -277, -380, -103, -295, -234, -346, -147, -287, -155, -202, -203, 141, -505, -502, -243, -120, -251, -397, -215, -3, -133, -450, -274, -87, -552, -529, -437, -256, -478, -710, -228, -251, -286, -622, -211, -272, -263, -442, -164, -463, -339, -555, -363, 239, -308, -599, -264, -113, -445, -839, -285, 121, -49, -111, -143, -192, -405, -220, -3, -15, -262, -398, -167, 71, -175, -448, 368, 513, -204, -353, -105, 265, -450, -202, 283, 389, 156, -277, 71, 225, -12, -65, 253, 488, 86, -69, 221, 128, 21, 121, 600, 267, 85, -7, 200, 542, 82, 279, 630, 549, -163, -117, 212, 849, -64, 426, 575, 479]
4982D79n97J75J20o3L04l03K74l46J61r2L01j1k09j89J33O8j11r9J94L70n92j07
5004a40N36j78m81k9M44K93n26k53J51L84k67j84L83J07n36J61j7r0J4P1J50K15
5026B08q24J31M04J01l14k00N94l13j22l48J68N65j73q0N7K26n99J21Q6K84R4
5047F6n52L41L54n21j1K20L19m95q5R0L54j82l50o8P18n94J46P3J00LM4M1J58
5070A69j61k25L44j97R4n6J22K47m12j53J70N60l45k37L43J15J19o54K36L00K7
5091D06n49K23R7J11j11M1N20r6m20p1J68m42J73J76j12L44k59j08J93r0n13N39
5113B20N75m29l57J83M77k20o50K56J12j74p8j3m2L57N3j93K64m6n54J20J81j01
5135e9j37K85J27l13l87J96K22k79n5R6N20j44n84L74j28J73k05P2k43J45m54
$$ y = [479, -118, 57, 177, 114, 418, 115, 389, 43, 204, 112, 413, 402, 193, 4, 137, 205, 94, -5, 189, 559, -33, -140, 396, 218, -263, -292, 152, 445, -81, -334, -183, 201, -66, -250, 133, 240, -296, -135, -152, -242, -228, -157, -7, 208, -616, -485, -81, 20, -294, -494, 100, -213, -335, -683, -515, 50, -123, -203, -146, 80, -519, -398, -312, -28, 66, -486, -145, 209, -312, -323, -103, 216, -279, -364, -274, 80, -102, -452, -520, 198, -396, -250, -177, -77, -74, -30, 11, 169, 8, -217, 127, -70, 24, -32, 90, 337, -75, -228, -58, 502, 157, -80, 263, 378, 497, -157, 79, 379, 406, -143, 80, 177, 288, 177, 218, 738, 642, 222, 151, 319, -123, 50, 226, 114, 458, 199, 91, 284, 194, -319, 220, 795, 366, 9, 192, 669, 449, -201, 55, 167, -7, -85, -98, -140, 217, 270, 77, 341, 295, -259, -139, 42, -59, -196, 89, 216, -97, -484, -288, -66, -345, -400, -304, 216, 72, -512, -138, -266, -93, -298, -226, -469, -324, -778]
5156g78P18k20rJ97k81K05m2m89J73L66m29j23N57qq4r0J04K86l38j59j45M33
5178a56J17n58J84J63O9j24o7M23k89n2K20N2J70n38J96L42k94J7K64m3k91j01
5200b96J85L33J83k82k24K61j66m0P1j85N10j51k01K75J9l76J93r1K69k11K07
5221B83J03J49l91K81j69m0j59R5J15l4j55K50r8M68n10n0J29L35j49k78K22n3
5243C44J53j97J4nm61N40l5o9r3p9K17m17K63k71J51m7l14ON02J31l21J53r9J84
5267B50l8o23J85L13j34l1J36j35J44k70M8LJj53J68m4j95M13j14o5k28O3J94
5290a12k03O9k96J30O28j59m25P7j25J11j00k00K24l5K74q5K15n34K68K20l05
5311c63j19J69Q7J10j17j04K8K77j29m93O99j10m2q4o4Q4J58k91J93K66r1K88
$$ y = [-778, -60, -280, -289, -92, -373, -168, -210, -699, -526, -160, -589, -712, -155, -163, -247, -337, -233, 53, -285, -444, -589, -156, -39, -597, -413, -250, -181, -305, -372, 51, -238, -290, -70, -18, 152, -386, -190, 152, -142, -125, 139, 96, -195, -296, -111, 222, 405, 123, -101, 160, -6, -46, 25, -160, 350, 199, -2, 273, 292, -84, 109, 18, 287, 76, 283, 386, 535, 144, 425, 256, 216, 57, 152, 267, 233, 78, 328, 230, 698, 188, 138, 267, 602, 453, 175, 397, 344, 497, 300, 314, 309, -152, 388, 353, 284, 191, 112, 329, -88, 175, -96, 55, 8, -306, -300, 202, 333, 12, 165, 66, 250, 212, -411, -226, 87, -47, -78, 58, -77, 67, -203, -155, -152, -151, -304, -136, -180, -375, 38, -76, -141, -369, -306, -112, -315, -246, -542, -412, 216, 57, -368, -291, -416, -305, -405, -605, -381, -416, -142, -227, -12, -546, -278, -58, -363, -482, -313, -226, -116, -233, -337, -309, -32, -161, -654, 45, -65, -107, -191, -255, -171, -13, -304, -111, 155, 64, 352]
5333C52j03l47l23N89L88p05K30j5K97k71k2J18R9J31K8n00L96J76L5q32M23K39
5355C83m06K30j42J57l9J6J22q6p8lPL58o55M71m4J49l43k2l2L43J87n76K37K87
5379E21j6p25O7K55K38k78l76M47M1j31M6k53K85j69KL9K61m58K11j97n4J50K93
5402A99K59n32l34L21K1K68n02k64N80L3k49l49K94P5m2J42q7J15j57j43K44J0
5424i8k95J63K07k05n43N63L70l04k83K38O6j37j06k29O26R2o97J68j05O59l12
5445a62k85R2M41j50K42k94K3Q1N8L95n23l65P39l79L35r21P40K80k5m10K0N56
5467D88J31o48k16O09j28R5m28O91k89k16J56J18Nk76mK02k74J47KN34k11n49
5489f1O5P97l61l47m01N44K25l56r5M66L67p88K02j01K39l29J6K36j54j04L41
$$ y = [352, 249, -98, -421, 168, 556, -149, 81, 66, 363, 92, 70, 188, 287, 418, 446, -54, 342, 518, 553, -279, 144, 383, -23, 207, 65, 222, 183, 199, 321, 235, 157, 154, 161, 519, -136, 335, 291, 440, 97, 75, 43, 386, 573, -3, 234, 521, 505, -220, -153, 102, 340, 62, -314, 133, 174, 43, 89, -164, 121, -48, -46, -7, 254, -204, 7, -190, -244, -94, 199, 458, -74, -408, -87, -66, 202, -300, -564, 16, 49, -200, -549, -255, -180, -222, -80, -167, -52, -209, -352, -108, -98, -393, -230, -23, -228, -771, -208, 162, -142, -425, -187, -121, -258, -364, -593, 33, 125, -572, -404, -509, 150, -162, -447, -355, 86, -64, 178, -116, -93, -12, 46, 441, -82, -447, 292, -87, 248, -673, 67, 347, 322, -88, -68, 488, 619, -29, -245, 364, 236, 331, -97, 594, 305, 89, 245, 363, 368, 92, 88, 290, 16, 163, 165, 699, 488, -61, 4, 801, 440, 93, -308, 236, 461, 105, 10, 476, 843, 55, 257, 156, 395, 66, 82, 318, 164, 60, 401]
5510D01Q0m48k44L06L68k34n92L4P63k87n03k79Q44j90j37m31Q68J41q98K25K94
5531H1Q1l24k76L83k50j04K55L95j20m03j15P58m02n91j14P58N1k86k86P29l31
5552a11m12k97P76J89m14k21K71N45p63K3J25N0n1k33K77n3k58L10M19j49m99
5573d76NL59L15o63j45P72J14l97o62J185l87m16J10K73K7J55p12N49O74n56m76
5594c52L98L66n97k44O03N55n48l33N95K38p92k87O61O19m33p10L00O49n92l40
5614b44K46Q16o09m49M15J56k24l06M37O62n51o57O04J92o01j90Q12K17n29m58
5634b61L32O83o39l31P74J69l70o48K00M50Np56M87N96k41p19J88M53m8p38O32
5655B18L79k53o57K21L00j70m41K08K94J55q84O05O17n85l06l28Q63m75l10K1
$$ y = [401, 481, 33, -211, 95, 463, 229, -363, -329, 434, 147, -356, -635, 209, 19, -118, -549, 319, 460, -438, -213, 81, 162, -162, -438, -55, -305, -409, -154, 241, 121, -282, -397, 361, -41, -632, -746, 12, 63, -223, -509, 220, -111, -523, -820, -44, 145, -269, -490, -219, 326, -437, -414, -289, -239, -290, -523, -246, -299, -557, -247, 172, 23, -476, -471, -112, 203, -460, -605, 167, 281, -116, -778, 407, 20, -396, -286, -13, 14, 169, -543, 6, 680, 124, -352, 46, 412, -185, -429, 174, 729, 181, -152, 443, 681, -111, -398, 263, 882, 449, -261, 39, 688, 96, -244, 2, 818, 209, -240, 175, 331, 107, -199, 238, 900, 349, -308, 296, 488, -113, -303, 509, 726, 197, -261, 71, 754, 115, -216, 558, 727, 357, -291, -91, 359, 364, -392, 95, 691, 450, -269, -81, 372, 324, -414, 218, 597, 344, -313, -92, 208, 38, -403, -195, 99, 254, -630, -25, 592, 7, -299, -627, 236, -239, -549, -528]
5675e28Q08no19K04K3k46l92P38L03m30k83J96L16l76k93J80O75m19o10L18P45
5696C05m82o55J16R96k06n90R9M1N38m59j85P56k06m94r4R19k66j84J39M01o52
5717a63j76L22L53k9o84N07M70m71o31K75P47k07k57q9M22l27m59K83J89N21m62
5738A34k40j3L35j57J6K56K38o92l04J022m90k19K30N50l62m17M4O41j94j90l39
5759a51Q65j90q45K64M59k37lq2K75n1R1n41L88K59o05J70L22j60o79L30O02j33
5781C48k02j38K89R3r13J85N82K25j94m29J17q7J58k68M44R2n82p8J25M16n35
5802c52j8N61l31l0k01K22o1j39KM45J26n85k23L77J57j67j12L09J2k72K0L71
5824A11k79M8m47N89m5m58J89M5L22k99j10K84K01n96K8J90M00l92J2J03N54m93
$$ y = [-528, 280, 275, -344, -140, -117, -363, -755, -17, 286, -144, -427, -231, 85, -291, -584, -404, 271, -148, -758, -440, 305, -177, -832, -716, 280, 74, -516, -417, -376, 162, -297, -482, 274, 68, -426, -520, 399, 133, -51, 88, 489, -163, -339, -17, 336, 307, -377, 130, 600, 129, -502, -227, 520, 313, 56, -33, 389, 62, -397, -114, 75, 596, 134, -106, -119, 216, 59, 75, 331, 569, -123, -427, 595, 105, -114, 116, 666, 304, -113, -69, 572, 378, 188, -151, 714, 524, -321, -57, 402, 165, 162, 80, 355, 304, 395, -146, 242, 501, -104, 66, 388, 228, -451, -121, 481, 348, 146, 8, 297, 390, -523, -338, 244, 469, 275, -154, -37, -124, 34, -234, 210, 302, -280, -358, -233, 183, -352, -370, 191, -140, -170, -371, -149, -210, -349, -347, 98, 224, -361, -584, -207, -50, -217, -329, -20, -8, -280, -260, 111, -168, -120, -567, 22, -23, -481, -292, -247, 75, -224, -334, -50, 151, -445, -417, -227, 173, -219, -207, -104, 450, -43]
5846d3l23j2O23q8k99M14k51L0p6L70r6n7l79J62J42j69p8M77q0p3m18M62K71
5869E09l51J54j25K60l49j78L97J36j27k25J29J04j97q7K80p4K07k30q4L21l75
5890I5l3K47m4j34k76L92k2q0R1j43J64Q1l67L38q5j9NJ2J02P9k44r8J14j89J46
5915A32j66m7L27j5k06q5m2L0k85M51j13M1M5j9k23Q0j11r0J68j10j51K6K90k72
5939c45j70O49m29j4k67J81J45Qk4K32l43L1m6M94l05kJ77j87j8L24m94M45Q8
5962A30n05J03k29K75k27M06j68O9K66l22K49J39m07J47J65o1K60j48J88j59n0
5983A21l7P4j95M8R0L0lK4k30J83m8L01j11j66J62j44J35j62J31L97j33k95l2
6006A40M3k06N51l92J3j66L12pj98Q7q7r2L75m18J09K90l06j79K94J38J05p4l38
$$ y = [-43, -366, -378, 245, 157, -142, 272, 21, 51, -25, 345, 249, 192, -187, -25, 117, -52, -130, 347, 267, 194, -224, 238, 509, 158, 312, 187, 447, 98, -80, 317, 453, 326, 101, 230, 334, 137, 50, 330, 256, 463, 233, 149, 470, 95, 62, 309, 265, 131, -145, 247, 225, 145, 236, 93, 257, 338, -29, 309, 224, 205, 210, 222, 324, 403, 159, 61, 175, -14, 132, -34, -81, 246, 231, 25, -60, -102, -72, -357, 94, -19, 22, 67, 48, -175, -95, -206, -296, -128, -238, -389, -363, -73, -345, -515, 134, -295, -309, -576, -395, -250, -242, -266, -34, -377, -346, -392, 102, -203, -205, -28, -215, -233, 91, -403, 42, 130, -375, -272, -501, -226, -453, -47, -215, -146, 120, -202, 47, 186, -221, -74, 91, 30, 290, 142, 330, 171, 121, 84, 158, -37, 11, 101, 131, 128, 152, -78, 105, 57, 358, 247, 81, 243, 99, 234, 72, 203, 600, 467, 172, 140, 183, -23, 528, 136, 149, -17, 295, 288, 90, 177, 90, -2, 373, -45, 64, 354, 48, -131, 163, 301, 406, 332, -6]
6029fj4J01j2o5J48k06L01p3k28K40j33r4J52j77J37L15j28m42J18K11k92k79
6051d26L9J12J68J4j41L29J60m63k98K61J83j01o9J46k09L35q3j25M5l52L38j88
6073c25LQ2n0K51j11k77N8N9KK7J71j35p9mJ56J63m84J22J50k78J56L27J9l81
6097c78L58j35RK3K14p8N2J3q6R2l19L92k52O6j23M89m01o9M14k03K78k98J15
6120A73k86J56j5M7lJ2K83k26K23k88R0j29L18n73L51j85K95Kj18J94k45N04k27
6143C53r5J13j40m6L44j76n1L3j23N9K7j20P0J01j54J10k21K32k66N8m38L88K12
6166B70q8l91R6K47j73j00M91j41k04l05J22L12k34L22k19J57o79N65p9j60%k76
6188d67K43k8Q7j67K60j13j23k5K80q9j56J26P0k9p8j4J32j83L8l0J6O9l19L76
$$ y = [-6, -20, 81, 69, 4, 152, -54, 247, 174, -54, 186, 53, -41, 111, -66, 71, 386, 258, -184, -66, 145, -147, -426, -387, -275, -107, -93, -234, 95, 255, -208, -506, -245, -62, -163, -232, -86, -295, 40, -43, -168, -123, -475, -137, -325, -322, -240, -290, -39, -150, -427, -369, -310, -308, -281, -110, -245, -324, -328, -172, -9, -493, -371, -221, -499, -343, -16, 3, -378, -20, -155, -146, -123, 91, 13, 65, 78, -8, 84, -235, 157, -95, -29, -152, 337, -64, -133, 281, 78, 356, 58, 173, -113, 43, 28, 75, 72, 84, 367, 141, 364, 76, 166, 37, 355, -218, 133, -52, 243, 245, 127, 321, 76, 580, 353, 258, 371, 231, 185, 529, 353, 302, 335, 212, 271, 298, 178, 248, 349, 195, 305, 84, 316, 50, 108, -330, 58, 270, 182, -209, -113, 134, -39, -139, 352, 211, 7, -298, -176, 136, -98, 224, 5, 162, -517, 48, -31, -191, -191, -467, -224, -252, -165, -332, -72, -185, -308, -333, -53, -142, -298, -172, -102, -131, -209, -223, -91, -274, -236, -266, -250, -181, -500, -124]
6212a24k82J32N6J57k71L23j55j13l3J60j04J70k29J63J29j25j68L23k53l1M30
6233A55k93L54j84p3O1ko3K38q8l1k91J59J98r3J50n03M09o1k03j69L56M65l19
6256A72J68K8k75J80k56K70j9J6j46J50j61K38K78m25o4J23pr6k76M37j98q0K57
6279C14m12K07j27J25k57O17k51k32m89O28r8J7k3J19j15l2k32L32NL2k24L82
6301B86n6n82K18K62j17l55M79k2q2k99K64j76j4j3J73j09L21k90j04R0k76M95
6323I3l55M9P3j99j88K97n9J62J79m41R7j38K39K51l76K7o5K56j12k83M89n6K23
6346A63k81J18k16R8N31m74K3r9K4k81K87j14J18J95n0L7l97L49L2M8l13R0K71
6369A59L34o46j40K22K28m65M06o2pL9n1J16J34j48j6p3O8J9J43j04K8Q2j87K59
$$ y = [-124, -406, -274, -218, -61, -332, -9, -164, -277, -310, -150, -254, -84, -313, -150, -21, -146, -314, 9, -244, -275, 155, -138, 216, 32, -41, 20, 18, -45, 193, 105, 74, -217, -58, 140, 47, 197, -306, 103, 42, -161, -330, 26, 491, 172, 340, 368, 93, 273, 17, 287, 268, 284, 138, 288, 127, 365, 643, 218, 154, 277, 270, 174, -102, 335, 137, 57, 314, -98, 109, -18, 107, -150, 467, 216, -16, -505, 123, 25, 42, 19, 138, 23, -9, -241, 91, 96, 128, -96, 286, 230, -352, -134, 128, 11, -344, 135, 113, 31, -268, -4, -180, -194, -207, -34, -143, 178, -112, -216, -126, -402, 93, -262, -213, -140, -339, -527, -230, -289, -127, 52, -389, -292, -430, -191, 60, -316, -289, -354, -98, -210, -493, -4, -60, 163, -118, 0, -216, -118, 413, -61, -38, -137, -113, -394, -107, -221, -103, 92, 42, 79, -318, 31, 63, 111, -202, -112, 159, 493, -153, -293, -71, 157, -308, 98, 36, 29, 68, 17, 133, 267, 119, 103, 30, 98, 117, 260, 156, 184, 266, 79, 338]
6393C38j66J37j89K33J61k28m23M85j65K1j01J17L7K18k94o4j74M75k99J82j41
6414A60r1o8M2j41K64L5l4L13o59R2J55K3l8J28l21J25j4K2m0J03J01j40j14l8
6438a35j8L01j58j6N7J53j04l20J46J12J18l09j71K6K12l1l49K64L44k55K62k4
6460A05q04N82P2l31K71o8L80p37J38J3Q7J75o0N7j43Q7j13J61l90J67J86P9N6
6483c0n41O39o3k56n1L01N2k05j80K44O1K72m06L7j42O5J57J70j58m21N65o2j3
6506C5l05M51j36%K4k24M90j68j44J9R4rj00J46l02M20J54l34K8J3j46K22K31
6529D59k67j7M06l86J57k77o3M71J36r0m00n7J03m5r4K04j52K33r8k43K09L19
6551E08m74K66m64K81k8k11L55j40K16n20N14k4n21L65j89m3j16L6M17l32J07
$$ y = [338, 172, 309, 120, 353, 514, 286, -137, 348, 183, 204, 103, 220, 257, 475, 181, 117, -57, 418, 119, 301, 160, 69, 1, 43, -98, 166, 201, 167, 480, -179, -87, 68, 91, 53, 181, -140, -15, -29, -7, -47, 56, 157, 17, -97, -135, -153, 148, -10, -26, 31, 184, 80, -240, -94, 18, 136, -173, -344, -318, -106, -137, -486, -222, 122, -133, 129, 105, -699, -117, -45, -376, -105, -173, 207, -530, -392, -379, -292, -117, -177, -120, -263, -176, -289, -128, -518, -351, -165, -86, -30, -571, 68, 5, -251, -302, -1, 51, -154, -334, -90, -29, 243, -163, -126, -268, -203, -46, 124, -34, -455, 110, 48, 35, -270, 181, 45, 45, 69, -155, 335, 167, 23, 42, 136, 127, 27, 173, -129, 291, 445, 111, 139, 152, 6, 228, 459, 192, 175, 581, 195, 352, 75, 12, 483, 619, 529, 129, 72, 175, 130, 36, 240, 88, 321, 223, -20, 189, 508, 34, 300, -164, 117, 89, -122, 233, 93, 309, -211, 303, 279, -242, 123, -66, -109, -225, -189, 228, -104, 3]
6572Ck5L3J52j24j35j65K30k08K43K30l77J44N1l02k6J77K8j59J75l8M0J38n88
6595e03J88J33K72j78j5l25M62j46k18K42O9j25j24J28N2j20J60J63l67J05m04
6616e51Q63j94m64q1J84J54l8r7K32N7j69J06j37j43M31pj97J38J58l2l06n5J02
6639d6K96k40P5l53K75L31l15m2J19M7K2j47p0j95N27j24J57q9o8Q9K45l88k2
6662H4J37l0l45K58N36o38M72m63L8J85j34J49k40O2jl5pK14j22r8jJ11l42K90
6686H0L0K8l01L80j18l82R7J88j9o7K2p2O8j86J16J17j99M42k55K8r2l8j34K52
6710a5K23l68k07L31j38O5j74J55J79m87j0M52k78L14j49k15Q4K0L90m94j86J34
6732c74J46J72j35k65L35k51L09j78P0m4L23m47N4L78k55J36P8j81J89l7j32m3
$$ y = [3, -22, 11, 163, 39, -96, -261, -31, -239, 4, 234, -143, 1, 52, -250, -276, -99, -71, -230, -55, -93, -53, 85, -503, -315, -182, 90, -88, -103, -428, 34, -112, -330, -88, -19, -144, -268, -140, -88, -208, -48, 115, -252, -147, -551, 312, 118, -346, -427, -243, -89, -127, -224, 8, 65, -104, 2, -135, -278, 153, 146, -51, 87, 245, 213, -93, -148, -46, 250, 10, 85, -268, 7, 338, 23, -19, 100, 147, 169, 22, -48, -243, 284, 160, 317, 228, 160, 249, 494, 106, 84, 221, 191, -154, 104, 640, 2, 474, 11, 49, 234, 100, 249, 9, 71, 70, 35, 28, 242, 120, 22, 21, 132, -210, 80, 110, 138, -163, 217, 99, -283, -186, 2, -17, -84, -62, -134, -66, -252, -136, -19, -218, 224, -31, -3, -95, -133, -267, -15, 208, -160, -367, -36, -174, -109, -283, -128, 51, -436, -446, 6, -272, 42, -107, -322, -238, -218, 172, -322, -508, -374, -228, -56, -191, -456, -121, -372, -63, -241, -171, -215, 108, -339, -285, 93, -162, -26, 52, -129, 60, 23, -109, -152]
6754a52l3n0J15q0J47J65n3K16k95r3J63K96k99K1n7O4J25p7rL4N5N4j22j36L39
6779C38k46p5L7K87J25m99M33p9k11K31k73j90L11k5L02k80n4j76J26k3j18J54
6801I5J83j21k11L28j51j64K35l17R5l05M84K3l93L99m5k90j76L77J64j76k30
6822a96K54q8q3k12L14k23j6j5K0N4J34o7q1Q5j84K96J6M07n93j05J85r3J84o5
6846g2Q7J9j99j72L49k42k84L07N7M8j66K44l70M73m13J65J80o8n02Q3M49k2M4
6869en0k0P7j21j09L05k28oK77J15p53K43L17j84K92o78N35J2Q6J40j69j85J41
6892C2PQJ00J32Q4n52L81l43J24K01j52L33k87L4QK47k66k1p6L27m89j10M40J74
6916C36k46K22J48K6n28J62JK14j05k10N85m09j81J82L45k71j97J69j15J28j71
$$ y = [-152, -185, -235, -120, -200, -53, 112, 59, 275, -20, -113, 50, 346, 47, 68, 11, 75, 200, 123, 114, 148, 203, 257, 135, -1, 338, 92, 17, 54, 341, 466, -33, 400, 321, 110, 341, 68, -122, 189, 164, 466, 186, 132, -44, 82, 59, -59, 95, 278, 157, -54, 274, 123, -41, 194, -123, -28, -333, 151, 174, -219, 180, 135, -155, -331, 46, 210, 34, -196, 58, -30, -113, -325, -11, -234, -250, -265, -245, -191, -57, -124, -205, -120, -304, -8, 8, 415, -178, -283, -98, -191, -7, -72, 15, 34, -165, -337, 12, -230, -514, -207, -150, -102, -268, -24, -394, 79, -334, -169, 11, -57, -559, -476, -27, -49, -5, -55, -75, 2, -119, -228, 77, -151, -157, 120, 235, -518, -275, 42, -142, 150, -528, 7, 19, 105, 245, 76, -109, 32, 39, 47, 147, 279, 363, -189, 192, -151, -27, 174, 22, 355, 68, 102, 110, 357, 91, 70, -6, 321, -168, -278, 162, 336, 90, 312, 460, 486, -42, 120, 121, 335, 230, 20, 605, 196, 15, 197, 542, 271, 74, 243, 128, 256, 85]
6937H5o8M23Nm22j23M65O1l86l3R3k2l2J04l06M29p4m27M63Pm55M1J81N7J0P1
6962A47L9m45j83L62K53k99N6k20K08L8k19K03R0r5j98K58l59M95l70j35L61l5
6984d8k62K38j66j02q6R4L25j90l91K65N04k85j19j33O74m19pN7K91k32kj05L01
7007B02n71J91j81K39J66k0l62L94k01J7P3kK10k19K19K14n15l0J88J13M6J7o8
7030A20k8J38j53j71J75K49m48K54j01N2n01K37L33j13j44O3K26Qj14p3j0L92
7052C91n3l71J6M70m01m7K68M1j85k45J32LJ02j10K16k30m0%k1P5N1k32N47l01
7076G6k45O5K26N7k23j8R6k86K67l78K92M70l20j56l4J53J79k85j94L81m07J23
7098a61j69K06R0k68K72k1k33K03k53nm1O90n95J47l5k56L4L01k05l4L24m8n0
$$ y = [85, 17, 440, 445, 23, -100, 365, 426, 40, 7, 100, 78, 46, 150, -156, 273, 199, -228, 235, 242, -213, -172, 9, 66, 76, 147, 186, -259, -442, -80, 173, -126, -70, -290, -82, -44, -263, -60, 30, -65, -263, -5, -364, 131, -239, -374, -13, -48, -310, -72, -238, -340, -426, -332, -7, -197, -588, -323, 181, -104, -223, -356, 318, -101, -108, -51, 240, 8, 6, -99, 202, -369, -178, -359, -120, 46, 26, -336, 58, -143, -126, -53, -55, 155, -64, 155, 369, -146, -176, 12, 125, 171, 188, 120, 92, 230, 77, -94, 81, 330, -118, 136, 35, 87, -414, -177, 156, 43, -101, -38, 188, 196, 82, 9, -1, 391, 338, -33, -17, 453, 52, 5, 273, 314, 129, -116, 16, 19, 121, 11, 227, -3, -43, -43, -64, 11, 62, -170, 377, 76, -169, -104, 122, 179, -44, -62, 34, -252, 15, -363, -71, 399, 79, -77, -111, 42, 221, -64, -258, 123, -284, -161, -330, -124, -34, -302, -30, -51, -284, -81, -334, -339, -380, 310, -285, -138, -173, -429, -395, -94, -299, -333, -9, -57, -107]
7121a07N0k41M21Q8n04o8K08N7O9K14j12k50R1K2j42j26J08O4P73l86o97J90J09
7144a69r2l4k29O19L3j80J40k51L26l91J29J73M6q7N7L2J32oJ31k28J85k3j36
7167A77j55L70l39Q1%J08j34l90M47M4J85l62R8j44Q3J58o1j12K13K40k47k94
7189c4Q0o0m6N8K54J32k66k18L06j24J03RJ58l39J41O4j05l22N0K99j82l5K8j84
7213b33L9K40J39l42j1J39j8l52J63K04r5j2q7J01jj44M6j46p6L86j64J00J08
7236a6k91Q8l90k9K78J44K8J83m4l74L06J38j78J5R6J08l98L13K25j27M7m57K10
7259a25o1L53l39k14L21j8j92P8J48L72k76k19K27k3J4k7J41j28l85M46l53M85
7281B25j57m7k62J25k41M57L1J67l29l5L9R6J3j79M02l79J09K4K82l55L16j36
$$ y = [-107, -57, -298, 123, 211, -293, -361, -153, -96, -27, 187, 75, -175, -84, -62, -204, -330, -222, -158, 615, 229, -468, -278, -169, -261, -295, -524, 95, 128, -52, 88, -163, 163, -228, -99, 74, 120, 33, 90, 122, 254, 248, 379, 151, 336, 313, 177, 22, 392, 53, 134, 134, 242, 108, -282, 165, 209, 394, 32, 130, -14, 69, 227, 166, 54, 267, 507, 260, -34, 46, -14, -60, -2, 252, 384, 118, -100, 206, 82, 185, 194, 352, 13, 154, 218, 113, -209, -159, 140, -42, -77, -49, -233, -194, 46, 185, -157, -168, -29, -47, -399, -236, -32, -127, -139, -226, -125, -126, -270, -224, -370, -446, -60, -224, -124, -16, -307, -219, -609, -638, -360, -216, -188, -5, -49, -423, -117, 21, -157, -142, -46, 62, -336, -23, 202, 75, 122, -335, -125, -186, 167, -172, -386, -65, -83, -275, -197, -49, 323, 47, -172, 55, 32, 46, 19, 160, 32, -353, 93, -260, 225, 68, 21, -241, -116, -357, 100, 131, 298, -31, -66, -27, 69, 82, -97, 305, -74, 35, 59, 341, -14, 302, 166]
7303A66j7M7j64K13l57K88k14K19Nj02j73K10m4r9M69m53q2M12j69j29J41k26
7325e9q1J57qJ64M55n06J10q5j70O8k0j17MJ24K70j49l5l18R6J4l5J58k29J31
7349f1p8L1j28J6M7m0K4r7L09q1k14N20l15l7R7j77L9N0p7r8r3nK34k73J97Mn1
7376b57L86k39L1k67J08r9K91l7q6j12L50m03J24n6j8J91J16l07L52l3j50K73
7398A58k19q4K11Q6k01K68k26J32J9j63K01l19q1M0L52k88L56m70K57P4j76l47
7420d20L58K76M5k2j41j71jJ02N2L42j72l28O6M08J3l07K16j40M5R3j71J85k55
7443G3K62k68QJ19M0j10R5j73K07j15qL7o7P0J72k86R2l1R0j44r5J09j02K68j13
7468A30j96k50N69l67N84l89j97RMK89k86K23k08K4L9J65ok65NJ80k85J24k1J30
$$ y = [166, 149, 196, 32, 245, -112, 176, -38, 181, 186, 84, -89, 121, 77, -22, 447, -6, -88, 324, 155, 26, 167, -59, -140, 17, 9, 173, 628, 122, 232, 147, -23, 45, 25, -92, -88, 36, 306, 157, 122, -196, -100, -86, -121, 37, -192, -61, -139, -108, -236, -220, -173, -213, -189, -286, 23, -58, -272, 248, -67, -104, -7, -184, -145, -95, -172, -270, -363, -368, -134, -407, -210, -206, -257, 129, -110, -79, -346, -238, -337, -46, -83, -169, -281, 69, -334, -210, -266, -284, -93, 23, -284, 68, 35, -115, 158, -61, -145, 66, 152, -49, 219, -7, 125, 144, -19, 182, -137, -218, -178, 174, -114, 242, -228, 29, 103, -73, -420, -62, 214, 259, 237, 96, -75, -76, 26, 78, 420, 248, -80, -14, 394, 407, 100, 316, 176, 221, 314, 143, 328, 73, 335, 67, 75, 194, 234, 124, 219, 46, 253, 138, 130, 167, 100, 170, 342, 56, 148, 117, 207, 63, -32, 77, -25, 243, 130, -66, -316, 253, -114, 470, 81, -116, -107, -103, 186, -100, 123, -85, -61, -22, 143, 137, -128, -123, 57, -228, -104, -125, 5]
7492E%r0J17Oj24m2j48J65O8J64l28p0l19K97J87j33N0j00L32J19k09j80P5L4
7516a24J42j55o8K17Mk50J60p2m0J10Q1k13L46J0j72J02J38k66k88M03j66L5l6
7539a02J00MQ0j10J34J87k90O7q2o2K19J94m27J2K19l32N30r7k08j75K53K14j29
7562A99k50J41p1K40M05m19k04N0k66M76j11N5m0K3j14L9J71l94Q6n7K53k9Rj55
7586C7m2K86l07L12k57K05l07L17j29j40L82k84R6k66J42j66K58p2k52L42j55
7607@j9J14m00K45p9k19M67l91Q6Q0l20J30J36j10J45N8o6q5j87K41J84q1l84
7630d55K61p0J29k9mJ94n4k48l98N85n1Q5k30L48j00j52K23m91L78r2l82K55R3
7653b05N8j0K19k53n9L84L9k68J64K6p3P3l0J01k48J12j40p4J31K8J19nJ84j21
$$ y = [5, 5, -85, 32, 38, -86, -128, -276, -111, -43, 121, -207, -277, -596, -299, -112, -245, -195, -295, 37, 156, -53, -233, -158, -124, 18, -137, -205, 12, 16, -234, -74, -146, -186, -76, 5, -208, 138, 148, -24, 78, 216, -50, -338, 65, -101, -66, -102, -2, 2, 82, -28, 106, 293, 3, 70, -12, -74, 145, 339, -88, -76, 143, -189, 341, 244, 36, -139, 114, 328, 199, -51, 90, 19, 259, 664, 245, 41, 91, -175, 301, 190, 245, 205, 228, 114, 153, 324, -70, 16, -41, 212, 183, 192, 37, -5, 281, -26, 286, 29, 234, -73, 244, 115, -25, 357, 73, 169, -97, 45, -121, 137, 65, -187, 155, 0, -19, 95, -305, -60, -139, -358, 109, -282, -196, -116, -436, -306, -170, -280, -135, -77, -143, -228, -415, -174, 10, -71, -455, -194, -264, -135, -164, -168, 26, -28, -276, -674, -89, -140, -55, -285, 63, -37, -189, 34, -457, -79, -171, -553, -298, -205, -147, -157, 62, -191, -250, 134, 173, -95, 69, 95, 22, 95, 65, 166, -82, 30, -110, -184, -53, -25, 94, 89, 273, 152]
7677A52m46M01K09q2mk7j11j12L64j97L9j37J4k27N02j28l97K57K41J5k96kJ46
7700A74oj45P6J35K83o36L86k71J67k56J41L65k33jj46J12O6j3n5L11m69J58j11
7723C2K37j0l39nq1K70j2j31K12J01Ml49Qn9J8j88J70K24K0k98L12m76J51O5K85
7748A61No09L83k22K85m76K03L78j37J33l48J70J39k73J78m1J43j43k9j37qK91
7770D6j94k2Q0j94p2L81r2J87k20N1r3J57q3j22QL72j8l93L43k28p3Q9N69k97
7794A82l01K49j03J33k58N3M12j17j99P6q2l68K79K85l8j18k81N9M33n75K59J41
7816A21K02ml31M2j9K25l95K11n2J12j43J64J68q8J09k22Pk00N8K11K2l86J62
7839b6K29O9l70r0K87J32P7k30r6K58K3m99Q5R3L59l23N4O0j63K80j64n7J23q1
$$ y = [152, -294, 107, 316, 234, 230, 203, 92, -20, 344, 147, 186, 49, 63, -164, 338, 210, -187, 70, 311, 326, 30, 28, 174, 168, 23, 99, 234, 517, -119, 267, -4, 163, -93, 48, 413, 180, 179, 33, 145, 211, 198, 143, 454, -15, 143, 32, 269, 259, -80, -85, -166, 104, 92, -39, 173, 274, 278, -71, -63, -122, -104, -292, -122, 102, 122, -176, 136, -340, -189, -124, 161, 166, -443, -60, -282, 3, -473, -270, 108, -29, 104, -244, -74, 65, -208, -30, -71, 72, -71, -100, -237, -245, 46, -148, -170, -90, -284, -356, 25, -67, 120, -100, -49, -142, 15, -68, -190, -182, 190, 172, -221, 122, -106, -179, -90, 479, 182, -119, 130, 27, 160, -98, -45, 367, 250, 51, 127, 45, -323, -44, 241, 203, 85, -196, -137, 296, -279, -20, 121, 323, 319, -12, 30, 11, 236, -159, 52, 0, 112, -31, 133, 301, 213, 322, 100, 107, -93, -35, 176, 198, -188, -26, 203, 272, -98, -188, 99, 231, 308, 78, -18, 240, 263, -236, -151, -58, 301, -22, 32, 92, -71, 209, 45, -12, 111, 30]
7863C0k45J67j47J70k10L49k48j37K50J88k96j60K63Q8l11P9J14n0o3K19j45j08
7885b03k4O5l69L03K30m2L6j43r0P9J44o9j12J34mj9j10j74K68j85K86r5k68O42
7909B80r7q4l38J42o2R3Q3j46m2k58K01M62r2k15J94l43J83k86L74J14j76R3j01
7932b1K64q8k62J25o0K64k56J21k41M5K90j35K31l14L23l51K31k90L14p6l00N87
7954D01q4j97K13M8m14J58J41Q7m68M28j31K8r5n8k82K69K60j68J15k25qnQ0K15
7978C08k44r5k46J71K27M8j39J54K3k81M89j12k90k89J08J76N64q76J65J84j38
7999i3j01K99j44kk20J27M67k82l68J46j20r4M45J84j92j47k09J95J6N0j68%J8
8022a93J68O9k16j02P8q4P8J29k19K77j26QQ0j00j44K82p0k58L00J52n04R9J49
$$ y = [30, -215, -48, -195, -25, -235, 114, -134, -271, -21, 167, -129, -289, -26, 62, -249, -170, -56, -106, -169, 50, -95, -203, -227, -162, -531, -228, 2, -40, -4, -147, -237, -158, -14, -83, -195, -61, -65, -84, -194, -368, -100, -285, 1, -94, -362, 280, 183, 99, -239, -97, -159, -66, 17, -129, -171, -429, -228, 234, 142, -73, 121, -222, -39, -325, 49, 163, -13, 80, -21, 243, 155, -107, 18, -42, 222, -34, 87, -154, -109, 181, 46, 277, -37, 286, -65, 166, -124, 190, 114, -186, 401, 317, 120, 333, 381, -33, 125, 266, 353, -115, 313, 182, 210, 115, 57, -225, 44, 304, 136, 251, 26, 18, 13, 93, 308, 64, -31, -277, -106, 121, 169, 30, 184, 207, -74, 415, 303, 13, -276, -168, 8, 572, -304, -139, 45, -93, -194, 105, -39, -41, -261, -134, 333, 51, -317, -171, -291, -385, 60, 244, 52, -95, -304, -109, -93, -43, -211, -211, -193, -25, 44, -172, -274, -196, -280, -202, -73, -292, -15, -141, -133, -53, -153, -297, -15, -85, -343, -43, 109, -395, -296, -147]
8045a47K58o0j77J3J04J93j33k27J59j13L81k33K38k29jK94m7j51l32L05J80j66
8067A09l29K72L64q47L16K24J55j40l25K39J4K53k02j19L79l83P1k20J83J83L04
8088E01m10J07k5j68q3K2N56p21M25r8K3K43j47k84J91k60J1L87o6q3k6j3J2O2
8112A56l39M2N08l46j7P1j82K22L5j31k46P4j7O8K1o0p3K61k21q0J17l3L60j95
8136eL6L2k86K54P3k63J65l02L32k38K52k73k1L7L94j74k45K2K24l5j07M50k44
8159G8l72L2K1m5r1J96K5J88K9j52l7j14l2J1K72J92k09K34l20p8L60q7J18K0
8183B39O5o34L13Q5k78K35K51k8
$$ y = [-147, 111, 51, -126, -113, -9, 184, 51, -176, -17, -130, 251, 18, 256, 27, 26, 320, 273, 122, -210, 95, 275, 109, -220, 52, 416, -431, -115, 109, 264, 124, -201, 38, 52, 305, 103, -16, 363, -20, 51, -169, 14, 197, 501, 91, 198, 173, 5, -78, -56, 500, -221, 204, 106, 129, 372, 225, -59, 132, -128, -117, 270, 204, 121, 95, 82, 94, 156, -183, -141, 367, 21, 4, 75, -107, 115, 150, 19, -227, -153, -170, -102, -81, -141, -214, 47, -174, -254, -137, -170, 190, -5, 31, 63, -223, 31, 104, -159, 6, -296, 36, -202, 50, -223, -244, -207, 187, 13, -232, -210, 14, -21, -128, 322, 78, -294, -262, -241, -286, -377, -181, -156, 32, 61, -91, -128, -242, -274, -263, 9, 201, -8, 226, -94, -172, 188, 101, 219, 239, 304, -330, -17, 68, -210, 25, 276, 248]
8191B48
$$ Imaginary data points
##PAGE= N=2
##DATA TABLE= (X++(I..I)), XYDATA
0@%%%%%%qJ6j6J6k1K9l2M0n0N8p2Q8j01J17j36J56j80K08k42K78l13L54m04M54
30B39n10N76o46P20q04Q99r98J105j227J362j506J664j844K044k264K511k792
47a471L112l481L909m417N032n788O746q008R752j2323J6499k4408M4453j83502
61a53895m07749M03323M32131j35697l52123Q6686K79116m2197k82823m7210J86006
72c4432J17658l9154n9222q1630q5893M3363J64926L6228j21192j8995J18453
83D0110n4053k35114p661L08448J50123k14958j66208J45431R6794k01347j40361
94b78796K12817K21726j22033k14430M5004J36584n2021q1788J18173J18902j25468
105b1330j73450M9569J24662k6919l8288J19452Q0903j45297j52540O6860J08512
$$ y = [0, 0, 0, 0, 0, 0, 0, -8, 8, -8, 8, -13, 16, -16, 24, -26, 32, -40, 48, -53, 64, -72, 84, -96, 112, -130, 148, -165, 189, -215, 239, -271, 305, -341, 379, -425, 474, -524, 581, -646, 716, -790, 874, -970, 1074, -1190, 1321, -1471, 1641, -1840, 2069, -2348, 2684, -3104, 3642, -4366, 5386, -6937, 9562, -14846, 29607, -153895, -561644, -158321, 273810, 138113, -214010, -127324, 151792, 109595, -173228, -220438, -34432, 83226, 44072, -15150, -96780, -182673, -139310, 25616, 61844, -59348, -78343, 40110, -13943, -249057, -256718, 51730, 201853, -13105, -179313, -33882, 62912, -138435, -278796, -65979, 155747, 33714, -180716, -135712, 872, -51149, -132937, -14764, 104138, -21330, -194780, -145211, -20549, -47468, -85756, 33696, 114599, -30698, -183238, -116378, -7866]
116g866m8191k9405J38449O6131j82045j51464J29535J68118p4016j23608Q7384
127b6978J14315j14674j54157R3654J91227j0881j24851K155N1573q0470q3926
138a43013J01075J39316l5916r1592L7920M0301j07014p3473J36754J37257r3754
149D7861j42563O3957J21374o8791j21642Q4067J62800m2215j71528k2676J12364
160B3008K8536m9381L1526O6261m7662r2832J6258N3855l7576k8685J00762Q0685
172A44755j03076j27453O4503J30431l3863j09059L6132J07622m1736j28807J0895
183d9656J27625K9719p8477j8142M2048k8796o6151L3209Q6977n346n8291J8933
195C3652M2375n7851p5359N4926J01361k5089r1732J4734P6183k2735p8463K7024
$$ y = [-7866, -56057, -85462, 52987, 119118, -62927, -214391, -84856, 83262, 9246, -114362, -26978, 87337, -27337, -181494, -87840, 103387, 92506, -32345, -30190, 21383, -59087, -143013, -41938, 97378, 61462, -30130, 7790, 48091, -58923, -132396, 4358, 141615, 47861, -94702, -30745, 90629, 21838, -99804, -15737, 147063, 104848, -66680, -89356, 23008, 51544, 2163, 33689, 99950, 52288, -40544, -24286, 29569, -8007, -36692, 64070, 144755, 41679, -85774, -21271, 109160, 75297, -33762, 2370, 109992, 68256, -60551, -49656, 77969, 107688, 29211, 11069, 53117, 24321, -41830, -8621, 78356, 73010, 14719, 33652, 76027, 18176, -57183, -2257, 99104, 74015, -17717, -2983, 73200, 50465, -27998, -974]
207i74R2160j3770j00299j6434P0893J0617n1938J3539P0518p017p5335j3653
219b1693M8760J603l7207K1322N3741k1848o4305P228N1906j2281m9572J9772
231b574N4889k5585o7474J7098P5247l35o6914l215N8495n032p3588j2477P1538
244B0073L4584m2455k6395K6456Q759l1581r709K4133L955j9074P783J9660j9625
257c436k8222K5787M2911k3055n5934Q287N3869j560n1743K424O0975J1008o0952
270a9641l1115L8976K6189l0243k1007K6951K4127j6318j7195P971N503r466l98
283a5666Q558r982j5584J5064K7952o846k9859M832L0450o062m0071p044L7984
296f274J4988k7797j3418K5307J2570k4587j8299J6713J5134j1982r871J2096
$$ y = [-974, 91186, 77416, -22883, -39317, 31576, 42193, -9745, 3794, 74312, 67295, -8040, -21693, 27067, 28670, -8537, 12785, 66526, 44678, -19627, -12399, 39507, 27226, -22346, -2574, 52315, 26730, -40744, -23646, 51601, 51266, -15648, -18863, 39632, 34600, -38988, -51465, 20073, 54657, 12202, -14193, 12263, 21022, -10559, -20268, 3865, 7820, -11254, -3471, 16189, -3436, -31658, -5871, 37040, 13985, -41949, -33662, 20207, 18647, -33096, -30672, 30303, 41311, -19641, -50756, -11780, 14409, -15834, -36841, -9890, 14237, -2081, -19276, -11305, -5802, -15268, -15666, -7108, -17090, -32674, -17610, 10342, 3496, -26363, -21531, 8919, 2857, -37214, -44258, -6274, 8714, -19083, -32501, -7194, 5376, -19211, -37510, -20797, -5663, -17645, -27516, -15420]
308a5420J2215n842n728N377p02j0874k794Q145k075r808O936K0598J281k1797
322b0488p248J7468O666j7998j0580J6395J5707p555r995N935R419m580q770m08
336a6032L486O15Q52L981J798j682Q62K204n053q957K554J1546J820r247J768
351i485J6137N643j3961j0671Q434J0195o681j0915L386J3956N249o943o604K523
365B63O014l65o782l742N597Q539L167m656l227L769M908m052q154N40J0062M171
381A6052n897k681O957M637o418q725Q59O823J246m808j325Q065P546k131p982
396A2218k714L719L002l171m581J611N796M317l429n233o47L160j234m768j016
411G030N018L210j486j226J100O25l162m845n41L721K224j351j567K528L128j642
$$ y = [-15420, -3205, -9047, -14775, -9398, -10100, -20974, -23768, -15623, -17698, -27506, -20570, 28, 1309, -20488, -27736, -10268, -3602, -21600, -32180, -15785, -78, -7633, -17628, -11693, -2274, -6854, -15624, -16032, -12546, -11931, -11079, -7098, -5300, -6982, -6120, -3916, -8969, -17926, -15372, -3826, -2006, -11253, -9485, 6652, 12295, -1666, -12337, -3903, 6292, -389, -11304, -7918, 6038, 11287, 4344, -2260, 263, 6277, 5912, -870, -4612, 985, 9524, 12691, 8035, 4808, 8577, 13485, 9433, 1279, 1819, 11881, 16052, 10155, 7474, 14431, 19068, 12650, 3925, 4784, 11607, 12853, 8045, 6720, 14785, 22331, 20200, 12218, 9504, 13223, 16225, 13054, 8473, 10084, 15880, 20197, 16768, 11535, 10888, 14048, 12814, 8046, 7030, 12048, 15258, 13772, 12546, 13646, 14271, 11109, 6264, 5723, 9444, 11668, 10317, 8750, 11278, 14406, 12764]
427A2764n662l787m60J628M70j562j029K917M279j008n886k637K274J370k720
442I51k733K334M340O01m111k767J37l53l536j641J658J884R56P94O03j081j705
459c669j183k266k874Q37M532J872l203j321M935L108n960q257N32O063J655n017
475a0216j621M584L864j059l005k793j745L38L420J867j791k93N609K995o474
490f320o395K052M353k257m234L689O610n41l574J381M507k429o257j193M447
505f161J085k088L178N584q09m743l08J820l215k434N358N183l040m839M075N273
521C919l885o396L344N578l647n836M895Q965K6o281J395N222m772j0363O63J0030
537B857L202m123J31M311j716m894J605K972l002k864O021M132p893o217R506
$$ y = [12764, 7102, 3315, 2855, 4483, 4953, 3391, 2362, 5279, 9558, 8550, 2664, 27, 2301, 3671, 951, -1782, 552, 4892, 5493, 1382, -1385, -1248, -1601, -5137, -6778, -5120, -3236, -2280, -1486, -883, -1964, -3669, -4852, -7118, -9992, -9155, -4623, -2751, -5954, -7275, -2340, 768, -5192, -13449, -12917, -6854, -5199, -10216, -11837, -7253, -3389, -4448, -7453, -10246, -11991, -11653, -8233, -6366, -8157, -8450, -2841, 154, -6320, -12715, -10663, -6310, -8567, -12801, -9112, -2502, -3043, -6617, -5236, -729, -3158, -9415, -10608, -6161, -5076, -7164, -3986, 1598, 789, -3954, -4262, -2442, -5657, -8091, -2733, 2450, -590, -5429, -1354, 3919, 34, -6362, -3018, 2560, -1087, -6923, -2028, 6937, 6963, 682, 2077, 7299, 2527, -7836, -7173, 2857, 6059, 1936, 2067, 6378, 4662, -232, 1373, 4345, 1343, -1521, 4500, 8632, 739, -5478, 4028]
552D028J1942o656j4660L52J1003p67r662K088J3779L708j1720q044L251K209
566H51j754K088M841j624l652K716K947o012l680R134O587j1775j4836O092J6714
581H637O01j1560J68J1190j750j6199n198J2271Q803k093j933J419m458o765L198
596c669P487k627o132L432O759o392r408O401J4727K25j3089m936L808j621n672
611a0707O892J3966M65j1262l581M420k708p105N925J3569q03j2673l992O990
625f04K168l620L483O435m522j1936j495R030M621j81M729L402q337j3234N45
640i516R117K173j225O852O377j0213j5109L886J5649L002j0447l560O055j019
654B022q049R54J1216O291l086n278o288p779oJ3612J1188m983q824K347L118
$$ y = [4028, 15970, 9314, -5346, -4994, 6009, 5242, -4420, -2332, 11447, 15155, 3435, -4609, -1358, 851, -903, 1185, 6026, 4402, 750, 3466, 6413, 401, -3279, 5855, 12442, 667, -14169, -8077, 8637, 9238, -2322, -2154, 9036, 7286, -8913, -14111, -1840, 6963, 4870, 2937, 4356, -102, -6867, -3669, 3818, 1191, -4941, -1509, 5250, -1142, -10550, -4149, 10578, 10803, -2286, -7222, -3414, -5035, -10707, -3815, 10151, 10616, -646, -4227, 193, -2515, -9620, -3695, 9874, 9071, -3602, -7594, -604, 1564, -2056, 1427, 7862, 3340, -8596, -10091, -1061, 3560, 3379, 8108, 11510, 3173, -10061, -9516, -399, 1774, 549, 7401, 13778, 3565, -11544, -7658, 7991, 10993, 546, -3014, 3041, 2022, -6027, -5073, 6143, 12434, 9348, 4070, -2218, -9997, -10003, 3609, 14797, 9814, 990, 3337, 6455]
669F455r852j0692R651J7793m64j4709o071O894L439j306L844M706n896r251p01
684f160K214k170L893J4307N649j4820j7143K647J1330j43m087O957Q444p338
698C580j4005N06R496K022j730M015n96j2540p741J2266J4682l769r613L560M252
713D385j2152j3234Q639J8169L295p929k483l70p537l412J0280R293o441r044
727h541N337N071r400o331J4416J5091r832j8591K60R669k027l929J1726J2422
741A5341q955j6571k30Q652k184l913J0305J0130r421j4323M486J1836k458o517
755c822P326P196j3162j5012R503J8226p02j0789L791P916j0099j4688O053J6630
769H367J469p709K052M774r666j0140J0077J4714n835j4158L904J1735o746j2805
$$ y = [6455, -3397, -14089, -4438, 13355, 12891, -1818, -7889, -995, 2444, 1138, 4982, 9688, 3792, -5459, -6160, -3946, -6116, -2223, 12084, 17733, 2913, -14230, -11583, -253, -396, -4483, 2474, 10918, 3580, -10425, -9919, -423, 1599, -131, 3884, 3288, -9252, -16993, -4727, 9955, 6186, -3427, 133, 4385, -7767, -21001, -12362, 5807, 9102, 1173, -1310, -1680, -9217, -12629, -2349, 6944, 503, -8541, -3204, 1867, -7533, -13864, 552, 15643, 5811, -12780, -12520, -2851, -4878, -8807, 2919, 15341, 6386, -10185, -10415, -1763, -3947, -7860, 2445, 12575, 3154, -11169, -6683, 5153, 2695, -3822, 3504, 10700, -2462, -17474, -7971, 10255, 9553, -1236, 2555, 10471, 372, -14316, -8263, 8367, 9836, 2127, 4179, 8953, -713, -10853, -776, 13938, 8103, -6055, -2151, 9584, 2838, -9967]
783i967R499J9228l631j9359m164J0818O24p598N537J3130j928j3052j818N941
797C260l134m612Q594J0113q824j4145N532J3150l728j1496N204J3135p216j7697
811a1864J282J7528L798j0902M96R042n162j4688J54J4407L277r348j41P529k502
826B906j0224N97J1328N05q680j211N280l542o642P727J1575m567j3607J169R620
841B234l885j1653N141J6570j06j5625l995J0991K424r656j606R588J956q362
855e984l116O972K899l771Q46L651m317q077L036Q139j598n980N394R090o140
870A044j3559K302J3200Oj0567m61J0815J862r666k782R009L721o279l968L676
885a647O21k899K408O613j222o012J127M122l548o436M786R286j657q052J592
$$ y = [-9967, -468, 18760, 15129, -4230, -8394, 2424, 3048, -4550, 987, 14117, 12189, -863, -2681, 3260, 126, -4486, 4108, 14221, 5397, -8748, -3216, 9934, 6206, -5290, -86, 13049, 5833, -11864, -10582, 6946, 10744, -158, 338, 9380, 4218, -10470, -10316, 4091, 7368, -1980, -2121, 5408, 2906, -7318, -6721, 4607, 5112, -3568, -4779, 501, -3041, -9683, -1956, 9619, 5052, -8555, -7386, 2234, -1651, -13304, -8163, 8407, 8301, -7324, -11319, -328, 2096, -7560, -9166, 422, 2378, -5984, -9100, -2128, 771, -3000, -2154, 1497, -2820, -10897, -7861, 278, -1320, -7300, -1906, 7184, 1044, -12515, -10213, 2987, 2993, -7574, -8035, 2780, 4642, -5024, -7806, 1203, 4924, -1355, -5323, -1647, -1026, -3925, -1517, 5096, 3874, -2138, -1011, 3111, -437, -6873, -2087, 7199, 5542, -2510, -918]
900i18P906j517q430J447Q749p27r089q42R250L016o030j765N250L8n975j184
916h21M487J472k794K194M349k765o050J975O189k823o913K341Q034j633p136
931A06J518P645n28q257j474O401M42o471m14P354K650o228k475L912N59m972
947b32n45M439M49l460O93L991k203m760K099M014k637o245R60O781O73n192j140
964b315N808K49p227k726N267K688m233j439M359J617m286j280K160J56l225k01
980d628L387o61k996J912M327j145n789n89M103J340n383j215N492K672k927l125
996e225K106J664k581j938J891J287j431P47K382j87k905k39K641n18l808l7M409
1013a742J406k342j086K919J352l404k694K109K621j204j611J739K660m51j732
$$ y = [-918, 6988, 5471, -2959, -1512, 7237, 6510, -2579, -3421, 5829, 8845, 2815, 1050, 6300, 6338, 363, -821, 3666, 5138, 2344, 4538, 8887, 6122, 72, 2047, 8236, 5413, -1500, 841, 8875, 7242, 106, 1624, 9269, 8741, 484, -990, 5411, 5853, -618, -1032, 6322, 8972, 2744, 269, 4181, 4740, -232, -777, 3662, 4111, 651, 1344, 5335, 3132, -1628, 471, 4485, 1848, -4397, -3437, 3344, 4017, -1175, -2315, 3493, 3742, -3485, -6211, -944, 1744, -2489, -3928, 431, 2048, -2238, -3518, -1358, -1202, -4427, -4628, -1241, -1902, -4898, -2986, 1341, 196, -5593, -6182, -2079, -739, -6122, -7337, -1845, 827, -2100, -5225, -3119, -1455, -4036, -5974, -4083, -2796, -4227, -3480, -1098, -1285, -4190, -4429, -1788, -2306, -6114, -6151, -1742, -336, -2678, -3764, -845, 507, -2897, -5591, -3482, -861, -2065, -3676, -1937, 723, 272, -1460]
1028a460l92N29n87J25Q95m60n71K074K173o95l119m51K109L58j922o26K370K173
1046B523n07k176O30J560j405k181J114J248L10m02L73J611n35q78p11l74m48
1063b48P66P70k2l90J339R18o62k722m09J275N12p62j008J685K383r58j170q43
1081D54O0L08j372L1L36R97O78j48k33l27J66n31j571j13J018O90Kj70K11J095
1101A581k47j629j679Q53J679l29j355K48K170Q49r40k042o28R64Q58o14r36M49
1119g48K443O25j534j509J25J544n72k165l5K357K516j294k211M58K481n42k845
1136i06r77K402K111n64j569p6K000J411k230k498L96K600R75j496j458J820K870
1153D811m11l354j581K360K613k235k399K243L442r52k770p19K220P51k623j196
$$ y = [-1460, -1852, -1323, -1910, -1785, -890, -1350, -1921, 153, 2326, 1631, -1488, -1939, 170, 528, -1394, -2020, 350, 2523, 2016, -160, 470, 2030, 625, -1556, -442, 806, 1116, 714, 1087, 2698, 2163, 1285, 574, 200, -248, 518, 1288, 1266, 876, 2215, 3133, 2471, -251, -660, 615, 1127, 365, -643, 1042, 3425, 2467, 1297, 454, 514, 822, -550, -519, -183, 814, 1492, 1344, 1111, 784, 950, 419, -1152, -1265, -247, 443, 445, 275, 486, 1581, 1334, -295, -1974, -1121, 558, 229, -1126, -878, 1292, 2141, 1201, -841, -1469, -505, 353, -261, -1197, -748, 1695, 2320, 786, -723, -598, 946, 374, -1791, -1826, 531, 3047, 1753, -458, 0, 2481, 1939, -906, -1883, 519, 2630, 2066, 497, 421, 2421, 3832, 1602, -896, -500, 2100, 3075, 1579, 121, 1941, 4811, 4400, 1046, -535, 1825, 4438, 2203, -196, 2047, 5489, 4537, 1767, 1048, 3268, 4019, 1396, 200]
1169B00J605J744J17j315l35R48Q76r28j954j291J897K421n12k760p1L427J165
1186E234l967l718K897M032j981m049J304M002R6l620j231K056N32k088j319J249
1202e71J281k55j47J10q55k91J63o95k248l72L887J486m144k476L938L120l878
1219a947n525K882N559j838n873P10N438Q88m390j793K520J076k648j131J711
1234d361J002m33J115P07k715k533K794K797l697l577M510N717m429o518L424
1249f197P399j842p985j34P210Q78n778q33O222K269m899k542K645M27k206J308
1265d058L692j205l600K898L956l392n173L577O824l059p928K301Q871J05p652
1280c843O9P910M39q691k237P662L898n270j815N504R28m907j449M690N29m984
$$ y = [200, 1805, 3549, 3666, 2351, 2016, 2964, 3840, 2912, 958, -333, 1564, 3985, 3473, 713, 642, 4069, 5234, 1267, -2451, 446, 4478, 2497, -1552, -248, 3754, 3850, 230, -1001, 1055, 1587, -501, -1820, -571, 710, 455, 308, 418, -437, -728, -565, -1260, -3508, -3880, 7, 1493, -2651, -5127, -1189, 1931, -1947, -7472, -4590, 969, -869, -6742, -6032, -594, 294, -4096, -5889, -3369, -2293, -4941, -6072, -4361, -3359, -3792, -2677, -1970, -4685, -7218, -4424, -1627, -5324, -8901, -4391, 1326, -3103, -9621, -6197, 1202, -640, -8625, -8759, -1549, -671, -6449, -7282, -1060, 1209, -3690, -6232, -3587, -3160, -5366, -4058, -366, -1571, -5171, -2273, 1683, -1709, -6882, -3305, 3519, 460, -7468, -5167, 3704, 3809, -3843, -3774, 4136, 4575, -4116, -6353, 1309, 5207, -63, -1878, 3626, 4554, -353, -1802, 2888, 3417, -1567]
1296a567J784O399j777p606K149Q948k45r277r49Q360J004q743j024R860L382
1311A0698q070l872P150J315p745j834Q674L249p026k652O339J260o285p78O855
1326G278P9p711k33P292O11p801O87J0235K0j2500m324J1062N232r022m208R441
1342F138M950r278o549O141N337m817l640N317J530n938j688P399J254o987j380
1357b211P362o67j0345q09J1947L719j0497l984R717L104j1932o049J1416Q359
1371I130q593q054O870O455o892n316O033N453o220n146M994K848n675l18Q710
1386D279J474j0625l802Q741L123r449k498J2872N143j2462q128R820Q335r111
1400b288p375Q757P496p964p749O446P604m821n265N420K645p652m293Q770O081
$$ y = [-1567, 217, 6616, 4839, -2767, -618, 8330, 8085, -1192, -2141, 6219, 7223, -1520, -2544, 7316, 10698, 2628, -1244, 5906, 7221, -524, -2358, 6316, 9565, 2539, -113, 6226, 7486, 1201, 423, 7278, 7357, -354, -587, 6705, 7316, -485, 202, 10437, 10457, -2043, -6367, 4695, 9927, 905, -3303, 6138, 11088, 1810, -4739, 1402, 6739, 1922, -1718, 3599, 5129, -809, -2497, 4902, 6156, -831, -2211, 5151, 4484, -5861, -6670, 5277, 8996, -1501, -5485, 4232, 7336, -4596, -10645, 771, 9130, 537, -7517, -647, 5808, -1084, -6400, -367, 5086, -1134, -6280, -1286, 1562, -4113, -4431, 4279, 5753, -4872, -8674, 67, 3190, -6259, -8757, 4115, 9258, -3204, -11332, -1512, 6823, -2288, -9663, -906, 6590, -1374, -9123, -2677, 4927, 106, -5159, 261, 2906, -4746, -9039, -269, 5812]
1415E812p018m543Q442L658j0739o782J0326Q358q126o879Q402O453r800p447
1429i883R555R144p948r780O557P886o118p035P575Q637o157q712L701N841n972
1444b709m637R182P223q709q083P095P134q390p239Q871R482r190j0487P837J0124
1459G504o188q604O333Q952q278j0682N994J1333l909q597N299P424o624r952
1473i995N692Q996m301p768O165Q092p435j0123P002J1180n953j1199M986R882
1487E221n109r690N495J1123l621j0870K512P931m170q742O061J0507l583j0521
1501g456L138Q897m309r718M890J1292l218j1773K528J0917j901r813K819R986
1515F279k873j1187O90J0889L83p931J435Q417k150r681P29R605o96q504K157
$$ y = [5812, -1206, -5749, 2693, 6351, -4388, -11170, -844, 7514, -612, -7491, 911, 7364, -2436, -9883, -328, 8816, 868, -8912, -2355, 5531, -587, -7622, -47, 8590, 2433, -6279, -2578, 3263, -2709, -7346, 1836, 9059, 350, -7733, -638, 6496, -1894, -9133, -262, 9220, 30, -10457, -2620, 7504, 1316, -7288, -955, 7997, -281, -10963, -4969, 6364, 2455, -6142, -843, 6581, -43, -9995, -4303, 4693, 392, -7376, -1211, 6881, -554, -10677, -3675, 7505, 1552, -9647, -4661, 5221, 112, -9578, -4083, 7040, 3419, -7451, -4939, 2992, -1178, -9920, -3859, 6648, 3065, -7456, -4318, 4579, 270, -9448, -4558, 6734, 3516, -8257, -5729, 5188, 3287, -6526, -3707, 6279, 3406, -7781, -7091, 3798, 4181, -3750, -2315, 6102, 3952, -5729, -5000, 4605, 3909, -4595, -2438]
1530b438R722k244j0057J081J0899l72j0188k57R538j10r214O85J0007R42q734
1545g40r95P183k21q405O69R746J303q489j053P916j26q592l06Q916J318q591
1561d67j247P991J534p552j451P509J594q039k820P129K651n572j197O768Q42
1576G673p361k629N782K799o567j155O855J879o743k341N784J963o139j947N555
1591C408J425o139j648P068K664o442m064N108L141n398l875M684M521l056l352
1606a955K105K301l691k634L547J303l468j260M568J455n149j507M523J725n393
1621c530k467M048L003m004k191M457L057m274m047K653K692k127l153K452L342
1636h9j416k497J448J186j828j214K248J005l363m52L573K455l727k098K522K225
$$ y = [-2438, 7284, 5040, -5017, -3936, 6963, 6591, -3597, -3854, 5684, 5574, -3640, -2955, 7052, 7994, -740, -1735, 5448, 5227, -3178, -2509, 7237, 8540, 51, -1002, 6914, 6788, -1804, -2110, 6806, 8124, -467, -1714, 6277, 7811, 259, -1192, 6317, 7911, -128, -2948, 4181, 6832, 1260, 63, 6831, 7673, 312, -2317, 3465, 6264, -303, -1458, 5397, 7276, 533, -1808, 3976, 5939, -200, -2147, 3408, 4833, -1306, -2954, 4114, 6778, 336, -3728, 1380, 4521, -877, -4752, -68, 4453, 1397, -1955, 150, 2451, -1240, -3874, -327, 976, -2492, -3752, 816, 2271, -2878, -4385, 138, 1863, -3530, -5997, -1949, 1054, -2950, -5141, -684, 2373, -1901, -5948, -3295, -603, -2730, -5883, -3431, -89, -1505, -4002, -2554, -1368, -3196, -4410, -2162, -1157, -4520, -4972, -1399, 1056, -2671, -4769, -2247, -22]
1652b2k679k851K310L589j412k506J635K704j592k873R51J715n75j280J532J876
1668E22q62j006O82P99j822q34K031J152k230m76K607K658k514k829J488K241
1684A607j381k397Q33L744k49j515p6J132q2j757o9J061k44l23J061J019o78m77
1702A209O81l8j497m89J247J049q11j108J784J280j113k609O79J675l27k041K06
1719b23K122P51r54q24M94R9j364N6K20k16K21O01O39k80p76K10J55r75j203L91
1739h56J480Q7j031L01J374j58k091p69J090N76o46o49M87J306L74o51r57q97
1757a630J87L50N98q20j25J343R07p82j326n61J482J28j643l16J478R41m03o91
1775h83K83P32o73j033l74J378N65l01l40O75J209n03j499o43R9J173M01j055
$$ y = [-22, -2701, -5552, -3242, 347, -1065, -3571, -1936, 768, -824, -3697, -2746, -1031, -1606, -2886, -1354, 522, -340, -1346, -664, 135, -1687, -2521, -490, 662, -1568, -2044, 563, 3221, 707, -2122, -634, 1607, 226, -2171, -1338, 2406, 2157, 642, 566, 1698, 1616, -141, -210, 851, 607, 284, 1345, 2364, 1686, 1209, 1890, 1852, 355, -134, 1113, 2162, 1351, 243, 2027, 3307, 2194, -415, 264, 1939, 1612, -429, -223, 1899, 2650, 1696, 872, 1366, 1465, 101, 157, 377, 161, 382, 983, 1622, 1342, 566, 776, 931, -44, -1247, -856, 624, 711, -320, -19, 1355, 1197, -894, -1663, -573, 3, -643, -1292, -805, 501, 875, 224, -733, -1630, -1443, -1093, -495, -1315, -1440, -97, 810, 28, -1298, -1859, -377, -249, -1892, -2208, -730, 211, -192, -883, -600, 132, -541, -1574, -1948, -570, -5, -306, -646, 29, 1238, 735, -764, -1407, -1308, -135, 266, -789]
1793g89K47J581J082q01j874q5J088P6n44p00J579R76j27j131M21K63k03j180
1811a21l70P65J240m9j60M41K69o0o18q06P0L78O83l22n87J269R54l73j777m50
1831C76O71M41o77j054J455J397J47j246m99J62k39m41o08O55J055p88M86M1R5
1850A429l28m08j348j8L46Q37R1l32N68J76j85j179j449M38J240k87n67K77Q95
1869A96L17q77p30l58l28L00l32P1P99J59J71n5l34o62r4l63n90N52O90O26k61
1890a103l71L14M61j129j294K83J180P65q53m25J308N02o02j078K34k86j79J74
1908b099P44O5L45O79K6l38j609J10O23J34l17R62Q41M14r46k96K98m3j031l15
1928a753J025J047o3l77J021L33l97j182l95O2R8K73J370K79p7J09k03l57j099
$$ y = [-789, -542, 1039, 2121, 1320, -554, -639, 449, 525, -19, -719, 860, 1836, 1709, 578, 999, 1262, 1059, -121, -491, 274, 1514, 1465, 1305, 1746, 2015, 1955, 1337, 531, 601, 979, 1662, 1340, 753, 2022, 2976, 2603, 826, 376, 1047, 1488, 811, -243, 1212, 2609, 2756, 1510, 1011, 1173, 934, 493, -115, 540, 1595, 807, 1293, 1334, 1429, 1101, 693, -655, -673, -327, 510, 601, 269, 837, 1013, 828, -351, -1800, -1362, -122, -409, -976, -699, 196, 513, -364, -1094, -1452, -1780, -1480, -1812, -1741, -942, -783, -612, -667, -1001, -1663, -1757, -2120, -2710, -2158, -1468, -842, -1103, -1474, -1160, -699, -1828, -3122, -2839, -1659, -894, -1747, -2172, -864, -362, -964, -2042, -1808, -2094, -2273, -2099, -1355, -1290, -945, -266, -240, -578, -2187, -2077, -1454, -1320, -1637, -675, 166, 580, -366, -662, -364, -407, -1438, -1753, -728, 319, 256, -121, 900, 1233, 836, -346, -741, -679, -581, -308, 1062, 1341, 1264, 1373, 1170, 813, -286]
1947b86nO65J248o76j69J089K37q68m93O31p6q06j288J360J193J8J40L0J5m30
1967A529j329m58M46K86O35J096j40q31p02P71j22r55n06Q79J083j181p67J560
1985A294R85p89j243j71o1q44o05J019K235K40j465j248O89L4j153o18R44J018
2003B61J06n67o39J27L01R90n27j925n95J370O47p67J3J635J217j380l014m69
2021c216J718Q47o14L31J831mk159j006J090J145p06q72J04Q77l49j5N01J073
2039E76J54l72j016j419l64J543J939m3p21M59Q94j696k516Q10K958P89k077j002
2057a104K000R19j775q52K091J727k489j786M33K033M43J07M79O69j348j554j23
2074a30K37N01J022J408Q9k441r70J859M68j340l58K009N74k858j124K484K446
$$ y = [-286, -291, 374, 1622, 946, 777, 1866, 2103, 1235, 742, 1373, 1297, 491, -797, 563, 1756, 1774, 1914, 1944, 1959, 1529, 200, -258, 188, 474, 1109, 2205, 2065, 1234, 532, 1303, 1181, 226, -280, 599, 1682, 501, -266, 1294, 2279, 1490, 247, 76, 15, -829, -1434, -415, 1820, 2060, 595, -653, 36, 70, -1083, -1701, -757, 261, 367, -200, -839, -712, -411, 579, 52, -1873, -2468, -1098, -451, -1218, -1205, 430, 1647, 267, -2747, -3216, -1498, -651, -1265, -934, 897, 893, -1266, -2272, -1182, -37, -743, -1615, -1511, -634, -983, -998, -497, 576, 730, 358, -658, -2077, -2441, -898, 1041, 998, 277, 736, 1630, -66, -2582, -1772, 1186, 1975, -102, -1104, 896, 1815, 40, -812, 1279, 3006, 517, -1269, -836, 1197, 1640, 1747, 2226, 2895, 1547, -7, -130, 107, 608, 1630, 3038, 3127, 686, -284, 1575, 2043, 703, 345, 2354, 2928, 70, -1054, 1430, 3876]
2091C876q63k175OR06j547j570J527K682J96j395m05n0j365j051J871J847j367
2108A123j321Q21J234k137j019K066J894j543l215L25J699L17j316J532J872j139
2124A193l233p06J843L46j160J307K039o57l153o53K258j9j632P52J738j455k371
2141c563O30L501n27k103n7K170j329l449J84L908J722k342j098J591J19k818
2157c461o14K519J797k019n84J324K9j700L60K347J33k665m50J810M36k329M55
2174b612M085M55l938j901K725J741k574j531L576K536k137l053R09K433m92j326
2190a104J117M86j305m71J664R38j449j36J741K46k877j462L091K307j535j818
2206e67K709J237k856k914J890L578p35k798O64K565o61k550O92K017n70j228
$$ y = [3876, 3013, 838, 844, 1750, 203, -1367, 160, 2842, 3038, 1643, 1238, 1188, -177, -1228, 643, 2490, 1123, -198, 623, 1857, -280, -1299, 767, 2661, 1118, -2097, -1772, -73, 244, -1072, 460, 2332, 1193, -2040, -2746, -903, -557, -1717, -410, 1629, 972, -2181, -2834, -576, -595, -2227, -1475, 263, -1192, -3563, -2933, 568, 41, -2062, -2119, 51, -1278, -4727, -4543, -635, 1087, -1255, -2353, -762, -643, -3461, -4075, -1556, 241, -1778, -2362, -1038, -1009, -2709, -2349, -2, 131, -2534, -2984, -1174, -738, -3067, -2612, 1473, 1928, -2010, -3911, -1186, 555, -2019, -3550, 26, 2562, 425, -2628, -1719, 714, 222, -1104, 13, 499, -806, -1277, 387, 1325, -124, -260, 1481, 1727, -1150, -2612, 479, 2786, 1251, -567, 2142, 3379, 523, -2391, -501, 3077, 2342, -456, 208, 2773, 2112, -438, 254, 2271, 1701, 473]
2222D73J46P54l77p96J628J290j250j783R82Q10k009j225K582K507k002k110J382
2239A002J659j398k837J134L098n11l199J41K951M15j666p40Q15J77j567k05N17
2256b14O39MR58O20j770j816Q97J531j140j101J182K047j113k265L36K577m71
2273I01k291n82K074O80k217l59K461Q24j640r31K85N0o97J17J468K27r69Q70
2291B71N05r79j636J61K206r8j409j85J817N97j658k37Q92P37j855k49R87M22
2309B89n30L13J384m1j459m36M67q3p16N53J800p5j163l85J534oj825l94J506
2328G33P83j190j000J735J063j33j433m3K57r31K83M87j51K91Q49R1m36j556J61
2347a40J116j1j380O14J435J56j618k72R99P40j704r26O26Q55m87l41O70J071
$$ y = [473, 619, 1373, 996, 200, 1828, 3118, 1868, 85, 1067, 1877, -132, -1357, 1225, 3732, 1730, -380, 1002, 2661, 1263, -1574, -440, 2658, 2147, -1052, -911, 2040, 2455, 789, 49, 864, 1041, -526, -731, -214, 425, 429, 1387, 2007, 237, -1579, -682, 849, -291, -1392, -210, 1837, 724, -1541, -1205, 1372, 901, -1390, -1972, 102, 782, -1435, -1794, 667, 1491, -149, -1080, -795, -745, -1442, -1325, 143, 370, -599, 271, 776, -203, -1839, -1678, 528, 430, -979, -1164, 653, 1250, -408, -645, 247, 984, -871, -1120, -133, 289, -241, 72, 1456, 1415, -44, -480, -13, -96, -812, -259, 1541, 1466, 303, -82, 1452, 1446, -379, -773, 733, 1516, 326, -674, 1061, 2124, 1991, 558, 515, 772, -159, 124, 611, 460, 751, 1600, 1691, 1255, -301, -140, 976, 965, -415, 199, 1634, 1790, 172, -100, 899, 1639, -65, -991, -365, 490, 3, -338, 332, 1403]
2365A403p16j043k51o9l29L04P52K4m27Q9L56J21j670L6J103Mj118m94J255J094
2385D24j013p48M93M41j094j222N49J260Q4m23N5L24k60q18L09j71n80M27O69
2404a294N8m60J51J248m20j241p76P42R40j40r81R80Q07j43q80j88R9R9n74L92
2424a581O43K64K21J64n10j49j33J48J75o38O13Q68N30n12l77M45P00r48j038
2443a115J86J445O60j080K31N51P15m75p70j85K94l6R87m34j67O21R94k85r98
2462A139o48L47P59n15j34M59R61Q3o38j79K53j86n90j56O00O84j63j59J26JL4
2483B078m73n83p8N93K96J90m68K57N51n6j065p50J64Q32L7p09j75J210K50j293
2503H08j09j67N95m34j100O19N15N19j59p06l01O20j88j006o74Q50Q44j9q21j23
$$ y = [1403, 687, -356, -607, -676, -1005, -701, 51, 75, -352, -263, 93, 214, -1456, -1420, -317, -313, -1431, -1925, -670, 424, -589, -1337, -844, -403, -1497, -2719, -2170, -910, -826, -1249, -1194, -870, -1130, -1948, -1639, -1810, -2390, -1963, -1294, -1236, -1696, -1545, -297, -717, -1958, -2734, -1992, -1052, -1192, -2173, -1193, -386, -529, -1409, -1597, -1498, -1399, -1973, -1581, -938, -674, -453, -289, -799, -948, -1081, -933, -758, -1396, -783, 85, 615, 103, -274, 171, 871, -77, -1115, -929, 516, 1176, 96, 327, 878, 1593, 1118, 348, 163, 457, 421, 1408, 974, 807, 1428, 2422, 2137, 1139, 491, 838, 1597, 1082, 948, 1407, 2368, 2451, 1813, 1634, 1887, 1701, 1111, 955, 1555, 2239, 2076, 1917, 2043, 2044, 2078, 1605, 1022, 944, 1537, 1833, 2023, 1555, 1812, 2363, 2307, 1242, 492, 656, 1488, 1525, 816, 641, 1851, 2101, 808, 699, 532, 1127, 693, -407, 212, 727, 1246, 1087, 381, 80, 700, 512, -494, -1168, -318, 526, 507, -314, -437]
2523d37N91L28j100r74K73P40N55n16o74Q37P66r88q71j18O30j64o28K15Q12K10
2543e13k6o45k30q6M61n81k67j85J026Q52k97j316k3J049j31q34m20O91R12R7
2563d66n50k54O11L01p46o89L69R4L01M93l5n1n6O57j74r76J79L15L65o0k61R75
2585C42N04r07n49N40j33l13n82O96Q41J41j04m52J95K98m16l89L5O37J15M8K82
2606H29p57L00P24m33o57n13P94N28n42l86R03J003o96j423k44P26jk97M0J042
2626I40J49l84j011l2P19j14M1j70o18J45R39O36j218k34P32J38j053j257J030
2645f22J615j53j325M08P85m23j250l1N53N50l84n13J070k53l01R0J81l30k76
2664f09L78k85m26p4J429J096j381j446K78J214n81r67L85J916L82j836m74P99
$$ y = [-437, 154, 482, -618, -1592, -1319, -579, -24, -540, -1214, -377, 389, -599, -1470, -1588, -958, -1122, -1750, -1535, -723, -513, -539, -1184, -1414, -1500, -1039, -1620, -1887, -2072, -1046, -194, -491, -1807, -1830, -781, -912, -1746, -2166, -1475, -563, -466, -1016, -1270, -659, -358, -1104, -1793, -1424, -1330, -1029, -536, -571, -622, -678, -21, -195, -1171, -992, -677, -312, -372, -633, 342, 846, -61, -610, -70, -203, -516, -1098, -402, 439, 580, 476, 24, 219, 517, 101, -288, -253, 384, 499, 547, 829, 72, 372, 1096, 663, 6, -507, 287, 815, 273, -113, 790, 1793, 1097, -326, -570, 156, 155, -142, -102, 940, 1089, 705, -306, -338, 381, 267, 308, 138, -480, -335, 604, 1240, 22, -212, 520, 658, -395, -1652, -622, 993, 840, -485, -77, 708, 285, -965, -996, -443, 107, -277, -790, 280, 27, -274, -184, -3, -333, -609, -231, -516, -942, -1016, 413, 1509, 128, -1318, -1040, 174, -407, -1374, -989, 927, 1309, -527, -1001, -202]
2682b02Q85o47k30J72j6k81j61Q11L61j62L95N7j258r98O21J554l2m37K03J369
2702B004r86j843pK168M39j361n10J496J15r85o14J458R57j351r65K07K14l26
2720A10J011J319k61j472k30P61l99j532O52K607k59j883p14J337R20j472j90
2737C05J040R77k111q87J149J251n25M4J20j78j737n02J691L49q72M40Q17k30
2755A141j980m82J700J242j870j183J721M36j254j268J956J038j017j616N2R35
2771d49j237j99J713Q56n57j440J88Qq23r2J542P62j361j115J429O41j380j211
2789b725J891J198j797k289J475K115k35j392M15J013j024j642L29J890J11m11
2805a078M94Q3q71q27O63J010q06r20J361P84j873n96J534K089r80k072N25J392
$$ y = [-202, 683, 36, -194, -22, -38, -319, -480, 331, 692, 530, 925, 982, -276, -1274, -653, 901, 869, 432, 635, 2004, 1018, -825, -832, 1336, 1775, 414, -96, 1400, 1515, 530, -84, 1374, 2331, 980, 15, 222, 436, 110, 1121, 2440, 2179, 707, 477, 1238, 839, -693, -41, 2566, 2307, 424, -290, 1047, 1967, 495, 305, 1345, 2322, 211, -676, 473, 1724, 1199, 1243, 1363, 1185, -552, -1054, 637, 986, 114, 554, 1371, 1141, -839, -1321, 379, 1621, -249, -1432, 289, 725, -529, -1797, 159, 1197, 180, -1436, -1384, -449, -1686, -1885, -172, 684, 127, -1313, -1125, -1117, -1940, -2032, -490, 272, -1089, -2204, -775, -134, -1514, -2725, -834, 364, -1433, -3722, -2247, -132, -367, -1759, -1344, -331, -1355, -2997, -2668, -778, -667, -1078, -584, -501, -1372, -2199, -1536, -526, -1332, -2252, -891, -107, -1980, -2576, -1042, 1047, 67, -2005, -1480, -88]
2823h8o06j361J184K101l51j674k50P26k38m54P42J031k97r90N02J021q95q10
2841g07R66J624j333j538N19J897l14j164R91J336p44k316L70J350J67m93K70
2858H81J361m18j433PQ10J60p87J90J514j084j040J182J422r96j694N72J199o68
2876A178j266N54J633L58j448k36P33k7j342q7J050P8n32Q7Q12q1r21N42K48r12
2896D21j063P10R09k94r73P42J663j501j665P6J732j12j281jJ620M4j522k78O99
2915g4J76n00m02N34J38l55L26L72l40p98R2Q67r27r27Q62J645n78j038m75J625
2935B23j54j633k14J376J46q32k95J356N51q32o09K46N3o45K69Q31k54j64K82
2954b99Q80r42o42K36J226m70j016k17J674L36j395l24J417J91j207q76J040Q31
$$ y = [-88, -694, -2055, -871, 1230, 879, -795, -1045, -319, -557, -1011, -269, 762, 465, -525, -23, 998, 103, -707, 259, 1883, 550, -988, -469, 1428, 1114, -50, 941, 2277, 1533, -783, -413, 937, 1104, 611, 881, 2242, 1824, 391, 398, 1208, 1368, 581, 771, 2285, 1201, 161, 1343, 2765, 1769, 75, 647, 1846, 1178, -88, 466, 2099, 2457, 1009, 773, 1506, 1479, 137, 50, 1100, 1178, 646, 733, 1545, 1464, 543, 1085, 1333, 421, -642, 68, 977, 683, -290, 452, 2115, 614, -1051, -975, 757, 645, -636, -637, 983, 1027, -495, -773, -74, 102, -398, -800, -266, -128, -483, -157, 215, -125, -923, -831, 36, -891, -1818, -956, 689, 111, -927, -1402, 223, 69, -1564, -1778, -402, -256, -1088, -1383, -27, 524, -308, -917, -671, -618, -1263, -994, -163, -417, -581, -299, 581, -361, -1003, -767, 459, -11, -1027, -1244, 430, 766, -629, -953, 464, 655, -552, -1428, -388, 443]
2972D43l34n25Q74N52n23p80jK89J22K4P22k86p23M23O55J65j374j04J052K68
2992I39j255j33J340R81j069p93N54K48p58m51L33J225m49m71L87J49m71l90J44
3011F0P52j279O5L18O31n65k28R43l9r89o41K71Q04j48p17Q26O53p01q42L85L10
3032a31l97l10N13K04p4m86J68L42k61o81M44L0k03l26O54O03j54p07j0L74n11
3053i19l88oJ047k88l70L32J2J39l58L8k6n30N03O7L37k7L7K64K32p93k99K51
3075g45L57l22N6N17Q00m37q74J61P91j28m43l78O76O80o07j16L58K90j56m62
3095A8k56L18K47K84p5K56l35L23P6m13l58N35M25m03N1K13Q03o33n57J18K45
3116H82J41o81R8L61M91j50l25q2L05K24p83J4%O04J60j3n35M24K16m17k26m50
$$ y = [443, 109, -416, 458, 1010, 487, -293, -294, -5, 117, 141, 863, 577, -146, 277, 932, 1097, -277, -381, 671, 939, -316, -449, 891, 1872, 803, 10, 564, 812, 54, -397, -64, 1161, 712, 241, 628, 777, 306, -84, 60, 812, -467, -402, -84, 547, -18, -246, 697, 658, -331, -972, -701, 103, -45, -762, 64, 717, 16, -826, -441, -131, -528, -838, -325, -121, -195, -681, -513, -171, -432, -1113, -669, -639, -842, -1168, -514, 89, -65, -772, -782, -408, -919, -1307, -1313, -266, -554, -924, -592, -580, -441, -799, -761, -787, -1317, -814, -747, -410, -437, -400, -136, 96, -697, -996, -745, -388, -710, -654, -137, 663, 226, -648, -487, 304, 176, -267, -645, 31, 711, 104, -12, 346, 636, 480, 18, -238, 80, 327, 611, 536, 792, 457, 780, 856, 443, 85, 620, 1045, 642, 693, 906, 1709, 1076, 519, 637, 882, 1023, 342, 440, 801, 1292, 1142, 817, 735, 1040, 1264, 481, 495, 495, 1099, 1259, 1246, 711, 1135, 1351, 934, 708, 258]
3138B58M04M8l1m28N31L10k70n21j81L45j11q8k18l12R46j41l76k79N44n2p39
3159c61P4l17P83j3m69p1K58L1J1k97p19L71M70k2m76l60J016Q2q50p7k86O44
3181e78k39J0l8M24J2n1m95q7O7K99k51j70M36M77j66l96N6J30n1k77q7j34O44
3204d65r0J39J21k70O26n25j44J8q3L78l1j24L34N2j6j65j40J18m1J32J73m0K64
3227B21L22l96l55L26K02j01l35j81M75O40K4n37J1K89J75n49r6K78N1O8J90Q8
3249H10o6J01l16k67J83j7K47k69K52M43m23J91m4p01K87Q3l81j32L62N50J22
3270A015l90k11k39L12n69J04k04N76J55l25o6RJ51n0j16l26o3K77o3j83K12M8
3292E4K94l96o71j6M41l7j38q1K85L06k78l02l24M89k37K5k77L02J58n8k31M98
$$ y = [258, 662, 710, 679, 251, 782, 1092, 822, 301, 120, 465, 354, 266, 48, -264, 682, 541, 165, -114, 430, 378, -361, -287, -604, 179, 166, -303, -374, -116, -85, -74, -371, -1090, -719, -249, -271, -747, -1107, -91, -9, -859, -936, -1222, -578, -817, -807, -845, -421, -409, -460, -955, -1042, -975, -676, -927, -1097, -661, -184, -350, -746, -690, -560, -611, -888, -975, -1109, -465, -555, -416, -295, -565, 61, -464, -608, -590, -673, -295, -326, -450, -116, -64, -80, -245, -385, -267, -308, -176, -3, -43, 221, 543, 147, -208, 118, 320, 219, -116, -297, 178, 818, 842, 305, 316, 605, 780, 231, 135, 413, 464, 532, 722, 810, 744, 845, 529, 262, 445, 428, 675, 406, 658, 1101, 678, 869, 825, 124, 411, 494, 113, -19, 343, 893, 1015, 625, 414, 175, 487, -82, 22, -182, 394, 549, 224, 158, 167, 318, 268, 152, -174, -237, 40, -23, -206, 6, 54, 348, -48, -719, -735, -294, -331, -469, -550, -265, 41, -237, -539, -863, -374, -611, -586, -863, -561, -403, -461, -692, -194]
3314a94k00J2M5p82J51J78N23j95Q9J92j58K0o69J6P44J24j94m24M00J61k64J1
3336d14k16M88L45n07o96O04M58J85l5n86q6L26k0q6kM95P48m02m47J02P0o3r
3359B52k50Q27k29L7j57q7R27k08l32k67j11J6l8K03J14K93L67l40o75j99N17
3380F60P7P8j18K02L8p9J97n77L90L42o10m60L63K6K49j14K01J48l74J3n21m83
3402c52O15N20K47l42M7l55j50k89k46O85rL4m86R0l2M34p6k92N0j93m53l10K08
3425f55N64M39kk19n18m52J84j19O5L21K91k80n34J3L34r5O0N52o80k39l57O9
3447a258L41O81J78Q8o86o47j73K37M71J28J20J63jn93l10O18K26M01o84j4OJ99
3469e09Q7Q7n9J57j24l93l24L07L97L37K51j51K8k85k58n4j33Q12M41l15p14J26
$$ y = [-194, -394, -382, -337, -1119, -968, -790, -267, -462, -373, -181, -339, -319, -988, -972, -228, -104, -298, -722, -322, -161, -425, -414, -630, -142, 203, -304, -1000, -396, 62, 247, 212, -374, -460, -134, -154, -240, -242, 253, 1001, 599, 152, 254, 324, 261, 252, 2, 829, 600, 637, 480, 393, 1320, 1112, 780, 513, 402, 418, 380, 583, 697, 990, 1357, 1017, 342, 143, 660, 737, 815, 697, 899, 937, 858, 1055, 478, 868, 1210, 600, 140, 503, 529, 778, 664, 865, 1013, 639, 652, 131, -352, 263, 783, 1030, 688, 735, 380, 230, -59, -305, 380, 371, 405, -81, 9, -23, 411, 335, 43, 93, -100, -553, -863, -655, -91, 348, 346, 127, -391, -843, -659, -778, -713, -392, -101, -381, -915, -902, -568, -663, -603, -51, -731, -970, -1327, -1258, -917, -236, -58, 30, -656, -1303, -1476, -1239, -768, -640, -520, -357, -358, -951, -1261, -643, -417, -16, -700, -714, -708, -509, -422, -335, -394, -237, -361, -754, -1078, -771, -374, -37, 214, 63, 91, -194, -452, -506, -639, 173, 614, 299, -415, -289]
3491b89R18j31l10k08M51j12n60O9K02N36L58P6n63j11n60N13P6O9K00J44j98
3512E70k25k82L89N65l04n58J80N03q02q0L87Q30k83l82n81L22k31p7O49J6m4
3533E62j43k23l5k45m09Q94L60o76o22N76J44j37k12J89O8K6q84P6M51M53l78
3554a65M26J27p07j97j48L55J15K35n01L49l20m03O07M22l08o10K08K23Rp40M68
3575e55R27p3j194l31O88J21j61k5N06L89p51q7L51m0j55R0K51j55n13O16L01
3596B00l9l99M84M70q71p92J5J626j49l35m26P29M17j143RN75K90m82q8N8L31
3617D80j76J39K69J82q22j25Q71o17j48N80J121o35j163o4J103J35j004K53R92
3636A371k80p56o19Q22P24o17l41J19J99n09K38L81L83n25K03R0k42j152M82N52
$$ y = [-289, 629, 498, 188, -20, 431, 319, -241, -172, 30, 566, 924, 1000, 437, 326, -234, 279, 355, 424, 624, 768, 570, 345, 63, 452, 1017, 713, 155, 335, 838, 36, -44, 343, 1173, 890, 508, -73, 249, 18, -59, 590, 606, 562, 419, 196, 161, -84, -493, 401, 761, 85, -537, 39, 183, 46, -166, 23, 91, 117, -767, -691, -240, 213, -165, 261, 388, -319, -516, -664, -309, -194, 41, -460, -111, -431, -834, -227, 195, -113, -723, -515, -292, -283, -1023, -555, 372, 299, -895, -1226, -538, -417, -578, -603, -97, 292, -459, -546, -195, -235, -390, -300, -49, -204, -717, -101, 200, 161, -238, 246, 716, -155, -947, -932, 694, 545, 210, -216, 513, 930, -213, -204, 371, 661, 179, 91, 149, 480, 304, 443, 712, 894, 72, -53, 818, 201, 53, 633, 1754, 1119, -44, -108, 995, 1130, 126, 379, 1371, 1091, 335, -284, 538, 1262, 645, 304, 423, 622, 113, 351, 732, 1115, 590, 793, 883, 641, -511, -29, 523]
3656E23K79q94J60O71j53j003K13Q06M05o29r88O51N84o03m72P44O63j077o79
3675g99R9N43P3k50K80L88r35k64M80J38p23K64R57l3q42p09Q34K69k16o54L56
3696g44M51p75n78N75J088k62n71J45k2j71m09N02jj94k9M30R1n28k43J007J68
3717g0r10n59J060N60r11l29Q19M57l52p91L92J23J23l64M77L31l04P0l04J31
3737c51k46L31K76M11p23m64J156K65m48m63M74M76o12m91K96J143k42o02j22
3756F4O21o9n21R6J88r0N94j41k45j82j30R56m4r54L2M84L00m32m45R42N97p29
3778H92p94K60N57j61q25J39R12j03n71m3n2N36l01k90q9M94O9J21j10k91k35
3799A15L52L83q92l67O96J53o4n31P19N8l39m09j95L62J85q2l75K01N85l76n72
$$ y = [523, 802, -92, 68, 739, 586, -417, -204, 602, 1007, 378, -610, 41, 625, 22, -450, 294, 957, -120, -799, -700, -157, -84, -334, -54, 334, -601, -865, -385, -247, -970, -706, 251, 218, -624, -1333, -499, -230, -446, -1100, -744, -293, -1068, -1646, -1071, 17, -245, -816, -671, -693, -864, -1273, -771, -772, -966, -995, -565, -474, -1002, -1245, -238, -70, -980, -1539, -479, 81, -830, -1159, -340, 117, -235, -1026, -634, -511, -388, -752, -275, 56, -248, -178, -482, -351, -597, -266, 10, 421, -302, -766, 390, 655, 207, -256, 218, 694, 82, -409, -113, 1030, 788, 186, 64, 685, 616, 95, 191, 379, 289, 883, 742, 497, 315, 185, 1141, 1097, 143, 175, 659, 959, 527, 82, 1024, 1621, 892, 98, 358, 915, 754, -71, 68, 980, 877, 306, 263, 211, 747, 446, 156, 67, 561, 630, 751, 641, 350, 115, 467, 850, -42, -409, 287, 440, 376, -155, 564, 622, 283, -126, -321, 41, 226, 144, -231, -30, 555, 179, -393]
3820c93L29j85K43L6k22k80P17j71J34o27j83L97K1n63kM93K87P9n48l71O91J64
3842D6n22r1K1L79k6j84j28O09m48K37l07j36N2N0J90J38l30L39M88n37l11J65
3864c06k0N9J83j10K08L45l41m13M97j5L24q44J71M58J74j14p1L56m93J87Q9n26
3886b02J33L1N12J36k85q5K21N2n15L2J27K54l16k39N42R8K86o61LK96M63m87
3908C96l00J96k72R36j62n84o0j69L47m89k61L23O56l7k01m59N43j76k40m55P
3929d61N10o6k23P7L3P9k28j21l03Q0K74k93L0l7L82M15k3q29j97M82N09p87k86
3952i83L48N56j79n16j67O82%m12k26K70L15l64j42L43K92j46j77k11j0M4M28
3973b55m6j12k15M68l32j13r7K07N53l24k90l1N72K81o25J36K25K99p26o6L77
$$ y = [-393, -64, -249, -6, 30, -192, -472, 245, 74, 208, -419, -602, -205, -184, -747, -749, -256, 31, 110, -438, -809, -118, 46, -476, -567, -546, -167, -193, -377, -505, 104, -344, -107, -414, -550, -498, -448, -258, -120, -450, -111, 377, -160, -471, -306, -326, -267, -84, -194, 14, 359, 18, -395, 102, 87, 411, -433, -262, 196, 370, 256, 185, 541, 48, 235, 324, -202, -69, -38, 474, 610, 325, 240, 461, 513, -2, 30, 157, 411, 95, -144, 398, 496, 782, 121, 124, 420, 883, 396, 96, 292, 20, 956, 794, 210, 150, -19, 328, -161, -422, -99, 557, 520, 319, -140, 403, 227, -13, -468, -461, 49, -17, -240, -163, -130, -51, -279, -400, -703, -623, -349, -642, -612, -649, -267, 148, 125, -704, -901, -419, 90, -697, -983, -635, -79, -258, -774, -941, -259, -259, -671, -897, -627, -312, -676, -818, -475, -183, -329, -506, -717, -727, -683, -255, -301, -413, -628, -160, -492, -605, -702, -495, 58, -266, -556, -587, -15, 266, -359, -223, 2, 301, -425, -491, -114]
3994a14J30J89k2K3k22N7o8J49l71J6M36K49j26m74M27P78p47m60N61L78l69l21
4016I9M8P31N2l49j29J09M0J9j64K95n8l36O04P0p05m66M21R34n41q88J079L12
4038A177j60r12J82P63K99j318M78J65J06o43l2J060k83n48k02L38j14k04K18
4057C70O14p74k47J03Q68p13q08M75P71k35j250LJ321N09j171l71O38p2o91j52
4077h12O51L09p01L71M13n01o18J62P21k14n30L76O22p64r06O79J291l65j562
4096a378P4J313j50j377J69J946L63j362q62P81L01o33L9N14M83p67m02Q72j1
4115h7j005N36J419l84j751L54R84J79r41R9J374K8j677m56J240J225j281j85
4133c29O48L41j044p64J217L45m21j98L07M38q73n6J142M88j382l65J406K8j481
$$ y = [-114, 16, 205, 183, 206, -16, 41, -27, 122, -249, -233, 203, 452, 326, -148, 279, 1057, 310, -150, 411, 789, 420, 99, 147, 878, 930, 581, 452, 561, 601, 620, 456, 751, 693, 357, 961, 1031, 326, -140, 281, 1215, 674, -214, 865, 1177, 1017, 105, 287, 1050, 1349, 31, 509, 674, 780, 137, 105, 1165, 882, 334, 132, 470, 356, 152, 370, 984, 210, -37, 66, 934, 221, -587, -112, 659, 424, -826, -823, 498, 1007, -164, -535, 103, 31, -660, -812, -161, 148, -553, -182, 231, -270, -888, -726, -5, -219, -749, -373, 249, -515, -1421, -742, 549, 184, -1378, -1304, 9, -141, -1518, -1349, 597, 960, -402, -1264, -483, -182, -815, -776, -262, 221, -546, -948, -76, -87, -1092, -556, 863, 479, -1272, -918, 66, 245, -696, -597, 777, 805, -872, -1328, -88, 1137, -144, -329, 319, 660, -384, -1148, 69, 414, -7, -205, 102, 540, -333, -389, 753, 1241, -141, -506, 900, 928, -553]
4152e53j88J582N36j262n33R38O66j464m51J221P23q34j072R06R52r44l07J042
4170I58J24j021m40N25N63p52j56J317m8j454p14J530J025j644n33J362P93j201
4188B34j126R95J086r27j013Q20M29k88j020R24Q14r91n98P11N51j106p31J190
4206d6Q99j285p80J138J045j473j025J270J175q29j493J032Q65m76j064O13Q15
4223C81p10q02N00J085q72k96M16P45j090q62J401N82q84o83J062J087j305j606
4241a851J626J267n84j874O52J707r03r81P26J228m36j305M38N91N5q20L65P46
4259F47k82j003L83J112p59j087J451J101j052j792J274K021j379j364O00J454
4275A325m43j879N47J680j84j103j4P28Qr56N83R04n79q81O91Q17j024n57O64
$$ y = [-553, -741, 841, 1377, 115, -418, 520, 1186, -278, -729, 492, 1215, 381, -691, 215, 1167, 223, -84, 958, 1082, 61, -379, 146, 709, -43, -199, 1118, 1070, -384, -1098, 432, 1457, -187, -720, 642, 1435, 234, -892, 103, 1189, 262, -751, 69, 498, 210, -810, 114, 928, -63, -661, 50, 601, -505, -1236, -46, 853, -432, -1212, -74, 971, -502, -1527, -257, 918, 89, -1404, -372, 493, 17, -1047, -434, 381, -329, -1131, -631, 454, -418, -714, -298, 447, -643, -1505, -104, 478, -406, -1089, -27, 1060, -245, -1851, -225, 1042, 458, -1416, -764, 943, 40, -941, -215, 1013, 577, -728, -290, 301, 356, -464, -99, 647, 365, -638, -255, 857, 98, -989, 462, 1563, 511, -1281, -7, 2014, 635, -729, -129, 1325, 882, -997, -450, 1230, 1046, -57, -71, 657, 665, -291, 292, 1196, 617, -264, 427, 1244, 220, -337, 327]
4294C27J311q32j932J093J516q95j417O35J913o87j710K76R52O82j643rJ410j33
4312H57j319mR22o9j20m14Q89n06j107O87R50k31j501O50J285m71j937L88J659
4331F08J48j403l83J349k47j263j53J351L32j015l39R31r4l77Q2N34k14p61j6
4350i30J084l94j046M26J049J06j645K26J348J20j165m81J513K59r55r83J129
4367c39P19q66l00M99nl06r6O54j2m55l3R19m86r12K71J051M13j284k31J281J01
4388E83j303j23J243N29j000n03O37N70o42m78R38K82l58m39j01M47k22o8N36
4407E28K40o11P5M65l47m91J59J097j30j158j09Q49P76r02p25J010K87p05q47
4426e39N13R57k80n37Q5J99k29P1P5j02Ok84P76l53n72J40L29L83n98l11N61K08
$$ y = [327, 1638, 806, -1126, -33, 1483, 588, -829, -194, 1719, 1032, -678, -402, 550, 1232, -411, -420, 990, 857, -462, -466, 456, 387, 267, -147, 742, 236, -871, -184, 766, 535, -966, -316, 969, 498, -1439, -1051, 608, 756, -647, -1030, 319, 72, -1191, -1344, 7, 339, -676, -1015, -84, -178, -555, -473, 61, -153, -914, -930, 154, -240, -1286, -860, 189, 295, -1350, -1124, 224, 344, -821, -1302, 211, 470, -485, -1468, -339, 380, -486, -786, -287, -292, -598, -694, -40, -52, -507, -540, 379, -107, -1019, -748, 303, 716, -568, -799, 482, 583, -720, -843, 400, 929, -71, -574, 63, 633, -9, -487, 451, 733, 375, -64, -165, 282, 60, -8, 528, 768, 157, 232, 697, 350, -141, 18, 1115, 985, -173, -282, 567, 1343, 441, -284, 726, 1013, 308, -539, -26, 931, 651, 114, 199, 398, 169, 240, 315, 213, 219, -65, 711, 358, -214, -74, 255, 638, 40, -271, 290, 498]
4448D98n10l75P67N69o11r63M0J008j83n39p8M05K18l28%J67j73k85l8L04k58
4469c65R3K12R0n30k63N49O56m99p24K65J000q35k8PK60O5m22l94L91M07o3k91
4491d19n9K41m74L11j4j77M03r5J08l15k4L38J83m00Q1K90J06n94L81l36O79N7
4513B71m23j86M2M86l68j9Q3K0k77L43j52K22L50j38O8n63j22O96K45n4m42K8
4535A10O05j43o45J60O13J2n09j65K28QM52l44p8M9O7m1k40J13J82K13k97k10
4557A40J83K33k02M3l76J66M42j26k46K9J7J81m03j79L85N8k13r2L73l02L71m95
4579a3J09k91K70J86m32J37l3O3J33k16o32O42j92nk25M4L12K86k82j82J08j95
4601d08n4l04L52L26k62j49K18R7nl21M5j48K16n0J80k27j0J10o1O61o36q2K09
$$ y = [498, -12, -387, 380, 949, 338, -625, -585, 423, 240, -299, -377, 28, 246, -82, -82, 85, -88, -373, -411, -107, -365, -272, -60, 30, -500, -763, -214, 442, -57, -781, -516, 484, -351, -379, -372, -112, -47, -469, -863, -472, -65, -128, -419, -478, -237, -711, -400, -414, -591, -188, -283, -175, -490, -514, -176, 7, -393, -312, -22, 84, -510, -129, -465, 214, 271, -152, -338, -296, 190, -178, -197, -114, -94, -371, -28, -180, 42, 392, 254, 322, -241, -363, 333, 578, 524, 82, 110, 715, 572, -73, 87, 700, 712, 203, 38, 266, 274, 726, 382, 304, 353, 420, 379, 139, 252, 434, 647, 350, 140, 323, 556, 354, 397, 21, 187, 629, 503, 257, 286, 303, 484, 81, -98, 287, 345, 132, 40, 413, 111, 482, -13, 96, -195, 75, 261, -171, -34, -67, -4, 129, -87, -719, -77, -269, -274, -499, -455, -143, 143, -139, -321, -213, -408, -462, -766, -414, -88, -350, -499, -281, -184, -189, -510, -465, -613, -397, -447, -267, -494, -504, -394, -455, 206, -430, -512, -303]
4624c03q3k39R1K47J32j97%J1l3K81l09O3M6J8K22j45k67L58N2j22j73J1K67r7
4648a69L37j90O7K18N8k66j50J03K12l5r7K59j17R9k87L05j38O9n4k24m0K66K18
4671D44k3l32M00l53J88J91m91M03J62j77R3l06K08M2n6j16J68j54J04j97J98
4692C96j00J97j03J39j66k38L6l9M87p34K63K63k90k07R6J55J26j71j63n1J98
4713I4M4l27J73J01p4p3j02L2l9PJ76o2J08j54J27J29p30K61L04l19Q5L6k8J50
4737h1j29p01J028l19j49k51K49P7J73k99J76K00J01p23L54K66l87K92l0Q3N6
4758a4l02J34j87pM22k36p7k01m7L07L40k74j29m0K07R9J16j94J34K95n36K4L91
4781B25l04J88N3J64p1M8L1k63K21m53N06m09M98l57M32r3k75K16P6K68n23l29
$$ y = [-303, -386, -625, -534, -287, -155, -352, -352, -341, -374, -93, -402, -339, -293, -275, -53, -198, -465, -107, -55, -177, -350, -339, -72, -169, 168, -22, 45, 263, 321, 55, -95, 8, 220, 185, 88, 347, 230, 329, 42, 347, 209, 278, 224, 0, -40, 226, 444, 421, 89, 489, 136, 324, 515, 24, 427, 589, 412, 505, 199, 407, 449, 393, 277, 445, 291, 395, 198, 396, 296, 493, 390, 529, 363, 125, 161, 122, 609, -125, 138, 401, 111, -96, 0, 155, 281, 110, -53, -104, 94, 138, -189, -16, 85, 11, -62, -164, -132, -171, -164, 12, -50, 58, -96, 31, 160, -570, -309, -5, -324, -239, -203, -231, -81, -210, -911, 117, -202, -351, -602, -353, -276, -103, -402, -226, -26, 75, -648, -294, -28, -415, -123, -153, -70, -14, -316, -182, -369, -376, 46, -190, -267, -468, -515, -208, 132, -142, -271, -311, -104, -5, 111, -83, 51, 346, -190, -166, 225, -79, 109, 162, 326, 255, 303, 334, 71, 292, -161, 345, -64, 434, 77, 509, 416, 141, 357, 433, 701, 178, -151]
4803a51L00K76j17j13L52K9l58N16n64M53l90j37L09K2j28m78Q41J49o99p2L39
4824C79l30oj08K72J53k36l32n2N30l44j8J58j5j03J91K60k51l15J49K02Jo54
4846d69J45K47J55k91k92M21M50n49m65L75J53j95m12O86k81K1o5M4r2J29Q2j3
4868b16j07l56K2N03r1l38j38K48K47k64j99M35J88l0m85K32M02k89k4l17M91
4889h6L1k34k8nl02K20N36j58K98n89K28N31p19K01O6K28l87j89M07O3j00p1N16
4912D57j97j70m13N02N9pk12Q9K40m65P3M22K26m22j10J05k3m2R8j10K34m3r0
4935B01rK73l01j0N29j55l45M2J30M85q66M26J45J26n27p3J59kJ09J17K13n1k91
4958C25j66K21j91j36n2L81P1l91j28J12L65j93j53K06k81r5k37M56j27M9l50
$$ y = [-151, 149, 425, 308, 195, 547, 576, 218, 734, 170, 623, 233, 96, 405, 427, 299, -179, 662, 811, 112, 40, 379, 49, 43, -65, 207, 360, 124, -208, -260, 270, -74, -92, 66, 51, -52, 139, 399, 148, -167, -18, 184, 185, -469, -324, -77, 78, -213, -505, -84, 366, -183, -648, -273, -120, -315, -727, -41, -322, -301, -366, -322, -414, -285, -203, -216, -323, -679, -657, -154, -245, -583, -721, -473, -226, -490, -689, -254, -66, -96, -581, -349, 53, -236, -260, -577, -86, -55, -289, -317, -322, -624, -404, 132, -26, 272, -317, -89, 442, -277, -76, -10, 218, -169, -358, 49, 112, 12, -59, 457, 260, 90, -323, 179, 238, 231, 19, 108, 348, -117, -44, 378, 604, 182, 72, 177, 154, 112, 210, 100, 334, 291, 201, 192, 465, 164, 154, 683, 528, 183, 225, 355, 840, -26, 400, 545, 671, 144, 71, 230, 228, 337, 454, 667, 616, 325, 159, 380, 189, 53, 1, 382, 453, 62, -66, 46, 411, 218, 65, 271, -10, -105, -342, 114, -13, 36, -314]
4979c14N92l49l04K6L96K55j34n93L46K41m81P9K69J31k56k03K24p4m29J7M96
5000f5J7m12k79J44L81l90K06O02j01o40n3L67j71O0M7L32o1m62N5N69K45n25
5022a34n91R05n22j56M7M64J25M9m70P4L08j74k90J36O26n83qL49L62q20K05P1
5044b7L79k84n06O10L05m96MR2M44o53j42M72R6k55r4J03P12o66k39N39k26j3
5066A55j98Q47n56j28j32j61O35m22j85N59l02J2l71M07O44o20k23J66L26m25
5086B8j57K11M81j21o64j9N90n6n03J71J19J48l82J73k30J47J14k76M14l23j51
5107b86R7K13k91K07M1M38o90j70j26O88k49p2j67J27M7j93j0M87%l06j7J34q1
5130a79l51J69J20J32o7K12j00n00J08p3O07p13P8K04L93o7n73K98J58L80n66
$$ y = [-314, 278, -71, -375, -349, 47, 302, 168, -425, -79, 162, -319, -240, 29, 160, -96, -299, -75, -149, -578, -561, -65, -48, -460, -739, -595, -214, -604, -398, 204, 103, -537, -590, -223, -394, -334, -287, 45, -16, -478, -423, 146, 391, -134, -725, 180, -342, -498, -451, 13, 138, 187, -283, -209, 99, -75, -365, -229, 397, -186, -194, 155, 517, -303, -98, -27, 352, 68, -438, 172, 477, -19, -15, 77, 521, -132, -274, 198, 294, 39, -55, 48, 760, 94, -145, 394, 168, 155, -43, 804, 248, 120, -12, -173, 462, 40, -145, 414, 112, 124, -247, 160, 804, 184, -39, 127, 453, 28, -129, 82, 563, 442, -222, -241, 349, 293, -210, -39, 80, 228, -154, 19, -211, -64, 50, -226, 188, -135, -286, -189, 24, -267, -60, -19, 419, -271, -441, -567, 121, -128, -200, -367, -240, -193, -386, -396, 91, 91, -215, -232, -98, -179, -530, -361, -241, -109, -176, 36, -64, -564, -456, -529, 78, -635, -557, -353, 40, -27, -600, -302, -144, 236, -330]
5151c30j37K51j67L48J27O8l79M5J93j80L4J57K06p7n8l86K26K69q5j15j84K61
$$ y = [-330, -467, -216, -383, -35, 92, 160, -219, -174, 19, -161, -127, 30, 236, 159, 101, -285, -59, 210, 125, 10, -174, 87]
$$ [...]
8191A39
##END NTUPLES=NMR FID
##END=
