##TITLE=1H_LR-669-K1
 CDCl3, 8 sc, 
 10.4.2019
##JCAMPDX= 6.0         $$ Bruker NMR JCAMP-DX V2.0
##DATA TYPE= NMR FID
##DATA CLASS= NTUPLES
##ORIGIN= UXNMR, Bruker Analytische Messtechnik GmbH
##OWNER= root
$$ XWIN-NMR		Version 3.5
$$ Wed Apr 10 14:54:52 2019 Russian Standard Time (UT+4h)  she@DPX200
##.OBSERVE FREQUENCY= 200.1315
##.OBSERVE NUCLEUS= ^1H
##.DELAY= (6, 6)
##.ACQUISITION MODE= SIMULTANEOUS
##.ACQUISITION SCHEME= undefined
##.AVERAGES= 8
##.DIGITISER RES= 18
##SPECTROMETER/DATA SYSTEM= spect
##.PULSE SEQUENCE= zg30
##.SOLVENT NAME= CDCl3
##.SHIFT REFERENCE= (INTERNAL, CDCl3, 0, 15.7039)
##AUDIT TRAIL= $$ (NUMBER, WHEN, WHO, WHERE, WHAT)
$$ ##TITLE= Audit trail, XWIN-NMR		Version 3.5
$$ ##JCAMPDX= 5.01
$$ ##ORIGIN= Bruker BioSpin GmbH
$$ ##OWNER= she
$$ F:/spectra/data/she/nmr/H-F/1/audita.txt
$$ ##AUDIT TRAIL=  $$ (NUMBER, WHEN, WHO, WHERE, WHAT)
(   1,<2019-04-10 14:53:50.45 +0400>,<she>,<DPX200>,
      <created by zg, POWCHK disabled, PULCHK disabled
       configuration hash MD5:
       00 E9 B6 7A A2 85 ED C7 34 08 36 98 17 FE 4E 26
       data hash MD5: 16K
       26 69 DD 67 C2 4C 6A 7B 5F 82 D0 B2 2A 43 4E 85>)
$$ ##END=
$$ 
$$ hash MD5
$$ 95 45 6D 69 FB FC 7B 2C 92 A6 EE 42 72 68 A9 74
##$RELAX= 
##$RELAX= 
##$RELAX= 
##$RELAX= 
##$RELAX= 
##$RELAX= 
$$ Bruker specific parameters
$$ --------------------------
##$DU= <F:/spectra>
##$EXPNO= 1
##$NAME= <H-F>
##$PROCNO= 1
##$TYPE= <nmr>
##$USER= <she>
##$AMP= (0..31)
100 100 100 100 100 100 100 100 100 100 100 100 100 100 100 100 100 100 
100 100 100 100 100 100 100 100 100 100 100 100 100 100 
##$AQSEQ= 0
##$AQ_mod= 1
##$AUNM= <au_zg>
##$AUTOPOS= <>
##$BF1= 200.13
##$BF2= 200.13
##$BF3= 200.13
##$BF4= 200.13
##$BF5= 200.13
##$BF6= 200.13
##$BF7= 200.13
##$BF8= 200.13
##$BYTORDA= 1
##$CFDGTYP= 0
##$CFRGTYP= 5
##$CHEMSTR= <none>
##$CNST= (0..31)
1 1 145 1 1 1 1 1 1 1 1 1 1 1 1 1 1 1 1 1 1 1 1 1 1 1 1 1 1 1 1 1 
##$CPDPRG= <>
##$CPDPRG1= <>
##$CPDPRG2= <>
##$CPDPRG3= <>
##$CPDPRG4= <mlev>
##$CPDPRG5= <mlev>
##$CPDPRG6= <mlev>
##$CPDPRG7= <mlev>
##$CPDPRG8= <mlev>
##$CPDPRGB= <>
##$CPDPRGT= <>
##$D= (0..31)
0 1.2 0 0 0 0 0 0 0 0 0 0.03 0 0 0 0 0 0 0 0 0 0 0 0 0 0 0 0 0 0 0 0 
##$DATE= 1554893629
##$DBL= (0..7)
120 120 120 120 120 120 120 120 
##$DBP= (0..7)
150 150 150 150 150 150 150 150 
##$DBP07= 0
##$DBPNAM0= <>
##$DBPNAM1= <>
##$DBPNAM2= <>
##$DBPNAM3= <>
##$DBPNAM4= <>
##$DBPNAM5= <>
##$DBPNAM6= <>
##$DBPNAM7= <>
##$DBPOAL= (0..7)
0.5 0.5 0.5 0.5 0.5 0.5 0.5 0.5 
##$DBPOFFS= (0..7)
0 0 0 0 0 0 0 0 
##$DE= 6
##$DECBNUC= <off>
##$DECIM= 24
##$DECNUC= <off>
##$DECSTAT= 4
##$DIGMOD= 1
##$DIGTYP= 9
##$DL= (0..7)
0 120 120 120 120 120 120 120 
##$DP= (0..7)
150 150 150 150 150 150 150 150 
##$DP07= 0
##$DPNAME0= <>
##$DPNAME1= <>
##$DPNAME2= <>
##$DPNAME3= <>
##$DPNAME4= <>
##$DPNAME5= <>
##$DPNAME6= <>
##$DPNAME7= <>
##$DPOAL= (0..7)
0.5 0.5 0.5 0.5 0.5 0.5 0.5 0.5 
##$DPOFFS= (0..7)
0 0 0 0 0 0 0 0 
##$DQDMODE= 0
##$DR= 18
##$DS= 0
##$DSLIST= <SSSSSSSSSSSSSSS>
##$DSPFIRM= 0
$$ [...]
##$SUBNAM2= <"">
##$SUBNAM3= <"">
##$SUBNAM4= <"">
##$SUBNAM5= <"">
##$SUBNAM6= <"">
##$SUBNAM7= <"">
##$SUBNAM8= <"">
##$SUBNAM9= <"">
##$SW= 24.9337058887773
##$SWIBOX= (0..15)
0 0 2 0 0 0 0 0 0 0 0 0 0 0 0 0 
##$SW_h= 4990.01996007984
##$TD= 16384
##$TD0= 1
##$TE= 0
##$TE2= 300
##$TE3= 300
##$TEG= 300
##$TL= (0..7)
0 120 120 120 120 120 120 120 
##$TP= (0..7)
150 150 150 150 150 150 150 150 
##$TP07= 0
##$TPNAME0= <>
##$TPNAME1= <>
##$TPNAME2= <>
##$TPNAME3= <>
##$TPNAME4= <>
##$TPNAME5= <>
##$TPNAME6= <>
##$TPNAME7= <>
##$TPOAL= (0..7)
0.5 0.5 0.5 0.5 0.5 0.5 0.5 0.5 
##$TPOFFS= (0..7)
0 0 0 0 0 0 0 0 
##$TUNHIN= 0
##$TUNHOUT= 0
##$TUNXOUT= 0
##$USERA1= <user>
##$USERA2= <user>
##$USERA3= <user>
##$USERA4= <user>
##$USERA5= <user>
##$V9= 5
##$VALIST= <valist>
##$VCLIST= <CCCCCCCCCCCCCCC>
##$VD= 0
##$VDLIST= <DDDDDDDDDDDDDDD>
##$VPLIST= <PPPPPPPPPPPPPPP>
##$VTLIST= <TTTTTTTTTTTTTTT>
##$WBST= 1024
##$WBSW= 4
##$XGAIN= (0..3)
0 0 0 0 
##$XL= 0
##$YL= 0
##$YMAX_a= 136400
##$YMIN_a= -155401
##$ZGOPTNS= <>
##$ZL1= 120
##$ZL2= 120
##$ZL3= 120
##$ZL4= 120
##$ABSF1= 10
##$ABSF2= 0
##$ABSG= 5
##$ABSL= 3
##$ALPHA= 0
##$AQORDER= 0
##$ASSFAC= 0
##$ASSFACI= 0
##$ASSFACX= 0
##$ASSWID= 0
##$AUNMP= <proc_1d>
##$AZFE= 0.1
##$AZFW= 0.1
##$BCFW= 1
##$BC_mod= 2
##$BYTORDP= 1
##$COROFFS= 0
##$CY= 11.3945322036743
##$DATMOD= 1
##$DC= 2
##$DFILT= <>
##$DTYPP= 0
##$F1P= 18.9103706918063
##$F2P= -1.10871071338519
##$FCOR= 0.5
##$FTSIZE= 0
##$FT_mod= 4
##$GAMMA= 1
##$GB= 0.15
##$INTBC= 1
##$INTSCL= 1
##$ISEN= 128
##$LB= 0.24
##$LEV0= 0
##$LPBIN= 0
##$MAXI= 10000
##$MC2= 0
##$MEAN= 0
##$ME_mod= 0
##$MI= 1.114404
##$NCOEF= 0
##$NC_proc= 0
##$NLEV= 6
##$NOISF1= 3.799351
##$NOISF2= 2.8
##$NSP= 1
##$NTH_PI= 0
##$NZP= 0
##$OFFSET= 15.70392
##$PC= 1
##$PHC0= -8847.573
##$PHC1= 3.400263
##$PH_mod= 1
##$PKNL= yes
##$PPARMOD= 0
##$PSCAL= 0
##$PSIGN= 0
##$REVERSE= no
##$SF= 200.130013532006
##$SI= 16384
##$SIGF1= 3
##$SIGF2= 2
##$SINO= 400
##$SIOLD= 16384
##$SREGLST= <1H.CDCl3>
##$SSB= 0
##$STSI= 0
##$STSR= 0
##$SW_p= 3612.71676300578
##$SYMM= 0
##$S_DEV= 0
##$TDeff= 0
##$TDoff= 0
##$TI= <>
##$TILT= no
##$TM1= 0
##$TM2= 0
##$TOPLEV= 0
##$USERP1= <user>
##$USERP2= <user>
##$USERP3= <user>
##$USERP4= <user>
##$USERP5= <user>
##$WDW= 1
##$XDIM= 8192
##$YMAX_p= 0
##$YMIN_p= 0
$$ End of Bruker specific parameters
$$ ---------------------------------
##NTUPLES= NMR FID
##VAR_NAME=  TIME,          FID/REAL,        FID/IMAG
##SYMBOL=    X,             R,               I
##VAR_TYPE=  INDEPENDENT,   DEPENDENT,       DEPENDENT
##VAR_FORM=  AFFN,          ASDF,            ASDF
##VAR_DIM=   8192,          8192,            8192
##UNITS=     SECONDS,       ARBITRARY UNITS, ARBITRARY UNITS
##FACTOR=    0.0002004,     1,               1
##FIRST=     0,             0,               0
##LAST=      1.6414764,     0,               0
##MIN=       0,             -155401,         0
##MAX=       1.6414764,     136400,          0
$$ Real data points
##PAGE= N=1
##DATA TABLE= (X++(R..R)), XYDATA
0 0 0 0 0 0 0 0 0 -7 8 -8 8 -8 16 -16 24 -24 32 -37 43 -49 59 -72 80 -94 107 -122 140 -159 181 -203 229
31 229 -258 290 -323 361 -402 450 -498 553 -611 679 -751 831 -919 1019 -1131 1257 -1401
48 -1401 1565 -1755 1979 -2249 2579 -2997 3539 -4285 5367 -7104 10349 -18554 86536 120172
62 120172 -5894 26498 69671 65272 -8346 -7713 63280 136400 118874 64953 39952 68295
74 68295 77480 39317 -12176 -1006 56624 91422 62452 30413 39470 61213 36142 -14167 -25787
87 -25787 14742 47892 44008 33335 49637 64239 37645 -15227 -38793 -24175 -11033 -22141
99 -22141 -22887 11817 52713 50678 12448 -15365 -13934 -13749 -39916 -69176 -59245 -12097 22235 8060
113 8060 -25971 -29631 -7709 -14946 -63627 -92719 -58691 -6528 -3144 -35956 -44330 -19032 -13342
126 -13342 -51696 -94154 -95220 -64540 -41321 -40737 -43671 -30616 -12513 -17709 -52714 -88486 -94195
139 -94195 -78697 -70439 -72181 -61212 -34261 -18613 -30590 -52535 -63737 -68852 -78709 -85294 -74306
152 -74306 -54031 -42393 -42901 -42238 -38707 -46921 -69939 -86713 -80876 -61692 -51149 -49473 -41113 -25480
166 -25480 -21136 -39202 -65929 -79633 -72879 -60678 -56398 -54397 -39640 -14270 -4251 -22842 -49336
179 -49336 -55022 -47203 -50438 -62463 -57044 -28619 -5681 -6198 -17792 -22629 -24301 -33672 -44927 -45803
193 -45803 -33780 -17260 -4588 1262 2270 -1362 -9533 -21798 -31611 -30349 -20091 -9951 -1739
206 -1739 10572 24193 24755 8875 -8298 -10753 -7031 -10278 -14804 -2100 24960 41296 33059 17804
220 17804 15217 18982 11288 -5426 -7628 12279 35671 41786 34633 31590 36676 35587 20479 4035
234 4035 4383 23423 41093 43089 39543 46792 56271 47993 24359 10337 18743 31894 33972 34534
248 34534 47431 64042 64255 47986 34035 30437 30244 26926 25107 34977 51899 62545 60172 50728
262 50728 45020 42284 34296 22505 20401 34828 51647 56068 50437 50762 54969 48481 28574 14301
276 14301 20633 35714 41473 39005 43279 55456 58416 42150 22228 16005 21607 24977 22092 24745
290 24745 38118 50749 49161 34393 20954 17591 17428 11630 5688 12361 29611 39773 33763 22955
304 22955 19864 18707 8136 -6266 -7584 5410 17092 18397 16417 19051 19095 9106 -6653 -16091
318 -16091 -14770 -8043 -3853 -1202 4438 12082 11451 -773 -16316 -22602 -21177 -21586 -24044 -19967 -5960
333 -5960 3784 -891 -13472 -20642 -22486 -27937 -38135 -40548 -29216 -15280 -11784 -16180 -19105 -19551
347 -19551 -25308 -38585 -48185 -46398 -36516 -28277 -26179 -24668 -20900 -20151 -28631 -43017 -51330 -47860 -41952
362 -41952 -39904 -37929 -29070 -19241 -20451 -32210 -42443 -44491 -44719 -48299 -49276 -40605 -27010 -20739 -23906
377 -23906 -29500 -32487 -36071 -42894 -49456 -48399 -38243 -27146 -22321 -22141 -22039 -21650 -26619 -37853 -45284
392 -45284 -41950 -32585 -25994 -23255 -17971 -10203 -8970 -18804 -29728 -32750 -29063 -27156 -26236 -19544 -7585
407 -7585 249 -1422 -8839 -14415 -16493 -18853 -21951 -20163 -11238 582 7319 6332 3155 2004 -495
422 -495 -7882 -14377 -12123 -1651 7823 10877 12601 16785 17994 11178 890 -3263 529 6289 9444
437 9444 13922 22249 28348 27785 20050 12023 9390 9805 10243 11853 18464 28490 35307 33724 27595 23059
453 23059 21069 17057 12079 12757 22072 32141 36090 34691 33526 33499 28483 19316 13532 16591 23780
468 23780 28938 31793 35895 39181 37920 30468 21388 17137 18147 21318 23209 27462 34328 39241 38124
483 38124 29769 22825 19762 18099 15337 15166 22509 31729 34941 31745 28032 25369 21264 13787 8514
498 8514 10140 17580 23186 25209 25614 26178 24292 18012 9655 4165 4980 9807 13562 15428 18933 21952
514 21952 20883 13194 4124 219 680 1133 1237 5190 12407 16648 13179 7192 2380 -1655 -6017 -9051
530 -9051 -8059 -2265 4035 6810 5700 3351 106 -5067 -11561 -16109 -15229 -10225 -4863 -2493 -1721 -443
546 -443 -2028 -8820 -16872 -20686 -19047 -16660 -15242 -11986 -6791 -3546 -6177 -13141 -18481 -21021 -22246
561 -22246 -24004 -23047 -17816 -11525 -8628 -10271 -14327 -18740 -21463 -25088 -28353 -27649 -22539 -16020 -13018
576 -13018 -13857 -14886 -16115 -20262 -27003 -30865 -28729 -24317 -20828 -18149 -14654 -12185 -14804 -20124 -25660
591 -25660 -27694 -28250 -26876 -23811 -19155 -14111 -11709 -12701 -17056 -21163 -23843 -25781 -26813 -24707 -19182
606 -19182 -12651 -9851 -10991 -12790 -14098 -17477 -22375 -24782 -21851 -15623 -11363 -9149 -7380 -5663 -6428
621 -6428 -11931 -17036 -18593 -16498 -13283 -10104 -6241 -1950 438 -353 -4580 -9176 -11333 -10431 -9160 -6848
637 -6848 -2804 3673 7299 6017 2527 -114 -1289 -4036 -5465 -3325 3324 8286 10773 11427 11936 10080
653 10080 5777 1842 771 3453 7383 11255 14531 17240 18696 17462 13045 8026 6416 8584 10824
668 10824 13009 16581 21709 24817 22839 17721 14281 13766 12749 11494 13440 18632 24356 26430 24722
683 24722 22374 20356 17659 14553 12412 14045 18328 23154 25788 25736 24586 23288 19937 15199 12267
698 12267 13370 16855 20133 21986 24046 25669 23803 19217 14431 12759 12449 12419 14448 18002 21560 22913
714 22913 20936 17447 14024 10984 8641 7436 8449 12324 15927 17808 16626 13831 11487 8666 4122
729 4122 1107 2053 6342 9499 10198 10385 10798 9032 4079 -1168 -3474 -2566 -1331 380 2844 4852
745 4852 5721 3989 25 -4096 -7541 -8337 -8336 -6851 -4480 -1200 345 -472 -3794 -7774 -10353 -12615 -14494
762 -14494 -13829 -10350 -7053 -5123 -5761 -6408 -8760 -12641 -16745 -18466 -16712 -15094 -12619 -10379 -8568 -8443
778 -8443 -10211 -13999 -17607 -19996 -20265 -18661 -16434 -14385 -11254 -9179 -10473 -13808 -17219 -19045 -20272
793 -20272 -20499 -19476 -15536 -11659 -10137 -11071 -12298 -14306 -16996 -19410 -20372 -19170 -15857 -12480 -10242 -9319
809 -9319 -9320 -11198 -13747 -16695 -17901 -17786 -15343 -12092 -9334 -7255 -6260 -7092 -9674 -12418 -14042 -14227 -13403
826 -13403 -11292 -7488 -4285 -2765 -4099 -5605 -6830 -9240 -11041 -10994 -8525 -5342 -2373 -468 203 -306
842 -306 -2029 -4208 -6321 -7576 -6221 -2895 -40 1911 3195 4190 3635 306 -2328 -3229 -2520 -1020
858 -1020 1051 3667 6853 7859 7050 4839 2454 1111 645 883 3101 6168 8699 10574 10619 8823
874 8823 7088 4918 3827 3298 4285 7574 10435 11911 12472 12207 11145 8789 5901 5098 6259 8455
890 8455 10047 12387 14365 15025 13403 10473 8436 7448 7589 7936 9704 12287 14607 15455 14868 12893 10553
907 10553 8940 7965 7471 8741 11773 13944 15298 14343 13554 12248 9728 7939 6624 7841 10083 11780
923 11780 13232 14110 13629 12380 9482 7032 6181 6230 6976 9218 10765 12244 12268 11077 8928 6196 4664
940 4664 3829 4695 5580 7124 9283 10321 9072 6863 5124 3313 1544 529 1584 3837 5559 6241
956 6241 5902 5475 3619 1052 -1370 -2255 -1821 -809 764 2292 2895 2758 1430 -1202 -3910 -5253 -5517
973 -5517 -4774 -3432 -2649 -630 -236 -1246 -3925 -5705 -7343 -8362 -9154 -7584 -5819 -4068 -3996 -3900 -5471
990 -5471 -7531 -9365 -11064 -11628 -10917 -9467 -7564 -6794 -6399 -7225 -8398 -10348 -12400 -13569 -13333 -11356 -10354
1007 -10354 -9279 -8355 -7778 -8892 -10921 -12915 -13513 -14012 -13488 -12100 -10233 -8257 -7590 -8871 -9779 -11461
1023 -11461 -12794 -13970 -13919 -12567 -10460 -8490 -7410 -7535 -8205 -9434 -10910 -12028 -12526 -11772 -9754 -7687
1039 -7687 -6444 -5508 -5071 -6441 -7961 -9351 -10011 -9290 -8225 -6536 -4658 -3297 -2692 -3171 -4211 -5358
1055 -5358 -6657 -6736 -5877 -4436 -2483 -907 605 545 -329 -1461 -2598 -3028 -3119 -2176 125 2230 3288
1072 3288 3377 3704 2838 1109 -266 -477 796 2480 3574 5370 6646 6447 5975 4587 3512 2686 2543
1089 2543 3817 5491 7224 8372 9246 9181 7551 6248 5666 5070 5077 6271 7991 9639 10769 10165 9967
1106 9967 8647 7204 6080 5750 6511 8372 9532 10644 10825 11063 9894 8207 6868 6303 6377 7518 8763
1123 8763 9880 10499 11321 10163 8697 6962 6263 6254 6116 7089 8481 9852 10145 9276 8093 7041 5891
1140 5891 4680 4273 5194 6551 7468 8512 8216 7156 5856 4827 3399 2490 2582 4190 5036 6040 6725
1157 6725 6017 5019 3676 1823 962 1125 1134 2085 3348 4053 4250 3347 1787 563 -601 -1366 -1362 -494 895
1176 895 1563 2297 1790 590 -722 -1961 -2804 -3294 -2967 -1605 -661 65 -32 -729 -1309 -3064 -4473 -5282
1194 -5282 -4670 -3979 -2919 -2321 -1446 -1588 -2674 -4493 -5558 -6122 -6564 -5951 -5318 -4085 -3286 -3055 -3377 -4527
1212 -4527 -5861 -6860 -7461 -7407 -7208 -6137 -4730 -4050 -4170 -5026 -5791 -7189 -8034 -8599 -8145 -6891 -5815 -5226
1230 -5226 -4833 -4840 -5755 -7088 -8127 -8497 -8566 -7792 -6534 -5531 -4931 -4614 -5423 -5982 -7794 -7998 -8144 -8045 -6817
1249 -6817 -6044 -4531 -4078 -4668 -5238 -6012 -6666 -7575 -7614 -6846 -5532 -4718 -3512 -3204 -3193 -4410 -5440 -5886 -6131
1268 -6131 -5883 -4586 -3439 -2515 -1835 -1859 -2390 -3283 -4162 -4719 -4104 -3346 -2452 -1354 22 262 -245 -880 -1544
1287 -1544 -1950 -2098 -1925 -1073 339 1509 2234 2233 1697 1042 42 -379 -284 849 2013 2896 3544 4118 4149
1306 4149 3794 3169 2228 1841 2433 3459 4389 5423 5987 6244 5834 4948 4011 3728 3905 4503 5271 6789 7250
1325 7250 7690 7286 6872 6043 5209 4967 5155 6045 6889 7856 8179 8667 8295 7226 6408 5596 5463 6193 7059
1344 7059 7541 8067 8484 8597 7783 6569 6019 5452 5301 5624 6255 7272 7729 8048 7195 6041 5409 4470 4274
1363 4274 4052 4904 5627 6378 6361 6020 5350 4222 3456 2777 2228 2879 4060 4244 4475 4257 3889 3234 1978
1382 1978 950 696 788 940 1643 2205 2569 2095 1078 463 -583 -1395 -1799 -1288 -829 -390 52 82 -158
1401 -158 -1310 -2388 -2918 -3624 -3854 -3129 -2454 -2038 -1666 -2084 -2710 -3233 -4423 -5204 -5339 -4986 -4529 -3681 -3335
1420 -3335 -3283 -3444 -4500 -5302 -6013 -6234 -6412 -5745 -5218 -4549 -4285 -4240 -4731 -5718 -6141 -6661 -6350 -6241 -5866 -4966
1440 -4966 -4400 -4300 -4410 -5123 -5490 -6311 -6754 -6647 -6119 -5465 -4833 -4286 -3878 -4318 -5013 -5504 -5911 -5926 -5961 -5100
1460 -5100 -4144 -3735 -3540 -3093 -3692 -4063 -4842 -5046 -4867 -4394 -3928 -2818 -2432 -2064 -2524 -2901 -3223 -3927 -4033
1479 -4033 -3424 -2783 -2238 -1545 -1016 -996 -1228 -1929 -2040 -2184 -2275 -2009 -1233 -371 179 289 139 47 -693 -1324 -1180
1500 -1180 -937 131 298 1407 2132 1842 1145 578 200 324 380 470 1160 2131 2569 2821 2590 2327 1891 1215
1520 1215 1566 1469 1990 2378 3217 3284 4031 3284 2710 2274 1731 2250 2347 3119 3514 4337 4530 4513 3864 3184 2748
1541 2748 2833 2825 3384 3939 4285 4877 5009 4630 4079 3323 3304 2781 3456 3465 4296 4750 4781 4871 3979 4141 3000 2863
1563 2863 3059 3342 3823 4398 4721 5041 4476 4091 3453 3057 2740 2999 3448 3789 4133 4363 4067 4133 3350 2469
1583 2469 2206 2333 2702 3013 3492 3993 3798 3535 2617 2551 1651 1379 1241 1656 2314 2759 2700 2583 1978 1546
1603 1546 696 293 282 75 948 1533 1707 1185 1300 515 15 -631 -798 -1129 -600 -275 75 76 -55 -803 -1196
1624 -1196 -1412 -2090 -2405 -1839 -1829 -1452 -1214 -1240 -1635 -2224 -2908 -3051 -3413 -3544 -3222 -2726 -2372 -2129 -2213 -3187 -3422
1645 -3422 -3979 -4271 -4697 -4401 -4068 -3778 -3177 -2948 -3108 -3596 -4218 -4547 -4738 -4570 -4408 -4280 -3744 -3520 -3728 -3981
1665 -3981 -4390 -4649 -5137 -5182 -4712 -4561 -4269 -3682 -3392 -3349 -4159 -4359 -4482 -4659 -4793 -4010 -3709 -3333 -3317 -2690 -2994
1686 -2994 -3540 -3854 -3794 -3608 -3779 -3488 -2677 -2171 -1833 -1932 -2135 -2498 -2628 -2956 -2710 -2282 -2128 -1444 -788 -648
1706 -648 -504 -1102 -1130 -1617 -1449 -1181 -741 -196 169 605 382 685 216 242 -162 30 223 823 1274 1767 1922
1727 1922 1875 1433 1492 1067 1088 1551 2024 2321 2596 2903 2955 2591 2383 2098 1675 2042 2416 2800 3205 3699 3823
1748 3823 3540 3426 3189 2607 2529 3099 2938 3252 3679 3864 4118 3764 3402 2979 2880 2831 3046 3553 3344 3889 4159
1769 4159 3871 3768 2998 2498 2600 2365 3103 3212 3721 3869 3486 3412 3168 2787 2172 2389 2327 2674 2520 2898
1789 2898 2605 3397 2714 2293 1751 1661 1654 1794 1717 2317 2263 2310 2041 1575 1327 881 931 1143 1025 1209 1326 1786
1811 1786 1568 968 701 255 97 -133 104 502 995 818 712 696 383 -207 -168 -883 -833 -450 -209 142 -4
1832 -4 -196 -326 -683 -1054 -1248 -1316 -1253 -1184 -932 -680 -949 -767 -1035 -1427 -1521 -1873 -2112 -1664 -1666 -1273 -1561 -1119 -1337
1855 -1337 -1958 -2264 -2660 -2168 -2041 -2035 -1611 -1546 -1533 -1844 -1650 -2012 -2614 -2574 -2705 -2278 -2019 -2158 -1730 -1916 -2276
1876 -2276 -2380 -2458 -2900 -2857 -3040 -2556 -2470 -1872 -1948 -2038 -2502 -2388 -2881 -3108 -2642 -2541 -2344 -2131 -2313 -1916 -2069
1897 -2069 -2414 -2253 -2743 -2894 -2796 -2337 -1935 -1930 -1542 -1802 -1960 -2138 -2395 -2432 -2142 -2239 -1793 -1444 -1548 -1516 -1364 -1184
1919 -1184 -1714 -2163 -1805 -1617 -1343 -1289 -1043 -625 -950 -764 -1133 -1150 -1183 -1203 -1231 -561 -480 123 179 130 -40 -228
1941 -228 -383 -248 -110 -84 96 960 1079 943 1095 687 484 602 550 714 722 1432 1641 1756 1701 1671 1304 1348
1963 1348 1544 1190 1644 1835 2284 2378 2353 2228 2341 1896 1923 1880 2134 2123 2551 2689 2859 2842 2365 2586 2399 2372
1985 2372 2166 2500 2769 3377 3052 3168 3003 2929 2372 2301 2154 2233 2540 2890 2789 2954 3112 2726 2347 2101 2116
2006 2116 2345 2320 2270 2480 2705 2720 2463 2110 1794 1817 1057 1540 1898 2016 2105 2127 1707 1465 1448 1029 834 786
2028 786 711 1142 1065 1127 1013 576 691 406 -118 -235 -138 251 290 250 -102 -52 -71 -648 -793 -777 -811 -710 -1042
2051 -1042 -735 -646 -657 -780 -899 -1187 -1648 -1563 -1497 -1504 -1493 -1505 -1043 -1426 -1623 -1547 -1934 -2106 -2263 -2231 -1942 -1912 -1843 -1773
2075 -1773 -1875 -1964 -2205 -2336 -2422 -2111 -2665 -2142 -2023 -2137 -1937 -1864 -2070 -2546 -2432 -2438 -2383 -2452 -2058 -1988 -1931 -1978 -1922
2098 -1922 -2379 -2037 -2457 -2361 -2246 -1957 -1681 -1665 -1328 -1712 -1576 -1908 -2013 -1947 -1886 -1527 -1426 -1404 -1215 -1170 -1437 -1344
2120 -1344 -1397 -1286 -1383 -1163 -906 -484 -908 -556 -552 -805 -907 -591 -969 -982 -671 -492 -398 -33 -173 -168 -305 -618
2142 -618 -483 -413 -62 -109 224 382 596 124 115 63 -232 319 36 133 555 573 639 789 808 423 443 548 528 687
2166 687 1039 1089 1127 1145 1109 847 740 629 554 848 800 1231 1068 1335 1444 1331 795 1350 1085 1146 1265 1229 1483
2189 1483 1731 1743 1735 1194 1247 1043 1265 1418 1450 1345 1716 1675 1861 1589 1397 1783 1267 1351 1520 1481 1574 1879 2073
2212 2073 1622 1533 1465 1412 1433 1397 1188 1405 1695 1723 1634 1902 1385 1456 1209 1257 1045 1297 1450 1438 1573 1342 1238
2235 1238 999 1161 855 921 983 1181 1249 1350 1529 671 950 987 430 704 662 921 833 724 676 671 459 58 199
2258 199 -69 225 144 326 135 281 418 136 -164 -62 -380 -806 -743 -337 -397 -425 -439 -322 -615 -682 -891 -1036
2280 -1036 -974 -1135 -854 -1170 -885 -1174 -1297 -1244 -1401 -1577 -1736 -1372 -1252 -1551 -1377 -1216 -1312 -1445 -1827 -1783 -1779 -1984
2302 -1984 -1896 -1623 -1529 -1541 -1370 -1435 -2021 -1721 -2002 -2142 -2241 -1826 -2029 -1875 -1630 -1449 -1734 -1592 -1797 -1532 -1728
2323 -1728 -1900 -1579 -1800 -1333 -1400 -1119 -1384 -1664 -1646 -1656 -1404 -1488 -1173 -1227 -699 -863 -1123 -1210 -1168 -1220 -1522 -1183
2345 -1183 -1049 -817 -531 -713 -459 -578 -685 -762 -808 -717 -333 -414 -15 53 160 -168 -90 -54 -159 -63 -28 176 42
2368 42 560 248 496 1049 426 550 783 550 728 473 846 1167 947 1275 1027 770 1062 1030 1106 1124 1038 1467
2390 1467 1155 1265 1480 1317 1129 1387 1338 1113 1244 1405 1722 1953 1411 1256 1515 1668 1663 1227 1221 1378 1542
2411 1542 1678 1497 1455 1506 1391 1033 1491 1131 1185 1374 1343 1832 1464 1291 1230 934 949 888 794 1216 1030 1402
2433 1402 931 1166 1242 667 733 710 619 901 820 807 680 596 765 246 535 235 318 328 241 680 848 136 116
2456 116 132 303 -273 -20 301 347 -33 157 184 244 112 -202 -182 -299 -325 -475 -160 -192 -218 -145 -55 -515 -556 -304
2480 -304 -431 -602 -334 -481 -263 -396 -455 -313 -463 -416 -548 -672 -589 -382 -548 -261 -109 -413 -511 -721 -840
2501 -840 -767 -674 -947 -669 -800 -775 -1029 -501 -755 -855 -998 -1017 -948 -796 -1077 -854 -829 -708 -1319 -918 -885 -1082
2523 -1082 -919 -1213 -795 -765 -887 -964 -642 -942 -649 -931 -1107 -877 -1155 -876 -644 -1012 -613 -782 -888 -947 -920
2544 -920 -885 -859 -783 -954 -792 -734 -970 -920 -591 -973 -750 -641 -666 -623 -533 -769 -573 -764 -714 -684 -914 -654 -676 -520
2568 -520 -652 -264 -374 -513 -375 -540 -629 -159 -681 -369 -233 10 -193 183 -227 158 -266 -257 -128 -265 -130
2589 -130 356 187 38 49 164 310 409 291 321 570 365 762 744 199 902 846 554 544 906 652 542 957
2611 957 912 1242 1104 945 675 837 858 1018 1208 858 1130 900 1412 1211 1238 1020 1168 964 1227 1245 1204 1387
2633 1387 1440 1259 1561 1478 1272 1120 1125 1111 1116 1544 1402 1439 1351 1354 1490 849 1090 916 1276 1147 1162 1089 711 941
2657 941 1032 903 1023 824 695 907 910 975 1031 906 609 608 668 108 353 229 442 745 447 420 290 232 191 -108
2681 -108 -194 -197 178 15 -71 -225 -63 -414 -441 -257 -338 -341 -251 -257 -383 -508 -293 -438 -516 -370 -959 -657 -623 -520
2705 -520 -748 -600 -730 -1027 -880 -911 -835 -681 -1104 -1075 -1042 -910 -826 -762 -841 -1029 -1031 -945 -1301 -979 -1014 -951 -849 -970
2729 -970 -1061 -1088 -1060 -1110 -1292 -1164 -1202 -1011 -903 -1120 -801 -806 -976 -1040 -853 -959 -1115 -1041 -937 -982 -885 -797 -861 -584
2753 -584 -800 -571 -735 -611 -734 -594 -525 -638 -677 -574 -241 -232 -589 -580 -325 -539 -600 -203 -436 -327 42 -417
2775 -417 -447 -180 -301 -492 -266 -169 -233 35 120 -376 -468 -202 -74 324 -35 306 133 370 343 153 229 -12
2797 -12 199 -212 250 288 305 30 117 259 224 224 295 248 308 424 438 418 361 542 296 208 125 492 260 487 654
2822 654 542 504 303 438 244 256 556 612 639 822 384 596 502 871 393 147 498 572 280 597 882 482
2844 482 1007 782 360 430 584 375 741 408 821 916 894 914 553 639 576 654 470 546 764 939 770 593 728
2867 728 991 398 689 771 591 498 558 834 703 717 338 528 466 664 579 511 441 852 423 599 148 152 451
2890 451 587 350 571 759 437 668 562 643 529 500 256 226 -36 368 383 21 225 181 79 241 143 -163
2912 -163 -121 -90 -376 85 -126 -75 -53 -53 109 -51 8 -148 -363 -484 -449 -651 -446 -503 -569 -487 -523 -287 -429 -454
2936 -454 -528 -676 -346 -461 -371 -644 -969 -312 -839 -877 -635 -725 -668 -811 -759 -542 -1009 -677 -635 -923 -966 -668 -1096
2959 -1096 -718 -874 -759 -1236 -1023 -759 -753 -609 -948 -1189 -690 -682 -873 -657 -714 -756 -767 -1045 -444 -922 -687 -650
2981 -650 -435 -782 -556 -673 -570 -596 -373 -309 -446 -276 -592 -262 -299 75 -282 -293 -193 -319 -188 -106 -139 -49
3003 -49 -203 11 70 -201 91 60 -43 76 -120 -164 74 118 1 196 595 310 127 212 383 673 430 522
3025 522 289 483 686 580 503 574 413 726 484 346 826 843 929 712 702 648 503 529 523 577 583 481 535 528 570
3050 570 667 793 692 747 754 705 584 823 572 769 778 73 774 623 423 691 689 388 488 416 528 493 428 682
3074 682 519 424 341 378 520 485 190 272 491 477 230 454 242 151 206 434 668 83 75 607 161 170 593 316
3098 316 111 -9 214 313 -73 -195 16 67 220 148 -78 247 286 152 362 -251 -247 -42 -61 150 87 -96 104
3121 104 36 -35 -99 -8 9 -262 -267 -148 -232 -350 -309 -167 -54 -203 -122 -142 -153 -210 -209 -76 -104 -375 89 -196 -158 -231
3147 -231 -104 -453 -317 -441 -417 -55 -188 -240 -180 -138 -338 -111 -342 -60 -312 -105 -406 -550 -293 -354 -626 -356
3169 -356 -194 -287 -149 -313 -662 -399 -597 -445 -658 -397 -297 -284 -288 -107 -183 -738 -402 -474 -441 -641 -804 -437
3191 -437 -226 -165 -368 -222 -370 -529 -616 -562 -316 -389 7 -230 -407 -313 -303 -262 -364 -435 -378 -460 -698 -539 -466 -96
3215 -96 -320 -194 -199 -196 -275 -543 -464 -66 -67 -95 30 -331 -186 -3 -347 -180 -324 -280 364 287 -161 -81 -45 -70 5
3240 5 -204 2 -31 -163 242 323 368 -20 291 -113 580 262 67 447 325 262 458 272 525 196 207 378
3262 378 181 -1 130 383 501 530 692 463 348 214 582 680 444 488 419 569 631 398 679 518 352 530
3284 530 699 559 551 705 469 615 247 316 622 456 305 358 226 536 747 233 264 717 199 466 534 451
3306 451 493 105 215 234 396 399 458 -24 110 90 146 126 28 699 139 471 454 143 29 -52 -61 -147 -131 33 56
3331 56 78 158 -132 19 151 116 -127 19 -368 51 -7 -114 -267 -70 -398 -240 -307 -23 -207 -174 -443 -419 -308
3354 -308 -439 -487 -677 -459 -400 -353 -333 -698 -391 -160 -363 -223 -551 -146 -457 -172 -210 -248 -204 -195 -464 -746 -487
3377 -487 -271 -445 -291 -426 -558 -149 -351 -163 -372 -388 -637 -279 -562 -161 -356 -492 -109 -595 -79 -363
3397 -363 -182 -227 -238 -207 -69 -111 -438 82 -359 -19 -11 -287 -230 48 -173 -141 -104 -223 -318 -78 62 152 -90 -120
3421 -120 -197 -204 -94 182 34 134 -197 34 -80 -8 -137 -67 67 176 73 43 105 -99 105 119 97 -63 286
3444 286 194 179 -47 223 224 -68 -379 -203 -69 -136 227 183 0 -3 314 -115 112 -109 130 -72 80 -52 -39
3467 -39 21 147 -181 -68 345 137 239 33 136 267 288 -10 212 275 115 48 217 216 184 248 273 311 180 146
3491 146 148 322 235 162 76 311 183 141 -47 83 259 161 92 55 237 178 86 176 -30 330 273 -70 166 0
3515 0 255 260 84 522 208 341 121 309 140 90 187 425 172 137 111 -189 112 188 95 -12 87 -33 216 222
3539 222 288 72 -76 276 27 356 270 225 85 349 -48 382 -50 394 293 161 284 205 -315 90 -3 154
3561 154 -25 185 -17 -43 -8 -45 -204 -39 77 -375 -38 -38 132 -126 178 -375 -37 -66 -31 117 -89 -30 -3
3584 -3 -162 -114 -147 -248 -225 -187 -296 -228 -436 163 -87 -418 -68 -444 -363 -238 -162 -385 -574 -88 -240 -166 -313
3607 -313 -330 -106 -364 -630 -385 -217 -356 -397 -484 -279 -335 -346 -133 -64 -324 -456 -143 -213 -137 -298 -272 -242 -4
3630 -4 -501 -184 -231 -298 -203 -203 -134 -136 -168 -271 -185 -106 -410 214 -64 -322 172 -358 52 -122 69 -51 -338 54
3654 54 -84 -83 125 66 -69 -100 -4 335 113 -342 32 -189 26 144 171 62 129 -120 49 140 192 238 -77 57
3678 57 338 63 -9 350 20 199 253 321 88 217 114 270 329 422 152 295 345 85 210 215 312 248 167 245
3702 245 221 141 236 296 302 -175 201 148 206 321 206 206 5 369 278 -172 234 -235 51 166 454 -54 264 222
3726 222 -168 -124 80 303 14 453 279 204 378 292 48 293 102 44 -5 17 -260 -111 -149 10 -135 15
3748 15 -75 -112 -4 175 -186 -172 82 82 -7 -209 12 61 -231 -171 -187 -172 -42 -55 47 -307 2 89 37 -294 -153
3773 -153 -41 -287 -196 -197 -199 -127 -173 142 248 139 59 -138 154 124 -153 -223 -125 -154 77 155 -130 -138 136 101 14 -31
3799 -31 150 -466 -219 -51 -61 -299 -85 -140 -43 111 -14 -234 -60 -152 -278 127 -352 -275 -10 317 -140 253
3821 253 -29 -93 -350 -148 -33 191 -27 -443 -125 -175 -26 -38 226 -203 -156 -61 -117 0 -60 -259 -464 -152
3843 -152 -118 -129 -219 -87 -304 62 -47 131 -106 -414 -110 36 -35 -197 -484 262 -191 -436 -221 -95 -432
3864 -432 -170 -241 205 -93 88 -214 -202 -305 -48 -115 -265 -134 -117 76 63 -117 40 -9 55 27 -290 268 -286
3887 -286 -2 175 -61 -131 -13 -45 -14 275 -110 -124 -149 122 120 82 107 38 -2 144 147 -155 112 -117 200 -81
3911 -81 211 375 -16 456 251 45 316 197 259 -108 -58 269 189 165 410 280 139 159 204 497 294 85
3933 85 239 231 138 395 113 215 246 305 341 -139 -65 170 62 119 115 -12 250 275 142 0 124 -2 34 -42 331
3958 331 147 -286 195 22 -68 158 144 -61 99 -68 -62 52 -31 -116 -1 304 -267 310 -25 -223 30 -181
3980 -181 -320 -131 207 -453 -245 -219 -102 -254 -133 184 -328 -238 50 -58 -238 -49 172 -91 42 -295 -112
4001 -112 -76 -149 -153 70 -267 -168 -391 -196 -211 -199 61 -338 -99 -66 -381 -123 -317 110 -190 -175 -179 -209 2 -109
4025 -109 -92 -125 -256 -102 -116 -363 -79 23 -119 -161 -433 -260 173 -211 -334 -232 -32 -406 10 -123 -186 46
4047 46 -104 -117 -244 -241 219 -316 -88 22 -161 -219 -328 54 -171 -54 -264 -143 25 207 109 254 -265 51
4069 51 -94 148 135 -89 70 -120 77 63 236 19 -23 -17 -55 -52 -212 82 165 290 -186 -254 167 58 -157 -24
4093 -24 -190 30 100 86 -179 125 -39 -80 19 -63 219 -206 -24 30 152 -116 -196 -114 67 252 117 -11 173
4116 173 -216 -71 55 108 30 18 -75 164 -168 216 -252 -164 75 170 -249 -37 -148 -153 244 12 -126 -103 230
4139 230 143 116 -231 37 81 97 199 56 -23 129 -86 34 10 56 -89 -163 65 12 77 -93 122 93 191 132
4163 132 -178 -295 202 103 -41 -151 195 119 173 93 171 96 124 -27 225 13 3 138 141 -86 169 74 -51 377
4187 377 63 205 215 118 26 261 202 180 22 91 275 -16 167 165 80 -225 -138 97 259 342 193 -107 183 -6
4211 -6 -174 59 379 -166 49 137 -240 -138 10 189 93 -215 -7 163 -117 -61 -110 -196 -277 34 135 -319 -147
4234 -147 -64 -46 -150 42 -265 -205 -43 159 -290 -141 -240 75 78 -324 -256 -153 -157 -245 -258 53 15 -58 2 -194 -279
4259 -279 -35 -187 -238 -333 139 35 -147 -371 -205 -114 -137 -369 -212 -47 -76 -84 -191 -101 -130 150 -80 -80 -188 125
4283 125 -111 0 33 150 -255 272 74 -228 -57 -65 -319 83 -344 -234 -54 103 135 -135 422 50 228
4304 228 -82 337 -121 -23 -15 -44 263 -185 96 149 82 18 160 -48 -70 158 274 -73 -22 29 163 34 41 349
4328 349 159 -22 -28 50 -195 -37 6 -103 439 27 34 188 564 79 96 153 276 -150 297 254 370 270 131
4351 131 376 138 174 479 152 -93 86 6 368 377 105 0 392 -189 320 238 -48 -289 161 37 121 152
4373 152 34 -121 -33 -266 307 -324 129 209 -64 42 -67 6 -58 64 -33 -53 163 77 -73 120 93 -140 19
4396 19 -19 -268 -8 -445 -27 -35 -201 -185 312 -90 -55 51 -176 -231 118 216 60 -205 162 189 -22 -145 -1
4419 -1 105 -173 15 203 77 100 20 -211 159 20 -198 127 212 -141 -189 49 171 66 -158 -247 251 -157
4441 -157 34 140 416 15 45 138 6 -64 364 40 -70 201 257 -53 -277 202 -225 -78 69 -146 -253
4462 -253 327 151 -192 70 -241 -51 -84 -81 -121 -112 98 -211 6 207 -59 60 173 -230 -46 428 -139 2
4484 2 -178 72 -38 -43 -137 136 -71 81 98 115 51 -228 65 117 -108 -125 47 -128 -239 -123 -248 -47 -137 -44
4508 -44 126 -125 -78 -88 -279 -51 -263 120 52 -15 -325 -15 31 59 -13 -120 -162 178 -142 103 -20 57 183
4531 183 -34 -343 151 41 34 379 23 102 89 -17 85 -153 -59 -21 37 197 101 -101 120 55 -75 49 18
4554 18 -36 109 -55 56 -151 171 180 41 1 -105 223 17 -62 -81 -86 -15 78 80 58 127 16 126 173 456 253
4579 253 63 262 27 1 -157 214 -16 84 293 -54 161 167 -26 333 61 -44 -250 290 547 326 -141
4600 -141 298 217 435 66 -134 175 -191 145 78 -160 -158 -85 70 -196 -155 -3 -24 42 -117 106 240 -424 -157
4623 -157 -126 -146 -17 74 100 73 -103 -44 25 294 -218 -138 -63 -201 101 -201 -288 -129 -199 -254 21 -310 -207 -44
4647 -44 -193 -49 374 -69 -156 -372 -54 192 47 -3 -147 99 -132 -239 -104 -111 -30 41 -216 -415 62 -22 40
4670 40 35 168 -295 -27 185 -55 43 18 -109 -222 39 -79 -158 -171 258 -67 -18 10 -28 -14 114 -121 136 153
4694 153 121 -90 125 -165 160 -75 -68 28 -93 51 -102 -110 257 -264 -101 -258 -77 96 94 -437 26 25 -192
4717 -192 160 87 14 -108 -116 -57 -222 -86 -77 240 135 127 -89 84 144 106 -27 -28 272 129 97 -31 199 -167 -138
4742 -138 343 161 -58 299 128 -69 42 -80 -196 345 -264 -393 120 223 101 12 22 -10 113 -14 -105
4763 -105 310 -10 -1 172 -122 -145 126 -237 213 -85 -283 197 319 132 -35 189 173 -224 -239 127 17 148
4785 148 -8 -125 172 204 -378 117 71 -38 279 112 194 -291 279 -85 39 167 61 142 179 -343 -234 161
4807 161 42 -50 -97 95 137 -285 24 -44 25 183 16 367 135 76 229 158 -135 25 -32 -245 359 -211 -59
4830 -59 296 -111 -148 95 302 232 61 -59 138 -89 145 65 118 15 -28 15 -168 21 172 -299 -254 15 280
4853 280 -191 134 9 151 108 86 350 -63 -254 -199 -25 25 201 -210 -106 -11 146 129 -47 -243 -123 -229
4875 -229 -2 -48 36 82 64 -32 -451 -149 95 -368 -230 120 95 -197 108 -87 156 -11 27 -56 489 20 108
4898 108 -267 -47 94 83 -80 -50 98 -68 73 168 -272 -44 51 -85 -14 -112 -156 -49 -66 -202 -110 -97 -38 -36
4922 -36 -346 -177 180 109 -280 3 178 -199 -124 -181 121 -125 25 205 155 -72 -84 -199 -16 -50 50 -39 77
4945 77 -284 -241 -111 -221 -62 192 -5 209 -117 -41 176 176 -108 312 -214 -110 -154 -34 303 -29 -85 230
4967 230 39 -23 352 18 -53 -292 209 120 224 83 87 230 -72 159 59 37 66 191 224 -152 22 -178 -15
4990 -15 -323 221 150 167 -99 -60 156 209 266 -79 -12 131 -35 293 83 23 540 59 -15 67 169 206 114 -176
5014 -176 228 96 -69 132 192 -106 238 -6 -141 12 136 49 32 206 -30 -175 -129 -339 95 -285 19
5035 19 104 292 -115 -27 -67 69 -27 203 88 -319 201 268 -97 -179 -175 -70 -50 39 252 -27 64 -87 -5 240
5059 240 -50 178 274 -109 -215 216 -41 232 -121 -89 227 389 70 29 -191 42 220 -65 163 -35 123
5080 123 -101 26 -93 -66 122 73 22 -74 -173 -43 -83 -165 -23 55 -15 115 -71 256 135 132 96 120 -298 -255 599
5105 599 34 -248 75 -153 110 -188 120 -24 -110 -304 223 -91 132 -72 100 -67 -122 86 -150 -16 -235
5126 -235 -31 47 -186 9 21 -19 58 -1 -76 -119 -92 -170 201 -94 -183 -214 -211 -104 243 15 -217 -117 -216 129 -90
5151 -90 -330 -346 -80 -211 -5 -360 -199 -77 -156 -54 -170 -10 235 -104 -89 -109 -346 86 44 -119 -394 -245
5173 -245 -49 65 -113 78 -9 -29 -50 -74 151 42 171 -464 64 20 -34 151 -39 16 522 263 -140 35
5195 35 -154 -156 248 22 257 92 182 153 401 -95 68 -129 -98 120 -185 -145 374 198 -76 81 -43 129
5217 129 -82 113 338 102 16 268 118 -44 -36 352 -93 47 205 170 99 40 366 -38 114 51 134 -228 -155
5240 -155 -2 102 137 -42 56 -42 -66 232 18 201 278 -68 54 -98 112 107 195 -256 -237 -79 -474 242 -59
5263 -59 -43 139 -40 52 -99 -177 177 226 8 91 174 195 -225 143 -28 -234 -162 -85 35 -525 52 -167 -150 -194
5287 -194 93 116 46 -133 -281 138 21 215 77 90 -246 247 -206 -116 235 94 15 -218 -101 -73 6 -98
5309 -98 -196 -308 -151 -313 168 21 -63 283 -68 -19 200 -96 57 21 143 200 27 162 64 143 -8 101 170
5332 170 -20 -72 -304 119 -2 -195 67 61 138 -433 -81 -52 -61 -13 148 -189 11 74 197 65 151 -27 146
5355 146 -51 37 13 66 -339 99 -74 -39 66 -51 -191 145 153 -151 -56 -33 6 -283 59 167 -253 -58 -140
5378 -140 287 50 -100 -46 161 -176 -158 -35 323 49 244 -112 -6 -100 -87 168 15 70 38 -21 -389 214
5400 214 247 -97 -71 337 43 -35 21 -14 158 -2 -197 305 179 -225 -348 106 -202 -45 94 -44 -22 53
5422 53 43 -80 -161 -246 -8 -17 -114 13 -47 149 -135 160 133 270 68 -286 -211 -17 -153 -201 -55 43 342 -148
5446 -148 195 18 208 414 -1 59 129 189 -46 -152 302 214 133 -37 150 75 -32 -134 -33 -280 -149 9
5468 9 72 193 146 176 44 -236 -349 -51 -149 -52 190 271 -84 103 362 94 233 213 212 143 -289 273 164 -25
5492 -25 18 -36 -39 -104 -207 77 427 -160 -442 85 16 -225 125 -258 254 -233 72 -92 8 83 12 148 -3
5515 -3 -242 75 47 -96 162 132 189 112 171 -14 -156 -92 63 -171 -301 108 193 12 -54 140 -342 -150 36
5538 36 -85 -319 -263 -170 -26 -24 52 -15 17 123 16 0 130 -52 294 -229 -128 -217 -140 -223 0 -47 203 59
5562 59 -280 -183 87 249 232 28 -177 46 7 36 105 38 -73 -249 -147 20 -89 96 43 297 -63 80 50
5585 50 7 -207 -252 -74 215 13 201 -53 -48 -165 -181 35 -362 413 -105 80 -24 14 -150 -56 77 -161 84
5608 84 63 18 -164 172 87 332 -362 37 22 283 -196 21 211 -310 318 -30 -181 -161 -76 348 217 28
5630 28 -27 -362 354 19 -114 -82 37 -279 229 -109 40 301 -89 -223 180 -12 32 -1 -206 -171 -102 145
5652 145 266 133 152 -101 300 168 355 -10 -47 94 89 69 -152 -89 7 161 56 -148 -14 160 151 -132 -124 -113
5676 -113 41 147 150 184 -121 87 121 47 -222 30 218 144 -114 -266 15 -1 263 30 -28 53 -9 -43 -61 9
5700 9 -156 375 142 147 -186 -161 87 -59 7 -279 67 -55 44 14 52 167 1 -189 167 23 -177 215 178
5723 178 115 -61 -77 18 0 -197 117 178 19 -252 16 172 -117 121 33 -22 -90 -27 56 -96 253 -136 -166 -492
5747 -492 -49 20 241 14 -178 34 150 227 -241 135 12 215 -94 200 -54 -175 -49 -4 91 82 -174 76
5769 76 107 -327 92 -193 -222 278 130 14 -47 -82 48 40 150 110 -169 107 -194 -288 131 299 23 -132 -95
5792 -95 347 -116 -88 505 -202 205 -117 -26 38 95 184 -127 262 -90 -216 101 25 -426 1 -52 -85 115 -214
5815 -214 -11 -17 -60 13 442 161 82 9 154 -96 -139 236 134 339 35 125 -66 53 -126 -221 -27 21 -318
5838 -318 54 96 77 -136 -124 -33 262 55 -191 244 -71 45 43 -154 -108 -215 144 -138 -350 210 391 74
5860 74 235 58 -227 67 -487 -190 -148 -60 127 218 -137 -160 206 -148 50 168 -128 215 -88 -77 37 50
5882 50 235 78 -188 26 72 -284 -1 -61 -1 399 -121 -5 194 56 88 -162 128 235 -4 208 72 -119
5904 -119 -314 98 -102 -74 84 82 84 12 145 123 -46 -160 -78 162 23 -379 -342 -90 124 -74 -213 52 -15
5927 -15 -184 -287 262 -212 53 5 -57 -138 0 -90 -136 -285 -94 236 -160 -70 -176 82 -137 -149 72 106 -52
5950 -52 245 -28 24 -37 -42 -137 -149 -181 113 -95 -90 -6 -65 1 -83 -81 -59 -17 176 121 -60 119 -147 -31 56 -88 -20
5977 -20 -168 245 -168 104 114 31 -158 -2 336 -2 -201 122 174 -110 176 230 260 90 101 20 35 5 -56 149
6001 149 -367 -203 -64 -112 229 -6 -154 323 14 140 444 94 -58 159 120 72 77 216 -76 -159 2 -152
6023 -152 169 -50 324 177 405 -40 91 -9 -42 41 -122 -73 -68 114 157 130 -17 260 -3 73 112 42 5 93
6047 93 7 25 290 -140 47 210 -180 32 -295 -268 -267 -270 230 -32 -83 263 117 -97 -154 418 56 -44 332
6070 332 66 111 50 66 7 135 -45 -11 -211 28 -91 -61 -120 355 76 -25 -70 -240 170 -114 150 139 -149
6093 -149 115 -266 190 69 -10 -61 240 -143 -94 -170 189 176 -223 -19 -165 197 -152 149 46 284 56 -205
6115 -205 5 -252 51 175 99 -36 45 -214 -84 -147 -107 334 153 17 -128 155 -194 285 33 130 -99 70
6137 70 -9 359 54 87 -174 141 0 136 -3 79 127 -278 279 -166 131 225 316 -3 133 221 -128 104 -127
6160 -127 249 64 -67 -189 -135 -40 85 22 -245 -174 -52 3 -315 -43 -117 76 -15 -55 -228 -237 -140 -120 161 -84
6184 -84 -140 -65 102 136 113 368 -112 -156 76 -334 231 217 4 -65 -16 -51 211 -148 -77 60 -230 336 -160 93
6208 93 -155 -29 150 1 -135 -55 214 -57 162 150 80 11 -382 -59 27 -89 -143 -196 177 -94 140 139 -112
6231 -112 -25 -1 -46 23 -54 -28 -134 -143 -219 75 273 -129 66 73 1 118 -50 217 61 91 -152 -163 -52 -125 377
6256 377 85 328 119 0 76 40 -69 188 102 -67 119 355 -27 -66 19 7 -156 -153 17 132 -100 69 -52
6279 -52 32 4 -48 28 297 305 376 -87 -152 100 182 -132 108 363 -386 284 53 170 367 113 30 -151 -17 -76
6303 -76 -27 135 10 -102 59 22 -58 -39 -133 -69 -143 45 5 -205 158 82 -257 -171 23 -210 -72 -157 63 -206
6327 -206 -81 139 82 190 8 163 -40 23 -33 188 60 177 209 -154 -75 -14 -290 -4 -43 -292 -351 23 -198
6350 -198 -467 -304 -11 -212 143 -115 62 148 106 -83 -58 79 215 0 80 -97 -76 -111 195 -160 -94 -177 207
6373 207 103 41 56 165 -286 104 118 60 16 6 -31 -43 -110 333 -15 123 3 89 65 362 110 21 49 48 179
6398 179 -155 31 -139 147 -161 -285 -141 -4 -109 5 92 -220 -315 22 -76 -47 253 -287 -107 1 -195
6419 -195 97 28 -213 -239 290 47 76 -270 351 149 -67 73 -86 -128 -42 -75 -60 14 0 74 53 149 -4 -233
6443 -233 49 74 -183 162 -277 33 -32 -215 116 -19 205 388 -27 7 133 60 -302 -181 -12 -37 -163 155
6465 155 -117 -224 16 13 332 2 30 252 -90 70 -131 78 -76 -183 -264 -118 -27 127 -282 -12 -164 -42
6487 -42 -84 -151 66 122 31 -276 -22 65 303 -239 206 288 65 44 -84 -7 -84 270 78 47 -46 -54 25 -54 -100 -237
6513 -237 -96 53 -62 154 64 -131 38 -67 -6 -78 168 40 18 0 -170 159 95 154 -152 50 -82 -211
6535 -211 191 161 267 -16 -26 87 -86 36 187 -155 18 -178 114 56 -51 -80 -133 211 26 245 -51 -115
6557 -115 84 6 -204 248 -214 -25 -15 174 156 10 17 163 50 -35 265 -41 290 27 178 -165 144 8
6579 8 -121 214 -278 48 43 21 -22 139 -16 30 -296 -84 -225 269 -28 167 44 -142 116 65 115 142 -139
6602 -139 -148 -87 123 212 -326 -54 4 -379 132 129 75 235 -25 123 195 -379 61 38 125 -7 -99 -141 -60 41 163
6627 163 110 -31 258 -112 -9 253 102 -34 225 -49 -49 148 47 -135 96 -79 139 129 162 -72 39 -222
6649 -222 52 -100 -156 -143 26 205 157 -10 -67 90 339 -146 -123 -120 -84 324 49 40 5 -66 67 168 110 -49
6673 -49 115 45 7 183 -168 73 -20 108 -104 2 -6 4 319 -259 147 33 158 49 -132 148 63 115 13
6696 13 287 122 -89 -38 -299 24 -59 -33 -45 -107 -73 236 103 105 -16 86 -77 -142 9 -45 300 -44 -209 168
6720 168 -250 -284 64 -115 -241 -69 -220 12 99 -57 -98 -183 -1 -183 -41 -245 26 9 -80 99 473 -133
6742 -133 141 116 -183 24 167 -131 -5 258 253 -327 53 -175 157 106 -33 327 -121 -132 198 287 -83 96
6764 96 51 54 -221 -60 -46 -142 227 -78 -66 -33 -147 -25 192 -197 119 -66 -233 82 -320 48 -37 121 -268
6787 -268 23 198 511 -49 97 -31 46 231 -104 -226 106 -283 -87 67 57 -182 4 85 -104 139 -80
6808 -80 175 144 62 -309 -212 33 -133 4 -196 -49 272 28 -107 -203 242 101 -147 4 -137 -14 -83 -222
6830 -222 65 -154 -69 197 -118 -181 -157 -68 40 -46 -376 -462 -153 -134 185 -168 -97 -145 -147 -18 -148 119 -12 197
6854 197 312 175 -223 149 -66 -65 -27 170 -1 62 -132 240 10 70 114 -32 -351 0 -103 -27 41 -120 -166
6877 -166 61 -17 -17 43 -232 399 -35 -167 66 174 140 136 -12 41 181 134 -73 -36 120 18 -220 -10 76 -133
6901 -133 -179 -145 112 84 247 234 108 3 -74 -215 -88 65 51 -196 -186 119 -178 294 -283 -31 -46 34 -71
6924 -71 52 337 -2 -57 183 247 173 -194 30 53 99 165 -202 85 -146 -158 -238 -151 -344 305 -69 193 31
6947 31 156 -274 243 240 -18 -97 -198 -15 49 -133 -186 97 240 296 44 -368 13 -240 -193 -86 1 159 -93
6970 -93 -187 -203 -195 117 213 67 78 -134 11 -47 -80 -76 -70 193 -195 -45 -82 22 -228 361 -123 -21 -200 -518 -213
6995 -213 -20 77 11 -106 12 77 98 -107 84 42 -195 30 51 26 -224 477 -27 43 26 -54 296 34 -100
7018 -100 -138 94 -70 -4 115 -219 146 -4 -146 -270 115 34 -219 -23 -97 156 -92 36 23 26 -124 26
7040 26 -147 144 -76 -90 113 61 -270 -117 -51 190 222 -45 64 -169 18 -45 -109 -127 -153 -152 -108 -332 170 -36
7064 -36 49 -135 -139 -123 -227 78 -255 -276 -125 63 275 82 62 110 -38 -64 -348 411 41 -17 92 83 -205 58
7088 58 327 -161 -3 -291 -122 124 -256 -131 160 -58 57 14 -68 -33 -32 117 119 29 16 -125 144 203 -131 -165
7112 -165 199 64 92 -34 -129 -95 234 59 57 28 -77 63 205 -15 250 24 65 302 157 -108 76 -22 103
7135 103 -16 95 116 -260 434 -18 114 -31 26 308 156 -101 31 -62 -12 -80 45 -364 165 159 133 -219 56
7158 56 293 38 -5 -9 21 96 216 -250 213 -78 -3 56 -142 -107 -135 42 57 -29 219 -65 88 -184 184 277
7182 277 132 152 131 -59 -106 8 -183 62 174 -146 -92 143 -153 155 175 41 83 20 61 143 80 264 -104
7205 -104 123 -62 185 -103 -191 109 235 50 243 176 -12 269 225 200 79 -184 -101 113 -176 58 233 -3
7227 -3 210 -161 -19 -153 92 -20 9 -162 -68 173 4 49 -46 275 265 -160 136 -106 -196 172 9 -185 -110
7250 -110 27 -228 97 -187 -74 -151 -294 -97 -117 -62 17 230 -203 51 -70 -243 -88 -110 24 -155 -139 204
7272 204 -177 100 10 19 203 123 -9 30 -225 198 -39 80 50 63 319 180 245 122 167 -149 -184 81 39 -66
7296 -66 182 -89 36 132 -94 -232 -26 306 192 9 -11 -116 66 -234 309 -240 8 75 16 -72 319 -37
7318 -37 154 128 -322 54 -105 -158 -176 211 64 -206 257 165 120 130 -207 -64 -12 134 -125 5 260 -19 -174
7341 -174 -83 126 -59 -146 121 248 104 -342 -104 -107 69 153 -99 78 104 -133 59 91 120 -182 -165 49 166
7364 166 176 166 -35 -157 35 18 -368 -47 197 -188 382 118 -384 -28 -341 -170 97 -53 -163 -298 219
7385 219 24 -54 192 181 -157 -47 -308 -235 115 -279 -7 -33 -117 176 -60 -382 -103 159 45 4 187 54
7407 54 -266 -130 278 167 -95 -196 -17 -15 -205 60 -136 95 -126 80 183 -69 347 -91 -30 -27 -183 156
7429 156 222 165 -173 -13 -179 -72 -8 -66 -136 125 -150 175 42 -20 -55 -142 21 62 -34 -87 -65 155 -75 -21
7453 -21 -153 -72 146 -11 112 136 179 -181 220 -250 -86 312 262 38 140 110 212 -101 -52 19 -261 117 52
7476 52 150 196 118 -83 197 180 122 2 -74 -117 -13 -49 453 123 56 65 42 176 56 26 122 302 -215 12 115
7501 115 -13 -8 -73 -136 298 -11 3 -77 -73 39 -304 -160 -4 184 181 -143 -53 9 7 -138 -23 -84 -361 -15 -45
7526 -45 -130 -370 167 292 155 112 -190 -140 90 129 270 12 183 -278 11 -131 -193 53 -81 -184 -305 28
7548 28 -73 22 128 37 -117 105 -43 -233 -13 -183 20 71 117 -266 14 29 -484 55 46 204 339 -69 -147
7571 -147 147 138 170 -109 95 -99 -114 182 12 -166 402 -42 -201 19 -68 -82 45 -188 -141 55 68 141 -457
7594 -457 -15 -185 -62 176 164 148 -119 215 38 -156 337 -208 49 -146 142 424 101 37 -240 -214 -37
7615 -37 -73 -18 -45 167 76 -48 -65 -43 105 42 23 -259 -183 239 -5 -190 201 -104 40 -351 159 0 23 -384
7639 -384 183 -41 -71 184 51 169 -109 -236 42 -227 20 -3 -108 94 29 -79 -46 261 310 12 159 -47
7661 -47 53 24 298 -203 184 -226 -151 -154 24 -29 -96 317 -68 -143 -244 -53 107 70 181 -29 -91 -126 -241 -2
7685 -2 -103 5 -109 161 76 -55 -92 69 -33 127 -26 -41 165 -179 132 106 -293 -21 -140 -39 -143 63
7707 63 192 14 -151 -59 -89 118 -50 31 -258 -105 -213 -162 -39 142 439 -55 100 -70 139 39 42 44 190
7730 190 7 -165 -137 313 175 498 -14 -41 -31 -6 17 134 351 -151 -347 168 163 39 147 -50 -254 284
7752 284 329 -216 86 29 65 94 -13 21 229 -115 -94 110 -248 -146 -30 337 72 62 99 128 26 65 -138
7775 -138 157 151 122 239 -215 199 14 -383 175 190 132 -198 25 120 -59 -245 -276 67 -22 69 -118 123 -45
7798 -45 6 171 -197 -3 -66 75 45 -16 -123 129 -169 19 3 233 -45 90 -152 28 -264 -102 -254 -135
7820 -135 -112 2 125 -197 169 -62 -171 345 -129 195 86 -325 -142 -101 91 -77 -173 57 -38 -8 209 -8
7842 -8 179 -156 7 186 106 521 263 -153 -24 -102 -179 -96 61 216 204 320 -134 199 151 134 142 40 -56 -301
7866 -301 -5 -15 31 -204 -37 252 -228 155 31 83 -99 174 -129 -119 67 -43 13 28 -380 -74 117 111 -106
7889 -106 -110 15 -111 230 -228 -319 254 111 108 -15 28 28 -76 -241 127 -116 -54 166 73 157 61 -191 -223 -117
7913 -117 -177 -106 -23 -149 226 -61 174 49 -338 220 77 73 -81 -78 -93 -153 196 -118 79 166 113 -23 74 -146
7937 -146 -237 -66 -238 -88 -15 25 95 139 34 17 -269 87 68 98 14 88 -58 111 61 90 -47 81 32 -161
7961 -161 1 75 84 -104 342 165 -11 119 240 151 -56 16 -47 81 214 254 106 -86 -109 -157 95 135 -62
7984 -62 -156 -108 58 118 111 -77 -41 324 -168 17 301 -263 -3 225 -53 -77 347 -85 208 -41 -34 -46 -22 240
8008 240 -70 88 -422 -92 211 -29 -67 169 127 431 44 135 -215 -28 236 -105 -44 -198 185 -97 106
8029 106 -65 -296 -31 65 59 101 -372 202 192 153 -120 -171 -95 -115 372 -73 -158 -19 12 -146 46 -65 -160 214
8053 214 -24 79 -30 -181 159 -196 178 335 52 -322 27 -355 125 223 -13 113 -117 357 0 80 -29
8074 -29 147 232 368 -66 137 92 127 174 172 102 29 -229 191 -175 -255 248 -113 -129 -187 80 14 52 135 -16 107
8099 107 -235 79 137 90 -31 -175 -194 104 -13 85 2 -130 36 54 30 211 -279 -310 318 85 -205 129 -183
8122 -183 -24 31 82 214 101 3 30 -83 145 -82 110 70 -240 -170 -186 414 -340 -61 -53 210 -186 -76 128
8145 128 445 -50 -2 0 221 86 -242 73 -293 -68 72 62 265 -33 38 -67 40 118 28 -136 -12 -149
8167 -149 -119 -50 -85 298 -1 41 -162 -233 -299 28 -114 140 85 -62 83 -365 -72 150 -146 -97 167 43 -33
8190 -33 39
8191C9
$$ Imaginary data points
##PAGE= N=2
##DATA TABLE= (X++(I..I)), XYDATA
0 0 0 0 0 0 0 0 0 0 0 0 -8 8 -8 8 -8 8 -16 16 -16 21 -24 28 -32 40 -43 49 -56 64 -73 82 -92 104 -116 130
34 130 -146 162 -180 200 -222 245 -272 303 -333 369 -409 455 -506 564 -631 709 -802 914 -1054
53 -1054 1231 -1464 1791 -2279 3089 -4684 9025 -44890 -155401 -95393 -23398 -25990 -81343 -64840
67 -64840 11934 52837 -429 -73493 -91669 -56747 -44891 -78311 -107601 -75094 -14814 358
79 358 -47145 -86446 -75336 -53475 -74147 -108495 -96710 -43289 -15140 -34430 -60563 -57871 -55067
92 -55067 -85666 -125244 -124021 -84618 -56442 -59111 -58105 -31322 -11794 -38214 -88358 -110098 -95188
105 -95188 -81652 -91849 -98916 -70440 -23685 -7949 -41098 -81220 -81627 -57562 -61006 -95178 -100526
118 -100526 -50403 -2504 -14503 -59211 -69422 -44614 -41237 -75684 -97338 -71813 -25588 -3845
130 -3845 -12637 -24967 -21090 -15854 -31728 -64327 -80981 -62556 -28027 -10694 -10291 -3042 13148
143 13148 12866 -11371 -35849 -39217 -30229 -25493 -18912 -824 19179 22953 12545 4520 2888 -5164
157 -5164 -19168 -20241 476 25792 34562 29529 29174 33582 26767 4976 -13490 -9615 12426 32924
171 32924 39611 40364 48664 60174 53504 25255 2038 6864 25624 32184 28527 39489 64840 75470
185 75470 59078 37066 30188 31859 28938 26205 35312 52597 66594 68670 62121 51981 42417 33749
199 33749 27718 28398 38987 54173 63473 65851 66593 65964 54805 34158 21040 26816 39491 43360
213 43360 44153 56744 74585 74960 52672 30718 28420 35409 32367 23862 30744 53623 69168 61472
227 61472 43083 33796 35202 31860 19663 12506 23439 45451 56884 48686 36223 34294 35203 22557
241 22557 2039 -1501 16975 33888 34614 29986 34922 39513 27569 5572 -6930 -2627 4536 6508
255 6508 9869 19645 29641 28371 14535 -1324 -8381 -8471 -11107 -14378 -8545 8043 19383 13498 -903
270 -903 -7642 -8214 -16060 -30504 -34319 -18912 -225 1507 -6191 -8737 -4954 -11151 -30131 -45401
284 -45401 -41858 -27286 -19446 -20595 -18969 -10528 -7615 -19556 -38509 -48751 -44549 -37790 -37314 -36786
298 -36786 -27477 -14101 -13148 -28125 -43135 -45793 -43698 -48396 -53442 -45571 -28377 -19105 -24464 -32769
312 -32769 -35585 -38466 -48065 -58202 -57243 -45390 -33250 -28345 -28598 -27493 -26941 -33607 -47506 -57503 -54660
327 -54660 -44084 -37306 -35238 -29210 -19748 -17451 -28885 -43728 -47714 -42907 -41251 -42573 -36550 -21457
341 -21457 -10550 -13356 -24145 -30192 -30505 -33712 -39538 -39561 -28056 -13554 -6506 -8340 -11501 -12148 -15406
356 -15406 -23594 -31995 -30585 -18769 -6925 -2924 -1901 2575 6504 -742 -13771 -20380 -15101 -7342
370 -7342 -4363 -639 9796 19504 18548 8838 299 -1591 -1064 -1783 -481 7660 20195 28531 27304
385 27304 20931 16674 14482 10284 4172 4752 15431 28270 33650 32592 31685 33000 28322 17005 9591
400 9591 13552 23474 29707 32108 36916 43172 43252 33707 23220 19198 21097 23923 26057 31389 40527
415 40527 47488 46110 37354 29509 26609 25130 22034 21184 28778 40089 46051 42532 37272 35620 31942
430 31942 23358 15924 18022 27197 34242 36567 36779 38670 37679 29515 18665 12883 15175 19517 23006
445 23006 25947 31048 34969 33910 25114 14930 10237 10218 10210 10174 14178 23317 29030 25710 17490 11549
461 11549 8891 3514 -2213 -2078 5760 13827 16573 14488 12341 9936 3808 -4927 -11077 -9723 -4085
476 -4085 1287 4105 5235 7097 5472 -2139 -11783 -17470 -16075 -12825 -11277 -8688 -2614 2395 186
491 186 -8629 -16121 -18859 -20531 -23139 -23335 -16740 -8503 -5198 -8158 -12303 -15511 -19602 -25640 -30011 -29270
507 -29270 -22717 -15488 -12344 -13314 -14001 -15097 -20293 -28348 -34067 -32241 -26232 -22102 -19893 -16578 -12784
522 -12784 -13815 -21222 -28942 -31917 -31430 -30278 -28217 -23047 -16266 -12837 -14416 -19391 -24376 -27707 -30096
537 -30096 -31659 -29882 -24371 -16862 -12700 -13523 -16239 -18264 -21622 -26969 -30957 -28806 -21740 -15967 -13780
552 -13780 -12438 -9884 -10444 -16261 -23256 -25631 -22986 -19895 -16763 -12789 -7310 -3562 -5316 -10422 -15526
567 -15526 -18057 -17932 -16791 -14711 -10216 -3339 1545 800 -3580 -6877 -8706 -10924 -13656 -12189 -5311
582 -5311 1784 4592 5116 4726 3405 -855 -5661 -7869 -5249 -602 3346 7928 11534 13111 11287 6960
598 6960 2285 -86 362 3093 6352 10503 16277 19934 18165 13521 9669 7994 6961 5453 7404
613 7404 14238 20809 22990 21812 19477 18373 15088 10604 8461 11319 16500 21357 24035 24943 25566 23874
629 23874 19636 14617 11660 13064 17202 20642 23151 26219 28533 27437 22009 16634 14596 15128 15387
644 15387 17022 21158 26830 28714 26154 22511 19821 16526 12965 11986 14071 18809 22857 24511 23983
659 23983 22670 19891 15752 10635 7929 9634 14408 17290 18401 19542 20535 18551 12628 6456 4591
674 4591 5840 7364 8550 10760 14747 16585 14029 8287 4044 1489 205 -940 -45 3668 7804
689 7804 9689 8282 4278 468 -2475 -5677 -7867 -7965 -3844 396 2043 955 -575 -2161 -6435 -11510
705 -11510 -14319 -12909 -10280 -8549 -6531 -4337 -3502 -6028 -11249 -15437 -17615 -18440 -17748 -15401 -12671 -9581
721 -9581 -7496 -8999 -13602 -17928 -19409 -20960 -22426 -21485 -17335 -12499 -10941 -12403 -14764 -16338 -18989
736 -18989 -22873 -25403 -23639 -19254 -16309 -14266 -13172 -13474 -14772 -18237 -22378 -24343 -23688 -20824 -17783
751 -17783 -14694 -12836 -11276 -12080 -15097 -18979 -21446 -21368 -19866 -18184 -14933 -10748 -8327 -9430 -11573 -13717
767 -13717 -15794 -17817 -18364 -15788 -11864 -8561 -6481 -5490 -5792 -7591 -10602 -12895 -13853 -12373 -9363 -5648
783 -5648 -2981 -1367 9 -695 -4015 -7588 -8840 -7878 -5751 -3208 -475 3132 5428 4505 1126 -1094
799 -1094 -2726 -3051 -2854 -669 3267 6559 8733 8850 7656 5207 3187 1393 716 2364 5255 8793
815 8793 11409 12716 12049 10546 7954 5646 4256 5128 7247 9896 12623 14967 16076 14450 11006 9015
831 9015 7813 7453 7488 9976 13495 16420 17471 16451 14427 12355 10245 8601 8232 9967 12552 15978
847 15978 17804 17024 16072 14211 11485 9170 7379 8736 11801 14052 15424 16195 16691 14762 11610 8490
863 8490 7584 7318 8707 10517 12869 14915 15411 13930 11205 8855 6687 5841 6183 7677 9797 12186
879 12186 13246 12685 10159 7577 5920 3620 2708 4003 6456 8761 9384 9448 9008 7301 4075 1299
895 1299 265 933 2117 3897 5376 6770 6392 5247 2014 -611 -1967 -2906 -1858 -240 1204 3113
911 3113 3876 2634 -45 -2510 -4493 -5214 -6202 -4934 -2714 -748 432 -559 -1933 -3644 -6147 -8631
927 -8631 -9534 -8914 -6487 -4533 -3502 -3099 -3751 -5424 -7844 -10196 -11857 -11703 -9835 -8322 -6722 -5802 -5163
944 -5163 -6663 -9051 -11803 -12799 -13064 -12953 -12001 -9572 -7293 -6667 -7978 -9721 -11295 -12965 -14425 -14699 -13248
961 -13248 -11490 -9433 -8173 -8288 -8742 -10545 -12575 -14058 -14831 -14182 -12525 -10440 -8942 -7737 -7642 -8595 -10746
978 -10746 -13145 -13730 -12925 -11854 -10968 -8653 -6584 -5768 -6843 -8656 -10053 -10932 -11413 -10858 -9361 -7515 -5004
995 -5004 -4059 -3624 -4932 -6358 -7731 -8531 -8870 -7771 -5194 -2622 -1587 -753 -1013 -2019 -3265 -5230 -5149
1012 -5149 -4463 -2772 -691 920 2329 3114 2163 413 -820 -1540 -1181 -228 1755 3569 5373 6358 6431
1029 6431 4781 3606 2721 2215 2473 3551 5582 8005 9134 8804 8657 7413 6234 4912 4449 5572
1045 5572 7853 9388 10676 11445 11536 10413 8940 7153 6693 7104 8118 9497 11438 12645 12794 12336 10563
1062 10563 9146 7771 7859 8276 9116 10552 12539 13262 12557 11227 9875 8662 7267 6815 7942 9423
1078 9423 10991 12037 11997 11272 10085 7945 6772 6059 6445 7424 8411 9769 9992 10010 8799 6957 5268
1095 5268 3973 4259 4676 5435 6384 7697 8073 6598 5071 3498 2564 1706 1329 2468 3656 4484 5165
1112 5165 4418 3454 2013 238 -1104 -1419 -1013 -203 1387 2045 1890 1819 210 -1549 -3052 -3933 -3774 -3030
1130 -3030 -2000 -1329 -526 -502 -1228 -3164 -4768 -5828 -6103 -5715 -4987 -3617 -2233 -2445 -3267 -3863 -5717 -6852
1148 -6852 -7541 -7707 -7161 -5947 -4714 -3783 -4035 -4935 -6062 -7583 -8791 -9137 -8677 -7422 -6144 -5468 -5099
1165 -5099 -4724 -6094 -7510 -8641 -9205 -9000 -8409 -7327 -6172 -4856 -5167 -6118 -6795 -7711 -8962 -9376 -8909
1182 -8909 -7811 -6409 -5373 -4690 -4934 -5902 -7198 -7848 -8709 -8477 -7709 -6492 -4952 -4252 -3890 -4452 -4802 -6632
1200 -6632 -7195 -7454 -6946 -6192 -4658 -3562 -2627 -2777 -3477 -4374 -5449 -5931 -6024 -5551 -3744 -2576 -1368 -971
1218 -971 -1278 -2346 -3584 -3701 -4399 -4143 -3063 -1736 -662 627 357 -200 -698 -1601 -2340 -2810 -1593 -411
1236 -411 613 1937 2384 2124 1353 527 -19 -692 -395 990 2128 3233 3983 4256 3674 2573 1891 1141
1254 1141 1480 2038 2943 4593 5548 6106 5510 5029 4073 3586 2886 3129 3901 5274 6236 7255 7542 7121 6073
1273 6073 5212 4631 4376 4717 5904 7094 7983 8415 7962 7442 6517 5819 5182 5372 5706 6684 7683 8606 9006
1292 9006 8384 7193 6523 5521 5181 5439 6227 7123 7920 8613 8201 7267 6677 5649 4604 4642 5259 6140 6734
1311 6734 7179 7113 6983 6231 4676 3738 3551 3508 4249 4782 5707 5758 5850 4827 3533 2528 1605 1746 1622 2313
1331 2313 3382 3909 3577 3136 2406 1168 -103 -542 -583 -280 814 965 1609 932 481 -190 -1949 -2658
1349 -2658 -2871 -2608 -2298 -1452 -1080 -832 -1276 -2422 -3684 -4404 -5205 -4986 -4437 -4053 -3046 -3202 -3563 -3997 -4734
1368 -4734 -5951 -6457 -6656 -6429 -6022 -5127 -4538 -4400 -4734 -5395 -6004 -7003 -7544 -7491 -7309 -6356 -5713 -5631 -5256 -5582
1388 -5582 -6115 -7175 -7819 -8108 -7828 -7356 -6118 -5342 -5180 -5497 -5550 -6427 -7075 -7721 -7350 -6936 -6446 -5446 -4478
1407 -4478 -4387 -4624 -5444 -5820 -6199 -6734 -6224 -5524 -4392 -4104 -3141 -2884 -3652 -4030 -4560 -5114 -5113 -4307 -3502 -2334
1427 -2334 -1822 -1417 -1676 -2104 -2684 -2999 -3406 -2639 -2339 -1549 -539 306 407 69 -277 -891 -1269 -1161 -820
1446 -820 29 1141 1834 1791 1770 1342 1022 518 362 839 1186 1964 2712 3359 3496 3365 2648 2437 1641 1964
1466 1964 2364 2604 3529 4315 4905 4719 4215 3520 3056 2687 2995 3024 4243 4754 5474 5258 5119 4209 3629 3200
1486 3200 3367 3669 3968 4937 5385 5552 5449 4775 4400 3864 3387 3611 3661 4582 5128 5029 5490 5548 4633 4211 3517
1507 3517 3055 3174 3937 4697 4712 5034 4956 4586 3922 2970 2760 2683 3085 3712 3996 4609 4278 4345 3496 2725 2204
1528 2204 2189 2091 2402 3312 3420 3251 3296 3021 2399 1575 932 1108 1196 1601 2344 2355 2391 2329 1552 1059 431 63
1550 63 330 400 815 1502 1247 1409 538 -207 -742 -908 -805 -1409 -883 113 596 454 20 -576 -1140 -1822 -2018
1571 -2018 -2053 -1864 -1285 -830 -932 -965 -1028 -1898 -2546 -2924 -3055 -3136 -2622 -2224 -1909 -2039 -1907 -2665 -3270 -3889 -3719
1592 -3719 -3858 -3675 -3696 -2989 -2793 -2911 -2939 -3437 -4165 -4518 -4827 -4635 -4186 -3687 -3458 -3348 -3259 -3553 -4480 -4933 -5045
1613 -5045 -4948 -4587 -4094 -3588 -3650 -3306 -3564 -4017 -4519 -4758 -4725 -4601 -4296 -3883 -3174 -2834 -3467 -3639 -3812 -4270 -4263
1634 -4263 -4405 -4212 -3362 -3281 -2419 -2790 -2460 -2855 -3338 -3315 -3164 -3436 -2852 -2262 -1708 -1281 -1282 -1652 -1836 -2057 -2589
1655 -2589 -2388 -2017 -1352 -882 -87 224 -223 -210 -732 -704 -1082 -946 -19 196 1037 1200 1586 1056 1047 558 670
1676 670 666 854 1390 1704 2607 2979 3014 2507 1954 1667 1657 1945 2145 2871 3106 3702 3775 3729 3257 2831 3036 2879
1698 2879 2914 3565 4024 4486 4635 4759 3787 3766 3267 3342 3655 3789 4022 4550 4607 4809 4482 4165 3849 3597 3091
1719 3091 3167 3558 4346 4333 4329 4571 4230 3661 2955 2814 2915 3006 3281 3841 4112 4013 3662 3266 2774 2301 2276 2016
1741 2016 2562 2644 2848 3334 2875 2770 2159 1826 1321 1011 1090 1552 2090 1947 1966 1763 1148 1025 239 586 322
1762 322 266 758 759 977 588 395 -142 -342 -894 -1125 -1211 -1195 -590 130 -205 -290 -973 -1176 -1665 -1606 -1765 -1871
1784 -1871 -1490 -1171 -759 -1313 -1380 -1826 -2367 -2398 -2433 -2571 -2459 -2031 -1629 -1932 -1954 -2097 -2616 -2987 -2964 -3038 -2731 -2561
1806 -2561 -2406 -2103 -1869 -1939 -2866 -2884 -2997 -3148 -3276 -2914 -2422 -2238 -2131 -2111 -2339 -2791 -3276 -3099 -2894 -2933 -2476
1827 -2476 -2407 -2265 -1912 -2318 -2237 -2800 -2670 -2861 -2886 -2615 -2486 -1810 -1629 -1816 -2006 -2155 -2625 -2816 -2482 -2274 -2126
1848 -2126 -1720 -1492 -1402 -1508 -1741 -2014 -2135 -2113 -2041 -1894 -1644 -1061 -920 -1132 -973 -1409 -1492 -1499 -1434 -1593 -1364 -807
1870 -807 -280 -542 -461 -425 -825 -1027 -1030 -1068 -743 -552 87 240 167 135 -131 -319 -555 -425 -340 245 331 708 729
1893 729 913 610 520 309 452 168 545 1052 1416 1788 1510 1353 1372 1002 959 879 974 1470 1571 2227 2168 2072
1915 2072 1854 1931 1500 1165 1613 1780 1769 2425 2441 2569 2465 2557 2272 1881 1988 2095 2570 2671 3488 2877 3233
1936 3233 2935 2764 2610 2141 2205 2154 2588 2615 3337 3125 2973 2623 2717 2305 2417 1907 2332 2637 2823 2799 2962
1957 2962 2223 2653 2031 1861 1780 1988 2003 1919 2646 2263 1909 1737 1530 1223 1357 1326 1114 1478 1766 1546 1444
1978 1444 1269 1080 554 467 277 431 645 747 424 469 367 436 12 -293 -485 -451 -338 -485 -334 -258 -64
1999 -64 -511 -710 -1301 -1368 -1379 -1520 -1226 -1148 -861 -1251 -1276 -1607 -1956 -2077 -2466 -2175 -2286 -1982 -1826 -1788 -1733 -2087
2021 -2087 -2269 -2390 -2395 -2435 -2612 -2773 -2192 -2200 -2094 -1951 -2436 -2517 -2812 -3317 -2963 -2735 -2520 -2484 -2263 -2475 -2608 -2591
2043 -2591 -2688 -2884 -2962 -2815 -2645 -2467 -2189 -1889 -1988 -2054 -2402 -2458 -2688 -2732 -2392 -2172 -1842 -1432 -1710 -1592 -1690 -2012
2065 -2012 -1848 -1705 -1558 -1800 -1264 -1025 -1031 -1039 -872 -1156 -1223 -1451 -1343 -1029 -997 -642 -205 -69 -220 -149 -720 -478
2087 -478 -686 -565 -595 -83 71 684 357 477 77 75 -5 115 254 608 737 1082 1237 1153 868 707 620 418
2109 418 756 916 1155 1426 1175 1573 1511 1532 1328 1138 1293 1290 1492 1518 1675 1876 1850 1584 1549 1334 1382 1717 1416
2132 1416 1333 1814 1886 1821 2065 1690 1591 1494 1294 1650 1557 1767 1984 1837 2060 1983 1563 1354 1359 1353 1336 1763 1607 1777
2156 1777 1549 1764 1523 1386 1118 1261 1244 1238 1731 1679 1912 1353 1505 1168 898 790 955 779 860 1337 1206
2177 1206 1569 1324 924 1113 398 983 794 884 957 1204 897 801 777 473 277 262 444 113 475 760 878
2198 878 738 634 137 -164 124 -215 -227 -35 137 395 172 95 -173 -135 -134 -661 -463 -561 -341 -242 -392 -119
2220 -119 -345 -333 -839 -834 -1298 -651 -1027 -529 -442 -500 -525 -530 -1318 -1206 -1364 -1646 -1076 -1107 -1503 -1101 -1204 -885 -1375
2243 -1375 -1287 -1564 -1633 -1574 -1499 -1323 -1375 -1324 -1746 -1695 -1479 -2106 -2047 -1687 -1768 -1918 -1590 -1648 -1773 -1440 -1635 -2029 -1889
2266 -1889 -2163 -1806 -1609 -1906 -1656 -1477 -1504 -1773 -1847 -1690 -1565 -1912 -1607 -1777 -1476 -1459 -1194 -952 -1346 -1285 -1717
2287 -1717 -1388 -1646 -1440 -1252 -1247 -1048 -953 -1177 -1275 -902 -875 -1110 -812 -709 -494 -513 -400 -360 -354 -386 -819 -576 -155
2310 -155 -454 -194 29 73 13 339 245 102 239 -199 371 547 501 757 821 936 807 708 674 551 932 766
2332 766 947 1344 1238 1255 1248 1387 1049 1281 1007 1404 1268 1320 1791 1797 1625 1966 1509 1572 1501 1399 1606 1736 1716
2355 1716 1749 1898 1852 1693 1828 1568 1608 1662 1462 1969 1988 2185 1867 1551 1726 1370 1382 1354 1579 1381 1456 1674
2377 1674 1688 1789 1359 1326 1308 1234 1223 1428 1439 1331 1384 1483 1374 977 999 1021 491 700 831 485 972 974 767 346
2401 346 405 595 486 38 71 106 191 447 266 -5 65 -16 -124 -105 -426 -240 187 -142 -84 -221 -29 -575 -733
2424 -733 -178 -701 -544 -826 -499 -557 -705 -752 -641 -916 -1034 -1252 -649 -1108 -848 -614 -555 -1005 -652 -1080 -1183
2445 -1183 -1085 -1045 -1189 -879 -746 -1084 -820 -1139 -988 -1105 -925 -1313 -1148 -1223 -1158 -1008 -647 -752 -1089 -1397 -1056
2466 -1056 -1021 -1176 -1375 -1038 -720 -908 -1175 -850 -1153 -1119 -1115 -938 -1143 -1010 -556 -749 -782 -851 -1016 -997 -916 -915 -996
2489 -996 -810 -786 -900 -712 -676 -777 -591 -762 -791 -942 -553 -822 -593 -635 -797 -225 -437 -548 -504 -309 -619 -391
2511 -391 -553 -291 -392 -117 -236 -81 -190 -597 -544 -428 -284 -535 -122 -22 -188 112 -8 -256 -1 -247
2531 -247 -178 -79 186 -12 45 488 353 206 -138 201 76 59 493 376 516 518 748 625 206 257 410 592
2553 592 384 595 531 460 689 520 568 949 630 417 875 831 1144 1258 1216 1105 1118 837 707 1267 1041 907
2575 907 1214 1148 1113 1425 1411 879 1089 755 704 914 1012 908 1188 1398 1105 1176 1087 1482 1041 775 884 1119
2597 1119 1202 1415 1371 1106 1083 1100 935 771 1019 1054 1031 970 1067 1164 963 796 681 931 667 709 872 985 553
2620 553 578 500 677 258 200 382 212 255 589 385 276 310 72 -120 102 32 -158 -207 -187 152 -240 -73 -226
2643 -226 -420 2 -361 -816 -269 -590 -763 -485 -641 -406 -806 -701 -663 -1079 -982 -855 -982 -921 -323 -914 -885
2664 -885 -1002 -965 -1091 -1027 -1257 -938 -1080 -809 -992 -1312 -1196 -1294 -1342 -1280 -1300 -1626 -1309 -1258 -1030 -1329 -1066 -1083 -1054
2687 -1054 -1365 -1502 -1022 -1263 -1069 -1267 -1238 -985 -1342 -1147 -1087 -836 -957 -1046 -1214 -805 -1094 -908 -831 -738 -1239
2708 -1239 -943 -999 -989 -761 -758 -733 -576 -601 -565 -844 -814 -433 -363 -481 -300 -425 -217 -377 -208 -234 -319 -306 -202 -9
2732 -9 -77 -222 -238 179 -40 66 190 258 147 364 66 101 61 286 251 235 512 534 291 431 412 319 481 681
2756 681 678 420 761 580 420 610 673 556 530 791 646 1078 727 666 847 735 942 531 894 649 747 1103
2778 1103 635 1080 963 1028 589 1056 662 610 900 878 790 1054 523 868 364 686 452 427 1010 748 730 910
2800 910 601 718 661 483 542 737 888 661 837 762 648 560 570 180 547 254 521 650 660 651 419 474 404
2823 404 490 514 551 491 329 480 538 427 153 223 375 180 340 216 -87 421 -9 299 176 390 479 64
2845 64 108 -135 236 213 -46 170 -3 78 -79 345 130 -153 141 -112 21 -215 247 72 87 -54 18 -304
2867 -304 -320 -114 -212 -441 -168 38 -90 21 -528 -270 -320 -355 -368 -196 -279 -186 -389 -214 -584 -468 -797 -686
2889 -686 -617 -619 -383 -507 -408 -510 -618 -685 -554 -886 -870 -645 -477 -978 -713 -717 -756 -1080 -1021 -779 -815 -683 -712 -533
2913 -533 -956 -588 -843 -809 -469 -925 -956 -749 -1383 -676 -1109 -658 -975 -783 -768 -736 -668 -559 -624 -334 -602 -725
2935 -725 -925 -467 -411 -659 -478 -490 -625 -262 -588 -637 -181 -647 -420 -226 -150 -477 -200 -487 -652 -323 148
2956 148 -284 -254 -104 -68 38 -243 -156 5 93 -222 252 157 202 345 -123 277 379 114 390 274 155 362
2978 362 317 594 254 741 522 543 204 559 743 847 596 968 458 482 970 382 1027 762 906 333 828
2999 828 895 885 625 602 508 670 593 557 662 819 832 828 648 685 836 697 672 714 857 464 538 721 910 837 728
3024 728 730 578 506 423 750 520 509 499 395 732 623 448 170 404 520 466 235 194 457 597 238 175 -45
3047 -45 84 426 279 270 482 370 111 -107 -67 137 -602 -32 196 12 -110 -340 184 -47 -204 -128 -63 -132
3069 -132 -282 -332 -371 -126 37 -389 -467 -297 -34 -307 -407 -99 -565 -425 -155 -388 -530 -474 -556 -114 -269 -345
3091 -345 -290 -153 -239 -290 -488 -593 -581 -635 -409 -448 -532 -898 -372 -317 -243 -437 -146 -451 -479 -561 -363 -331 -247 -445
3115 -445 -267 -515 -370 -538 -470 -471 -404 -389 -595 -205 -110 -216 -132 -575 -334 -286 -409 -404 -319 -18 -108 -327 -297 -224 -387
3140 -387 -591 -164 6 -401 -340 -524 102 -118 -164 -170 -300 -347 -364 -362 -90 -406 -497 -384 -392 -227 -255 -32 -90 -173 -333
3165 -333 -377 -83 -381 -20 -113 -246 66 -56 98 -345 -569 -67 351 52 -29 217 79 -293 -185 -97 -154 -80
3187 -80 -98 251 302 184 -28 -33 77 78 28 497 329 167 342 82 382 94 -51 154 90 332 149 69 300
3210 300 360 170 241 244 238 296 186 98 118 582 278 378 452 534 368 715 370 413 279 334 838 363 630 651 424
3235 424 339 530 509 494 382 471 538 601 817 476 507 209 328 375 384 535 674 450 578 362 400 616 196 225
3259 225 377 443 431 401 325 303 482 251 172 253 239 287 402 136 130 207 -96 205 108 65 100 -204 153 570 -100
3284 -100 450 -14 13 95 -461 -171 -158 -411 -34 -107 -164 -326 67 -329 -189 -24 -630 -490 -95 -142 -394 -304
3306 -304 -196 -167 -208 -506 -97 -276 -512 -342 -290 -238 -611 -554 -433 -341 -539 -702 -668 -475 -356 -235 -670 -392
3328 -392 -415 -292 -367 -649 -657 -265 -803 -562 -299 -402 -286 -177 -327 -492 -443 -553 -324 -650 -320 -372 -437 -83
3350 -83 -274 -377 -321 -493 -383 -450 -154 -325 -159 -278 -393 -402 26 -278 -145 -160 -187 -112 -24 127 -24 -119 -51 251
3374 251 -165 -72 -27 27 -273 224 -112 -165 88 254 -227 56 284 257 -7 325 -72 436 209 170 452 376
3396 376 390 263 166 -105 103 271 127 59 357 84 412 87 304 -147 12 224 426 49 389 -129 190
3417 190 283 221 267 -108 340 728 324 178 288 -61 239 330 405 214 45 173 256 408 298 205 201 294 228 102
3441 102 368 187 106 541 227 88 -44 252 319 264 217 383 480 234 264 59 73 249 -19 331 81 18 105
3464 105 165 349 189 -28 211 288 268 276 4 221 -119 106 -69 52 198 169 -443 186 56 408 14 162
3486 162 652 341 61 -165 45 153 -47 -88 120 -280 -28 -32 -31 257 -100 -72 -5 43 159 -219 -69 124 -371
3509 -371 -13 163 44 54 -118 48 117 -200 -261 -92 103 -174 -167 80 155 -131 405 -29 -98 86 -67 -257
3531 -257 -200 -185 -198 -269 -275 45 -342 -103 -98 -327 -159 -153 -123 -421 -299 -241 -181 -180 -37 -170 -383 -379 -303 -239 -75 -504
3557 -504 -445 -130 -481 -35 -150 -156 -573 -252 -324 -575 -263 -497 -456 -285 -147 -462 -427 -206 32 -292 -267 -157
3579 -157 -130 -237 -62 -119 -323 -406 -470 -176 -75 -127 -234 142 -182 -331 -248 90 -2 -46 -330 -167 -199 91 -19
3602 -19 -294 -198 -52 -144 -54 -19 -122 -130 -244 -172 279 256 5 124 202 -24 143 462 397 95 -93 366 111 124
3626 124 270 213 180 168 -139 178 364 -29 43 377 332 261 405 394 174 196 511 289 431 81 327 224 188
3649 188 402 53 146 258 230 379 697 384 460 57 262 298 399 333 151 272 314 377 144 201 271 171 108
3672 108 119 17 373 94 343 258 141 242 -116 339 -8 258 -416 126 -219 140 397 343 198 276 194 119
3694 119 -36 -151 -209 334 287 -339 137 -137 133 -250 -5 73 -257 -112 -69 -98 -339 135 -228 -127 -301 76
3716 76 -61 -243 -14 86 -71 93 -104 -289 -176 -206 -86 -166 -118 -242 -54 -242 -36 -68 -7 -121 -267 -226
3738 -226 -224 -143 -113 -342 -93 -372 -170 -264 -109 73 5 -67 -212 -35 -106 46 -25 -389 444 -24 -113 -182 -252 -92
3762 -92 -173 19 -45 -81 -151 -43 99 -171 -225 -10 -350 -142 -2 -209 4 -153 -62 -46 223 -190 -206 -43 -69
3785 -69 -68 -113 -176 -356 -26 -3 22 -244 -380 -75 -74 -149 -64 -67 -154 46 -3 53 -171 -9 -129 276 4 -89 -278 189
3811 189 -130 -138 -29 302 -310 -126 -254 73 -209 13 128 -92 -226 -147 -111 261 34 37 -75 7 -238 -174 -100
3834 -100 -417 -72 -139 18 129 -291 166 -22 33 138 190 232 29 113 -49 297 50 -98 160 -26 -90 237
3856 237 405 107 134 337 -242 202 -133 220 149 66 199 127 -9 112 179 43 173 -52 247 208 269 115
3878 115 246 188 -30 72 132 -106 272 209 -23 289 211 -22 63 542 256 463 391 -18 -84 224 345 344 113
3901 113 58 275 156 413 -10 430 179 235 217 74 66 151 14 81 250 388 114 6 452 523 42 304 -91
3924 -91 -231 33 -77 -99 -106 -170 -206 -260 -12 -14 79 2 -160 -24 192 110 -243 -102 -245 297 189 -29 -335 -431
3948 -431 -21 -373 -45 -379 -342 -303 -278 -31 27 -226 -352 118 207 -111 -405 -131 -66 -332 -129 -65 -376 -41
3970 -41 -74 -215 -285 -369 -3 72 -181 -212 -501 -263 -11 -394 -153 -335 -68 -185 -94 56 -226 -336 -193 -98 -351
3993 -351 -86 -260 -238 -211 -155 -183 -199 4 -138 -234 -55 -66 -53 13 -168 -223 -56 -125 -248 -190 114 111 236 -211 -51
4018 -51 -127 335 161 390 -88 -121 176 25 230 105 -39 164 187 99 160 29 -39 373 140 13 90 26 -38
4041 -38 134 -64 253 107 -132 264 208 174 -35 -389 148 180 351 210 177 19 125 -126 -5 224 -34 266
4063 266 47 2 389 342 -44 13 12 -52 368 169 -7 11 132 108 167 90 202 164 119 362 279 85 20 -155 22
4088 22 164 140 164 61 186 -151 -1 -153 265 402 -230 -371 -180 -77 -7 -334 61 200 -66 130 -8
4109 -8 162 88 4 -19 98 308 39 88 211 120 149 109 218 -100 -417 118 246 148 67 271 47 -11 -53 -323
4133 -323 157 -105 -174 248 -240 -212 -175 -196 219 -15 70 319 218 38 -272 26 -155 31 232 196 -18 17
4155 17 43 -56 92 85 201 38 -206 -149 230 108 -21 305 96 17 -328 -157 -286 39 -50 179 -204 33 -98
4178 -98 -13 322 -3 63 -89 -167 3 -227 126 13 -109 -208 -243 65 -192 -203 -101 203 187 -93 -221 -145 2
4201 2 -216 -150 146 171 -210 -240 53 -6 -162 -51 94 23 -227 123 -440 240 -189 -25 -50 -166 127 -102 101
4224 101 -109 182 -217 -219 -154 -133 -99 -166 112 159 -173 113 -571 124 180 19 -68 -37 -180 -189 -165 85 -25 -102 -120
4249 -120 170 168 -349 85 110 130 -49 130 -96 -123 -69 -56 66 -144 -15 236 391 -46 -243 200 194 187 12 -48
4273 -48 181 63 292 206 136 32 96 205 443 -26 -35 25 129 205 100 196 -117 -97 121 -44 272 129 138 67
4297 67 -56 67 167 53 148 36 -44 438 89 217 298 8 126 113 267 222 -98 187 137 82 -58 32 112
4320 112 152 307 244 -80 315 50 -152 -108 0 208 91 69 78 161 55 -334 106 97 -6 -22 7 60 29 121 -32
4345 -32 53 -30 190 135 -239 11 143 55 -56 -141 79 -231 -141 -157 -267 30 0 36 -159 -443 18 -305 -111
4368 -111 -163 18 173 -351 80 -151 -229 -276 13 -12 -79 -13 -362 171 362 -372 -146 -252 -199 -82 102 75 166
4391 166 -84 8 -26 -203 41 91 7 133 205 -120 -300 -235 -6 -125 -66 52 -174 -304 10 -53 159 46 124
4414 124 -425 -48 234 -359 262 -200 -299 -119 -42 -111 65 -160 -179 -245 -15 124 84 -132 -419 -221 -148 -160 -96
4437 -96 -105 -262 -78 256 175 -57 94 10 26 -204 54 75 -152 36 71 -24 -113 -332 50 106 81 13 30 -1 -308
4462 -308 -166 -108 100 113 44 -94 180 90 220 76 140 -67 55 -28 -284 -212 -123 -142 232 71 78 -86 49 -45
4486 -45 15 49 93 154 112 -120 -143 -205 226 -55 -292 186 184 123 214 31 -132 -281 -195 2 -269 73 223 -371
4510 -371 -90 226 -11 73 156 336 -480 95 -196 51 -214 6 -30 -98 128 97 -17 -153 -73 -46 340 -76
4532 -76 129 119 124 237 335 -119 58 98 164 -44 40 21 538 -11 -93 34 292 66 177 4 143 249 143
4555 143 457 -131 264 326 25 54 208 -195 -17 27 196 45 22 152 91 -24 192 143 -17 -90 2 -166 -233
4578 -233 -222 51 -41 109 6 209 -296 168 -87 -85 234 -189 -269 -320 -153 -226 -425 -85 4 -13 -43 -204 18
4601 18 -253 254 7 -160 -398 -195 -278 -92 -216 -117 -47 -159 -158 -88 105 -301 -179 172 -27 -16 -3 -13 -303
4624 -303 -92 57 -53 -441 -128 19 -173 24 65 -242 50 93 89 81 -126 63 -229 -129 146 174 -121 120
4646 120 56 86 -127 131 225 114 172 219 73 -237 38 -152 202 -178 -26 167 2 -65 -103 365 -235 -30
4668 -30 0 44 13 -145 188 100 334 -282 -56 29 27 157 247 321 276 -264 -54 263 13 -107 -125 375 124 139
4692 139 198 -72 120 254 206 47 163 435 297 42 -177 332 -91 273 -8 -133 73 -119 -9 -124 -133
4713 -133 79 -32 133 25 -10 -271 -34 320 -53 271 170 -193 -83 -96 -98 -46 -186 -60 -398 -81 215 10
4735 10 -177 174 40 160 195 206 327 347 -106 -238 10 -277 150 -171 -25 -70 -31 -427 -139 18 111 -151
4757 -151 -196 -85 -79 152 -260 -43 -42 195 -73 -117 112 177 65 -4 -114 -38 -30 -4 140 77 -54 178 -43 182
4781 182 -176 78 -60 207 -78 -283 -71 -181 -16 -3 76 20 125 184 290 -122 -57 0 183 -50 -275 -261
4803 -261 213 24 -21 -74 -191 25 -134 18 -145 -209 -68 -196 6 3 -68 -85 72 13 122 -136 -63 243 -145
4826 -145 -16 82 -333 8 162 20 18 91 -126 -276 -7 331 506 -104 -64 95 -89 113 58 68 124 -16 -368
4849 -368 -2 15 -124 -249 -177 -106 -237 -128 -497 61 69 28 -322 -74 -92 -104 -256 51 -114 -420 41 -169 59
4872 59 152 -26 -161 61 -191 -290 -305 -4 -222 -385 -123 278 -177 -254 -358 11 -71 -69 48 -130 -106 58 59 -218
4896 -218 105 -3 111 -85 -65 106 23 -75 32 -16 -36 -52 -83 -387 -113 124 77 24 419 -143 16 -95 299
4919 299 -88 76 148 -251 4 190 279 -163 -188 49 344 295 -125 147 46 -262 163 124 153 149 128 -59 -179
4942 -179 -236 -182 339 395 111 -262 -154 53 53 204 -38 -183 -86 -77 137 117 -106 245 -130 198 158 81 122 277
4966 277 -51 143 122 117 317 33 -9 -262 61 216 97 78 -228 -75 64 -62 -9 26 -131 453 7 -108
4988 -108 52 59 -58 -268 -130 -72 -119 -2 -207 11 42 -102 14 190 64 -66 -16 -253 46 35 40 -17 67 182
5012 182 121 49 67 -491 134 -180 -296 -180 -260 -102 0 -8 -172 241 136 -3 -15 18 390 -227 -13 116 -304
5035 -304 -172 -7 -276 137 -16 -165 10 465 36 -116 147 229 2 -47 361 201 137 -359 -311 -191 -138 87
5057 87 -10 -138 1 356 -26 18 -26 -198 -82 134 89 172 170 -58 61 97 44 174 -144 139 537 265 58
5080 58 -164 141 20 4 28 83 -165 -239 -38 -87 95 152 -251 113 257 77 91 26 18 163 -11 -66 149 -32
5104 -32 -74 255 -86 204 403 -207 -129 -225 -198 -64 188 -186 89 -54 83 178 -47 -255 43 -19 4 -66 -17
5127 -17 8 85 349 -87 -36 188 -36 236 202 -186 -9 59 -221 -65 -94 -61 137 214 280 -3 203 -71 -109 222
5151 222 27 -41 132 120 33 159 263 -19 -11 -119 -126 240 -158 -266 228 -190 261 -114 123 15 -358 -45
5173 -45 196 6 -51 105 211 192 230 -80 -323 9 -62 30 -10 360 -188 -16 65 163 47 41 229 -356 71 103
5197 103 43 176 -180 223 81 46 20 -10 98 339 -115 57 -118 46 209 -72 7 -61 -173 -57 -244 86
5219 86 -218 -193 34 -275 339 39 47 89 78 74 -63 -266 -42 -201 10 -402 -139 274 -290 -191 -276 -99 -214
5242 -214 123 227 -244 167 -149 -57 22 143 -161 -225 57 -68 -88 -13 -176 -139 -311 15 -50 -182 -235 226 -537
5265 -537 -135 -144 -30 -114 -52 -196 -215 -44 148 -126 -253 -21 -259 78 108 185 -43 -3 23 100 -155 -67 -121 -56
5289 -56 -50 -24 -122 324 6 -74 190 -30 21 109 -193 75 -21 -6 300 20 296 105 -16 -333 56 -86 136
5312 136 -74 -56 51 244 114 -398 -182 -40 -165 -96 189 287 -172 36 238 -84 -10 77 -95 170 197 39
5334 39 -245 174 -2 189 227 -295 -72 129 192 136 10 -150 139 216 188 48 6 -29 -104 -176 -42 39 28 -219
5358 -219 154 -175 -96 311 142 80 -19 99 -208 42 215 -70 285 -64 -171 -23 194 -57 150 -51 305
5379 305 -262 15 27 133 117 -25 -75 -43 94 -63 -50 -318 -93 95 -167 197 198 15 336 -16 25 110 253
5402 253 13 -135 -150 324 303 -274 -153 3 163 86 160 -37 -181 7 6 -194 91 20 -70 -114 -183 -168 -238 197
5426 197 -67 -231 -26 70 83 31 -45 -61 110 -75 -28 20 321 139 30 20 43 96 -361 -19 307 -90 -37 281
5450 281 159 126 268 -78 86 -63 -94 -110 126 -119 -71 187 151 352 -175 -226 101 -76 -91 -220 88 113 -141
5473 -141 -136 -139 27 -242 147 -80 138 62 149 -41 -65 -247 307 273 -219 -470 199 -77 116 170 -388 273 -114
5496 -114 -349 -134 -205 -180 -79 94 7 -87 -175 -29 126 123 85 45 -120 18 93 -226 -208 288 8 93 331 -18
5520 -18 -381 -170 -51 -377 154 -63 -291 81 -365 13 -198 -2 -76 -90 -7 -321 -115 166 -231 44 -102
5541 -102 -142 55 -199 -91 44 -114 -6 -112 -199 24 67 -9 204 -63 139 -17 -113 -11 49 48 -136 400 -78
5564 -78 2 -231 438 324 143 -172 -96 -153 169 10 145 16 116 78 188 356 -101 -24 159 125 101 -107 71
5587 71 236 34 -77 182 70 27 -28 116 349 -171 -42 132 -174 95 313 -3 75 -190 28 -29 5 46
5609 46 -2 -349 -113 -125 -1 -197 125 -183 180 274 -142 132 -40 204 -184 -7 58 161 148 -172 32 -58
5631 -58 75 217 -103 192 75 -74 -137 -190 212 -43 189 -57 -90 65 -159 -66 -201 -148 101 -140 43 74
5653 74 -198 -103 41 -75 75 179 36 51 -201 117 163 235 75 155 28 -328 20 172 68 214 27 -162
5675 -162 -341 -131 -320 -25 -213 -71 275 -225 -4 233 11 73 48 -46 -136 -70 107 55 -99 -57 -236 -140 53
5698 53 -311 -75 3 -246 137 72 -110 165 -170 181 87 -136 -327 267 409 -58 207 173 474 -154 -38 349
5720 349 -67 -308 108 -196 28 177 127 -12 -324 131 10 135 -121 50 -13 -158 -86 -69 -14 187 -134 -215
5742 -215 226 -212 -163 15 218 157 137 -190 -125 -213 -173 348 123 206 -169 -36 -18 -6 -208 201 -68 -155 -87 170
5766 170 220 19 147 174 78 162 73 87 -104 -63 -308 -182 153 87 -111 -218 -230 -247 -92 -156 87 -99 -88 167
5790 167 90 97 14 111 241 -13 -55 28 208 46 -73 -66 -51 58 -68 183 75 156 -13 103 -53 -140 102 36
5814 36 81 55 -45 138 -17 184 -8 -152 20 38 -43 -130 -213 84 -80 -246 -172 153 35 149 -90 222 17
5837 17 -480 31 434 66 504 51 363 -80 232 -25 52 7 44 144 257 347 381 -245 -327 -56 57 285
5859 285 -252 -142 -245 -178 57 24 133 47 -266 38 -73 0 67 27 231 -6 -333 351 265 -109 -137 -141 -15
5882 -15 120 107 -171 8 -96 -14 26 48 160 -257 -315 -210 -94 102 128 137 -213 -67 -174 48 -361 205 -266
5905 -266 -141 -181 343 229 -230 -2 -229 144 -112 -5 -290 0 178 -266 33 -8 -281 154 15 126 -197
5926 -197 -63 -136 -102 56 150 93 -79 94 -200 86 143 -119 78 102 17 189 89 -33 136 -169 241 -315
5948 -315 -121 150 213 127 -123 -113 -18 212 -223 45 -80 34 269 -15 -280 11 -135 -41 -55 -163 1 -184
5970 -184 -338 25 279 -144 29 -12 -122 -80 -42 -27 -45 116 -287 16 -56 -97 -94 154 234 111 90 258 309 137
5994 137 -135 153 -204 130 151 -33 -106 -296 -104 -18 120 32 26 26 125 -267 -200 398 -22 -83 91 -82 113 285
6018 285 -78 126 -263 42 -35 218 -48 -279 152 217 -468 48 174 -121 -332 65 115 -6 -167 -116 -156 4
6040 4 129 12 -207 -231 -97 21 -105 89 -237 -10 121 -167 20 322 -115 42 -147 -59 -119 -50 -82 83
6062 83 153 -94 86 35 -301 -76 -180 65 -85 -8 352 -26 176 61 56 129 80 29 -66 -180 -144 392 -14 -28
6086 -28 12 -5 -104 37 -208 145 113 -229 -69 -24 147 -20 -65 -81 -90 134 -11 232 76 93 414 -142 -77 2
6110 2 174 -176 86 -182 177 176 93 -309 -241 33 76 -191 -49 -208 118 163 3 24 117 -79 -56 132 -31 110
6134 110 -123 250 250 128 -149 -128 -25 223 -17 287 184 263 -46 -220 78 -318 -109 -147 201 12 -41 6
6156 6 -67 -200 -136 -78 122 -37 96 186 45 -86 -180 -25 176 250 -93 31 250 -130 -183 -64 -339 230 194
6179 194 203 -88 92 128 375 -63 -1 -63 69 -113 -89 0 -13 -135 -187 66 155 151 -273 7 -18 -22 41 108 135 -59
6205 -59 -124 489 -233 -20 -314 -384 164 -56 -16 27 124 -52 34 58 64 -126 -14 72 7 209 47 142 245 -111
6229 -111 116 -62 64 -83 74 251 80 -47 -254 -40 -35 295 192 178 124 207 -177 221 117 226 283 -49
6251 -49 -22 -256 -22 -88 79 -68 -92 518 159 58 -44 51 75 -301 -25 -156 246 -139 193 265 -253 199
6273 199 -18 92 -123 137 327 -67 222 -200 154 217 -54 15 177 -88 -42 -180 157 -118 -206 122 -177
6294 -177 176 191 -7 111 32 -80 374 -128 152 122 -67 109 -25 -107 -460 79 126 -319 -184 159 -118 65
6316 65 182 -40 -41 163 -245 -78 -92 206 -94 140 192 232 118 14 -103 192 5 2 311 -479 64 -31 -22 -284
6340 -284 -26 -260 138 -219 79 397 -14 -2 -322 -41 121 374 -97 255 216 -33 -182 -68 -167 25 -44
6361 -44 195 61 155 276 -85 140 -14 6 -68 100 -189 183 96 252 191 -68 214 26 -155 158 11 95
6383 95 -243 190 17 12 -62 46 -322 17 -37 -216 203 278 -278 66 90 43 -160 -59 -41 35 104 -117 52 6
6407 6 -59 -57 176 29 -113 31 259 -147 94 108 341 468 -8 -75 165 -47 61 -154 -249 70 -175 191 -6
6430 -6 -206 -7 -116 -21 -239 4 46 31 -126 -149 -301 -311 -82 -168 -274 -206 24 66 -56 -69 -100 -84 33 -267
6454 -267 31 -101 301 101 -139 -300 -271 -219 -101 -10 -229 -250 -69 88 -434 78 -230 -62 -193 -303 88
6475 88 143 22 -168 -44 -39 309 -261 -24 210 -88 219 -141 10 111 25 111 131 -85 113 3 164 54
6497 54 -24 91 76 421 34 46 241 -55 37 88 160 92 -44 -5 -155 -108 165 6 2 -407 142 134 47 -39 -77 24
6523 24 114 55 186 38 -276 314 -217 99 29 -24 -143 12 50 -238 -105 17 68 -50 -121 192 -103 239 18
6546 18 -121 -172 -3 124 354 -83 86 151 -10 13 245 122 -250 -93 42 181 -51 -1 -236 210 -41 -274
6568 -274 -225 48 -378 -14 54 144 -118 153 161 9 -224 -166 288 30 -35 46 -245 57 -33 -101 322 -143 -233 263
6592 263 -39 -70 -138 -120 -58 -22 66 5 -315 5 -142 242 285 -71 45 -142 92 39 -355 -37 255 -127 136
6615 136 -192 -203 -207 97 42 8 -417 -221 -6 261 -80 -387 102 13 99 -181 170 -32 -178 83 4 113 -67
6638 -67 -95 -354 -171 236 -14 163 -38 -151 -251 -49 -169 0 -211 -107 41 202 18 -174 240 82 270
6659 270 17 -145 -80 -143 153 276 19 -310 156 -44 -36 262 200 128 120 -26 255 21 135 114 -28 39 -165
6682 -165 -99 44 -344 -120 -277 -4 8 91 -82 0 -55 -57 93 12 -35 -60 231 72 -219 -371 74 219 82
6705 82 211 -70 213 -102 345 4 228 -123 -37 269 -97 -109 -26 -150 50 -7 58 104 113 133 240 195 -425 412
6729 412 172 224 -446 -70 310 239 -102 -70 195 304 158 -53 166 108 -43 35 -149 225 -193 65 318 40
6751 40 158 -139 88 -99 -118 138 8 -111 67 -16 -110 27 -102 -84 -179 -197 115 3 127 -308 -156 149
6773 149 -34 -123 54 26 79 -48 263 35 1 17 167 -17 -80 130 171 170 -37 2 74 0 -294 -94 39 -245
6797 -245 -203 21 -315 -144 187 -148 68 135 -150 122 12 218 16 60 -262 -20 20 111 -285 -142 194 103
6819 103 -68 107 7 -343 -7 35 -27 11 57 -330 -87 118 27 -126 -51 159 -55 -224 -91 -71 -62 -209 183
6842 183 135 52 -60 -110 262 181 -140 -56 -36 -22 -64 -136 141 354 -347 -37 314 -54 -23 -145 30 -85 18
6865 18 -406 -111 -154 -261 -147 271 44 -41 -17 -215 -12 306 -130 -56 41 120 69 -101 -129 63 -35 205 -63
6888 -63 237 143 22 -94 57 -34 51 37 122 132 -223 -75 -184 -141 -42 -74 -107 -9 -276 -106 69 -364 71 -145
6912 -145 -147 276 15 -50 2 -74 91 388 -177 -89 85 -82 -178 139 152 342 179 -223 363 135 -222 159 -28
6935 -28 213 -198 -8 130 109 31 -72 171 233 93 -58 -164 -91 -43 77 165 211 -111 -11 19 -14 34 -131 13
6959 13 183 -115 132 75 -22 -141 -355 124 -179 106 165 259 -70 -250 138 -22 -169 358 -60 146 58 -281
6981 -281 -279 -152 -111 -22 -78 -50 -84 15 101 -400 66 247 -20 92 58 53 35 152 -30 -173 109 237 99 45 -139
7006 -139 58 -38 -214 -94 -243 -201 3 -144 -215 -135 60 276 -219 -13 107 275 -140 49 -149 -324 66
7027 66 176 -127 -59 47 -113 49 195 328 -153 37 53 103 -205 103 164 103 -261 127 -32 -86 -49 -46 -158
7050 -158 157 128 -121 -24 -80 -152 55 37 -70 146 143 -229 165 -20 41 -129 -252 -177 219 -165 -357 81 163
7073 163 19 32 24 -58 209 57 -27 46 -500 -58 -228 156 39 170 -27 -231 113 -169 48 -85 318 -40
7095 -40 149 174 -259 -101 201 166 -366 -180 -130 -152 -64 -68 206 -62 -98 17 -201 -46 135 -340 -361 -40 37 -158
7119 -158 -190 36 -41 -304 -140 238 175 245 -36 -211 144 -215 -126 140 -151 152 122 -198 246 277 -144 -234 95
7142 95 -106 -52 160 -96 -193 -54 6 -83 -33 179 198 86 296 -141 124 -213 194 194 -3 -203 -97 -91 -22 80
7166 80 -123 162 16 73 300 -67 1 69 73 138 33 -91 214 -464 136 198 269 -150 15 -73 -100 30 -58 197
7190 197 -195 86 44 16 -249 -30 246 221 15 13 246 136 -5 -274 13 -79 189 -137 -30 -7 37 -241 10
7213 10 57 -200 128 379 277 15 44 -104 47 54 -268 138 199 159 79 -258 -384 -168 124 300 405 -57 45
7236 45 55 221 -204 25 -45 68 -98 119 -68 99 -99 -134 56 -106 115 -78 -97 -75 281 7 -85 -217
7258 -217 -65 71 61 -160 273 98 -112 -1 116 57 43 109 -16 -50 89 -44 169 -19 -143 -14 -172 0
7280 0 -51 -63 -49 -600 -125 -15 168 70 -25 -195 -68 40 -417 39 130 -70 21 153 -40 194 -141 29 -7
7303 -7 144 287 -3 -32 173 144 -111 150 54 -99 78 39 74 -189 -182 -66 -74 -139 84 -23 180 -105 256 -114
7327 -114 -86 -101 135 109 -204 -143 147 8 -1 -35 -174 -13 -32 103 190 84 -105 -333 137 198 -46 -82 -87 231
7351 231 -324 -191 -221 -51 129 -112 -85 195 68 403 75 335 296 -266 290 -24 -225 377 -12 -63 -183
7372 -183 -24 -220 13 -202 238 -208 3 -7 -96 96 -153 92 -103 223 41 86 -19 -2 -22 157 -51 73
7394 73 224 38 258 -85 -136 -55 -174 156 -49 87 -21 -53 184 -38 586 60 -9 -69 -181 -100 -59 44 -105
7417 -105 182 265 -87 -187 -32 -5 157 -59 214 -32 292 -11 183 31 -454 -124 82 73 -160 -266 -75
7438 -75 -46 66 13 -311 -103 -159 -141 -135 -57 -59 341 -158 135 -385 99 118 -194 41 -15 -10 16 65 -55 141 88 -11
7464 -11 315 108 -147 67 -243 -6 12 -289 -81 -105 385 -399 73 17 -142 -64 -8 123 114 256 20 57 -232
7487 -232 202 163 217 183 144 165 6 117 -235 156 176 -8 -63 36 148 57 -175 -80 -52 125 169 106 74 166 -18
7512 -18 -126 -193 -10 -171 65 126 295 -146 380 -244 368 -1 -519 -86 9 56 194 -67 85 -229 266 -53
7534 -53 -39 265 -309 -277 -10 -55 336 197 -1 23 -109 -198 333 243 3 65 -211 -73 -52 162 157 139 -81 -128
7558 -128 208 5 312 -408 18 -345 170 -124 -211 42 152 -96 267 96 -376 68 130 95 -28 237 -232
7579 -232 239 41 -51 -8 243 12 -28 135 79 -268 323 71 -6 197 -54 80 -49 114 113 186 120 -139 -56
7602 -56 260 259 231 16 23 -4 31 -153 145 -440 184 -117 -95 -174 -48 1 160 56 165 -50 204 67 258 23
7626 23 -56 -152 249 -46 -42 -354 230 163 -16 191 -108 -10 -326 62 253 -336 -172 68 -195 -39 -217 -269 121
7649 121 394 194 79 168 -70 340 -84 99 51 -61 -14 -24 34 -134 68 -125 47 -230 142 80 -105 65
7671 65 10 91 152 -51 -36 154 -445 -58 -216 -100 40 -79 -289 -96 -207 167 45 267 -116 -159 167 -96
7693 -96 -104 -9 -165 43 109 204 120 -20 11 73 121 54 -92 154 260 136 -58 276 56 -97 88 132 130 110 -133
7718 -133 -149 -3 219 -145 63 -198 -273 5 -450 57 147 -255 109 71 -200 -101 61 -62 32 -60 158 250 -6
7741 -6 -100 -148 116 102 -35 -22 45 -257 173 -12 160 22 -25 -67 -142 -11 47 -48 -89 56 -264 178 327 128
7765 128 -41 -1 224 -59 -113 158 55 -307 -11 205 86 228 -16 -153 176 -20 287 72 32 130 27
7786 27 -316 -134 -63 109 50 291 111 104 134 384 -20 -28 247 58 30 120 112 9 -163 259 -73 -38 266 -350
7810 -350 -87 162 54 -14 -97 -26 153 259 -152 -163 -111 49 -59 -139 159 -94 -55 32 -89 -95 -255 -27 195
7833 195 110 -36 -65 134 111 -35 36 67 125 -127 -19 -207 29 12 156 -47 129 218 -251 -70 160 -36 -102
7856 -102 -276 -200 194 -236 -137 49 174 -108 235 42 -333 -61 -419 -73 -145 -219 -197 100 -22 -227 310 -312
7878 -312 24 -66 -353 -29 130 -245 -69 -30 26 -112 134 -176 -53 -51 -280 -58 -167 133 29 -45 27 156
7900 156 135 99 -95 6 75 -71 -464 52 -166 -279 -270 -41 -341 -207 -45 -100 72 -182 141 -81 186 48
7922 48 115 -41 -523 45 -319 -86 224 42 -332 -171 -70 108 -77 383 235 139 2 -57 -97 -51 151 -75
7944 -75 84 -535 24 123 -144 -74 -51 -269 53 172 -50 16 -65 121 143 213 -75 -105 45 -211 84 147 45
7967 45 266 -236 -238 284 180 -47 -78 -124 -187 -2 375 68 163 148 46 -25 -284 118 264 -180 247 114 -117
7990 -117 -325 429 -254 190 -31 69 -81 -47 42 181 19 -472 -251 -28 -221 -59 13 -44 76 -146 215
8011 215 18 -60 -217 -119 -95 -134 64 -142 93 -219 103 27 18 167 109 104 89 452 -89 -13 152 144 312 74 -241
8036 -241 -67 -103 47 -51 -91 196 79 34 -93 82 -180 -288 201 -178 -298 -147 -194 -125 -25 95 -309 187
8058 187 194 -41 -19 -185 -13 -298 -101 76 -14 217 -43 15 155 -24 16 196 15 -321 196 -107 -18 341
8080 341 -5 116 -159 67 374 -174 52 -136 -137 141 -107 191 124 -259 100 51 85 68 230 92 -17 50
8102 50 -15 76 -189 2 -41 128 12 -329 -1 -171 -107 -55 -97 -340 38 209 -53 137 -11 -203 79 58 16
8125 16 2 -197 -134 174 50 15 176 -52 -52 -72 101 64 -211 55 31 162 -11 -301 -17 65 -304 61 -28 204
8149 204 -130 223 18 9 -223 132 -32 75 127 15 108 -83 120 -142 -236 342 73 -89 81 356 -125 -214
8171 -214 265 17 240 96 161 49 -69 -52 21 109 121 -235 -231 -42 -56 157 -195 -18 -13 110
8191A10
##END NTUPLES=NMR FID
##END=
