##TITLE=1H_LR-669-H-CR2
 D2O, 8 sc, 
 7.6.2019
##JCAMPDX= 6.0         $$ Bruker NMR JCAMP-DX V2.0
##DATA TYPE= NMR FID
##DATA CLASS= NTUPLES
##ORIGIN= UXNMR, Bruker Analytische Messtechnik GmbH
##OWNER= root
$$ XWIN-NMR		Version 3.5
$$ Fri Jun  7 14:20:32 2019 Russian Standard Time (UT+4h)  she@DPX200
##.OBSERVE FREQUENCY= 200.13155
##.OBSERVE NUCLEUS= ^1H
##.DELAY= (6, 6)
##.ACQUISITION MODE= SIMULTANEOUS
##.ACQUISITION SCHEME= undefined
##.AVERAGES= 8
##.DIGITISER RES= 18
##SPECTROMETER/DATA SYSTEM= spect
##.PULSE SEQUENCE= zg30
##.SOLVENT NAME= D2O
##.SHIFT REFERENCE= (INTERNAL, D2O, 0, 15.7039)
##AUDIT TRAIL= $$ (NUMBER, WHEN, WHO, WHERE, WHAT)
$$ ##TITLE= Audit trail, XWIN-NMR		Version 3.5
$$ ##JCAMPDX= 5.01
$$ ##ORIGIN= Bruker BioSpin GmbH
$$ ##OWNER= she
$$ F:/spectra/data/she/nmr/H-F/1/audita.txt
$$ ##AUDIT TRAIL=  $$ (NUMBER, WHEN, WHO, WHERE, WHAT)
(   1,<2019-06-07 14:19:13.67 +0400>,<she>,<DPX200>,
      <created by zg, POWCHK disabled, PULCHK disabled
       configuration hash MD5:
       00 E9 B6 7A A2 85 ED C7 34 08 36 98 17 FE 4E 26
       data hash MD5: 16K
       A4 76 4E 64 3D 84 77 D8 C1 78 83 26 60 6E 85 68>)
$$ ##END=
$$ 
$$ hash MD5
$$ 68 D3 3E E0 CA EE 34 6D A0 BC D3 22 81 CB E5 4C
##$RELAX= 
##$RELAX= 
##$RELAX= 
##$RELAX= 
##$RELAX= 
##$RELAX= 
$$ Bruker specific parameters
$$ --------------------------
##$DU= <F:/spectra>
##$EXPNO= 1
##$NAME= <H-F>
##$PROCNO= 1
##$TYPE= <nmr>
##$USER= <she>
##$AMP= (0..31)
100 100 100 100 100 100 100 100 100 100 100 100 100 100 100 100 100 100 
100 100 100 100 100 100 100 100 100 100 100 100 100 100 
##$AQSEQ= 0
##$AQ_mod= 1
##$AUNM= <au_zg>
##$AUTOPOS= <>
##$BF1= 200.13
##$BF2= 200.13
##$BF3= 200.13
##$BF4= 200.13
##$BF5= 200.13
##$BF6= 200.13
##$BF7= 200.13
##$BF8= 200.13
##$BYTORDA= 1
##$CFDGTYP= 0
##$CFRGTYP= 5
##$CHEMSTR= <none>
##$CNST= (0..31)
1 1 145 1 1 1 1 1 1 1 1 1 1 1 1 1 1 1 1 1 1 1 1 1 1 1 1 1 1 1 1 1 
##$CPDPRG= <>
##$CPDPRG1= <>
##$CPDPRG2= <>
##$CPDPRG3= <>
##$CPDPRG4= <mlev>
##$CPDPRG5= <mlev>
##$CPDPRG6= <mlev>
##$CPDPRG7= <mlev>
##$CPDPRG8= <mlev>
##$CPDPRGB= <>
##$CPDPRGT= <>
##$D= (0..31)
0 1.2 0 0 0 0 0 0 0 0 0 0.03 0 0 0 0 0 0 0 0 0 0 0 0 0 0 0 0 0 0 0 0 
##$DATE= 1559902752
##$DBL= (0..7)
120 120 120 120 120 120 120 120 
##$DBP= (0..7)
150 150 150 150 150 150 150 150 
##$DBP07= 0
##$DBPNAM0= <>
##$DBPNAM1= <>
##$DBPNAM2= <>
##$DBPNAM3= <>
##$DBPNAM4= <>
##$DBPNAM5= <>
##$DBPNAM6= <>
##$DBPNAM7= <>
##$DBPOAL= (0..7)
0.5 0.5 0.5 0.5 0.5 0.5 0.5 0.5 
##$DBPOFFS= (0..7)
0 0 0 0 0 0 0 0 
##$DE= 6
##$DECBNUC= <off>
##$DECIM= 24
##$DECNUC= <off>
##$DECSTAT= 4
##$DIGMOD= 1
##$DIGTYP= 9
##$DL= (0..7)
0 120 120 120 120 120 120 120 
##$DP= (0..7)
150 150 150 150 150 150 150 150 
##$DP07= 0
##$DPNAME0= <>
##$DPNAME1= <>
##$DPNAME2= <>
##$DPNAME3= <>
##$DPNAME4= <>
##$DPNAME5= <>
##$DPNAME6= <>
##$DPNAME7= <>
##$DPOAL= (0..7)
0.5 0.5 0.5 0.5 0.5 0.5 0.5 0.5 
##$DPOFFS= (0..7)
0 0 0 0 0 0 0 0 
##$DQDMODE= 0
##$DR= 18
##$DS= 0
##$DSLIST= <SSSSSSSSSSSSSSS>
##$DSPFIRM= 0
$$ [...]
##$SUBNAM2= <"">
##$SUBNAM3= <"">
##$SUBNAM4= <"">
##$SUBNAM5= <"">
##$SUBNAM6= <"">
##$SUBNAM7= <"">
##$SUBNAM8= <"">
##$SUBNAM9= <"">
##$SW= 24.9336996594482
##$SWIBOX= (0..15)
0 0 2 0 0 0 0 0 0 0 0 0 0 0 0 0 
##$SW_h= 4990.01996007984
##$TD= 16384
##$TD0= 1
##$TE= 0
##$TE2= 300
##$TE3= 300
##$TEG= 300
##$TL= (0..7)
0 120 120 120 120 120 120 120 
##$TP= (0..7)
150 150 150 150 150 150 150 150 
##$TP07= 0
##$TPNAME0= <>
##$TPNAME1= <>
##$TPNAME2= <>
##$TPNAME3= <>
##$TPNAME4= <>
##$TPNAME5= <>
##$TPNAME6= <>
##$TPNAME7= <>
##$TPOAL= (0..7)
0.5 0.5 0.5 0.5 0.5 0.5 0.5 0.5 
##$TPOFFS= (0..7)
0 0 0 0 0 0 0 0 
##$TUNHIN= 0
##$TUNHOUT= 0
##$TUNXOUT= 0
##$USERA1= <user>
##$USERA2= <user>
##$USERA3= <user>
##$USERA4= <user>
##$USERA5= <user>
##$V9= 5
##$VALIST= <valist>
##$VCLIST= <CCCCCCCCCCCCCCC>
##$VD= 0
##$VDLIST= <DDDDDDDDDDDDDDD>
##$VPLIST= <PPPPPPPPPPPPPPP>
##$VTLIST= <TTTTTTTTTTTTTTT>
##$WBST= 1024
##$WBSW= 4
##$XGAIN= (0..3)
0 0 0 0 
##$XL= 0
##$YL= 0
##$YMAX_a= 181479
##$YMIN_a= -276197
##$ZGOPTNS= <>
##$ZL1= 120
##$ZL2= 120
##$ZL3= 120
##$ZL4= 120
##$ABSF1= 10
##$ABSF2= 0
##$ABSG= 5
##$ABSL= 3
##$ALPHA= 0
##$AQORDER= 0
##$ASSFAC= 0
##$ASSFACI= 0
##$ASSFACX= 0
##$ASSWID= 0
##$AUNMP= <proc_1d>
##$AZFE= 0.1
##$AZFW= 0.1
##$BCFW= 1
##$BC_mod= 2
##$BYTORDP= 1
##$COROFFS= 0
##$CY= 11.3945322036743
##$DATMOD= 1
##$DC= 2
##$DFILT= <>
##$DTYPP= 0
##$F1P= 18.9103706918063
##$F2P= -1.10871071338519
##$FCOR= 0.5
##$FTSIZE= 0
##$FT_mod= 4
##$GAMMA= 1
##$GB= 0.15
##$INTBC= 1
##$INTSCL= 1
##$ISEN= 128
##$LB= 0.24
##$LEV0= 0
##$LPBIN= 0
##$MAXI= 10000
##$MC2= 0
##$MEAN= 0
##$ME_mod= 0
##$MI= 1.114404
##$NCOEF= 0
##$NC_proc= 0
##$NLEV= 6
##$NOISF1= 3.799351
##$NOISF2= 2.8
##$NSP= 1
##$NTH_PI= 0
##$NZP= 0
##$OFFSET= 15.70392
##$PC= 1
##$PHC0= -8497.601
##$PHC1= 5.600192
##$PH_mod= 1
##$PKNL= yes
##$PPARMOD= 0
##$PSCAL= 0
##$PSIGN= 0
##$REVERSE= no
##$SF= 200.130013532006
##$SI= 16384
##$SIGF1= 3
##$SIGF2= 2
##$SINO= 400
##$SIOLD= 16384
##$SREGLST= <1H.CDCl3>
##$SSB= 0
##$STSI= 0
##$STSR= 0
##$SW_p= 3612.71676300578
##$SYMM= 0
##$S_DEV= 0
##$TDeff= 0
##$TDoff= 0
##$TI= <>
##$TILT= no
##$TM1= 0
##$TM2= 0
##$TOPLEV= 0
##$USERP1= <user>
##$USERP2= <user>
##$USERP3= <user>
##$USERP4= <user>
##$USERP5= <user>
##$WDW= 1
##$XDIM= 8192
##$YMAX_p= 0
##$YMIN_p= 0
$$ End of Bruker specific parameters
$$ ---------------------------------
##NTUPLES= NMR FID
##VAR_NAME=  TIME,          FID/REAL,        FID/IMAG
##SYMBOL=    X,             R,               I
##VAR_TYPE=  INDEPENDENT,   DEPENDENT,       DEPENDENT
##VAR_FORM=  AFFN,          ASDF,            ASDF
##VAR_DIM=   8192,          8192,            8192
##UNITS=     SECONDS,       ARBITRARY UNITS, ARBITRARY UNITS
##FACTOR=    0.0002004,     1,               1
##FIRST=     0,             0,               0
##LAST=      1.6414764,     0,               0
##MIN=       0,             -276197,         0
##MAX=       1.6414764,     181479,          0
$$ Real data points
##PAGE= N=1
##DATA TABLE= (X++(R..R)), XYDATA
0@%%%%%%%qJ6j6J7k5L3m1N0n9P3q8J05j22J42j65J92k24K58k96L37l83M36m93
30b61N55o24P01p86Q79r81J093j215J349j496J657j837K034k249K492k764L069
47A616l414L806m261M791n422O188p137Q353r975J2264j5768K1865l5486J21282
61I8702n1211k34054N6165R3896K6665j9397J08732J01981n5904j92368r6089
72a62882M5568Q5033L5230N0939O4230l566j17391j20615k8593N7607P7113Q3297
84F5970O4784j1037j11293j18872l2433M9830O4643O5902P3108K9969p6883j36335
96g2647p4552L7089Q1829O7338N4813L8207l1728j10116j05630j5128O5818Q2419
108A7712O9956M7311j2473r6732j23054m5184O0189R6835O5227K3102p425n1256
$$ y = [0, 0, 0, 0, 0, 0, 0, 0, -8, 8, -8, 9, -16, 17, -24, 26, -33, 40, -48, 57, -65, 77, -88, 104, -120, 138, -158, 179, -204, 232, -261, 294, -330, 371, -415, 464, -517, 576, -639, 710, -786, 871, -966, 1068, -1181, 1311, -1453, 1616, -1798, 2008, -2253, 2538, -2884, 3304, -3833, 4520, -5455, 6809, -8959, 12906, -22580, 98702, 47491, -186563, -130398, -36502, -9837, -29234, 79498, 181479, 125575, -66793, -162882, -117314, -32281, 2949, 53888, 118118, 114552, -2839, -123454, -152047, -94440, -17327, 65970, 130754, 119717, 8424, -110448, -142881, -93051, -28408, 37494, 110602, 140571, 63688, -72647, -147199, -110110, -28281, 39057, 93870, 132077, 100349, -9767, -115397, -130525, -64707, 17712, 87668, 134979, 122506, 25774, -97280, -142464, -82275, 14560, 79787, 102889, 95464, 44208]
120D4208r4597p7294O662Q7939R8882M6315j6202n6451p4296p0312k8456M6921
132h6681J07838R6553J3129p4365r9172o0651o810L2118O3671Q2656N6504k1799
144A02991r6382r9660l3102M1572P4481O8417M5778L849n7004r8543p3577J0149
156a11031Q1437Q9816M7783m004m6257p8187p4795j9431N6722R4088O8033O906
168A11080m5941p4301p0903l1930L0041P9614Q3346L6963l1099p9911q3076m1171
180a17288K1389P1304Q1777M9020j0981o7711q6620n4490J0476O5708P6845M9255
192H8684L035m1040p3198p2384k2746N1762R2465O8274Q013m1806o3844o7237
204g0022m0744K3674Q7049R1278K8107m4541o9877n8802l3838J798N3743Q7620
$$ y = [44208, -50389, -127683, -121021, -33082, 65800, 112115, 95913, 39462, -34834, -105146, -133602, -86681, 21157, 117710, 130839, 56474, -42698, -103349, -110159, -78041, -14370, 68286, 124790, 102991, 6609, -93051, -126153, -84581, -10100, 58317, 104095, 107944, 50940, -47603, -121180, -111031, -29594, 60222, 108005, 104001, 57744, -20443, -95238, -114669, -57947, 36141, 104174, 111080, 65139, -9162, -80065, -111995, -81954, -2340, 81006, 117969, 86870, 6959, -76117, -117288, -95899, -24595, 57182, 106202, 95221, 27510, -59110, -113600, -103124, -37416, 39429, 88684, 91719, 50679, -22519, -94903, -117649, -65887, 26578, 94852, 102865, 61059, -2785, -70022, -110766, -87092, -43, 91235, 119342, 74801, 4924, -53878, -87716, -85918, -32175, 55445]
216E5445O0149j4877p1841p3720m1364j572L8928P4142P1162J4661n6870q6593
228c2350n9357o127M0119O7382O6010K6246l5928p7865o8755k1551K9105O2053
240a1018O8320L9526j7602o7293p4154l8066J3148N4603P3617N5325J00o1301
252C5205q2219m8616P084M8976O5878N6764J7479m1856p9718o2176o258M2304
264d7153O0190N2058K8463j6263o5548p7041l4224L1495O8333O1437K9264j1245
276G9766n3477p4356m9939J1285O5984P0992L6787q830m4743o3268n4026j0495
288i4320M4367P3995N4664O664l8040o1649n7675k4103K8106O9127O7737K2943
300I1816l2302o2570n8067k7768J7069N8729O8036L5656j9528n7504n9318l3424
$$ y = [55445, 115594, 100717, 28876, -44844, -86208, -87780, -48852, 25290, 96452, 111113, 54243, -32350, -91707, -97834, -57715, 9667, 75677, 101923, 65995, -11870, -80625, -102176, -73071, -11018, 57302, 96828, 79226, 11933, -62221, -100287, -87139, -32536, 41081, 96406, 96506, 35205, -47014, -95630, -88546, -39570, 26308, 83072, 100551, 58695, -21023, -83199, -89457, -47153, 13037, 65095, 93558, 77295, 11747, -65294, -99518, -68023, 310, 61747, 91011, 79766, 26289, -48067, -98006, -86721, -20737, 50255, 87042, 78212, 33469, -29799, -83825, -94320, -49953, 24042, 78706, 85370, 47330, -14319, -71994, -96097, -67991, 1136, 68873, 91816, 59514, -3056, -61123, -88891, -71822, -13093, 54943, 90599, 71071, 13567, -45751, -79175]
312g9175N455M5281O6655M9097k127n0820o5198m3739m525L7433O4900N7974J2185
325I3396m3347o9130n1123r792K9602N4950N7915K7105k5715o4404o0259k1367
337h2169K0997M7891N5420L8416n891n3700o9673l7987J2457M9094N6664M0821
349G2340M462m1884o6993m8567P42M3450N7041M3596J1720k7552n7617n5764j7664
362h2690L0641N8175N1820K1231j8495n0857n8745l3025J5808N6983O1054K9443
374H1343j4780m5746n5380l8524J558M5113O2331M0115n280l9908n2330m2149
386f3637j2250L1022O0683N2408R033l5459n4269m5963j8926K1202N5356N7535
398E6735K1658k6956n4049m8597k1927J2907M4512N5985L5171j1028m9964n4961
$$ y = [-79175, -73720, -28439, 38216, 87313, 85186, 34366, -30832, -74571, -79096, -41663, 23237, 81211, 93396, 50049, -19081, -70204, -79996, -50394, 4556, 62471, 89576, 63861, -543, -60802, -82169, -61172, -13281, 42139, 80555, 74664, 20964, -48709, -86696, -74239, -25145, 31519, 72340, 76802, 34918, -32075, -80642, -79900, -36450, 20591, 64187, 75907, 48355, -9262, -65026, -82690, -52049, 6126, 57946, 79177, 60682, 9825, -48920, -81945, -66137, -9154, 51900, 81343, 66563, 20817, -34563, -73087, -71529, -26416, 35915, 76030, 70750, 30842, -21488, -63637, -75887, -44865, 15818, 68226, 77259, 41800, -12469, -58432, -77358, -56156, -800, 56735, 78393, 51437, -2612, -51209, -73136, -60229, -15717, 40268, 75439, 64411, 14447, -40514]
410d0514k9474N826L6236N3877M4787N266m2085o1398m0346M56L3387M9212M5853
423F1083J6884k8555n9638m9375j0173K7176M6070M4866K4123j4108m9433n6127
435d7207k5538J7257M5059M8933K9697n235m2074n7529l6518P384M3809N1871
447B9909L3166M2l3582n2580m3397n730L6713N3991L9130O868k4905m6392m7642
460e4409k0837K4366N4676N0018J6137k1095m3406m7631k8051J2149M8066N4060
472D4043K6685j3860m1042m6716l0731R05L6725N3602L7568j858l7878m8488l5568
485e6613p104K7292N0950M6125J1145l3145n3241m0150j0068K0844M3948M7888
497D7871K2743k0542n1535m7402j7395J5506L8872M6316L0842o492m3423n2521
$$ y = [-40514, -69988, -64162, -27926, 25951, 70738, 76004, 33919, -27479, -67825, -67369, -33982, 15230, 61083, 77967, 49412, -10226, -59601, -69774, -42598, 3472, 48338, 72461, 58353, 8920, -47207, -72745, -55488, -10429, 38504, 68201, 62966, 20892, -36637, -73155, -65771, -21962, 29909, 63075, 63117, 29535, -23045, -66442, -72172, -35459, 18532, 57662, 64530, 39625, -6767, -54409, -75246, -50880, 3796, 53814, 69951, 48856, 5450, -42181, -70232, -58083, -10017, 44043, 70728, 56868, 15826, -30890, -61621, -60716, -23991, 29611, 67179, 65321, 27443, -21045, -56613, -63717, -36425, 14525, 60650, 71795, 38650, -14591, -54741, -64809, -43965, -17, 47871, 70614, 50072, -1463, -48865, -66260, -50754, -11882, 34434, 65276, 58784, 15361, -37160]
509c7160k8959P526L6679M7086L5582K797l5158n2282l6917j161L1673M6373L7907
522E3986J0523k4297m8517m3963j2122K4740M4504M0541J8697j3151m2086n0585
534d1730k6106J5635M4979M5256K3309o322l4159m9294l5673K580L9836M9452
546B7763K8752j173k7264m2054l9143j1757K6994N0058M0309P835k4643m1085
558e408l9716j8495J5305M5742M8104J9331j9169m2643m1563k0735Q101L6521
570a4625M7732K9582q244l8526m3990k6716J388K8908M4503L6395M295l0611m6213
583a6122l5502o158K3951M3237M0166J2742k3377m4925l9425j3455J7428L9348
595b092M1221K0793j3677m1372m2799k0265J1520L3249M0314K8626j094l4872
$$ y = [-37160, -66119, -58593, -21914, 25172, 60754, 63551, 28393, -23889, -60806, -61967, -30294, 16079, 53986, 64509, 40212, -8305, -52268, -64390, -39650, 4854, 45395, 64092, 50941, 8855, -41730, -67836, -52201, -7222, 38034, 61343, 55021, 20862, -28432, -64105, -61525, -21689, 27763, 56515, 55342, 28078, -13976, -53119, -64876, -37882, 12176, 52485, 60320, 35677, -5408, -45124, -63619, -48314, -2572, 45532, 64863, 45694, 3051, -38512, -59247, -51146, -14625, 33107, 62689, 54445, 15919, -28071, -54787, -53399, -24491, 20012, 56407, 60702, 30091, -16122, -51624, -57782, -33831, 9406, 49572, 62314, 38937, -5988, -45413, -58868, -41440, -2092, 39129, 59922, 46245, 4873, -37926, -58191, -46671, -13422, 26892, 55518, 54424, 19552]
607A9552m8234l0362M521L2953M0671L0326O713k4402m5620l9579o200K9153M3279
620A2771L1788R147j6068l6922m1736j9233J8592M3446L9334J4557j3153l3069
632I454l9324k6423N484L8531M5933K3988r100l3131l8871k7220k140K7979M4595
645A9755L3587Q31k9312m0075l1220q039K0035M0826L8280J1877k1637l9740l5592
658d0424j5359J3678L7824M1710J8975j4135l7059l7847j9898O519L1405M2128
670B7517K7593n253l4554l9770k3916J075K3780L8391L4999O934k8275m4418l1119
683d7016k853K1086L4136L5239J6129j7091m3078l9604j0145J8085L3190L2608
695C0686J9839n564l3361m3465k4131J0841L4376L5594K1479k92k4272m0428l3012
$$ y = [19552, -28682, -59044, -54523, -21570, 19101, 49427, 56140, 31738, -13882, -53461, -59661, -30508, 12771, 44559, 53706, 37638, 716, -41020, -60253, -41661, 1785, 41119, 55676, 42523, 9454, -29870, -56293, -50809, -12278, 33655, 57643, 48543, 15412, -23459, -50679, -52819, -24840, 19755, 53342, 54173, 24861, -15214, -46434, -54473, -34438, 6388, 44668, 56545, 34908, -4832, -40424, -55783, -42105, -4281, 37429, 56404, 42269, 5210, -32637, -52535, -46016, -14611, 27517, 55110, 49857, 15303, -24467, -48383, -47308, -23528, 14863, 49862, 56796, 28521, -15897, -47016, -49869, -28783, 5353, 40592, 56721, 39630, -3448, -43052, -53197, -35112, -1922, 30686, 50525, 44961, 11600, -31865, -55996, -45155, -10779, 24815, 46294, 46002, 21730, -18698, -51710]
708e1710j451L0375M0633K7132K903k0438l6420l3519j0745K0754L8791L3063
720C9368J0815j4397l4242l6225j7842J2585L5992L6592J7785q217l0088l7590
732b5464k5191M251L2866L9750K2695l998k6468l5160k7756m414K4274L9606L0285
745D5276K340k2022l4407k9928j1148J5425L6966L6522J2317j7762l5553l1989
757c3963j4146R031L0814L7531K1558q785l4307l6419j8417O378K5497L3535K6294
770D4601K601k5196l9272k8382p30K4491L3755K7675Q387j6333l5787l5616j0739
783e0545J9707L5388L0848J2141j1633l1041l5825j7448J0579L1286L3590J8482
795D5529m251k6834l6303k4993K939K7129L4728K3650K292k0625l5289l0563o656
$$ y = [-51710, -53161, -22786, 17847, 44979, 47882, 27444, -8976, -42495, -53240, -32486, 6305, 39368, 50183, 35786, 1544, -34681, -52523, -39938, -3946, 32646, 50431, 42214, 12126, -25464, -50655, -46404, -13538, 26212, 48907, 44909, 18441, -16719, -44475, -48889, -24615, 14991, 45276, 47616, 25594, -8813, -38741, -49889, -34464, 2502, 39024, 51341, 33579, -1974, -33963, -48109, -39078, -8264, 29267, 50825, 42040, 7733, -28686, -47103, -40725, -15228, 18307, 44601, 47202, 22006, -17266, -45648, -46378, -21887, 11868, 39543, 47930, 31597, -4190, -39806, -50545, -30838, 4550, 35398, 47539, 35906, 4865, -30960, -48408, -37829, -6543, 27047, 45529, 41278, 14444, -21859, -46852, -43913, -16784, 17944, 41594, 43886, 23261, -12028, -42591, -49247]
808d9247K2505L6659K8904N997j7430l0604l0535j4315J2462L4293L4887J2894
820D6470j3079k8408l0702j9293M410K8858L7160K1671o199k7624l2542k2641
832d1919q75K3421L6180K7079Q41k3829l2653k5300n624J6053L2518L0964J0687
845D7543j7282l3656k9871j0443J1800K7393L1894J8666p481l1882l5135j6963
857d5417Q743K5980L0346K1501o58k4509l5300k3661J629K2600L1651K4319N012
870D2236j8058l3560k8532o484J7832L1439K7922J1605j2522l1382l2500j3133
882d5137J3417L0192K9273J4376o810k5209l2746k0864N059K8402L2334J7759
894D0046k391k0494l0193k5239m726K1725L4814K5032K523j9015k8919k6537r827
$$ y = [-49247, -26742, 9917, 38821, 44818, 27388, -3216, -33751, -48066, -35604, -1311, 33576, 46470, 33391, 4983, -25719, -45012, -40602, -11744, 25416, 47087, 40888, 13264, -19278, -41919, -42794, -19373, 16807, 43886, 44727, 20898, -11755, -37055, -42679, -26626, 5892, 36856, 47543, 30261, -3395, -33266, -43709, -31909, -4516, 27378, 46044, 38563, 6681, -28454, -45417, -36674, -10694, 19652, 41153, 40495, 15986, -19314, -42975, -41346, -18746, 12905, 37224, 42236, 24178, -9382, -37914, -44398, -26566, 4873, 32795, 44400, 31878, 496, -32004, -45137, -31720, -1528, 27745, 42121, 35311, 10102, -22644, -43508, -38449, -10047, 22287, 40046, 37655, 17161, -13032, -38271, -42997, -21272, 13542, 38574, 41097, 22082, -6837, -33374, -43201]
907d3201J4242L2716K9538R035j4759k7574k6964j4643P192K7219L2172J7091
919D2064p504k6384k9070j8751J749K1639L2919K3851l09k3501l1813k1574k350
932c9034J7766K9844K6793P329j7829l1422k5424p288J2278K6809K8771J4395
944D2988j0517k9294k9701j3272Q030K4621K9207J8309l330k5761l1555j9470
956c9745M065K2405K8378K0647K623j8926l0657k5093l635J8277K8326K4203P892
969C8760j2722k7927k9097j1366J3389K8769K7252J1327q168k5012k9312j6574
981d0681P294K6777K8876J4786m327k0844k7650k0862l32K2013L0653K0955M71
994C7129j8780k7493k3784n983J6863L0108K5832N648j5801k7831k4591r394J0748
$$ y = [-43201, -28959, 3757, 33295, 42330, 27571, -3, -26967, -41610, -34418, -7199, 24973, 42064, 34560, 8176, -20894, -39645, -37896, -16257, 16662, 40513, 40204, 16703, -15110, -36684, -39034, -21268, 8576, 35369, 42698, 24869, -6553, -31977, -39265, -26987, -178, 28593, 42988, 32471, 3177, -26524, -39796, -31766, -7145, 22062, 40371, 37041, 11280, -20275, -39745, -35680, -13275, 15103, 35750, 38373, 19447, -11210, -36303, -39938, -21661, 6665, 30868, 38760, 26038, -1889, -30986, -42352, -28963, -194, 27058, 38385, 30217, 5205, -24107, -40681, -33387, -6610, 22266, 37052, 32725, 11881, -15769, -36631, -36963, -14950, 15703, 36658, 37129, 18349, -9144, -32928, -38911, -22048, 8060, 33892, 39540, 23739, -4092, -28683, -38077, -27329]
1007b7329K6697K7752J2147j0474k5305k6316j4360M940K2683K8628J8641l717
1019C3987k3039k8490j8379M92J9179K8624K1880K831j8857k9322k1940l214J5317
1032b0931K5067K3952R851j1928k7354k6647r376J0686K3613K5229J4834m351
1044C2645k4033l0031j6450O144K3137K6138J7355n39j9173k8521k1580J23K0027
1057a4758K5555J9475M508j3124k6402k5246q429J5189K7295K3468P734r312k3841
1070B112k6875j4350R050K6574K6688J2094p264k0650k5227j7358J800K1096K7963
1083A5653J7907j044j8798k4568k0151l943J5521K7679K2995M816j5528k6002
1095e463k2535p163J1149K5575K5455R920j1022k5211k3781j0413O519K0494K5536
$$ y = [-27329, -632, 27120, 39267, 28793, 3488, -22828, -37188, -32248, -9565, 19063, 37704, 33987, 10948, -17542, -35921, -35429, -16250, 12374, 34254, 37085, 18228, -11094, -33034, -36248, -20931, 4136, 28088, 37939, 26011, -1343, -27990, -37366, -26680, -3067, 22162, 36996, 32645, 8612, -21419, -37869, -31725, -8588, 17550, 34905, 34366, 15193, -13328, -34908, -34785, -14758, 10797, 30272, 34780, 21656, -4746, -29992, -38421, -23232, 4063, 27531, 35265, 25953, 2112, -24763, -39113, -30063, -3489, 23199, 35293, 28029, 7379, -17848, -35206, -33406, -12310, 15653, 33560, 32516, 13718, -10850, -31001, -34944, -19423, 8256, 31251, 36067, 20539, -5463, -27998, -35161, -24012, 1563, 27018, 36938, 25916, 705, -23076, -33489, -26970, -6476, 19060]
1108A9060J6917l892k3163k6758j5444K591J7754K5320K0070K962j8925k8791
1120a2299k0855o69J6972K3732K0705P040j2817k6143k3426p274J2085K2969K2597
1133B2617J1240o840k2829k6855j3437Q055K2371K4063J4353k398j9272k7086
1145a6018j8931K686K1331K5331J5945P70j4197k4230k1859n279J5993K6200K0048
1158B7790M922j1321k2585k3322j0128R765K4963K4515R826r432k1992k3422j3119
1171c3540N520K1777K5321J3956n148j9814k3087j5162j43J6588K5417J9162O56
1184C1503j7086k4450j8404l901J3075K4571K2586O441j4148k5238k0825o294
1196c2170J0410K1596K2453J0992q147k2469k3107j1175N914J9095K3163J4845
$$ y = [19060, 35977, 32085, 8922, -17836, -33280, -30689, -12935, 12385, 32455, 35417, 16492, -12299, -33154, -33823, -16851, 6881, 27586, 34626, 21809, -4334, -27760, -35034, -22949, 20, 22617, 33857, 27017, 4188, -22667, -36104, -28049, -5678, 18385, 32738, 30340, 11068, -16018, -34949, -32263, -10932, 14399, 30344, 31114, 16917, -7313, -29172, -34451, -18458, 7742, 27790, 32712, 21391, -1194, -24516, -34644, -24879, 84, 24599, 34425, 24993, 3001, -20421, -33540, -28020, -6243, 19078, 33034, 27886, 8072, -15015, -30177, -30320, -13732, 11685, 30847, 31503, 14417, -10033, -28437, -32338, -19263, 5308, 27894, 34335, 20187, -5051, -25876, -32170, -21760, -164, 22289, 33281, 25134, 2665, -20442, -31617, -25703, -6608, 16555, 31400]
1208C1400k154j9351k5101j5795K138J7560K3490J7000K312j6001k5107j9376
1220b8985j771J5341K2514J7866N877j0273k2705k2801p561J1275K2050K0146
1232B0973R029n549j9491k3859j4569N791K1905K4214J1616m297j6648k2076j6853
1245b9814l34J7938K4622J5956m35j4547j9918j8228o173J1310K4115K1486N375
1258C1353j2508k1515j9240q498P509K1694K3673R717r204k0673k0068j0889L201
1271b5448J8226K3570J4205m046j8017k0824j4480j144J3807K3280J9528K059
1283C0716j6210k2674j6474l961J0446K0838K0527P901j0966k2841j9639o595
1295b8932Q252J7702J9972J2302m358j9790k2957j1508M829J6651K0162J4815
$$ y = [31400, 29246, 9895, -15206, -31001, -28863, -11303, 12187, 29187, 31499, 15498, -9609, -28985, -30756, -15415, 7099, 24965, 30842, 20569, -2136, -24937, -32498, -21223, 827, 20973, 30002, 24453, 4962, -18897, -33466, -27675, -5770, 18444, 30060, 25763, 9115, -12961, -29814, -30148, -12210, 12412, 28368, 27933, 13386, -6532, -24760, -30933, -19623, 4492, 25978, 31353, 18845, -2670, -21910, -30408, -22899, -1205, 22468, 32185, 22981, 2308, -17760, -28649, -25448, -7222, 16348, 30553, 26507, 8490, -12334, -26814, -27958, -14151, 9129, 28657, 30716, 14506, -8168, -24642, -28603, -18157, 2681, 23208, 31109, 20143, -2698, -22337, -28932, -20680, -2978, 16994, 29296, 24938, 5148, -17809, -29317, -24488, -7837, 12325, 27140]
1307B7140O59j5895k4302j6453R99J6205K1036J5702L149j1747k1987j8840n102
1320b9436J2127K1059J8353O152p602j8653k0669j1588O996K0883K1419J0262
1332B9303o040j7611k1024j2904K663J7778K2404J2839k432j5532k0081j4842
1344b5479j563J3686K1557J6971J890j2622j9980j7593n797R972K1737K0072O248
1357B9099j0765j9435j8640q384O288J8754K1505J0510o709j8575j9138j0042
1369b5532K307J4426K0565J5215J38j6611k2114j3754O45J2713J8966J7188M896
1382B9048j2854k3054j7610k560J2485J8342J5928O840p006j8862k0691q347Q158
1395b0183J8461J7752R825l244j5796k1045j3932L065J7507K0284J2357p83j3581
$$ y = [27140, 27799, 11904, -12398, -28851, -27852, -11647, 9389, 25091, 28240, 16493, -5494, -24334, -29436, -17309, 3750, 22103, 28255, 20653, 2000, -18669, -30257, -23261, -2378, 19041, 29303, 23263, 5652, -15372, -28276, -25613, -7835, 14569, 27408, 24976, 9444, -10637, -25479, -27042, -13356, 8201, 25172, 27062, 14440, -5540, -23133, -28930, -18958, 2779, 22851, 29099, 18334, -1101, -19741, -28125, -21837, -3083, 18422, 28932, 22223, 3648, -15490, -25532, -23225, -8799, 11766, 26981, 27119, 10508, -11606, -25360, -24715, -12002, 6964, 24152, 29048, 16194, -6860, -24470, -27030, -14545, 3797, 19725, 26565, 19559, 697, -19994, -28341, -20183, -1722, 16030, 25855, 22611, 6815, -14230, -28162, -25097, -7590, 12694, 25051, 24268, 10687]
1408A0687k0336j5578j358J4790K0094J4566K114j0493j7980j7676o085J0135
1420a7120J9816J7590N764p413j7074j8813j0408N850J9413K0595Q955n626j6687
1433D842j8066j1859J149J5661K0348J3241j554j4086j7635j4076l173J0699J9824
1446E315J7490L979j2084j8871j6174n334P551J7744J9510Q178q883j8806j7666
1459a8051p002N573J4863J8091J1737k281j6244k0273j1327K574J3640J7253J4130
1472B2683K678j1715k0966j6553j361J2729J8289J4772M406q621j8097j7650o109
1485b5515Q317J7871J6618P266n470j5200j8681j0302M403J5790J7933J0829j733
1498B2126j3609j9321j3950O63J4810J8760J2106J167j0777j7482j5473m737J0848
$$ y = [10687, -9649, -25227, -26585, -11795, 8299, 22865, 24979, 14486, -3494, -21170, -27255, -17120, 2696, 20286, 26050, 18637, 1563, -17250, -27658, -21808, -2395, 18200, 27155, 21529, 4842, -13224, -25083, -23934, -8273, 12075, 25316, 23762, 9676, -7959, -22035, -25208, -14509, 5315, 22805, 26784, 14700, -4171, -20345, -25679, -18128, -384, 19126, 27304, 18421, -385, -18051, -25053, -19480, -4617, 13474, 25211, 22930, 6686, -13587, -24914, -22340, -8700, 8553, 22683, 25361, 13646, -7320, -23873, -25234, -12505, 5784, 20556, 24962, 16341, -1756, -19406, -25515, -17198, 673, 17291, 24557, 19087, 3887, -14794, -25096, -20693, -4903, 13030, 23859, 22126, 8517, -10804, -24754, -24091, -9281, 9479, 21585, 22752, 11975, -5507, -20980, -25717, -14869]
1511a4869J9240J5383L631q088j5691j6024q810N250J8113J9281P927o950j5506
1524B887j6348j0010K069J5020J9948J1203l662j4867j7282j0295j11J1438J8332
1537H322J4355J418j3064j8041j3442k391R315J6513J6686N589r457j8616j5937
1550a8750m676P173J5163J6181R365n365j6502j7885q135M960J3244J6114J0899
1563B1786l48j3358j8628j1784N48J2561J7038J2489J945j0173j8132j4583k580
1576b3219J1072J6555J3686M149p292j5569j6554o669P469J6481J5043O899l664
1589A8387j3856j7189j0968L503J5401J7139R714k258j2074j6355j2585q26J2270
1602i697J7923J2269J95j0575j4989j2705m500Q027J6707J5270M709q349j5172
$$ y = [-14869, 4371, 19754, 23385, 15297, -394, -16418, -25228, -19978, -1865, 17416, 25343, 18393, 2887, -13461, -23471, -21402, -6382, 13566, 24769, 21107, 6240, -11042, -21337, -21448, -10010, 8322, 22677, 24095, 11031, -7010, -20452, -22843, -13528, 2985, 19671, 25260, 15803, -2813, -18750, -23426, -16253, -1090, 15091, 24456, 19091, 2589, -15296, -23431, -18471, -5227, 10887, 21786, 21438, 8080, -10548, -22332, -21784, -9223, 7815, 20304, 22249, 12076, -6056, -20639, -23219, -12147, 4408, 18094, 22243, 14951, -618, -17172, -23841, -16372, 109, 15152, 22051, 18387, 4531, -12658, -23626, -20123, -4722, 12417, 22131, 19873, 7799, -8556, -21141, -21967, -9697, 8226, 20495, 20690, 10115, -4874, -17579, -22079, -14052, 2655, 17925, 22634, 14285, -887]
1615h87j4694o576M460J5175J7198Q376n422j5109j5206q166J908J2243J6572
1628I872J2012j313j3274j6187j0551j96Q956J5551J4021L764r610j7243j4079
1641a8277k718P932J4357J4587O669n969j6279j6304n646N768J3793J4393Q274
1654B0580j894j2963j7008j0257K711J2324J5309J0678N58j0247j7156j3441q27
1667b1633J1773J6160J1664K223p751j5501j4586m556Q450J6129J2902M682m968
1680A4988j3352j5132q472M531J4969J6085P201l375j2117j4808j0682K93J2577
1693g294J7462J0749j856j0725j4543j1209k918Q827J6289J3542K601r417j4300
1706b792j2022n323M956J4627J5444P084o442j5164j3983o306L240J2126J5843
$$ y = [-887, -15581, -22157, -17697, -2522, 14676, 23052, 17630, 2521, -12685, -20851, -18943, -6700, 9872, 21884, 20571, 7297, -8890, -19441, -19637, -10681, 4870, 18891, 22655, 13045, -4198, -18277, -20995, -13063, 1294, 15881, 22550, 16581, 302, -16002, -21648, -15880, -2087, 12306, 20580, 18686, 5723, -11285, -21542, -18831, -6507, 8802, 19480, 20038, 9791, -7365, -20806, -21633, -9860, 6300, 17964, 20187, 12436, -3065, -17651, -22207, -13757, 2372, 15274, 19956, 14988, 1636, -13496, -21968, -17437, -2468, 13617, 20818, 17443, 5326, -9482, -20164, -19871, -7294, 10168, 20917, 19061, 8336, -6207, -17416, -20334, -11507, 4782, 18324, 20925, 11508, -2792, -14814, -20137, -15181, -554, 14890, 21974, 15532, 368, -13615, -19921, -16681, -4555, 11288]
1719A1288R635l055j3719j5375q297K079J0030J4211J1524J933j0910j6106j1732
1732a8494j033R447J3472J2889M274o882j5623j4592l684P002J3988J2846O217
1745A9827m004j2987j5534p672M813J2658J3727P882j195j0684j5437j0725L65
1758a8966J1643J5165R903R28q817j4184j3158k927Q963J5337J2056K584o389
1771A2138j3012j3546o039N534J4182J4390N622m915j1968j3070q651J729J2704
1784d902J5800R048l149j1300j3442r410r81R585J5573J1857O97j0695j4210r911
1798a5440k848P097J3088J3719M897p442j4727j2521m624M791J2480J4060P600
1811B0130m367j3502j4111o817L193J0712J3540R819o81j1737j5238r181Q91R653
$$ y = [11288, 20923, 17868, 4149, -11226, -19523, -17444, -7414, 6797, 18321, 20254, 9344, -6762, -18494, -19527, -10080, 3392, 16281, 20555, 13673, -1950, -16542, -20226, -13224, 764, 13610, 19827, 15823, 2836, -12698, -20370, -15557, -2899, 10828, 18710, 17515, 6831, -8606, -19331, -18966, -7323, 7842, 17745, 18673, 9856, -4328, -17486, -20413, -11450, 3887, 15943, 18527, 12138, -874, -14420, -20459, -14925, -743, 13647, 19269, 14354, 2386, -10684, -19335, -17606, -4902, 10898, 19946, 16797, 5497, -7945, -17355, -18336, -8751, 6822, 18679, 19376, 8681, -5529, -15440, -18288, -11191, 1897, 15616, 20513, 13071, -1656, -14177, -18801, -14010, -1530, 12530, 20130, 15763, 2261, -11850, -18667, -15474, -4762, 8778, 18597, 17916, 6179, -9059, -18240, -17349, -7696]
1825g696J3013J0962K548q094j5532j2544k142Q776J3235J1791M475n028j3537
1838B27j4464n735O009J3126J2956N931k592j1054j4533q840K165J2271J3352
1851H819Q673m55q671j4121j1791j358J0368J4854J0445R00p875j1933j2590m759
1865a9494O534J4870J3110L509o273j1911j1642p381K904J2690J4324P969m325
1878A4884j1803j2833p759L73J0596J4373J0298p57j0894j3634r040q35P887J3309
1892D165J1806K415q311j4012j0607k309N613J2070J2710O058n914j3862j3058
1905a3236m371M939J1140J2411P611k445j2376j3810p911L217J0307J2198Q728
1918A6402M98r066j4432j0553J35R337J2153R829K866o825j3416j2730k810P346
$$ y = [-7696, 5317, 16279, 18827, 10733, -4799, -17343, -19485, -10709, 2526, 14317, 18792, 13764, 227, -14237, -19972, -13963, -837, 12119, 18050, 15458, 4404, -10129, -18969, -16804, -4533, 8819, 17492, 17037, 8366, -5755, -17546, -18904, -8536, 6318, 16763, 17663, 9788, -2145, -14735, -19494, -12960, 1910, 15020, 18529, 12256, 345, -11297, -18678, -15774, -3084, 11240, 19209, 14884, 3081, -9752, -17511, -17138, -6542, 7831, 18129, 17372, 6478, -7156, -16196, -17031, -9144, 4165, 15971, 18386, 10075, -3937, -14544, -16853, -11240, 830, 13540, 19598, 13684, -178, -13236, -17607, -12668, -1528, 10883, 18494, 16049, 3673, -10137, -18048, -14831, -4524, 7674, 16402, 16900, 7834, -6598, -17151, -17016, -7679, 4474, 14303, 17169, 10344, -3072, -15802, -18612, -11266]
1932a1266J3321J0607M047m270j1771j3155o798N139J3527J1774N684l148r550
1945D141j2396r222P08J1738J4046Q006j095q961j1911r874k685Q543J3970J1187
1959A6195J441q345j1879j0544l955N662J2702J2154M351n938j1570j1771n391
1972a6888L363J0588J2947P421l270j1356j2431p225J596R341J3016R412k23j0175
1986F116j3153q865l22Q075J1603J0603L284p476j3423j0805k394O029J1530J0967
2000A1769N813m105j2529j2556m983M289J0530J1179P198j351j0408j3554q123
2013a6831J974J0449J1645P834L31p441j2828j0447j392Q962J2103R172K144n755
2027I920j1210j1915m702O072J2994J1326L403m634r949j1748o747K806J1934
$$ y = [-11266, 2055, 12662, 16709, 12439, 668, -12487, -19285, -14146, -619, 11155, 16839, 13691, 4141, -8255, -17477, -16769, -5031, 9015, 17021, 15926, 6965, -4946, -14820, -17505, -8962, 5008, 16195, 17636, 9291, -2588, -13132, -17087, -11425, 1277, 13431, 17782, 11844, 274, -11497, -16888, -13525, -2937, 10010, 17431, 14161, 2805, -9626, -16851, -15255, -5914, 7102, 16514, 16291, 6116, -7037, -15902, -16224, -8149, 3454, 14057, 17341, 9865, -3558, -14363, -16757, -10728, 802, 11769, 17582, 13477, 948, -11608, -16591, -12302, -1772, 9407, 16605, 15254, 4846, -8708, -16831, -14857, -4408, 7237, 15071, 15402, 7961, -4867, -15314, -16706, -7744, 4359, 13531, 15675, 9920, -1290, -13205, -17907, -11835, 1159, 12485, 15888, 11254, 1305, -10443, -17190, -14384, -2450]
2040b450J2175O258k783r520j0859q153J60Q502J3365Q891j00q760j1416q699
2054a3389k366O553J2626J0899K330o975j1601r912l440L841J1160J2051N177
2067A6954m441j1482j0979n092K100Q743J2534P833j263j0508j2514o818M91P767
2081f675J1816Q870J846q178j2538r756p03O622J0324R900M025m779j1690j1577
2095a2493l918N605J0084J0441N389k136j0280j2194o711L205J0425J0880O368
2108A4665p20q047j1823q782J17Q999J2016P427M19o343j0738j0083k731O699
2122h925J2126R526K226n285j0144j0348n075M184J1255J1332M538m217r642j0213
2136h662o561J816R256J1624P242j457q673j0933p434r05O993J2118R442R85p877
$$ y = [-2450, 9725, 15983, 13200, 3680, -7179, -15332, -15172, -6670, 6695, 15586, 15486, 6726, -4690, -13389, -15755, -9202, 3424, 14323, 16653, 9678, -1923, -11835, -15275, -11434, -274, 11777, 16954, 12513, 1031, -9948, -15040, -12940, -4197, 8337, 16170, 14907, 4399, -8115, -14933, -14442, -6675, 5141, 14011, 15857, 7679, -4859, -14615, -15318, -8696, 1628, 11528, 15553, 10774, -916, -12493, -16411, -10806, -722, 9719, 15108, 12972, 2692, -9502, -16213, -13008, -2583, 8297, 14665, 13945, 5898, -5925, -14707, -14590, -5591, 6425, 13852, 14271, 7928, -2810, -12893, -15624, -8925, 3201, 12727, 14953, 9668, -476, -10824, -15899, -11715, -460, 10872, 15410, 11193, 1551, -8662, -15223, -13407, -4151, 7473, 14715, 13258, 4585, -6348, -13782, -14687, -7694, 4424, 13866, 14851, 6974]
2151F974j0629q386k976N213J1128J0585M154n630j1215r581m017L575R047J0745
2165H987O589k485r695j1736n635J475Q102J0337Q027Q84q043j2431q348J1P200
2180f761J0396Q596K413n496j1748j0018k539N959J0257R042M000l462r793j1133
2194a0287n323L832R954J0148N593j551q565j1221p430J062R278J1522O154j76
2208A2990o520j0312r015j828P202J1237R110J142n341r810r459m106M609J0869
2222G68J0572L775m879r137r737n220K283R097J1267N737k346r154j0177o034
2236a3185J81P413J0823Q429j44q022j0429p541j080N559J0388R519K735o413
2250H233j0770r143k411M882R098R984M306l360j0071j0072m374L509P875R458
$$ y = [6974, -3655, -12041, -15017, -9804, 1324, 11909, 16063, 10433, -782, -10363, -14380, -10805, -1758, 8987, 15576, 13091, 3396, -8340, -13975, -12500, -4398, 5939, 13966, 14850, 6807, -5624, -13972, -13961, -6761, 3635, 12231, 14644, 9148, -2600, -12618, -15157, -9198, 1059, 10101, 14101, 10639, 846, -10287, -15610, -11778, -1824, 8324, 13917, 12366, 3801, -7420, -14850, -13788, -4510, 7012, 13166, 12990, 6470, -3842, -12857, -14685, -7483, 3754, 12864, 14006, 8665, -1145, -10604, -14710, -10101, 768, 11340, 15115, 10236, 1099, -8638, -13858, -11575, -2478, 8789, 14526, 12180, 3026, -7151, -13185, -13004, -5591, 5232, 13661, 13517, 5495, -4934, -12475, -13555, -7996, 2392, 11911, 14646, 8233, -2537, -11680, -14091, -9209, -111, 9873, 14179, 10819, 748, -9324, -13698, -10189, -2314, 7144]
2264G144O470o05q640j1394o386R59P872R954P455J153p072j1062q469o24O638
2279f607J0024P683K531m426j0030r984l609N050R835R344L361k830q787j0008
2293h453n996K437R688J0134N050j389p909r685p147R4P831J0744O954J21o826
2308E648r161q065j920N747J0562Q691K349n452r764q237l664L368R494J0351
2322I947M173l675r402r142m554J751P877J0157O533j415q184r883o074j63O154
2337e900R675Q506J446o931j0704p661j607N476R232Q663L028m493r991r320k538
2352a3119L727Q515Q925M732j984q613j0392n361K575Q046R044N914J79o928j0506
2367e246p343K42O932R762P109J134n057j0017q099k558N700R343Q228K539l898
$$ y = [7144, 13614, 13009, 4369, -7025, -13411, -12452, -4580, 5374, 12829, 13982, 6910, -4152, -12621, -13245, -6607, 3417, 11100, 13631, 9205, -825, -10809, -14418, -9368, 467, 9811, 13172, 10342, 1555, -8453, -14449, -12012, -2324, 7810, 12860, 11471, 3562, -6123, -13270, -13176, -5345, 5399, 12353, 12474, 5648, -3513, -11578, -13498, -7751, 2811, 11502, 13851, 8399, -1365, -9602, -13266, -9898, -404, 9947, 14120, 10445, 1043, -8099, -12653, -10902, -3025, 7132, 13665, 12250, 4066, -5817, -11891, -12054, -5900, 3775, 12281, 13727, 6796, -3908, -11569, -13176, -7700, 1532, 10195, 13223, 8730, -1261, -10581, -13119, -9392, -877, 8048, 12780, 10796, 2183, -8209, -13570, -10995, -2949, 6095, 12009, 12188, 5260, -5246, -12589, -12347, -5415, 4347, 11456, 12590, 7533, -2484, -10583, -13141, -7441, 1902, 10130, 12669, 8771]
2382H771p835r390m849L317R086R679M187k770p556r346o086Q66Q225J0073O003
2397A2375j413o805q676p055p84N902R950Q174N56n933r134p418k643M440R414
2412I50R230K984m960r234p783l483K851Q585R094M999l219q431r070m244J460
2427a0271O937R053O666O5p712r986o381O77N552Q975P712J559n742j0202p707
2442a0805j187M873Q294P888K896l750q725q519l619L682Q276Q094M298j879p564
2457B253r150n942J830P847R336M786l0o205r191p174k71O578R196O850N96m963
2473F346q109p770k583M293R425P729K661l542q230p958m099K220Q559R279L918
2488A2139k324p622q057n725J270O665Q944O528j159o456q235o182j174N179Q797
$$ y = [8771, 936, -8454, -13303, -9986, -900, 8779, 12966, 10196, 2640, -6706, -12792, -11926, -3701, 6372, 12375, 10962, 4157, -4519, -11574, -12358, -6456, 3494, 11668, 12224, 6291, -2843, -10261, -12904, -8464, 950, 10180, 13164, 8204, -1030, -8813, -12296, -9445, -860, 8234, 13233, 10014, 1583, -7487, -11731, -10271, -3334, 5719, 12385, 12450, 4738, -5248, -11629, -10952, -5400, 3575, 11287, 12846, 7104, -3098, -10805, -11992, -7119, 1175, 9063, 11959, 8209, -516, -9035, -12654, -8972, -696, 7398, 11696, 9817, 2253, -6897, -12839, -11009, -3162, 6174, 10960, 10930, 4725, -4466, -11640, -11911, -5333, 3863, 10713, 11309, 6346, -1763, -9533, -12116, -7823, 1602, 9331, 11992, 8450, 220, -7738, -11837, -9617, -1058, 8221, 12139, 9815, 2193, -5864, -11589, -10319, -3654, 5290, 11818, 10659, 4203, -4032, -10214, -11388, -6209, 2588]
2503B588P814J396n511q743p236k012L979Q117Q621L271m072q507q461k855L042
2518h569P185Q335N019k143p405q469n657J755O325Q295O257L55o425r319o538
2533a0999j79O130P926P023J600m487q896p628k211M768Q080O832L180k684p353
2548A102q876m103K734P810Q249M133j544o338q971o003R72O963Q745N579j63
2563A0289n612q190o491j490N414Q966O681J324m596p598o762l255L315Q374Q024
2578H393L085l260p681p589m270K020P378Q753M878k513o995p475n146J84O098
2593d140Q739N969J83n986q534o022q27M495P979P007K645m792q503p080k032
2608a0899L755P220P245L727k729p872p891l525K527O462P615N033j141o291q624
$$ y = [2588, 10402, 11798, 6287, -2456, -9692, -11704, -7725, 392, 9013, 12284, 8212, -295, -8756, -11611, -8569, -1384, 6951, 11970, 9827, 2422, -6047, -11704, -9949, -3624, 4671, 10928, 11283, 4858, -4461, -10999, -11178, -5048, 2878, 9901, 11501, 7014, -1882, -9510, -11721, -6953, 1127, 7959, 11139, 8455, 1102, -7774, -11877, -9143, -1333, 6916, 11049, 9505, 3167, -5804, -11807, -10835, -3872, 4873, 10452, 10289, 4677, -3513, -10004, -11494, -6080, 2886, 9567, 10891, 6295, -1303, -8065, -11320, -8005, 369, 8393, 11478, 8218, 537, -7052, -11322, -9302, -1924, 6829, 11707, 9194, 2199, -5276, -10422, -10238, -4140, 4599, 10568, 10751, 4765, -3769, -9791, -10618, -6123, 1856, 8863, 11508, 6716, -1787, -8867, -10899, -7144, 76, 7321, 11048, 8319, 447, -7444, -10969, -8442, -1980, 5635, 10668, 9527, 3236, -5388]
2623e388n105M46O633P587N514O34n072q451o981j93N096Q048O130J847m138p844
2639a237p049k590M129P616O844K645k088o967q093m196J949P651P784L819j721
2654H496n755p972n136L43O152Q721N355n30n453p310o081j550M846Q084O718
2669H928J477m173p378o599k790L006P498P853L182l341p338o934l742J762O579
2684b010P869M532j291o702p206m664J08N241P545O058Q42n467p719o180q67M260
2700e651P620O346K018l693p532p468k024L408O986P014L281k146o894p958l703
2715a0396K111O527O717M563n28n517q038n339J74N927P310N341J047n013p049
2730b163o692j387M172Q047O345J288l116o683o662l383K695P046P019L570k186
$$ y = [-5388, -10493, -10047, -3414, 4173, 9687, 10321, 5249, -3202, -10183, -10376, -5280, 2768, 8898, 10745, 6607, -1237, -8286, -10876, -6747, 869, 7713, 10358, 8270, 1303, -6790, -10986, -9037, -1386, 6398, 10217, 8496, 2741, -5231, -10367, -10024, -3872, 4849, 10204, 9674, 4221, -3089, -9170, -10720, -5874, 2210, 8928, 10405, 6232, -1146, -7745, -10535, -7529, -31, 7822, 11004, 7663, 325, -6609, -10351, -8589, -2010, 5859, 10391, 9100, 2398, -4808, -9472, -9364, -4123, 3422, 9480, 10322, 4855, -2864, -9044, -9911, -5651, 1969, 8315, 10333, 6640, -892, -8360, -10384, -6976, 10, 7024, 10305, 8159, 1265, -6693, -10396, -8285, -1758, 4959, 9522, 8994, 3477, -4561, -9900, -9726, -3799, 3511, 8852, 9899, 4886, -2163, -8855, -10242, -6070, 1977, 8322, 9610, 6494, -189, -6851, -10234, -7539, -493, 6526, 10096, 7910]
2745G910o122p228m435P92O177Q162M510q31n682p176n130l66N077O948O327K58
2761I191m032p351n724j859K904P323P161K609l542o702o749k989K189O472P072
2776E973M026j817o283p148m214J066N701O835N007k4n125p987m721m7M169P275
2792B686N654J182l904p179o468j614M001O440O255K269k670o527o455l261K293
2807g298O226O518L614r44n682p234m870O78N809P139M704mm433p016n663j202
2823i658N026P178N584R89l794o288o137k594L087P007O340K571k493o012o277
2838e471l496J109O116P251L749p59o234o452m434K01M705O925N458L62m900o948
2854b818m813j512L904O587O077K024l654o678n982k326K752O027O966K893k074
$$ y = [7910, 1788, -5440, -9875, -9083, -2906, 5256, 9766, 8935, 3253, -3923, -9053, -9419, -4342, 2606, 8933, 9191, 5159, -2192, -7916, -9775, -6871, 452, 7613, 10222, 6680, -22, -6771, -9760, -7571, -1099, 5973, 9999, 8182, 1899, -5249, -9463, -8397, -2696, 4139, 9146, 9122, 3997, -3990, -8711, -8758, -4589, 2686, 8340, 9522, 5618, -1561, -8029, -9643, -5642, 798, 7053, 9322, 6652, 125, -6330, -9591, -7298, -1072, 5446, 9060, 8116, 2434, -4800, -9670, -8992, -3183, 3956, 8660, 8656, 4223, -2793, -8456, -9658, -4632, 2546, 8130, 9119, 5325, -963, -7100, -9694, -6607, 400, 6740, 9311, 6818, 806, -5471, -8967, -7858, -1742, 5509, 9258, 8499, 2265, -4187, -8621, -8420, -3715, 3210, 8668, 9030, 4130, -2818, -7631, -9143, -5239, 1348, 7425, 9449, 5795, -883, -6865, -9191, -6439, -412, 6554, 9447, 7373]
2869G373o442o782l197J955N095O559M062p65n077p023m539Q43M418O596N098
2884H174M36m149o710n518j304M053O599N986J715l058o743o233k139K772O053
2899f6O371K608j839n325o761l961J137N974O045M284k90m955o598n004k39M771
2915c848P266M979J18m083o417n255j797L478O743N908J628l062n787o097k558
2930h784J972O509O176L335k205n794o368l318Q61N209O899M513q48n520o609
2945c972m300K10M730O569N002P50m461o563n449j170L659O042N817K215k915
2960F164o309o479k006K183N809O114L058j374n981o454l658J621N061O361L987
2975H097j70m410o958m966K44M459O377M476J021l516o591n410j433L474O670
$$ y = [7373, 931, -5851, -9048, -7093, -1998, 4561, 8623, 7858, 2781, -4242, -8781, -7938, -3520, 3076, 8174, 8610, 4461, -2249, -7767, -9071, -5018, 1581, 7567, 9282, 6224, -519, -6752, -8891, -6119, -66, 6305, 8913, 7074, 1749, -5012, -8973, -7836, -1862, 4183, 8467, 8177, 3222, -3376, -8380, -8619, -3848, 3418, 8397, 8515, 4432, -1985, -7240, -9037, -5559, 1184, 7092, 8720, 5658, -129, -6226, -8784, -6812, -303, 5873, 9208, 7003, 1209, -5159, -8477, -7616, -2407, 4492, 9005, 8157, 2637, -3972, -8272, -8062, -3332, 3237, 8239, 8989, 4528, -2035, -7484, -8654, -4995, 1047, 6864, 9079, 6164, -145, -6624, -8630, -6447, -638, 5476, 8534, 7160, 1179, -5275, -8933, -7312, -2251, 4110, 8097, 7927, 3517, -3441, -8407, -8163, -3704, 2673, 7149, 8170, 4654, -1937, -7347, -8780, -5306, 1364]
2990A364N269J818k712n649n903k927K707N466O245K536j350n172o189l882Q39
3005g540N447O294L777k92m781o115m226o50M072O612N130J52l499o123n041j451
3021h234L043N889N647K188k680o313n452k684J844N651O114L311j300n360o320
3036d656l676J060M727O167M359j98m577o005m328l24L607N971M890J740l657
3051E100o045n542j799L085N665N453K581k149n709o471k800K269N362N651L280
3066G931q19m636o163m264M93M516O140M175Q9l948o124m579j055L728O126M962
3082F572J210k934n332n882j706K310N682N524K569k130n122n315l418J233N101
3097a638O167L414r24m694n590l930l94M377O087M617j35l614n817m550j078L266
$$ y = [1364, 6633, 8451, 5739, 90, -5813, -8740, -6033, -567, 5678, 8214, 6864, 1692, -4497, -8379, -7540, -2093, 4201, 7978, 7686, 2905, -3210, -7436, -8086, -4014, 2598, 7728, 7880, 4381, -1742, -6783, -8234, -5191, 698, 6345, 8533, 5853, -460, -5912, -8596, -6752, -1101, 5013, 8324, 7024, 1664, -4656, -8332, -7272, -2545, 3622, 7981, 7783, 3206, -2799, -7127, -7451, -3844, 2127, 7017, 8757, 5100, -945, -6487, -8286, -5201, 464, 5917, 8498, 6349, 640, -5831, -8631, -6362, -1000, 4651, 7931, 7112, 2476, -3687, -7951, -7458, -2942, 3198, 7373, 7462, 3514, -2610, -7189, -8244, -4516, 1610, 6572, 7782, 4848, -484, -6366, -8072, -5762, -80, 5444, 8013, 5883, 761, -4554, -7972, -6739, -1638, 4529, 7943, 7019, 2325, -3265, -7195, -7589, -3212, 2875, 7492, 7357, 3743, -2074, -6624, -7702, -4436]
3113d436N625N063J642l027n400n115j873J678N329N774K437j450n341n994k619
3128g707J120M750N537L687l27m585n998m050M62L524N886M663N64l757o067m145
3144f443j015L060N340M993J680k576n095n299k539K274N278M927L119j441m589
3159A674n702l737J059M561N734L547p6m047n431m586k75L894N535M020J384l431
3175D123n485m518j993K998N575M829K115k673m601n131k692J454M655N926K797
3190G379j350m430n319l498L27M280N558M266K7m279n547l729p76L328N548M596
3206F381J039l214n331m533j669K766M908M948K286k024n187n464k222J668M682
3221i66N150L098j007m358n498l329J61M384N267L682K48l506n617m064o21L186
$$ y = [-4436, 1189, 6252, 7894, 4867, -533, -5648, -7521, -5843, -514, 5260, 7697, 6247, 906, -5088, -7707, -6587, -1837, 3700, 7387, 7060, 2475, -3523, -7573, -7111, -3587, 2299, 6962, 7526, 3769, -2298, -6443, -7458, -4398, 942, 5935, 7615, 5039, -56, -5355, -7894, -5620, -342, 4585, 7704, 6263, 1674, -4028, -7765, -6706, -2145, 3589, 7136, 7060, 3013, -2418, -7004, -7279, -3385, 2150, 6170, 7554, 4123, -1362, -5880, -7873, -4875, 700, 5529, 7644, 4971, 370, -4761, -7453, -5999, -1344, 4582, 7379, 6029, 1599, -3720, -7218, -6891, -2611, 2947, 7213, 7240, 2961, -2586, -6315, -7091, -3763, 1785, 6381, 7420, 4206, -1125, -5658, -7327, -4561, 347, 5295, 7581, 5557, 370, -5094, -7316, -5648, -966, 4184, 7282, 6275, 1917, -3581, -6910, -6749, -2365, 2902, 6584, 6832, 3326, -2291, -6355, -6976, -3790]
3237c790N162M636R03k267n380m988j590K457N064M761K304k071m385n409k617
3252g210J329M571N509K906o53m340n611l425O31L768N666L661P5l553n423l908
3268f007r00K847N728M269J070k625n273m594j388K031M981N053J953j924m920
3283C01m864k472J514M146N510K668j074l990n356l122M24L846N287L541M44l941
3299B862m808m418k32L230M605M466J373k688n341m450j342K380M622M706K166
3314G131j765n038m934k366J283M831M643K887n47m574m945l362L76M171N272
3329C063L045K23l531m729m414l65L203N097M093Q29k739m456m560j879K503M810
3345A93M614J877j667m358m932k356J130M470M875K660k47m636m675l061K45L584
$$ y = [-3790, 1372, 6008, 6911, 4644, -736, -5724, -7314, -4857, 207, 4968, 7272, 5201, 816, -4593, -7210, -5881, -1310, 4199, 7105, 6452, 2112, -3499, -6924, -6293, -2525, 3141, 6802, 6877, 3324, -2099, -6007, -6907, -4060, 1668, 5937, 7007, 4382, -891, -5485, -6873, -4842, 139, 5192, 7145, 5221, 301, -4563, -7035, -5521, -1375, 4135, 6803, 5729, 1739, -3617, -6739, -6315, -2469, 2818, 6359, 6803, 2862, -1946, -6364, -6596, -3366, 1239, 5705, 7078, 4390, -951, -5401, -6743, -4363, 259, 4965, 7131, 5366, 328, -4606, -6972, -5689, -858, 3785, 6672, 6125, 1551, -3394, -6756, -6380, -2209, 3063, 6108, 6331, 2800, -1929, -6343, -6708, -3505, 1592, 5685, 6514, 3775, -681, -5241, -7120, -4617, 193, 4807, 6684, 5017, 659, -4273, -6629, -5499, -1029, 3846, 6506, 6259, 1623, -3052, -6113, -5868, -2284]
3361b284N411L295n6l783m897l390o67K712N177M099J163k800n076m044j421K103
3377d458M490M941J679j686m586m391k504J625L646M865K754p22m207m761k992
3392f307P02K958M955L406N49l405n104l457r53L419M537L916J069k455m645m273
3408e088j434K323M285M532J661j353m225m830k297J165M376M506K548o17l671
3423A881m711l130J25L418N343K976J98l109m765l586p89K834M605L976R79k485
3439C760m699l690j542J861M358M690J533j871l923m504j800Q56M003M426K956
3454F414j165l853m393l075O89L254M881L180Ml193m888l187p42K750M418L984
3470E078J366k457m750l963j575K264M152M315J744j621m191m175k313J059M000
$$ y = [-2284, 3127, 6422, 6366, 2583, -2314, -5704, -6371, -3659, 1518, 5617, 6780, 3980, -1096, -5140, -6561, -4458, 32, 4973, 6652, 4966, 380, -4011, -6515, -4890, -1244, 3621, 6375, 5653, 1446, -3315, -6307, -5605, -2647, 2308, 5714, 6263, 2858, -2246, -5703, -6656, -3237, 1300, 5216, 6285, 3830, -815, -5088, -6522, -4199, 86, 4618, 6279, 4926, 701, -4129, -6426, -5261, -885, 3621, 6169, 5552, 1881, -2830, -5960, -5835, -2417, 2926, 5902, 6100, 2991, -1774, -5360, -6149, -3315, 1290, 5266, 6245, 3760, -939, -4629, -6171, -4310, 48, 4738, 6271, 4400, 477, -4027, -5827, -4971, -968, 3458, 6414, 5249, 1396, -2997, -6072, -5383, -2129, 2752, 5932, 5936, 2743, -2145, -5332, -6074, -3324, 1094, 5078, 6444, 3987, -763, -4726, -6301, -4037, 115, 4430, 6174, 4553, 362, -3813, -6126, -5067, -1067]
3485a067M228K560l94l503m597l077O00K987M549L250K74k963m753l454n20K763
3501c117M277L938Q82k250m260m117j271J947L942M076J628j422m161l976k239
3516f123J090L959M498K566q93l748l971k706n29L665M579L229n9l160m220l425
3532e248l01K586M384L619R74k597m014l919j230J869M103M143J608j973l811
3547A93l985k016J100L619M329K581j054l468m161k501J66L329M041L073K66l091
3563B421m410l400k65K398M433L603R27k199m574l495j066J913L936L546K083
3578E851j432l604m460j806R37L589M363J992o66l334m257k478m60L835L897L300
3594E267o5k696m097l244p63K393M265L434J233k226l857l520j781J353M313L987
$$ y = [-1067, 3161, 5721, 5327, 1824, -2773, -5850, -5250, -2263, 2286, 5536, 5810, 2847, -1906, -5360, -5880, -3117, 1160, 5098, 5980, 3730, -530, -4647, -5918, -3971, -29, 4047, 5675, 4253, 92, -3884, -6123, -5033, -1074, 3424, 5990, 5097, 1349, -2622, -5328, -5857, -2192, 2387, 5616, 5557, 2397, -1823, -5248, -5549, -2963, 1421, 5040, 6014, 3417, -597, -4516, -5746, -3877, 226, 4369, 5977, 4004, 193, -3792, -5808, -4708, -1089, 3240, 5821, 4767, 1299, -2862, -5363, -5197, -1868, 2173, 5246, 5512, 2421, -1989, -5389, -5654, -3256, 1177, 4780, 5707, 3508, -1066, -4561, -5627, -3714, 222, 3768, 5851, 4419, 815, -3645, -5451, -4514, -925, 3438, 5430, 4764, 1430, -2827, -5305, -5765, -1930, 1967, 5267, 5202, 2506, -1591, -4835, -5598, -3205, 1060, 4494, 5727, 3501, -356, -3876, -5657, -4304, 9, 3996]
3610C996J719j388l576m082k322R99L270M413K236n60l022m075k824J17K886L939
3626A726L364K36k850l603l332j038K087M191L633J245j874m159l883j252J621
3641c888L633L925J646j005l903l676j939O73L267L896K836p89l007m066k578
3656d975k7K793L951L115N96k805l789l577p12K229M031L463J228j930l955l622
3672c986j512J607L701L454K187j454k960m065k324R42L262L700K550o13k661
3687A828l798l112o7K916M071K756K88k168l662l198j138K050L858L195R84j569
3703C234l351l513j588J171L461L774K086r64l671l353k410O26K954L994K705
3718E155n12k629l939k514n98K755L749K962O81k271l907l112o85J448L893L580
$$ y = [3996, 5715, 4327, 751, -3331, -5653, -4654, -1384, 3029, 5265, 4705, 1683, -2392, -5216, -5099, -2213, 1726, 5090, 5326, 2476, -1127, -4459, -5497, -3410, 781, 4414, 5659, 3785, -374, -4257, -5509, -3888, -255, 3670, 5316, 4311, 408, -3268, -5207, -4534, -1267, 2629, 5465, 4676, 1669, -2397, -4975, -5002, -2209, 1742, 4857, 5453, 2648, -1141, -4718, -5430, -3201, 830, 4293, 5521, 3591, -364, -3986, -5498, -3891, -190, 3264, 5451, 3997, 1037, -3028, -5352, -4410, -1148, 2552, 5102, 4489, 1828, -1970, -5082, -5149, -2233, 1838, 4594, 4882, 2714, -948, -4146, -5284, -3234, 624, 3819, 4803, 3234, -117, -3630, -5218, -4047, -586, 3188, 5274, 4310, 639, -2714, -5124, -4498, -1544, 2450, 5155, 4643, 2014, -1925, -4439, -5037, -2282, 1467, 4429, 5110, 2839, -1068, -4180, -4865, -3417, 476, 4056]
3734D056J059j518l373l799j422J415L237L635J806j307k942l714k175Q40K927
3749a275L488K613k18k588m110k542k65K668L576K911P40k061m123k994p50K061
3765b869L132L770P80j677l017l501j433O57L533L771J955j431k215m037k257
3780d839M86L061L594K302m5k616l441k842m78K527L519L004O11k014l629k819
3796c619j234J261M160L313J108j619l191l250j645Q15L032L400K532j082k702
3811A279l788j994M3K711L578K423M23k621l825k416l28K021L514K652J131j843
3827B960l447l082j325J754L335K963J207r07k951l513j476L27L541L428J705
3842D519n51k721l393k481K94K730L473K385K44k620l556k599n29K371L589K363
$$ y = [4056, 5115, 3597, 224, -3575, -4997, -3582, -345, 3290, 5096, 3789, 847, -2867, -5042, -4202, -1275, 2213, 4826, 4608, 2020, -2090, -4632, -4897, -2229, 1347, 4258, 4998, 2937, -1186, -4180, -4930, -2869, 263, 4033, 4813, 3136, 119, -3382, -4815, -4158, -625, 3146, 5101, 3670, 1455, -2582, -4839, -4353, -1292, 2302, 4604, 4559, 1943, -1498, -4340, -4818, -2291, 1228, 4232, 4843, 2829, -800, -3619, -4853, -3592, 568, 3881, 4989, 3370, 179, -3071, -4716, -3901, -869, 2531, 5063, 3981, 1279, -2509, -4503, -4460, -1749, 1829, 4252, 4675, 2054, -1771, -4187, -4515, -2494, 1020, 3672, 4803, 2960, -487, -3569, -4894, -3140, 195, 3158, 4365, 3458, 507, -3006, -4482, -4155, -614, 2814, 4519, 3968, 1247, -2146, -4627, -4333, -1603, 1870, 4255, 4499, 1879, -1677, -4276, -4805, -2434, 1155, 3518]
3858C518R09j645l342l099p57J289L387L116J073j177k781l190j968J100L040
3873e27L169J712k17l173k921k176m13L071L603K231l14k218l592k157l05J920
3889b307L276K778P12j598l470k731j162J464K908L287J456j263l069l056k014
3904d789J304K995L191J476m73k625l250j875K36J962L384K401N57k489l193k687
3920c875l95K029L033K747R37j645l256k944r66J310L216K922J213o62l336k944
3936b616j801P22K848L071K169l01k764l051k410J2K482L268K180K59k184l006
3952a122k887m12K146L238K406J046j563l051k663j579J368L176K876J378j017
3967C340k767l248j306N69K288L441J766k92k567l106k204K37K288K963K615q3
$$ y = [3518, 4427, 2782, -560, -3659, -4416, -3127, 260, 3376, 4449, 3272, 491, -2699, -4667, -3567, -527, 2642, 4354, 4137, 964, -1957, -4133, -4546, -1475, 2128, 4359, 4045, 1827, -1765, -3922, -4227, -2307, 969, 3747, 4459, 2861, -609, -3340, -4502, -3038, -130, 3157, 4613, 3350, 281, -2775, -4789, -3485, -490, 2701, 4177, 3704, 1079, -2171, -4046, -3810, -1848, 1536, 3937, 4494, 2005, -1188, -3875, -4270, -2241, 792, 3539, 4476, 2831, -425, -3369, -4335, -3025, 191, 3113, 4326, 3664, 328, -2616, -4417, -3695, -847, 2224, 4393, 4092, 1328, -1723, -4133, -4121, -1639, 1629, 3809, 4068, 1884, -1122, -4009, -4421, -2275, 963, 3369, 4415, 2852, -199, -2862, -4441, -3073, 103, 2979, 4357, 3340, 573, -2675, -3981, -3412, -1124, 2317, 4083, 3791, 1224, -1882, -4086, -3849, -1561, 1402, 4017, 3934]
3983C934j989l242k134o68J615L156K713O86j192l133k935r36Q37K936L070J464
3999D182r10k441l476j447O40K657K553K360p04j626l235k485n7J936L051K883
4015C881J84j546l338k684m45J314K855K694J159j557k585k677j311R89K620L159
4031B712J260p89k461k870j992O51K315L105J774j93j619l446k117p40K587K927
4047A104K280N52j375l388k354j009J675L029K534J223j080l062k743j429Q95
4062c148K565L112J630j070k412k853j779K60K663K926J616J33k151l040k036
4077c584k40J648K975K357O99j484l022k414r33J534K672K639J255j142k520l163
4093b723j257R47K173K979K059q64k098l180k068L61K115L000K060K98k020k613
$$ y = [3934, 1945, -1297, -3431, -4099, -2484, 672, 3385, 4071, 2879, -254, -3189, -4125, -3288, -352, 2718, 4182, 3272, 831, -2645, -4092, -3452, -795, 1758, 4118, 3414, 1788, -1447, -3932, -3989, -2053, 998, 3881, 4065, 2519, -819, -3503, -3948, -2634, 221, 2915, 4074, 2517, -68, -2745, -4056, -3067, -447, 2712, 3972, 3183, 722, -2148, -4140, -3489, -1174, 1931, 3705, 3512, 1893, -1553, -3670, -4410, -1823, 1104, 3384, 3936, 2561, -827, -3181, -4190, -2515, 514, 3048, 4271, 3191, 129, -2614, -4043, -3148, -583, 2529, 4159, 3089, 677, -2176, -3955, -3695, -1032, 1894, 3510, 3643, 1492, -1548, -3584, -3824, -2176, 799, 3156, 3855, 2371, -651, -3065, -3998, -2464, 208, 2847, 4102, 2960, 440, -2723, -3980, -3033, -860, 2119, 4178, 3314, 1216, -1964, -4032, -3671, -1556, 1444, 3504, 3802, 1782, -831]
4109h31k667l17J781K885K171P45j544k588k450j082J218K799K574J219r29k655
4125C29k469j615N65K520K749J878k18k573k833k137J1K548K662K090L23j978
4141A852k737k282o16J841K810K315O08j201l023k525q51P73K902K737J396r45
4157C054k652k650j264L58K224K918J720m67j877k909k185J44J931K859K107M71
4173C782j976k763k236m33J401K540K485O91j036k801k549q35J061K387K696J063
4189C477n37k434l059j000K93K057L136J687j91j820l226j482m11J740K894K147
4205C271O41k042k561k278n37J258K639K769M23j040k754k549p82Q83K469K614
4221B424Q99k94k485k658j300M71J756K936J802k38k103k435k305j2J794L019
$$ y = [-831, -3498, -3815, -2034, 851, 3022, 3767, 2223, -365, -2815, -3897, -2679, 120, 2694, 3913, 2984, 329, -2140, -3755, -3190, -670, 2079, 3957, 3739, 1166, -1667, -3804, -3793, -1245, 1417, 3507, 3830, 1852, -885, -3167, -3783, -1942, 868, 3183, 3791, 2590, -433, -2958, -3809, -3036, -134, 2603, 3999, 3054, 402, -2248, -3512, -3154, -930, 1988, 3708, 3241, 1364, -1545, -3730, -3586, -1655, 1204, 3311, 3782, 1806, -957, -3193, -3626, -2225, 315, 2800, 3491, 2455, -346, -2895, -3730, -2669, -282, 2414, 3477, 2940, 506, -2553, -3553, -3260, -1203, 1933, 3620, 3429, 1609, -1617, -3099, -3510, -1770, 1124, 3271, 3912, 1870, -691, -2969, -3506, -2248, 391, 3160, 3583, 2543, -211, -2760, -3542, -2659, -190, 2424, 3323, 3029, 544, -2114, -3414, -2943, -1187, 1749, 3551, 3313, 1210, -1225, -3530, -3542, -1748, 1271]
4237A271J957J86j377l026j967r10J810K553K200Q86j006k596k833r49R95K727
4253g9K401J049n37k170k759j310N54J822K725J922m11k087k746j634j68J818
4269a610L054K005K9j618k794k215l89J452K408K467Q49j094k849k502o83P79
4285b711K168K847J378q88k335k487j336M70J968K535J643j84j825k634j965L34
4301c022J355K600K117K74j318k951k222k51J492K400K428Q39j627j910k855q72
4317c523J124K207K291J102m31k336k165j500J92K256K816J109j37j666k582k091
4333c334Q6J811K723J379P13j836k497j650q69J165K814K054O17q63k667k427
4349b781l96P61K563K003J388o97k137k388j281r6K272K728J521n91j788k610
$$ y = [1271, 3228, 3414, 2037, -989, -2956, -3866, -2056, 497, 2697, 3583, 2577, -19, -2852, -3801, -2806, -79, 2322, 3371, 2834, 664, -2095, -3405, -2851, -1029, 1696, 3618, 3207, 1120, -1626, -3260, -3428, -1610, 1444, 3449, 3478, 1860, -934, -3149, -3538, -2086, 322, 2789, 3638, 2544, -305, -2807, -3490, -2711, -543, 2304, 3682, 2794, 459, -2028, -3364, -2894, -926, 1609, 3252, 3068, 1243, -1391, -3356, -3022, -1667, 933, 3050, 3324, 2006, -945, -3167, -3418, -1926, 474, 2902, 3741, 2114, 204, -2651, -3523, -2399, -192, 2099, 3201, 2770, 434, -1731, -3231, -3039, -783, 2033, 3142, 3005, 1339, -1243, -3334, -3248, -1437, 1286, 2665, 3378, 1542, -955, -2605, -3474, -2309, 505, 2559, 3176, 2313, -354, -2781, -3177, -2416, 147, 2150, 3538, 2841, 704, -1684, -2965, -3061, -789, 1939, 3460, 2869, 1081, -1529]
4365a529j687M08J411K108K264N74k050k625j681n12J513K334J712J045p64k811
4381b90j768j250R94K127K368J343p93k249k435j273L64K223K142J790l17j946
4397A030k414j551j88J717K375J778M08j522j997k262q81J556K660J647N77o91
4413B242k263k538q18J286J883K194J060m46j806k611j211K12J986K245J808m12
4429B811j739k264j630k65J635K451J650K99j265k392j856m96J021K496J878O76
4445C010r68j791k275j147O29K098K420J161o45j896k230j332K04J559K636J324
4461B757L66j780k559j640J53J280J992K041M32j129k403j859o09Q84K027K297
4477B250Q47p43k424k059r79M31K330J964J920q75j548k664j723K50K379J787
$$ y = [-1529, -3216, -2808, -1397, 711, 2975, 3549, 1499, -1126, -2807, -3319, -1806, 528, 2240, 3285, 2521, -290, -2058, -3308, -2314, -187, 2181, 3524, 2731, 482, -1953, -3226, -2862, -639, 1503, 3293, 2976, 1030, -1384, -2935, -3123, -1406, 969, 2747, 3155, 1633, -364, -2626, -3507, -1951, 709, 2356, 2933, 2242, -21, -2559, -3377, -2091, -208, 1986, 3046, 2600, 794, -1817, -3028, -2816, -830, 1415, 3223, 2811, 1072, -1192, -2822, -3087, -1452, 999, 2649, 2948, 1683, -709, -2565, -3061, -2040, 456, 2334, 3010, 2042, 251, -2024, -3171, -2542, -444, 1976, 3137, 2492, 596, -1634, -2966, -2762, -1203, 1433, 2757, 3123, 1343, -1216, -2856, -2703, -1423, 569, 2610, 3042, 1913, -490, -2349, -2958, -2074, -47, 2250, 3097, 2354, -70, -2129, -3108, -2677, -347, 1617, 3537, 2662, 1114, -1550, -3273, -3023, -644, 1143]
4493A143K081j89j364k479k071j19J612J983J762P94j174k222k301n73J111K249
4509B43J865R80j026j854k300j140P03K021K419J045o61j464k147j250j46J777
4525i35K006J483l8j146k492j418l75J541K075J917N49j653j799k059o28R36K072
4542C6K356Q86r23k434j965r47M19J980K245J119j40j990k208j052r4J477K397
4559A162J419J52j382k197j826r1J375J948J733N21o86k451j769o35Q44K064J905
4576B086N16m29j625k220j328P64J986J705J301m56j522k038j287N8J499K381
4592A391J432k11j207k066k019k6Q34K821J251P73j354k005j938p03J162J760
4608a05K275O27q58j621j993j425O22J886K159J380q59j223j979j608L6J348K606
$$ y = [1143, 3224, 3035, 1671, -808, -2879, -2998, -1386, 597, 2359, 3153, 1979, -243, -2544, -3117, -2006, 243, 2108, 3088, 2062, 208, -2092, -3232, -2529, -508, 1911, 2956, 2295, 831, -1316, -2566, -2712, -935, 1071, 2554, 2516, 1370, -1122, -2540, -2915, -1374, 701, 2618, 3167, 1514, -285, -2344, -2972, -2036, 36, 2392, 3278, 2355, -79, -2044, -2991, -2572, -592, 1653, 2772, 2632, 642, -1566, -2618, -2712, -1235, 1162, 2581, 2733, 1351, -846, -2672, -2763, -1388, 560, 2293, 2814, 2128, -323, -2092, -2727, -1883, 181, 2086, 2602, 2173, 548, -1672, -3000, -2236, -250, 1455, 2756, 2300, 778, -1260, -2547, -2489, -990, 1391, 2823, 2612, 1405, -661, -2680, -2706, -1872, 949, 2200, 2973, 1619, -386, -2324, -3027, -1865, -105, 2170, 2797, 1939, 318, -1675, -3100, -2478, -592, 1567, 2947, 2088, 865, -1114, -2722, -2686, -1338, 1268]
4625A268J241J52j864j403j888k14J315J966J663O32j006j837j787j075R61J785
4641i1J818J028p24j536k103j093N08J144K672J034j87j426k233j426J06J311
4657a198K000J397N26j703j554j889m50J525J657J690O55r16j882j875p82Q29
4673a970J845J736J078m85j536k270r81K43J904K035Q97k41j264k037j297l61
4689b704J583J900J700J15j017k176j560o25J024K332J341O57j298j404j758o76
4705b566L57J869K137R51p98j357j848j207K32J460K099J046j1j677j781j209
4721b303o6J214J787J516M55j181k296j305l52J072J585K077K83n30k108j582
4737a734m93L82J624J883R51o07j487k159p30J53J375J929J266J21j583j883j281
$$ y = [1268, 2509, 2661, 797, -606, -2494, -2708, -1393, 573, 2236, 2868, 1862, 25, -1762, -2837, -1876, -91, 1727, 2755, 2031, 495, -1608, -2701, -2193, -1049, 1623, 2657, 2470, 1044, -1189, -2615, -2509, -1198, 802, 2199, 2725, 1022, -532, -2421, -2871, -1346, 311, 2001, 2656, 1740, -142, -2017, -2799, -1970, -125, 1611, 2689, 2204, 668, -1602, -2583, -2340, -436, 1599, 2496, 2255, 991, -1046, -2343, -2704, -1121, 779, 2479, 2594, 1577, -599, -2159, -2784, -1760, 572, 1913, 2570, 1272, -132, -1890, -2566, -2209, -340, 1797, 2748, 1950, 593, -1255, -2462, -2230, -770, 1329, 2375, 2364, 687, -1094, -2303, -2369, -1155, 632, 2148, 2603, 1422, -874, -2179, -2531, -1459, 126, 2203, 2486, 1956, -152, -1734, -2227, -1845, -221, 1662, 2613, 2006, 519, -1640, -2370, -2217, -842, 1087, 2353, 2474, 891, -992, -2273]
4754b273k73J724J352J636M68j092j943j502o36P74K102J552N25o57j312j951
4770a506r00P59J427J972N97k42j419j957j408L98J371K282R38k09j316j565j456
4787b234k95J464J777J505K35j127j585j832m37Q99J572K040M32r11j417j702
4803a616o94J31J588J939J239l41j809j665j244K35J473J726J193k7j281j828
4819i81j214l08J374J812J337L91j418j325k020k0P93J429J967M87n66j492j562
4836a316j228Q15J476J734Q08o27j015j740j251K07J463J601J399k69j433r90
4852c66k117k3J705J528J481J14n49k090j546l03M68K020J236P40n70j695j644
4869a611p82L70J639J781N31l3j361j595j300J58J492J774J097J68j285j957j094
$$ y = [-2273, -2546, -822, 530, 2166, 2634, 1542, -401, -1903, -2539, -1765, 337, 1889, 2414, 1757, 445, -1506, -2406, -1647, -220, 1752, 2349, 2107, 688, -1269, -2677, -2279, -908, 1374, 2312, 2103, 787, -778, -2234, -2529, -1065, 712, 2217, 2452, 1325, -260, -2092, -2529, -1630, -58, 1982, 2414, 1503, 86, -1616, -2310, -2179, -591, 1348, 2587, 2246, 437, -1228, -2472, -2237, -764, 962, 2155, 2128, 847, -981, -2195, -2503, -1129, 683, 2020, 2411, 993, -332, -2352, -2372, -1579, -150, 1817, 2304, 1738, 246, -1316, -2544, -1729, -253, 1481, 2289, 1662, 647, -1093, -2344, -2137, -674, 927, 2326, 2057, 624, -366, -2483, -2506, -801, 727, 2208, 2322, 1773, -317, -1863, -2166, -1698, 322, 1558, 2298, 1728, 33, -1611, -2393, -2023, -384, 1397, 1928, 1895, 534, -1061, -2361, -2203, -711, 1063, 2160, 2328, 1043, -914, -2008]
4886b008n47J410J522J707M51j381j568j461k28P95J492J501Q03q76j605j444
4902a437j045Q56J228J585J204m15j343j970r28K18J525J312J068K81j227j898
4918i86j512M17J251J279J629O44j327j680j674n35Q41J788J522O95l42k019j448
4935a457r35O74J492J476Q07l1j278j728j293K78J187J599J379j71r90j463j719
4952b173J24P01K000J251L48o57j893j467n42P14J583J718O63p01j475j277j130
4969b213O19J219J994L56k68j058j672j041o0J496J338J593n02j143j269j544
4985b155O5R30J472J725O9r03j559j099n03N66J576J254Q78p13j612j525n58N58
5003a534J059J698J007k10j513j707q00n2J086J738R46M29r09k031j356J21R28
$$ y = [-2008, -2555, -1145, 377, 2084, 2535, 1154, -414, -1875, -2103, -1308, 184, 1685, 2488, 1612, 7, -1437, -2482, -1626, -398, 1187, 2391, 1976, 633, -1337, -2265, -2047, -522, 790, 1858, 2139, 912, -986, -2498, -2081, -830, 449, 2078, 2722, 1395, -285, -1959, -2494, -1653, 135, 1657, 2352, 2010, -9, -1457, -2392, -1718, -226, 1250, 2057, 2026, 748, -980, -2273, -1995, -808, 791, 2170, 1999, 1009, -454, -2173, -2049, -1348, 652, 1903, 2251, 1594, -299, -1766, -2308, -1594, -11, 1707, 2370, 1669, 194, -1083, -2213, -1594, -375, 1619, 1975, 1707, 649, -1023, -2064, -2124, -628, 710, 2303, 1801, 658, -611, -2155, -2090, -1160, 312, 2037, 2106, 1203, -356, -1455, -1958, -1392, 184, 1438, 2316, 1603, -9, -1534, -2092, -1534, -475, 1223, 2230, 2020, 507, -1200, -2000, -2052, -966, 772, 1718, 2147, 1238, -793, -2149, -2028, -1100]
5020a100J199J358P74o56j797j356p03R68J121J348J020o00j258j571q66M63J355
5037c01J215R25k1j295j365j069q5J176J839P82o3m42j817j364k41Q99J453J291
5055A517M09k49j524j615m36L56J525J567N55l38j495j353q37M4J270J658J054
5072B108m3j576j542n66j63P85J517J466R8j311j342j103j51N57J363J547N86
5089B230q95j475j341m14L99J344J514M97m39j090j287j056L07J290J416Q15J00
5106A915r58j564j386K04Q41J594J042M37j041j564j153l78N29J603J604N00q30
5123A395j247j597n77N05J359J165J035p34p73j479j183M51J037J598Q15k36n40
5140I94j966r94j95R36J894R21K89j142j199j377k45Q84J285J409L92l13j599
$$ y = [-1100, 99, 1457, 2231, 1575, -222, -1578, -2281, -1313, -192, 1156, 2176, 1576, 318, -1253, -2119, -1656, -301, 914, 1839, 1818, 523, -842, -1911, -1996, -820, 1019, 1801, 1738, 1296, -521, -1885, -2126, -1227, 226, 1517, 1926, 1677, 153, -1462, -1898, -1542, -17, 1550, 2105, 1767, 272, -1081, -1918, -1874, -604, 1054, 2108, 2065, 489, -1053, -1619, -1782, -997, 520, 1986, 2084, 773, -569, -1672, -1823, -1266, 97, 1644, 2230, 1335, -140, -1481, -1895, -1496, -152, 1362, 1859, 1420, 330, -957, -2013, -1706, -416, 1000, 1815, 1915, 957, -607, -1993, -1789, -948, 646, 1688, 2125, 1084, -480, -1633, -2011, -1482, 121, 1725, 2225, 1395, 148, -1449, -2026, -1521, -162, 1003, 2038, 1304, 531, -948, -2131, -1680, -643, 955, 1770, 1534, 994, -972, -1966, -2161, -1225, 669, 1590, 1879, 737, -462, -1839, -2084, -1200, 85, 1494, 1886, 1573, -26]
5157b6j308l38j14J550J550R87o95q83j497j058K82P65J798Q64J99j628r51j380
5175a883n2J318J118R16N68o70j577j232l14N20J344J447K88l56j399j124j034
5192b122Q64J019J385R55k55j147j483j213J23J289J235J419o2j025j664j113
5208a795j3P85J467J245k30k66j322j144n73M76J431J246M54n62r96j147r46M01
5226a489J334J234O30m30o40j580q28J04J005J287J121j62j189r57r78m69J034
5243i73J263J397m5o51j038j421q0K94J433J259N47q56j232q70o92K14J079J303
5261I31J126m56j491j052o12k99J269J526Q58qj009j435p75J05M67J148J333K08
5279A834p17j051j509m89Q90J096R15P81l43j339j484m94N05J043J450P84k05
$$ y = [-26, -1334, -1672, -1786, -236, 1314, 2301, 1606, 723, -774, -1832, -1550, -785, 1013, 1877, 2076, 448, -503, -1883, -1935, -617, 501, 1417, 1985, 1315, -262, -1494, -1808, -1288, 56, 1503, 1791, 1435, 36, -1088, -2122, -1258, -239, 1146, 2101, 1846, 699, -784, -1997, -1874, -585, 650, 2069, 2007, 982, -682, -1795, -1808, -1023, 444, 1689, 1459, 1193, -129, -1273, -1846, -1370, 61, 1307, 1761, 1199, 203, -944, -1890, -1489, -155, 1079, 1709, 1279, 639, -941, -1769, -1665, -660, 627, 1748, 1586, 397, -560, -1538, -2007, -973, 290, 1687, 1642, 991, -47, -1468, -1548, -1254, 179, 1438, 1985, 1129, -103, -973, -1665, -1451, -372, 931, 2057, 1601, 110, -942, -1554, -1853, -584, 942, 1800, 1792, 783, -652, -1427, -1322, -855, 293, 1626, 1834, 1117, 66, -1443, -1932, -1042, 54, 969, 1750, 1407, 68, -1416, -1910, -1405, -362, 1088, 1872, 1667]
5296A667j267j321q91K67R84J160J086N3m73j548j178j69L59J682J167J89q24
5313I43j103j313m79N28J469J108P50o23j279j242l25r3J160J314R60m03o96j636
5331i60o66Q7Q18J377J006M9j122j100r62j93N33J397J279N22q09j553r57n12
5349a766L34J165J411Q38n27j383j280n32N56Q79J586J51K74j396j135p95J02
5366a518R64J206Q27K11q10j482q12o1P02J076J004M53n99j212j408m67R07J049
5384C0J072N22k44j231j100j002P31J068J223O40m27o98j260q34p2R00J130J231
5402A679j54j002j373m55m26N52J311J439J12l12j716p04q92N53J407P82J116
5419A917r13q31r93p24j59J440R37J165m17p75j413j076K33R65J105P44N57j206
$$ y = [1667, 400, -921, -1812, -1545, -561, 599, 1685, 1738, 1265, -283, -1461, -1630, -1271, 411, 1578, 1767, 943, -160, -1473, -1952, -1424, 45, 1153, 1903, 1280, 1, -1241, -1566, -1659, -499, 815, 1775, 1372, 676, -960, -1626, -1539, -721, 656, 1662, 1711, 589, -511, -1473, -1666, -1133, 264, 1543, 2065, 1256, -297, -1254, -1766, -1432, -267, 1144, 1982, 1455, 72, -1208, -1740, -1184, -305, 1281, 1432, 1706, 310, -825, -1620, -1518, -554, 652, 1479, 1690, 880, -602, -1414, -1475, -773, 303, 1307, 1760, 1161, -51, -1459, -1926, -1019, 30, 1102, 1624, 1380, 149, -951, -1953, -1222, -154, 1069, 1709, 1282, 584, -676, -1510, -1582, -682, 448, 1679, 1525, 523, -850, -1305, -1731, -1179, 132, 1571, 1683, 1371, -345, -1049, -1941, -1388, 19, 801, 1917, 1004, 173, -820, -1544, -1703, -263, 674, 1839, 1422, 647, -766, -1842, -1609, -644, 461, 1205, 1762, 556]
5437E56j084j066K7M77J237J201M99p79j395r19m82O65R08R22J065n26r14j456
5455a064q04M16J279Q27Q61K50j233j183j015k7J171J283L78P89q86j136j334
5472a428k51R40Q89J132L17l55j219j139n65K51J682J149K73m99q80j083j126
5489a912L46J314J380M51n77n05j421n03M1P91J111J105J28p65j454q05o12P37
5507a150J335J198L23m73j489r24k34J35P75J459N65j23j071r56q34j61J075J076
5525E26J037R0j334p05j026j02R61P50J071K93l72j494j319M5L50J315J083N87
5543A756o60r57j205m71K08Q81J465N76j88j151j128m85R7R91Q30R64r1r18o32
5562a18j311q2N70J365J033K14r83p50j172j57M42J240R64N92o73j043j152m18
$$ y = [556, -528, -1594, -1567, -1090, 147, 1348, 1847, 1068, -327, -1246, -1728, -1063, -155, 767, 1832, 1306, 392, -1064, -1868, -1452, -173, 654, 1515, 1765, 532, -651, -1666, -1693, -522, 761, 1139, 1928, 1042, -94, -1428, -1679, -739, 150, 1282, 1599, 1244, 25, -1114, -1679, -1428, 254, 1403, 1676, 1177, 297, -786, -1912, -1566, -252, 1128, 1579, 1002, 497, -924, -1427, -1386, -595, 516, 1621, 1749, 984, -470, -1275, -1887, -1150, 185, 1383, 1706, 1233, -256, -1180, -1414, -1279, -504, 955, 1520, 1397, 326, -630, -1464, -1625, -550, 526, 1563, 1653, 319, -386, -1412, -1514, -553, 197, 1268, 1561, 1189, -305, -1624, -1579, -1229, 86, 1169, 1756, 1096, 139, -1066, -1537, -1329, -448, 1017, 1593, 1405, 254, -874, -1359, -1262, -271, 559, 1523, 1432, 514, -118, -1429, -1511, -941, 424, 1457, 1671, 688, -62, -1234, -1391, -949, 291, 1255, 1847, 1174, 131, -1021, -1439]
5580a439J69J267J161M01r5j239q24q38j97J008J331O36j0o17j010j113K98J86
5598i25J292J109j58l99j600n60j64L52J082J190L41n45j091r80m55J10J265J213
5616A077K81j55j065p58r08J76Q71R12Q67J63n79j444r58K47P07O70J042N92p75
5635I63j343p84m02N69J229Q39M36k56j119j220m12j12J570J172K03j87n34j257
5653f45j144L39R61J123P92J12q38r67j004m21O20J382Q82K69n31j043j233k27
5671a573K50J520O70O74l47j320o89n24nP69J359P76k81j008j052j149N06M77
5689i47J313R47L83r18j413n42l06Q01J088Q01M91q02r72r81n71M74J095J092
5707A033M38k92j199r33n10M47M47J491L09J81j120r52p96L21M62J182N99L72
$$ y = [-1439, -1270, -3, 1158, 1559, 1464, 225, -599, -1437, -1634, -626, 705, 1341, 1331, 714, -296, -1409, -1111, -925, 367, 1476, 1318, 919, -681, -1241, -1405, -1053, 29, 1219, 1560, 1015, -76, -1056, -1511, -1401, -136, 1077, 1358, 1203, 138, -620, -1528, -1352, -481, 431, 1298, 1461, 882, -562, -1520, -1273, -566, 104, 1146, 1738, 963, -380, -1164, -1566, -997, 232, 1071, 1507, 1251, 132, -1088, -1500, -1612, -42, 1130, 1333, 1146, 612, -645, -1789, -1450, -489, 634, 1426, 1538, 700, -267, -1271, -1692, -1072, 310, 1192, 1461, 930, -113, -1346, -1573, -1323, 197, 867, 1541, 1194, -126, -815, -1339, -1344, -575, 784, 1560, 1279, 271, -781, -1930, -1424, -947, 366, 1313, 1696, 778, -635, -1177, -1483, -682, 406, 1207, 1698, 896, -76, -1057, -1628, -1154, -59, 1033, 1471, 1179, -20, -953, -1463, -1016, -569, 922, 1231, 1412, 292, -660, -1456, -1135, -673, 509, 1108, 1480]
5725A480p84q57j287l4Q64Q70P53L11m28j230o12n39O21J061P88N54j65j030j184
5744h48q14L73R93J122J63M4m51j150q06J36O60J144Q00j69l15r35j167P7L4J277
5764A68Q82K58l91j107q04m18L52R04J152M76l19j243o62l87J53P87R25N19j24
5783A121p64p87p89p4P72J225N77R0q39q88p00o7M04P81J082J70k56j144p72l96
5803a254J50J097J022O0J92r58j236n76L46O56J382N49Q3r93q81j114j17J155
5821d37R22P33Kl46j371o22l16P49R96Q20K53m46l17j729m31N30J047Q10M15k10
5841A052j063p21o15J25Q42R73N31K32q55j210m07j97O05J154P94q0r19m63q81
5860a103k38O16O06J014O53j297j59j047n65O45P39Q32K83k4r81q16m75M25N18
$$ y = [1480, 696, -161, -1448, -1482, -618, 252, 1005, 1316, 888, -342, -954, -1493, -872, 189, 977, 1531, 1366, 336, -848, -1662, -1289, -296, 826, 989, 1033, 582, -568, -1374, -1238, -578, 566, 1366, 1197, 882, -53, -1220, -1143, -1109, 168, 1050, 1308, 917, -190, -994, -1412, -1060, -156, 996, 1472, 1153, -90, -752, -1139, -986, -199, 726, 1245, 1121, 357, -430, -1219, -1293, -521, 704, 1281, 1371, 532, -356, -1056, -1123, -719, 62, 1144, 1314, 1058, -86, -858, -1254, -1104, -7, 1015, 1075, 1267, 309, -927, -1503, -1157, -501, 881, 1430, 1513, 520, -361, -1475, -1592, -437, 485, 1218, 1220, 874, -497, -1119, -1435, -686, 310, 1130, 1383, 937, 620, -1109, -1540, -1010, 37, 847, 1262, 1052, -11, -732, -1347, -1222, -380, 593, 1124, 1356, 501, -709, -1116, -1313, -708, 446, 1240, 1160, 241, -222, -1103, -1341, -725, -119, 895, 1548, 251, 92, -955, -1520, -875, -136, 696, 979, 955, -26, -842, -1317, -892, -374]
5879c74P49P94Q1m12j186q71J32N87J112K60K30k93j144j057M0P02O01R85qJ97
5899A125j169q70m56N77O55P81N57j22q59p85p50L12Q29Q96L41k16k09j123m65
5918i51q3K07J215Q79j18l06j132q35k14K73J407P14q7q4r46o27m41J82R41R48
5938I42K60l00o17r62n11m3Q39R21Q39k76o97q81n59K0M02Q36Q54m1m44j167n50
5959a135n70P67R97J058K92n00p59j158m9M8P84P34Q55q2j014j126l04j07P77
5978d92R29N20Q9n21q26q81k24N39J234P03J39l05r31o19n09M30R37O68P7J07
5998A064q33j050m71J46J165Q65M53l70p40m17o67m16Q55Q95P59j02o35p64p75
6017a038j99N07R32Q80L18p47p02o54o88O95O31J038P2k42o44r72k63p9R52R81
$$ y = [-374, 375, 1169, 1250, 838, -348, -1219, -1087, -500, 612, 872, 1102, 809, -335, -1392, -1352, -650, -49, 936, 928, 1125, -44, -914, -1370, -793, -138, 643, 1200, 1078, 219, -566, -1316, -1004, -175, 721, 1062, 846, 637, -486, -951, -1034, -827, 388, 1267, 1149, 843, -289, -1124, -1338, -1065, 342, 1056, 969, 885, -61, -688, -1129, -947, -6, 942, 1202, 902, 285, -677, -1188, -1231, -392, 529, 1368, 1092, 395, -486, -1045, -1025, -623, 213, 1067, 1026, 582, -585, -1135, -1705, -938, 59, 1117, 1409, 909, 150, -1008, -1057, -1009, -225, 509, 1364, 1282, 268, -858, -1162, -1269, -492, 437, 957, 1046, 525, -301, -1182, -1406, -867, 367, 1070, 1209, 904, -27, -646, -1155, -725, 212, 880, 957, 1064, 231, -819, -1290, -1144, 21, 886, 1339, 969, 229, -188, -855, -1271, -416, 479, 1238, 1136, 501, -263, -1038, -1237, -730, 202, 1082, 1400, 653, -49, -703, -1391, -696, -65, 973, 1045, 803, 159, -813, -1076, -1155, -203, 778]
6037G78M20l34m14j058l76J93L35Q54R11j09n43j059o65KM25P85P14K20m34o15
6057C0q08k01J57P83O94N74j64q17r23m99o7R08Q92L26K66o98j115n70K00M78
6077e54Q76M31L61m60q37o51j79L85P58Q65L24o82m79r26n19N95K72J349J17k17
6097H29o09o77p58j02J054Q49N27k56l97o41q05j84N96Q45P18K72n95r32p85k25
6117a276M46R53O96N59p77o89p75n86O07O69J034K38J4j064n77n63L05M23P77
6136D14O18J40o56j018k16l77K61J301P87m06j36p91q09k38M31J015L65L58l24
6155G19n76r24l79M88M23O79P33l02o54j066m10M34O50R95J43l2n22q32n16n39
6175a488P65J068N38J10k33j024n01o67J188N44O67L7l4j025q95j07J58Q10R06
$$ y = [778, 1198, 864, 450, -608, -984, -791, -456, 398, 1309, 1200, 657, -402, -1067, -1065, -640, 145, 859, 1079, 645, 30, -778, -979, -822, -39, 655, 1229, 1065, 248, -675, -1174, -1241, -333, 559, 885, 1151, 453, -662, -1232, -1032, -554, 322, 753, 1114, 654, -183, -834, -1013, -628, 130, 995, 1319, 637, 158, -768, -1287, -692, -420, 929, 1046, 829, 220, -457, -1215, -1317, -263, 586, 1113, 857, 460, -181, -986, -1170, -574, 271, 989, 1261, 666, -266, -1051, -1276, -830, 123, 819, 1378, 601, -88, -863, -1449, -842, -173, 861, 1099, 1113, 49, -528, -1091, -786, -363, 414, 1032, 1172, 516, -502, -718, -1095, -834, 467, 1254, 848, 712, -79, -888, -1126, -695, 320, 685, 1043, 719, 143, -781, -1160, -672, -249, 430, 1163, 861, 207, -859, -1269, -835, -185, 810, 953, 921, 399, -433, -949, -1488, -723, 345, 883, 993, 760, -264, -765, -1432, -244, 300, 967, 1004, 970, -55, -950, -1057, -899, -89, 817]
6194H17K90q4p66j312lo1O84J029P25l19p18o01l95k54M27O93R02j8m23j044p58
6215a189K32M05O27P90K06k50p88o11o49N15M85R50M19R7j216o48k31J25N40P87
6235E96M33R5m28j312l04l22J100J98R82l16j68p62p13j70M31M67R14L09R0j008
6255A12r77n03M66M49J021L99n23j44r09o54K35O12Q30K68L28q41m98o59j94O19
6275e63R45N55j35k82q13o36k6K24N05J307k8j44j098n33j16J34K96J028N71l94
6295G97o35n23m95N3Q65J88J012k03p68q12n82K50m5J205M98N20m99r71p33j54
6315a032O82Q7Q67P69o17p58o01o69K93J038N56M20j0m58j088o79K45M03J052
6334E00L48j35l23n39o67L8M42O10N33J76m16n89n34n10K79R81O52j51M8p51n68
$$ y = [817, 1107, 1023, 257, -1055, -1058, -1119, -435, 594, 1319, 1000, 282, -319, -714, -968, -541, 152, 1054, 1036, 613, -431, -1189, -957, -552, 75, 865, 1071, 821, 33, -578, -1227, -712, -227, 723, 1142, 1239, 23, -625, -856, -731, -191, 596, 1029, 1124, 696, -616, -920, -1242, -142, 56, 1038, 722, 554, -208, -921, -1091, -660, -193, 721, 1030, 1120, 112, -865, -1368, -902, -453, 568, 967, 444, 300, -609, -1263, -1028, -416, 414, 682, 1010, 169, -329, -988, -1182, -563, 382, 937, 802, 520, -293, -929, -955, -731, -226, 1081, 1053, 909, -189, -722, -838, -704, -408, 620, 1191, 797, 162, -361, -856, -803, 62, 250, 1262, 1059, 291, -521, -1103, -853, -898, 307, 805, 1325, 826, -145, -878, -1032, -350, -263, 604, 1373, 756, -2, -603, -1272, -979, 59, 615, 1035, 1025, 567, -521, -1200, -955, -552, 500, 848, 713, 390, -149, -816, -778, -336, 274, 807, 983, 567, -22, -556, -1066, -787, 194, 846, 695, 743, -8, -576]
6355e76n0j62P12P21N72l98o24n86n93K05L77Q74M78p4k83j150l09k52O56N68
6375A06N85P2k39o05q72j01M84M20Q64J98l84n22m73m70J5N77O20Q17m37l23o73
6396c41m50j78K70R71O97l63p9o86q93M56J16O25P03o7m21l57q35q8K59P81M49
6417E69O0Q1o95n83l05J46O47L03P73q6o05o82p33M13J11Q33K81K8k98k55j114
6438a111q8O17O41Q95j09j56o96m85o47K56P64R56J35l12p88k30r32L14P96O93
6458E13M33l0p63l90n65J30M30O12N69K54r24o55l40j02L74N54N81L10k73p88
6478g0m86k61J09N77P64K26j95p90m97m23O55K01M73O83j0o76n59k82o73P04P78
6499B48M76K1k17n73o80k36O82M91L34N21m92n84o86R9k41J068K97N15m15n17
$$ y = [-576, -626, -788, -76, 645, 1217, 819, 195, -391, -984, -779, -402, 472, 950, 876, 593, -557, -866, -1118, -462, 106, 691, 763, 524, -81, -953, -1054, -570, -150, 714, 912, 528, 6, -467, -937, -922, -345, 275, 1092, 655, 332, -341, -791, -969, -699, 272, 969, 606, 527, -159, -1052, -596, -480, 145, 848, 781, 360, 3, -832, -920, -661, 120, 569, 629, 710, 15, -568, -873, -727, -80, 223, 996, 910, 305, -377, -1110, -697, -586, 247, 528, 556, 258, 3, -1111, -1199, -582, 59, 954, 845, 689, -7, -492, -1139, -883, -119, 837, 972, 660, -128, -358, -1290, -976, -180, 513, 946, 916, 153, -237, -802, -672, -242, 370, 939, 1193, 269, -386, -726, -828, -454, 100, 681, 991, 718, -70, -556, -817, -708, -131, 633, 859, 664, -126, -623, -1046, -391, -190, 283, 966, 956, 280, -279, -561, -1234, -530, 248, 724, 745, 528, -45, -725, -961, -279, 212, 546, 1067, 575, -9, -695, -596, -837, 231, 528, 1043, 628, 111]
6519A11q16l63L30L18J003L00M8n45l19j213P0P58N60Q90l36n23m00n25j33OR81
6540B02O79j94lj161j09l02J39P34M05P08n47k21p68p22L75K55R21N65o8o72o89
6561d73k64k60O43N53N58M39p75p65o03K91R9M85P95L19k64p45p77k57O09N60
6581A68N14M59m99n47p31j38K94K17M67N60o5q7j055o11L31M76P86N39O2p81o16
6602b57m63l65O94O26K79J99j82m10m57n38L18R11M73J52m41m11n56p02N12L94
6622b24J037N2k17m83n40l20k96L68Q37M88J95o31m39n17l58N30O57Q28k58k57
6642D52p17m03k92O81J53O80J03j7l00p35n77MM39J136K57j50m51o63n29M6N22
6663c61O94N62K8l77o95m55O1l7N96O70L31n40n88p03J19n3O61N79K81j22n13
$$ y = [111, -705, -1068, -738, -420, 583, 883, 931, 386, 67, -1146, -1076, -318, 242, 1132, 796, 273, -127, -652, -785, -779, 202, 881, 687, 684, -477, -586, -888, -749, -15, 390, 1098, 551, 330, -438, -1160, -785, -530, 391, 956, 888, 216, -473, -737, -997, -354, 199, 757, 1196, 421, -344, -947, -656, -557, -72, 723, 1042, 778, 33, -744, -1001, -392, 168, 682, 1141, 642, 95, -636, -774, -480, -263, 204, 764, 699, 612, -443, -1054, -723, -247, 539, 1078, 1140, 359, -257, -720, -1085, -391, 235, 514, 713, 531, 121, -336, -874, -556, 355, 828, 980, 539, 128, -428, -1130, -618, -224, 813, 865, 648, 165, -375, -695, -991, -623, 214, 702, 897, 266, -173, -690, -1048, -518, 139, 967, 709, 452, -265, -668, -960, -279, -126, 554, 657, 640, 340, -395, -972, -968, -529, 607, 864, 714, 263, -400, -929, -883, -361, 333, 895, 923, 546, -149, -604, -543, -580, 16, 686, 1017, 477, -111, -814, -695, -748, -87, 492, 773, 651, 138]
6684A38n68l74K27L17O86M79j34m72o34k89j44L27N99P40l51K17p00q78rK46O44
6705F7P70j86j25o02n54p0R7M00N98L10k90l47m08o24M09P61j6O28L46j106l43
6726b85o64L17K26L10P13J68p60k61m14k12K65N93O57J58n76j79o14k22J72N52
6746e6N86K89j44q03n37j52J97N11M91O71j36n37o05r43L12O87M34P39n13m2q21
6767c72k96j81M72P00K19K53j29p97k64m39L48N40M33M35l89k71p49k41j79O18
6787b89Q83k15K98o15j32n25k02N50N09N13J45p27k69o53j45O63L97N00J04k01
6807E89q11M0r39M29N88N94L69n38k03r52r0M16K60M20O92n50m8o98m7l51M89
6828c41O40K83K01n77l09p98K1N75N23N50K85l76r00l35LkN02N53K69l02l7p31
$$ y = [138, -430, -804, -577, -260, 426, 905, 771, 299, -335, -624, -768, -441, 158, 898, 547, 764, 64, -814, -823, -577, 67, 837, 651, 526, -76, -630, -700, -603, -203, 395, 705, 415, 68, -340, -964, -555, 206, 190, 818, 1164, 58, -285, -949, -632, -406, -96, 617, 785, 25, -236, -650, -862, -597, -4, 653, 811, 235, 56, -558, -780, -608, -56, 530, 819, 675, -128, -665, -817, -620, -109, 382, 1053, 917, 380, -225, -1168, -856, -169, 265, 1004, 491, 449, -372, -668, -849, -377, 323, 542, 795, 666, -131, -395, -834, -486, 54, 487, 922, 533, 262, -487, -728, -907, -289, 594, 379, 677, 62, -70, -595, -797, -247, 262, 775, 920, 193, -76, -729, -874, -211, 186, 686, 790, 589, -222, -182, -1121, -692, -104, 490, 859, 321, 118, -834, -924, -508, -248, 172, 864, 314, 266, -432, -479, -830, -341, 299, 582, 783, 206, -103, -901, -880, -305, 218, 768, 1053, 677, -223, -558, -555, -557, -55, 498, 767, 465, 428, -303]
6850c03m82J25M83N67K09K46m38q87k12k31O74L69L98K81l73o37l12j70J01P57
6870A65L98q3o1o24l69j18K9L45J164o4M2m70r11l83J77P00O20K4J18m70p07l1
6892e09j86M54L05Q53k1l50o46k51l14L78M28O54K9o7j065j86j78j5O79L53K21
6913E66K55q98n59K7j34Q19K82N02q3o03p17q2j03L92M78O29k07k46n89o51M31
6934d91J06M33N55J42l7p71p25k28K33P26O93K1P1q93k90m76L86K30M26O04K96
6955A011o92m07m68j37M90N49J32j4l5m89o84m42N76N83K25J01K44p36j73n24
6975h90L57M64N40K51m9n43n84j99k83P36L26O05J91m45n97p11O8L53O86O17j56
6996G37j71o69n08j19K25M43M26P46m50o26m82j63M8N96M64M24l51n12l33k63
$$ y = [-303, -785, -660, -177, 390, 599, 845, 407, -480, -692, -923, -249, 120, 518, 799, 426, -211, -523, -693, -592, 165, 563, 480, 419, -205, -574, -692, -663, -318, 846, 782, 824, 354, -557, -940, -763, -63, 557, 581, 699, 229, -478, -509, -695, -241, 64, 917, 896, 546, -100, -351, -665, -287, 141, 795, 824, 757, -308, -494, -672, -687, -8, 345, 566, 821, -77, -636, -609, -743, 76, 358, 860, 777, 174, -543, -625, -728, -336, 142, 771, 564, 318, -271, -922, -491, -385, 48, 603, 745, 708, -63, -788, -1016, -783, -57, 636, 657, 728, -165, -455, -931, -545, -315, 111, 715, 1011, 319, -88, -556, -693, -203, 346, 478, 464, 429, -60, -744, -1186, -610, -27, 198, 299, 543, -193, -366, -890, -533, -69, 471, 722, 673, 130, -454, -653, -936, -200, 126, 731, 922, 477, -120, -831, -763, -410, 276, 893, 737, 566, -103, -611, -730, -505, -62, 364, 1110, 660, 34, -448, -611, -563, 33, 497, 921, 570, 58, -275, -538]
7016e38J1L9P36M30j29o30l15k49J22L09M66J11K61l30n01k32l26oR37K57M28
7037H51l20n90j88o38K51O00MR20l20l56l05o68K14R2P51K63j47j52n12l23l43
7058i16M58M34P92J13o81l46k69m56J80P79N47M0N3q00K4l87Q4J60P27Q0l57l11
7080e2k42k50m82Q22L56N37n4k50p49k79J57K31M34K19J52q6m89o80K09o6L46
7101b16R10M7n1k80j122K46r8O71L56K71k24j05n45n33j40P84M20L61Q8p54j99
7122a13m49r8P41l06Q62K99n01k08m17n16L21N26M29Q9K9n18o59l11J83M19O03
7143D05N4j29o6p05k70P8N72L19J41K26j98n51k00m78K22P25N90R4k92m36n04
7164d03k81R9K76Q05J4j4l93j52m73L5J98N57L47j32l91k92m77j56P83J10M49
$$ y = [-538, -527, -488, 248, 678, 549, -81, -396, -645, -523, -214, 252, 363, 624, 294, -207, -439, -765, -771, 166, 423, 851, 531, -59, -247, -885, -634, -34, -30, 890, 570, 214, -91, -759, -545, -453, 298, 561, 414, 262, -250, -573, -916, -458, -24, 768, 881, 200, -146, -415, -871, -691, 88, 635, 675, 728, -72, -48, -435, -351, -191, 536, 616, 259, -52, -294, -544, -1026, -204, 152, 689, 635, 385, -364, -643, -486, -255, 179, 398, 550, 464, -25, -705, -496, -562, -216, 694, 741, 690, 410, -712, -466, -564, 107, 463, 734, 510, 405, -140, -673, -813, -29, 391, 752, 840, 86, -113, -562, -660, 81, -225, 637, 936, 435, 227, -190, -706, -385, 141, 570, 659, 688, 170, -489, -800, -617, -198, 405, 459, 330, 264, -441, -711, -633, -61, 258, 399, 625, 427, -124, -324, -802, -580, 145, 735, 829, 537, 101, -403, -684, -585, -309, 496, 510, 496, 103, -49, -522, -487, -289, 268, 615, 483, 92, -200, -677, -833, -50, 60, 509]
7185E09L43m26q21j29k95M90M30K49M82m00j66o64n37M29L77N22M80o11j75n62
7205d75j92L9L95P94J80j45l36n59k37J21J08K56N02rJ47n28q06j15M77N67N90
7226G74k52p4k87m30k23j6K90P13J49j05l28n89m42L50L29N92l6K61k97m86m96
7247f03L4J42L86M46Q1k9n78k74k1Q2K27P34Q3m10m54k31j74J57J38O10L1L34
7269G11l81n31k76r3L19N20L23O2k40j081M16n28K82N94M21m6J70o57l60j04K59
7290b20Q0N60K13k60j32o27k22L84K76K81K80j04m09n27j0l69O77J37N87k41k05
7311A49k36p24K29O36m3M52J61j23n57m46j50L05K50M51J43r4j21p02m12L67M99
7332C4P8K05L64l64q19K9J0K85N39K78k33j51l96l09n9l7O15O61j01j61l28k73
$$ y = [509, 852, 426, -395, -524, -819, -329, 101, 350, 832, 432, 266, -398, -935, -506, -129, 393, 873, 262, 87, -475, -667, -628, -233, 561, 741, 596, 260, -299, -536, -415, -307, -51, 451, 442, 589, 61, -745, -860, -383, 184, 774, 522, 448, 161, -269, -492, -508, -218, 495, 644, 539, 211, -378, -820, -470, -141, 451, 415, 676, 379, -107, -603, -569, -427, -41, 405, 486, 457, -121, -395, -416, -334, -107, 627, 710, 300, -154, -385, -559, -402, -264, 346, 377, 711, 330, -201, -477, -570, -251, 269, 592, 654, 414, -667, -251, -779, -497, 97, 518, 472, 642, -15, -375, -479, -220, -140, 420, 633, 373, 241, -386, -608, -224, 52, 333, 613, 509, 100, -427, -437, -806, -129, 8, 595, 354, 149, -87, -811, -582, 54, 11, 463, 624, 501, -56, -502, -652, -347, -97, 354, 497, 403, 282, -420, -832, -465, 34, 112, 317, 681, 317, -502, -473, -463, -178, 361, 639, 406, 255, -141, -450, -509, -546, 69, 730, 629, 468, 140, -133]
7354a33n35J03M66M04K11L4n06m35L7J17K70J96N01l96k36l30j41n2J95L02M90
7375E62j01j08o62J4l11N62K90m7M18L2p86l04K8j21P23L12j40k1q9n21l62J45
7397d87M79M34J53r9k80m57m20j71L83R31k70L13j39n24l64J10MN37N86k8l87
7418C04k28n36p4r7Q07L23m7k69n5n39N4l01M49M48L0L21n94l39n0J86j50K54
7440a03M95j1K0o09j92p1K1N80L64K47m77l3n65j7L55Q3L20K31K53o16q50J41
7462d34k83O92P3N71R0m65n54P4m07M20P37j91K75k26l99m01M3j17R25J53k9j90
7484C57k79n76j13K02L49N78L14l17l27k50n24j28N88P02o8p1k06o82J73l49M36
7505a91O64M2p9l4q35J2p2L07L99M08J14m01k86n38q5J28N47L19J04j50n36j71
$$ y = [-133, -668, -565, -99, 305, 516, 550, 44, -391, -354, -237, 33, 229, 730, 334, 98, -232, -373, -425, -230, 72, 562, 461, 353, -309, -295, -606, -44, 246, 199, 617, 649, -137, -441, -413, -534, 189, 501, 361, 340, 251, -270, -632, -487, -8, 426, 579, 480, 200, -257, -677, -848, -465, 466, 196, 509, 370, -154, -518, -408, -404, 133, 719, 691, 304, 76, -460, -534, -631, 176, 499, 452, 183, 128, -411, -357, -658, -209, 239, 269, 590, -4, -343, -393, -207, -357, -103, 392, 381, 401, -208, -400, -471, -450, 130, 494, 741, 264, 231, -334, -351, 4, 87, 407, 638, 891, 275, -575, -434, -717, -25, 48, 619, 709, 244, -310, -236, -643, -223, 514, 323, 598, 372, -27, -428, -385, -502, 423, 576, 547, 357, 78, -498, -611, -409, -60, 518, 832, 515, 188, -62, -586, -714, -126, 576, 508, 437, 231, -451, -278, -627, -191, 473, 515, 436, 402, -433, -421, -493, -186, 213, 621, 735, 334, 48, -490, -575, -447, 100, 419, 523, 373, -163, -334]
7527c34j27K89j29L13O35m6m8o41m18k21L81N81N5N5j74k19l22p6J30M03L64K8
7549D79r5n89k58k10M18M40J29J79J1m17k73m65K31J98N33J46J92n52l95k99R0
7570e07J4N95R7M65l09j77n44pj14P74J6P5j95j14o42n3K67L72K02L59k01k38
7592A35j68p11K17K74K58N54k1m18m66n1j43K82J69M82J33l3n85k81j10J52M17
7613H6N08L0j15l65k94j09j75L15N10J74P5m75m83j29l3M50N6N01J30l44m36k48
7635c71j04M81Q0N90k65l72M4m04k07M42J71J97N05l37k32m33m29M37j9Q98l03
7656C69K08n77k72n60J59N91N53l38J86l60n20Q7nL33kO96K9o38q6j55j28J0O98
7679B78J33q8K0l19k09m17J13L61M00L12j58O6l07n46j14K66P13jl8l66m20o7
$$ y = [-334, -461, -172, -301, 12, 647, 601, 553, -88, -506, -727, -346, 235, 290, 345, 171, -48, -370, -446, -316, 87, 451, 479, 384, -205, -463, -673, -255, 185, 314, 493, 504, 87, -186, -651, -420, -222, 311, 457, 649, 97, -298, -597, -507, -493, 102, 199, 664, 355, 178, -366, -373, -487, 287, 303, 378, 183, 69, -573, -626, -359, 13, 215, 574, 373, 135, -33, -744, -527, -253, 5, 559, 538, 120, -346, -397, -540, -258, -89, 393, 526, 493, -92, -373, -483, -331, 86, 594, 624, 509, 144, -150, -259, -434, -119, 391, 565, 640, 165, -318, -447, -480, -30, 26, 527, 657, 313, -123, -371, -475, 6, 86, 676, 411, 39, 83, -321, -528, -86, 85, 282, 787, 450, 218, -215, -644, -207, -226, 672, 369, 577, 0, -272, -832, -673, -82, 471, 133, 319, -41, -561, -474, -479, -146, -148, 548, 577, -61, -147, -302, -430, -420, 278, 411, 323, 343, 24, -185, -602, -489, -128, 272, 584, 426, 492, 185, -361, -475, -209, 504, 503, 465, 99, -321, -388]
7701c88j26M50K00M44k7m26l20k29j99K04L90L20M57m38l82k11o7k11M19K95L95
7722E50k21q5p59O4J76J69N64j50P5k92q2m37r6M92J01M72J00n45j64k92n6K67
7744a49L35M14K05n06l20k43j64Q0K93M08L18J52p34j65l90LK13M52K25l23j48
7765d4k00k90J12L16M37Q9K8k22n21J13r8j20N78J44m2L20p99L6l28n8O23J99
7787B73J43J10m82l6m72M8K7J23R56Q1o35j39n03L07j47M84J50M78l57l54l54
7808b99j52L91j98O06K22k63j6n42k48M72j50M44oKj36j40m03J89lO70k39J59
7830C60k19l59m3m12N99m1M94K79k23l58j99m52J47M04K16K49j83mn32j28L1L39
7852c5K59N53m68L0j56p81j9L23L88N32K0l65n77j13j76N41k88N31K86m05K42
$$ y = [-388, -514, -64, 136, 580, 553, 127, -193, -422, -621, -417, -27, 293, 750, 312, -70, -281, -348, -559, -140, 155, 550, 329, 244, -515, -451, -275, -106, 458, 308, 383, 91, 9, -428, -524, -32, 69, 541, 641, 96, -68, -360, -416, -149, 186, 600, 805, 299, -21, -264, -428, -348, -55, 353, 671, 823, 89, -76, -466, -463, -250, 202, 427, 104, -44, -244, -534, -422, -106, 331, 420, 448, 226, -295, -182, -280, -400, 178, 322, 280, 600, -199, -163, -491, -549, 74, 273, 416, 526, 44, 8, -464, -416, -389, -266, 690, 771, 136, -3, -506, -199, -346, 138, 288, 766, 409, 55, -299, -451, -60, -258, 348, 570, 307, 291, -251, -499, -27, -177, 267, 261, 263, 127, -13, -416, -227, -230, 440, 201, 360, 141, -218, -261, -673, -74, -115, 379, 658, 435, 77, -122, -574, -427, -23, 193, 442, 259, 255, -277, -405, -374, -35, 224, 777, 309, 339, 183, -598, -617, -294, 94, 626, 646, 281, -296, -409, -585, -44, -332, 199, 485, 80, 322]
7873C22o38j7j84L10P53O7k88M6o06k54L35j37L97K17N99p79j54m05N8L08K75
7894B25M9K85m43q1k8j24k28L70L97n2l1q0n20M7k65J70N85k7K75l44o73J9K62
7917b12j06M18L16r9k98o8l44J71k18N67R4L09l32k26J14j019Q02L4M26q8j60
7938H1j80l1k49m9L84L31L88l62l64j26p4r0K15RO85j10j37n69k07O3J04K60M31
7961D03J22j84o67J16k37j5J68M61M58k32l02l04m79K94L02L91M56o46J00n42
7981c37J44k23J95M18K15J51l85l10m03L53k43L33O54k41J57m76k95k78L31K52
8001A2M13P5k61l68r7l53R3L76L22L27k88Q4n28k45k85P11J27L75j06j50o4l55
8023a85l02J26N05L21K3l66j28l35k48N57J13J63J79m5n96R5p5l88O37J58K02
$$ y = [322, -316, -333, -517, -207, 546, 613, 325, 371, -235, -489, -154, -291, 106, 323, 922, 143, -11, -416, -358, -50, 225, 274, 559, 116, 35, 7, -117, -345, 25, 422, 370, 339, 259, -261, -214, -479, -309, 276, 249, 524, 180, -493, -474, -212, -318, 100, 416, 317, 19, -49, -393, -222, -440, 127, 221, 530, 198, -28, 86, -933, -131, -97, 329, 241, 81, -99, -130, -379, -428, -44, 287, 675, 313, -51, -177, -251, -341, -126, -117, 568, 458, 321, -248, -455, -392, -288, -28, 403, 525, 341, -326, -210, -447, -462, -294, 167, 625, 393, 91, -213, -692, -398, -96, 295, 751, 105, 205, -337, -193, -416, -221, 197, 412, 563, 178, -132, -535, -182, -425, -92, 562, 321, 478, 2, -293, -571, -240, 12, 425, 500, 239, -129, -226, -579, -486, -110, 212, 539, 251, 335, -193, -438, -723, -12, 115, 490, 384, 234, 170, -185, -487, -361, 144, 465, 488, 122, -6, -341, -589, -32, 81, 244, 423, 378, -218, -123, -198, -586, 51, 209, 411]
8044D11J82k89o74N9N7K72j34M59L29m38n36k66K81O7J08J48O34l97j83o67J50
8065d27J36K05K96L26n7p11p1m30J03M14N99j18K51n11k30k54jJ55L80M88l77
8086A66J3m65J99m10K9L12N68k9j53l52k91l58N70K03m7N34K5l65o37j17M51k52
8108d06O50L16ml86k32l13k00L06N21PJ44m05q3J5j37j61L75L25L04l28l10k06
8130b08j30J96k70Q26j06K1k67k21j88k84M82L20l2J27Nm66k00o3J17K80L68L22
8152F29k65o18l09K47QK91N34j19k19j19l80J72j94M09J65J36j70J96n34j2j09
8173b61J11M28K15k86k51J77n72k50O28J97J18J76j23Mo47j28M69N4
$$ y = [411, 593, 304, -370, -311, -254, 18, -116, 343, 672, 234, -302, -568, -287, -220, -112, 36, 670, 273, 90, -577, -427, -291, -86, 210, 536, 479, -232, -303, -733, -630, -216, 383, 265, 516, 5, -225, -479, -480, -325, 55, 543, 166, 179, -286, -87, -497, -468, -156, 412, 383, 230, -122, -413, -771, -201, 2, -45, 489, 514, 149, -488, -605, -154, -406, 244, 560, 556, 170, -62, -375, -575, -269, 252, 259, 403, -2, -85, -70, -207, -368, 7, 332, 636, 308, -2, -208, -338, -142, -412, 414, 308, 329, 62, -159, -347, -631, -149, 171, 139, 266, 271, -195, -395, -458, -341, -61, 307, 629, 364, -254, -563, -316, -308, -17, 517, 398, 179, 60, -320, -148, -342, 67, 232, 368, 198, 394, -140, -152, -261, -150, 278, 493, 207, -44, 133, -439, -689, -61, 136, 254, 430, 307, 311, -336, -464, 5, 59]
8191E9
$$ Imaginary data points
##PAGE= N=2
##DATA TABLE= (X++(I..I)), XYDATA
0@%%%%%%%%qJ6j6J6j7K5l2L5m3N4o3P4q9J04j20J36j56J79k03K31k63K96l34L75
32A97m19M70n25N87o52P23q03Q89r87J095j211J340j484J646j830K038k276K553
50A351k880L272l750M354n143O218p780J0270j4880K6254j06313j87170J52511
63a23686J68200L2148m4773M8551L4415j07954j76823k2413J33669J24099J8784
74H4217p156j310n2472j18604o7708N5263J20061Q2552K8206j6177p4466j18151
86h5745o7665M7550J12297P8826K6643L63m1368j06180j03250K137J09262J08616
98H1486L7371j1589l4268p3837r9879m4639O2723J14417P5839J1858l1330p0481
110A7671j01901o8681L5252J17709R9337J4935m5268o0368o4642n9191q836P2417
$$ y = [0, 0, 0, 0, 0, 0, 0, 0, 0, -8, 8, -8, 8, -9, 16, -16, 19, -24, 30, -33, 41, -48, 56, -64, 72, -84, 95, -108, 123, -140, 156, -178, 197, -222, 248, -277, 310, -342, 381, -422, 467, -520, 575, -636, 704, -780, 866, -964, 1074, -1202, 1351, -1529, 1743, -2007, 2347, -2796, 3422, -4358, 5912, -8968, 17286, -89027, -276197, -123686, 44514, 76662, 31889, 80440, 114855, 6901, -169922, -192335, -58666, 65433, 84217, 77061, 75751, 23279, -95325, -163033, -107770, 12291, 94843, 123049, 106872, 32406, -85745, -153410, -105860, 6437, 85263, 111906, 112269, 70901, -35279, -138529, -136392, -27130, 81486, 118857, 107268, 73000, -837, -100716, -145355, -82632, 31785, 107624, 119482, 88152, 17671, -84230, -152911, -117659, 50, 99387, 114322, 69054, 8686, -55956, -115147, -123983, -51566]
122e1566J11008O4547k3215p8766p8636m9152p250M2438Q8279R1954K9909o3869
134G5681j14577q0341J769O2061P3429O0325L5938j3680p7656j02532n1583L9995
146i1171R5787Q0304K8091j9625n5215p8120o8979o142P4594J04302N8206j7964
158A04068o6151p4235n7704j6725M5561R1382P7501R525n8933q3143o3576j9029
170a11459L3291P5106Q0031L6437l1788q1315q3885l8062K7312P6026Q2519M4931
182A09144j5756o7894q3305n3334R348O9273Q5710N0833q081n3598o9353n7081
194h4094j8130M0979Q6836P8685J3330n5981p9520n7979k0077K3031O8804Q6660
206H2544M3826l9644r1489p2605j9104K4579N0211O7286N6958j155p0850q9883
$$ y = [-51566, 59442, 123989, 100774, 22008, -56628, -105780, -113030, -70592, 17687, 109641, 139550, 75681, -38896, -119237, -117468, -55407, 18022, 78347, 114285, 100605, 22949, -79583, -131166, -91171, 4616, 84920, 113011, 93386, 38171, -39949, -108928, -115070, -40476, 63826, 122032, 104068, 37917, -36318, -94022, -110747, -65186, 26196, 103697, 113222, 54289, -28854, -92430, -111459, -78168, -3062, 76969, 113406, 81618, 303, -83582, -121644, -94332, -18306, 64213, 109144, 93388, 25494, -57811, -111145, -101797, -32524, 53186, 104019, 95938, 42340, -27013, -84094, -102224, -61245, 25591, 104276, 117606, 61625, -17895, -75874, -95951, -72920, -4116, 82544, 126370, 86726, -4763, -77368, -96472, -71893, -21682, 45604, 102562, 101407, 30557, -59326]
218e9326m6320J5517N3512O3857N5249J7806m5136q8232p0385m802N4747P3068
230A9555N7057J8686l2417p3354p2692k3240L7773P0786O4392K9371j8393o2652
242A4872p5159m0157J9449O3585O9702M4378j886n4629q1161n7535P318O1116
254c0107P1692M6906N451l8801p1844o7008j4520M8905P3540N1814J0419k5561
266F0886n5196o6857l9784K2828P3903P2160K5392k6180n5961o2835m3594N495
278h9743O0705P9737M3407j6625n7193o2044m2231m384M0852P1120N9237P638
290I0476m5699o7878n1413j4051K9556O3626O6018K7236l2001o9829o1969k0785
302h6713K4918N6923O2584L5207j6701o1172o6322l1051J5211M8734N8895M3343
$$ y = [-59326, -105646, -90129, -36617, 27240, 82489, 100295, 55159, -33073, -103458, -108260, -53513, 19555, 76612, 95298, 62881, -10473, -83165, -106405, -68632, 2154, 66546, 95917, 77524, 14872, -60287, -100444, -80995, -17410, 52292, 96670, 94784, 40155, -41006, -98541, -91223, -30107, 41585, 88491, 93942, 55141, -16703, -83711, -98231, -49326, 24214, 76028, 86447, 60886, 5690, -61167, -100951, -78123, -4220, 67940, 93332, 67152, 11191, -51644, -95238, -89743, -29038, 50699, 94106, 77481, 20288, -41756, -83987, -88371, -47519, 23601, 82838, 90476, 44777, -23101, -74514, -88565, -59009, 4617, 70635, 97871, 65870, -3959, -65928, -86713, -61795, -4872, 57712, 92919, 76218, 15046, -51276, -82327, -67116, -18382, 40513, 83856]
314H3856K95m9518p0405m6144L144M3656O0459N0102J2200l8977p0890n7763q251
327h8236M0630N8870N0393K0069k3573o0216o3642k5172K8027N8031N3542K6937
339G5660r363m6293o5343m3275J1253N6458O2936L5027m912m0113o0585m8968
351g7518l571M6820O5040M3117K227l3248n3937n0431j8268K9058O1168N4789
363F5246J6930k6059n2745n3709k8281J4347N3669O2836L2378j8279n3641n6143
375d3451l1522N737M2776N9806M2658l758m6489n8420l6732k686L1441N4509N0836
388F4705J3841l5819o1217m7118r871K6668N0777N3414K4423k3831n8695n4034
400e6757j8371K2325M6389M9910L0602q271m8044n9324l1754J2169M3546N0763
$$ y = [83856, 84151, 34633, -35772, -81916, -78772, -35116, 25343, 75445, 87645, 48668, -22222, -79985, -88236, -47606, 11264, 61657, 81726, 58153, -2063, -65705, -90877, -62850, -4819, 48723, 75660, 66297, 20004, -45339, -88614, -77361, -20903, 42033, 77060, 72148, 32035, -28550, -77518, -81089, -34269, 30771, 73888, 76115, 42867, -11070, -61501, -79769, -50711, 10457, 65246, 82176, 56117, 3372, -50337, -78618, -64271, -10602, 52234, 84612, 66333, 12692, -43451, -74973, -69236, -26460, 33346, 76004, 72246, 25757, -32663, -69395, -72081, -40640, 13869, 64705, 78546, 42727, -18490, -65608, -75479, -48811, 1966, 55380, 79803, 55972, -2723, -56757, -75128, -52803, -6414, 43496, 74098, 65827, 17783, -41541, -73295, -61126, -17580, 33183]
412C3183L5570L325l6551o0974m6368R9M2402N3711L7917Q596k5982n4530n2663
425f2265j5106L2955N4428M2896J4253j6987m5138n2724k8829J7194N1013N1383
437D3073K4538j1042m0725n2337l6433N163M5417N6765L3247o151l7612m9403
449b5500l7933n941L4617N6654M3219L368l3145m7799m0328j5363K1160N1396
461D405N2826J8883k6178n0476m5342k0563J3577M3735N3247K9798j4627m7493
473A1792m9704k5759O755L6056M9328L6499j15l9308n3247l4998l62L1167M6867
486A4971M1319J1960k9021n5857m4966p264K9495M5797M1187J8395j7089m9145
498b18n0922j9960K2154M5955M2526K3409p516l9089n2273l1851R360M2770M8013
$$ y = [33183, 68753, 72078, 35527, -25447, -71815, -71716, -29314, 24397, 62314, 70910, 44928, -9602, -62265, -77371, -44416, 10012, 52908, 67161, 50174, 5036, -47688, -76517, -59323, -8310, 43073, 67611, 56569, 15844, -36493, -72926, -67763, -22346, 34419, 67666, 61515, 23903, -25500, -63433, -69374, -34757, 21897, 65116, 68484, 35339, -12460, -52788, -68151, -46991, 4405, 57231, 76114, 49936, -540, -45882, -66445, -52868, -9133, 44114, 73912, 59285, 11792, -37912, -63671, -56916, -20860, 28468, 64967, 64852, 25544, -27703, -62701, -63063, -31896, 14971, 56290, 68250, 39229, -16628, -61594, -68858, -39363, 6434, 47621, 66016, 48927, -218, -51140, -71100, -48946, -2991, 39535, 62944, 55428, 16339, -35934, -67785, -58425, -15655, 32358]
511C2358L0163j418l3475n0447l8554j671L5624M9755L5323N002k6663m5869m2334
524e2206j3412K5357M8602M1835J2798j9372m0445m4729k5503J2388M6294N0082
536D1689K2953j3865l8689m3802l0504Q01L7237N3134L3428n817l5159m2755l1092
549e2441p549K3975M7488M3070R612k8753m6352l7111j1723J7979M1346M5706
561D5247K2003j8687m7007m4869j7278J4888L7222M2538K7646o215l9582m7980
573c2074k7012P193L3000M1874L1526L885k9438m7200l7076l673K7688M3882L6481
586D9056J0988k2929m5129m1006j2469K1810M1529L9230J6736j3846l9902m3907
598c9839k0729J4132L8839L9832K2492m679l1719m4988l2356L051L6692M5444
$$ y = [32358, 62521, 61103, 27628, -22819, -61373, -63044, -27420, 22335, 57658, 62660, 35997, -9872, -52206, -65618, -40261, 8341, 50176, 62974, 43602, 3157, -41572, -67075, -54687, -8393, 41689, 64642, 50777, 12088, -31714, -62218, -61417, -24180, 28954, 62382, 56565, 21406, -21349, -52441, -59990, -36015, 11473, 54543, 64155, 35402, -10950, -48061, -59784, -41805, -459, 45247, 67250, 48563, 1556, -43313, -60591, -45703, -8481, 34057, 61703, 55488, 15906, -32074, -59086, -51893, -18893, 22981, 54507, 58392, 28954, -18246, -55322, -58995, -31307, 12575, 49056, 60044, 37115, -8014, -49020, -61489, -39679, 1850, 41080, 57816, 43970, 4068, -39839, -60568, -46436, -7597, 32235, 54727, 50048, 18329, -26659, -59015, -55964, -19272, 26172]
610B6172K7976o14k5996m1133l6867r273K7552M8200L5848M029k3871l7064l4818
623c9859j6250J3997M2321M3486J5773j8898l8774l6176j9448O477L4063M4842
635C1554K7464r144l8379m1512k3386L933K8249M0274L2885K852l0538m4409l0519
648e0676k427K3568L8557L5406J2004k0955m2173l6892j1916J7853L6904L8897
660C8150J9068j3378l9582m0176j7892J1748L2524L8279K5167l776l3815m2933
672b6616k6122N988K9490L6160K7992O259k4243m4542l5479k890K7746L8266K8766
685D0775J0564j5069l8520m1042j5179K1392M0395L3238J2114j0394k9678l8667
697c0071k5177P580L7413M1004K0027q241k7188l4604k8710l594K7604M3895L0064
$$ y = [26172, 54148, 53534, 27538, -13595, -50462, -59735, -32183, 16017, 51865, 55894, 32023, -5041, -39859, -56109, -42112, 209, 43695, 59468, 40570, 1796, -34380, -53828, -47351, -13288, 31554, 59018, 49874, 11495, -30017, -53403, -49470, -21221, 19053, 51938, 54790, 24252, -20157, -50676, -53103, -29535, 9022, 44428, 56432, 35477, -6696, -43588, -55504, -37651, -747, 38150, 57218, 43840, 4258, -35918, -53810, -42062, -9538, 28741, 53908, 50132, 16317, -26616, -52738, -46750, -17260, 18900, 46892, 53151, 28908, -15634, -51113, -54003, -26257, 12009, 40775, 51339, 36270, -2250, -43292, -58471, -37079, 3316, 36554, 48668, 38274, 8596, -30071, -55248, -47668, -10255, 30749, 50776, 42535, 15347, -19257, -47967, -51561, -23957, 19938, 50002]
710E0002k08k6251l5866k9500q699J9477L9456L4850R059j9172l5159l3356j5503
723e0870J2291L5857L7863J7224j2334l2565l5494k1370M559L0379M0916K5235
735E1691o234l0805l6863k3297r98K3241L7788L1072M114k5790l8028k7776o099
748d7984J7513L4298L4235J3910j7210l8395l4230j1575J4641L1185L4098J9409
760D9895p603l3098l9054k0420R892L0650L3363K1050m66k3533l7141k9217k240
773d7922K7106L7533K6107K935j8967l3173l1761j2029J7644L8129L3482R475
785D8559j6468l2048l2173j6686J0683L2661L4894J7009q388k7718l4139k2660
$$ y = [50002, 49794, 23543, -12323, -41823, -50522, -31045, 8411, 43261, 52320, 33148, -2011, -35367, -50870, -38579, -2722, 35141, 52365, 40031, 7466, -28028, -49398, -44839, -14460, 26456, 51691, 45457, 14652, -22211, -45508, -46506, -23265, 14523, 45595, 49709, 23919, -14109, -41885, -47984, -30471, 3827, 38062, 51972, 34762, -3633, -37863, -49438, -34797, -3612, 30486, 49895, 42292, 9194, -29860, -50280, -40388, -9738, 23625, 44675, 44209, 20676, -16465, -45682, -47922, -20816, 16717, 42824, 45759, 26792, -6381, -38142, -50171, -32527, 5602, 39084, 48559, 32091, 43, -32130, -48816, -38133, -5472, 29422, 46431, 38043, 10325, -23814, -46474]
$$ [...]
8191D96
##END NTUPLES=NMR FID
##END=
