##TITLE=1H_LR-667-K1
 CDCl3, 8 sc, 
 9.4.2019
##JCAMPDX= 6.0         $$ Bruker NMR JCAMP-DX V2.0
##DATA TYPE= NMR FID
##DATA CLASS= NTUPLES
##ORIGIN= UXNMR, Bruker Analytische Messtechnik GmbH
##OWNER= root
$$ XWIN-NMR		Version 3.5
$$ Tue Apr  9 14:05:13 2019 Russian Standard Time (UT+4h)  she@DPX200
##.OBSERVE FREQUENCY= 200.1315
##.OBSERVE NUCLEUS= ^1H
##.DELAY= (6, 6)
##.ACQUISITION MODE= SIMULTANEOUS
##.ACQUISITION SCHEME= undefined
##.AVERAGES= 8
##.DIGITISER RES= 18
##SPECTROMETER/DATA SYSTEM= spect
##.PULSE SEQUENCE= zg30
##.SOLVENT NAME= CDCl3
##.SHIFT REFERENCE= (INTERNAL, CDCl3, 0, 15.7039)
##AUDIT TRAIL= $$ (NUMBER, WHEN, WHO, WHERE, WHAT)
$$ ##TITLE= Audit trail, XWIN-NMR		Version 3.5
$$ ##JCAMPDX= 5.01
$$ ##ORIGIN= Bruker BioSpin GmbH
$$ ##OWNER= she
$$ F:/spectra/data/she/nmr/H-F/1/audita.txt
$$ ##AUDIT TRAIL=  $$ (NUMBER, WHEN, WHO, WHERE, WHAT)
(   1,<2019-04-09 14:04:06.60 +0400>,<she>,<DPX200>,
      <created by zg, POWCHK disabled, PULCHK disabled
       configuration hash MD5:
       00 E9 B6 7A A2 85 ED C7 34 08 36 98 17 FE 4E 26
       data hash MD5: 16K
       B3 92 C0 CB C8 C3 95 73 F7 15 90 21 A0 F0 37 E9>)
$$ ##END=
$$ 
$$ hash MD5
$$ FE DD 24 F2 A9 E2 F0 50 F9 6C E2 E3 B9 2D C8 26
##$RELAX= 
##$RELAX= 
##$RELAX= 
##$RELAX= 
##$RELAX= 
##$RELAX= 
$$ Bruker specific parameters
$$ --------------------------
##$DU= <F:/spectra>
##$EXPNO= 1
##$NAME= <H-F>
##$PROCNO= 1
##$TYPE= <nmr>
##$USER= <she>
##$AMP= (0..31)
100 100 100 100 100 100 100 100 100 100 100 100 100 100 100 100 100 100 
100 100 100 100 100 100 100 100 100 100 100 100 100 100 
##$AQSEQ= 0
##$AQ_mod= 1
##$AUNM= <au_zg>
##$AUTOPOS= <>
##$BF1= 200.13
##$BF2= 200.13
##$BF3= 200.13
##$BF4= 200.13
##$BF5= 200.13
##$BF6= 200.13
##$BF7= 200.13
##$BF8= 200.13
##$BYTORDA= 1
##$CFDGTYP= 0
##$CFRGTYP= 5
##$CHEMSTR= <none>
##$CNST= (0..31)
1 1 145 1 1 1 1 1 1 1 1 1 1 1 1 1 1 1 1 1 1 1 1 1 1 1 1 1 1 1 1 1 
##$CPDPRG= <>
##$CPDPRG1= <>
##$CPDPRG2= <>
##$CPDPRG3= <>
##$CPDPRG4= <mlev>
##$CPDPRG5= <mlev>
##$CPDPRG6= <mlev>
##$CPDPRG7= <mlev>
##$CPDPRG8= <mlev>
##$CPDPRGB= <>
##$CPDPRGT= <>
##$D= (0..31)
0 1.2 0 0 0 0 0 0 0 0 0 0.03 0 0 0 0 0 0 0 0 0 0 0 0 0 0 0 0 0 0 0 0 
##$DATE= 1554804245
##$DBL= (0..7)
120 120 120 120 120 120 120 120 
##$DBP= (0..7)
150 150 150 150 150 150 150 150 
##$DBP07= 0
##$DBPNAM0= <>
##$DBPNAM1= <>
##$DBPNAM2= <>
##$DBPNAM3= <>
##$DBPNAM4= <>
##$DBPNAM5= <>
##$DBPNAM6= <>
##$DBPNAM7= <>
##$DBPOAL= (0..7)
0.5 0.5 0.5 0.5 0.5 0.5 0.5 0.5 
##$DBPOFFS= (0..7)
0 0 0 0 0 0 0 0 
##$DE= 6
##$DECBNUC= <off>
##$DECIM= 24
##$DECNUC= <off>
##$DECSTAT= 4
##$DIGMOD= 1
##$DIGTYP= 9
##$DL= (0..7)
0 120 120 120 120 120 120 120 
##$DP= (0..7)
150 150 150 150 150 150 150 150 
##$DP07= 0
##$DPNAME0= <>
##$DPNAME1= <>
##$DPNAME2= <>
##$DPNAME3= <>
##$DPNAME4= <>
##$DPNAME5= <>
##$DPNAME6= <>
##$DPNAME7= <>
##$DPOAL= (0..7)
0.5 0.5 0.5 0.5 0.5 0.5 0.5 0.5 
##$DPOFFS= (0..7)
0 0 0 0 0 0 0 0 
##$DQDMODE= 0
##$DR= 18
##$DS= 0
##$DSLIST= <SSSSSSSSSSSSSSS>
##$DSPFIRM= 0
$$ [...]
##$SUBNAM2= <"">
##$SUBNAM3= <"">
##$SUBNAM4= <"">
##$SUBNAM5= <"">
##$SUBNAM6= <"">
##$SUBNAM7= <"">
##$SUBNAM8= <"">
##$SUBNAM9= <"">
##$SW= 24.9337058887773
##$SWIBOX= (0..15)
0 0 2 0 0 0 0 0 0 0 0 0 0 0 0 0 
##$SW_h= 4990.01996007984
##$TD= 16384
##$TD0= 1
##$TE= 0
##$TE2= 300
##$TE3= 300
##$TEG= 300
##$TL= (0..7)
0 120 120 120 120 120 120 120 
##$TP= (0..7)
150 150 150 150 150 150 150 150 
##$TP07= 0
##$TPNAME0= <>
##$TPNAME1= <>
##$TPNAME2= <>
##$TPNAME3= <>
##$TPNAME4= <>
##$TPNAME5= <>
##$TPNAME6= <>
##$TPNAME7= <>
##$TPOAL= (0..7)
0.5 0.5 0.5 0.5 0.5 0.5 0.5 0.5 
##$TPOFFS= (0..7)
0 0 0 0 0 0 0 0 
##$TUNHIN= 0
##$TUNHOUT= 0
##$TUNXOUT= 0
##$USERA1= <user>
##$USERA2= <user>
##$USERA3= <user>
##$USERA4= <user>
##$USERA5= <user>
##$V9= 5
##$VALIST= <valist>
##$VCLIST= <CCCCCCCCCCCCCCC>
##$VD= 0
##$VDLIST= <DDDDDDDDDDDDDDD>
##$VPLIST= <PPPPPPPPPPPPPPP>
##$VTLIST= <TTTTTTTTTTTTTTT>
##$WBST= 1024
##$WBSW= 4
##$XGAIN= (0..3)
0 0 0 0 
##$XL= 0
##$YL= 0
##$YMAX_a= 182156
##$YMIN_a= -195098
##$ZGOPTNS= <>
##$ZL1= 120
##$ZL2= 120
##$ZL3= 120
##$ZL4= 120
##$ABSF1= 10
##$ABSF2= 0
##$ABSG= 5
##$ABSL= 3
##$ALPHA= 0
##$AQORDER= 0
##$ASSFAC= 0
##$ASSFACI= 0
##$ASSFACX= 0
##$ASSWID= 0
##$AUNMP= <proc_1d>
##$AZFE= 0.1
##$AZFW= 0.1
##$BCFW= 1
##$BC_mod= 2
##$BYTORDP= 1
##$COROFFS= 0
##$CY= 11.3945322036743
##$DATMOD= 1
##$DC= 2
##$DFILT= <>
##$DTYPP= 0
##$F1P= 18.9103706918063
##$F2P= -1.10871071338519
##$FCOR= 0.5
##$FTSIZE= 0
##$FT_mod= 4
##$GAMMA= 1
##$GB= 0.15
##$INTBC= 1
##$INTSCL= 1
##$ISEN= 128
##$LB= 0.24
##$LEV0= 0
##$LPBIN= 0
##$MAXI= 10000
##$MC2= 0
##$MEAN= 0
##$ME_mod= 0
##$MI= 1.114404
##$NCOEF= 0
##$NC_proc= 0
##$NLEV= 6
##$NOISF1= 3.799351
##$NOISF2= 2.8
##$NSP= 1
##$NTH_PI= 0
##$NZP= 0
##$OFFSET= 15.70392
##$PC= 1
##$PHC0= -8854.653
##$PHC1= 16.80026
##$PH_mod= 1
##$PKNL= yes
##$PPARMOD= 0
##$PSCAL= 0
##$PSIGN= 0
##$REVERSE= no
##$SF= 200.130013532006
##$SI= 16384
##$SIGF1= 3
##$SIGF2= 2
##$SINO= 400
##$SIOLD= 16384
##$SREGLST= <1H.CDCl3>
##$SSB= 0
##$STSI= 0
##$STSR= 0
##$SW_p= 3612.71676300578
##$SYMM= 0
##$S_DEV= 0
##$TDeff= 0
##$TDoff= 0
##$TI= <>
##$TILT= no
##$TM1= 0
##$TM2= 0
##$TOPLEV= 0
##$USERP1= <user>
##$USERP2= <user>
##$USERP3= <user>
##$USERP4= <user>
##$USERP5= <user>
##$WDW= 1
##$XDIM= 8192
##$YMAX_p= 0
##$YMIN_p= 0
$$ End of Bruker specific parameters
$$ ---------------------------------
##NTUPLES= NMR FID
##VAR_NAME=  TIME,          FID/REAL,        FID/IMAG
##SYMBOL=    X,             R,               I
##VAR_TYPE=  INDEPENDENT,   DEPENDENT,       DEPENDENT
##VAR_FORM=  AFFN,          ASDF,            ASDF
##VAR_DIM=   8192,          8192,            8192
##UNITS=     SECONDS,       ARBITRARY UNITS, ARBITRARY UNITS
##FACTOR=    0.0002004,     1,               1
##FIRST=     0,             0,               0
##LAST=      1.6414764,     0,               0
##MIN=       0,             -195098,         0
##MAX=       1.6414764,     182156,          0
$$ Real data points
##PAGE= N=1
##DATA TABLE= (X++(R..R)), XYDATA
$$ plain form
0 0 0 0 0 0 0 0 4 -8 8 -8 9 -16 16 -24 28 -32 40 -48 56 -66 80 -92 106 -122 140 -162 186 -210 238 -270
30 -270 302 -342 383 -426 475 -531 589 -655 729 -808 894 -990 1095 -1214 1345 -1492 1657
47 1657 -1845 2062 -2311 2609 -2963 3398 -3945 4659 -5635 7055 -9325 13547 -24138 109829
61 109829 146370 6982 92149 90291 -1402 -28176 103197 147343 99129 109001 182156 127023
73 127023 21130 28648 86598 24007 -31097 60048 153706 85953 20485 87695 128536 23418
85 23418 -41031 33755 76000 7391 -1481 84506 90749 4663 844 59696 19655 -64561 -23254
98 -23254 60994 24390 -37989 24821 89408 13578 -67273 -21210 14063 -62383 -96940 -11093
110 -11093 33343 -24836 -29194 43313 25309 -77538 -89199 -29017 -60794 -132048 -78815 20681
$$ packed form
0@%%%%%%Mj2J6j6J7k5L2m0N2o0P2q8J04j22J46j72J98k28K62l02L48l96M48n08
30b70N72o44P25q09R01j006J120j244J384j537J702j884K085k309K559k837L149
47A657l502L907m373M920n572O361p343Q604j0294J2690j6380K2872l7685J33967
61A09829L6541j39388Q5167j858r1693k6774J31373M4146m8214R872P3155n5133
73A27023j05893P518N7950o2591n5104R1145R3658o7753o5468O7210M0841j05118
85B3418o4449P4786M2245o8609q872Q5987O243q6086l819N8852m0041q4216M1307
98b3254Q4248l6604o2379O2810O4587p5830q0851M6063L5273p6446l4557Q5847
110a1093M4436n8179m358P2507j8004j02847j1661O0182l1777p1254N3233R9496
$$ plain form
122 20681 -3154 -66350 -22610 22671 -60563 -141210 -95528 -52023 -107390 -121069 -27036 10815
134 10815 -62241 -84479 -25750 -47710 -145184 -143123 -57773 -61178 -119153 -75956 3276 -37370
146 -37370 -118756 -93822 -49873 -107868 -156596 -87733 -28026 -74296 -98997 -32784 -19211 -105608
158 -105608 -135998 -75545 -71128 -133225 -113307 -26103 -24688 -85370 -68816 -19257 -65500 -137036
170 -137036 -107538 -54018 -86455 -113727 -44847 6124 -44419 -79885 -35083 -29230 -102480 -121931
182 -121931 -55938 -37863 -80208 -58321 12830 2601 -61965 -53969 -14020 -53488 -105999 -62362
194 -62362 -708 -24605 -50419 4387 37272 -22730 -64111 -22800 -8038 -60108 -60286 12434
206 12434 32029 -13276 -5986 43397 18351 -48208 -36558 14779 -4583 -38433 11316 69316
$$ packed form
122B0681k3835o3196M3740M5281q3234q0647M5682M3505n5367j3679R4033L7851
134A0815p3056k2238N8729k1960r7474K061Q5350l405n7975M3197P9232m0646
146c7370q1386K4934M3949n7995m8728O8863N9707m6270k4701O6213J3573q6397
158a05608l0390O0453M417o2097J9918Q7204J415o0682J6554M9559m6243p1536
170a37036K9498N3520l2437k7272O8880N0971n0543l5466M4802N853p3250j9451
182a21931O5993J8075m2345K1887P1151j0229o4566P996L9949l9468n2511M3637
194f2362O1654k3897k5814N4806L2885o0002m1381M1311J4762n2070j78P2720
206A2434J9595m5305P290M9383k5046o6559J1650N1337j9362l3850M9749N8000
$$ plain form
218 69316 37352 -3779 28063 48504 -8016 -39703 11055 41758 8466 11725 72603 79599
230 79599 23500 14760 51611 32280 -18197 3394 62327 55757 26217 60082 98827 60028
242 60028 13445 35264 57110 20717 5163 57006 87684 58351 51463 88259 82446 28934
254 28934 20329 57088 51945 21265 47704 97595 86597 50662 64838 85360 47731 12062
266 12062 38710 68018 47831 41529 83784 99392 61137 43593 66239 57682 15874 20738 63974
279 63974 66895 42897 61186 93907 70204 27641 34789 53514 27639 7294 41286 72102
291 72102 53073 40581 66337 67854 24433 6234 30758 32109 6105 17612 58519 58250 27715
304 27715 30737 48778 23684 -13477 -2297 23783 12703 780 28705 49677 24973 2349
$$ packed form
218F9316l1964m1131L1842K0441n6520l1687N0758L0703l3292L259O0878O996
230G9599n6099q740L6851j9331n0477K1591N8933o570k9540L3865L8745l8799
242F0028m6583K1819K1846l6393j5554N1843L0678k9333o888L6796n813n3512
254B8934q605L6759n143l0680K6439M9891j0998l5935J4176K0522l7629l5669
266A2062K6648K9308k0187o302M2255J5608l8255j7544K2646q557m1808M864M3236
279F3974K921k3998J8289L2721k3703m2563P148J8725k5875k0345L3992L0816
291G2102j9029j2492K5756J517m3421j8199K4524J351k6004J1507M0907k69l0535
304B7715L022J8041k5094l7161J1180K6080j1080j1923K7925K0972k4704k2624
$$ plain form
316 2349 13342 11875 -19685 -27693 667 11328 -4145 2520 27076 18154 -15948 -21308 -8941
329 -8941 -23118 -42876 -25782 1220 -3236 -15313 -3122 2165 -24205 -45300 -36512 -32034 -45905
342 -45905 -42030 -15342 -7740 -24298 -27596 -18386 -32450 -59439 -59206 -42084 -43055 -50186 -33799 -15533
356 -15533 -25877 -42906 -41002 -41822 -61084 -70050 -54047 -42072 -46699 -41832 -24906 -26730 -48024
369 -48024 -55888 -50179 -57516 -70464 -61051 -39520 -35677 -41460 -34534 -28130 -42456 -59534 -58255 -53660
383 -53660 -58507 -56419 -37885 -26066 -31313 -34482 -30185 -36393 -53971 -58152 -47739 -42193 -42968 -32368
397 -32368 -17177 -15911 -26159 -30611 -31730 -39471 -46297 -40479 -28894 -22613 -17082 -8461 -5651 -13258
411 -13258 -21745 -24705 -27172 -29882 -26286 -13860 -3837 211 2682 3744 -157 -9063 -15151 -15751 -12328
$$ packed form
316B349J0993j467l1560q008K8360J0661j5473O665K4556q922l4102n360J2367
329h941j4177j9758J7094K7002m456j2077J2191N287k6370k1095Q788M478j3871
342d5905L875K6688P602j6558l298R210j4064k6989K33J7122r71p131J6387J8266
356a5533j0344j7029J904q20j9262q966J6003J1975m627M867J6926j824k1294
369d8024p864N709p337j2948R413K1531L843n783O926O404j4326j7078J279M595
383e3660m847K088J8534J1819n247l169M297o208j7578m181J0413N546p75J0600
397c2368J5191J266j0248m452j119p741o826N818J1585O281N531Q621K810p607
411a3258q487k960k467k710L596J2426J0023M048K471J062l901q906o088o00L423
$$ plain form
426 -12328 -6323 1426 10436 16714 17779 14139 8592 2522 -1998 -2133 2427 10347 18319 24692 29356
441 29356 29463 23214 15630 11941 11039 9980 13634 24236 34003 36270 36201 36795 32605 22435 16518 19001
457 19001 22288 25027 33190 43506 45575 40861 38872 36140 26762 19127 23786 31806 33198 36802 47564
472 47564 52256 42792 34143 34132 30773 21380 22006 34362 40960 39188 43448 50432 43313 28356 26447
487 26447 29831 23432 18710 30759 44613 40590 34793 41164 41884 24968 13544 21078 25708 18399
501 18399 21339 37878 41851 29211 25823 31251 21577 5177 7653 21173 19945 13056 25267 37495
515 37495 25594 9839 13780 16740 1461 -6687 8951 20114 11318 10036 23123 21478 1096
528 1096 -5282 3810 -1070 -14311 -5143 13691 10611 -1524 5471 13536 -3942 -21868 -13769 -3759
$$ packed form
426a2328O005P749R010O278J065l640n547o070m520j35M560P920P972O373M664
441B9356J07o249p584l689r02j059L654J0602R767K267o9N94m190j0170n917K483
457A9001L287K739Q163J0316K069m714j989k732r378p635M659Q020J392L604J0762
472D7564M692r464q649j1l359r393O26J2356O598j772M260O984p119j4957j909
487B6447L384o399m722J2049J3854m023n797O371P20j6916j1424P534M630p309
501A8399K940J6539L973j2640l388N428r674j6400K476J3520j228o889J2211J2228
515C7495j1901j5755L941K960j5279q148J5638J1163q796j282J3087j645k0382
528A096o378R092m880j3241R168J8834l080j2135O995Q065j7478j7926Q099J0010
$$ plain form
542 -3759 -14790 -18567 478 9582 -5710 -12676 -2414 -7296 -28739 -30060 -12541 -12789 -24743 -14461
556 -14461 3890 -6295 -25963 -20659 -11528 -28143 -42316 -25901 -10014 -21357 -27380 -9421 -5231
569 -5231 -27741 -37464 -23095 -23974 -43151 -38099 -13677 -13596 -30909 -24183 -7975 -22614 -46155 -37773
583 -37773 -21187 -33395 -44728 -23976 -6508 -23237 -35373 -20122 -16337 -40690 -48675 -26521
595 -26521 -20925 -38021 -32653 -7385 -10450 -34347 -32187 -15283 -27633 -48985 -34641 -11435 -20748
608 -20748 -33733 -14775 -620 -22162 -38009 -21729 -14392 -35177 -38088 -10839 -3111 -22252 -20647
621 -20647 1647 -5895 -32888 -28309 -6655 -14839 -31809 -14054 9745 -2789 -19758 -3945 7187
634 7187 -15697 -29625 -6944 4850 -13671 -14253 13232 17399 -7609 -9125 11819 4701 -19894
$$ packed form
542c759j1031l777J9045R104j5292o966J0262m882k1443j321J7519k48j1954J0282
556a4461J8351j0185j9668N304R131j6615j4173J6415J5887j1343o023J7959M190
569e231k2510r723J4369q79j9177N052K4422Q1j7313O726J6208j4639k3541Q382
583c7773J6586j2208j1333K0752J7468j6729j2136J5251L785k4353p985K2154
595b6521N596j7096N368K5268l065k3897K160J6904j2350k1352J4344K3206r313
608b0748j2985J8958J4155k1542j5847J6280P337k0785k911K7249P728j9141J605
621b0647K2294p542k6993M579K1654q184j6970J7755K3799j2534j6969J5813J1132
634G187k2884j3928K2681J1794j8521n82K7485M167k5008j516K0944p118k4595
$$ plain form
647 -19894 -10678 16365 10585 -7150 9387 30489 12758 -8814 6831 21142 210 -10369
659 -10369 16420 30847 10810 6147 30629 31277 2277 145 24842 21553 -905 11403 39783
672 39783 32176 9106 21544 40406 20512 -1635 17223 35979 17623 7967 34880 47216
684 47216 21946 12616 34809 34841 6875 7132 35869 35309 13154 22748 48311 36662 9447 19861
698 19861 38828 21147 2320 23956 43802 25575 13324 35984 43536 15553 5351 28411
710 28411 30396 5793 9389 38364 36403 10694 16638 38245 23647 -2992 9035 30481 15550
723 15550 -444 20821 38264 16217 460 20015 26094 -1749 -8973 17623 22560 -1289 1006
736 1006 27957 22296 -7366 -3603 18556 5644 -18871 -3446 20300 6022 -11908 6489 21354
$$ packed form
647a9894R216K7043n780j7735J6537K1102j7731k1572J5645J4311k0932j0579
659a0369K6789J4427k0037m663K4482O48k9000k132K4697l289k2458J2308K8380
672C9783p607k3070J2438J8862j9894k2147J8858J8756j8356r656K6913J2336
684D7216k5270r330K2193L2k7966K57K8737n60k2155R594K5563j1649k7215J0414
698A9861J8967j7681j8827K1636J9846j8227j2251K2660P552k7983j0202K3060
710B8411J985k4603L596K8975j961k5709N944K1607j4598k6639J2027K1446j4931
723A5550j5994K1265J7443k2047j5757J9555O079k7843p224K6596M937k3849K295
736A006K6951n661k9662L763K2159j2912k4515J5425K3746j4278j7930J8397J4865
$$ plain form
749 21354 -3671 -21392 -785 8064 -16326 -21448 7067 12598 -13859 -14844 9222 2150 -27462
762 -27462 -22880 2228 -7030 -28635 -13108 10063 -5754 -27227 -11066 1933 -21828 -36395
774 -36395 -13672 -1383 -23466 -28380 -1835 1201 -26727 -29799 -6742 -12364 -37860 -30491 -3737
787 -3737 -10554 -31936 -18524 1276 -16494 -38020 -22081 -7779 -27464 -38098 -13558 -1297
799 -1297 -23099 -29669 -6657 -6347 -33593 -34923 -10307 -12841 -34705 -25109 845 -7873 -30743 -19881
813 -19881 -1923 -19212 -38313 -19934 -2931 -19726 -29699 -6156 4036 -20117 -28666 -6418
825 -6418 -4856 -29578 -28343 -1425 -1683 -23408 -15641 7430 -2974 -26639 -16777 2872 -11818
838 -11818 -27455 -8150 9905 -7059 -18131 1761 9435 -14599 -22653 248 4767 -16526 -13938
$$ packed form
749B1354k5025j7721K0607Q849k4390n122K8515N531k6457r85K4066p072k9612
762b7462M582K5108r258k1605J5527K3171j5817k1473J6161J2999k3761j4567
774c6395K2723J2289k2083m914K6545L036k7928l072K3057n622k5496P369K6754
787c737o817k1382J3412J9800j7770k1526J5939J4302j9685j0634K4540J2261
799a297k1802o570K3012L10k7246j330K4616k534k1864R596K5954q718k2870J0862
813a9881J7958j7289j9101J8379J7003j6795r973K3543J0192k4153q549K2248
825f418J562k4722J235K6918k58k1725P767K3071j0404k3665R862J9649j4690
838a1818j5637J9305J8055j6964j1072J9892P674k4034q054K2901M519k1293K588
$$ plain form
851 -13938 12056 10893 -11764 -7192 13155 2788 -19028 -7368 12907 1762 -11790 5960
863 5960 21183 2875 -9907 7697 14703 -6512 -11312 12066 17981 -1630 -64 21884 18471
876 18471 -4755 -1031 18209 9992 -7314 5610 24946 14216 -115 14672 26295 7511
888 7511 -4720 12896 21757 3834 184 23232 27274 7052 6235 25062 20789 -960 3925 24094
902 24094 18435 2349 14439 31788 19188 3262 15750 26766 9710 -594 17561 27520
914 27520 11260 6759 26461 28600 7600 4921 22507 20091 1624 7045 27459 22379 5890
927 5890 14189 28576 15906 211 11277 23044 9603 1008 18563 27252 10701 4434 19997
940 19997 20774 1353 -289 17108 16794 1347 6314 22967 16795 542 6353 17649 6253 -6368
$$ packed form
851a3938K5994j163k2657M572K0347j0367k1816J1660K0275j1145j3552J7750
863E960J5223j8308j2782J7604P006k1215m800K3378N915j9611J566K1948l413
876A8471k3226L724J9240q217j7306J2924J9336j0730j4331J4787J1623j8784
888G511j2231J7616Q861j7923l650K3048M042k0222q17J8827m273k1749M885K0169
902B4094n659j6086J2090J7349j2600j5926J2488J1016j7056j0304J8155R959
914B7520j6260m501J9702K139k1000k679J7586k416j8467N421K0414n080j6489
927E890Q299J4387j2670j5695J1066J1767j3441q595J7555Q689j6551o267J5563
940A9997P77j9421j642J7397l14j5447M967J6653o172j6253N811J1296j1396j2621
$$ plain form
954 -6368 5507 16777 5526 -1935 12383 17920 1291 -5448 7976 9257 -6313 -6587 9802
967 9802 9728 -4754 -1734 11450 4388 -11057 -5759 5164 -3380 -13168 -2143 8666 -2657 -10956
981 -10956 86 3916 -11579 -17173 -3514 -463 -13585 -13131 1569 423 -14254 -13489 -2078 -8049
995 -8049 -21293 -15092 -3116 -9705 -18513 -8996 -779 -11781 -21142 -11423 -7215 -19194 -23226 -9563
1009 -9563 -5731 -16830 -17542 -6320 -7886 -21265 -20903 -10309 -13593 -22968 -16655 -5839 -11530 -19599
1023 -19599 -12690 -6922 -17193 -24036 -14685 -9032 -17998 -20049 -8619 -5586 -15926 -17619 -9115 -10641
1037 -10641 -20734 -18372 -8388 -9945 -16911 -11511 -3487 -9468 -17082 -11564 -6693 -13790 -17601 -8449
1051 -8449 -2857 -9675 -11711 -3037 -1793 -11211 -12670 -4921 -5057 -12031 -9035 655 -684 -7052 -3754
$$ packed form
954f368J1875J1270j1251p461J4318N537j6629o739J3424J281j5570k74J6389
967I802p4j4482L020J3184p062j5445N298J0923q544r788J1025J0809j1323q299
981a0956J1042L830j5495n594J3659L051j3122M54J4700j146j4677P65J1411n971
995h049j3244O201J1976o589q808R517Q217j1002r361R719M208j1979m032J3663
1009i563L832j1099p12J1222j566j3379L62J0594l284r375O313J0816n691q069
1023a9599O909N768j0271o843R351N653q966k051J1430L033j0340j693Q504j526
1037a0641j0093K362R984j557o966N400Q024n981p614N518M871p097l811R152
1051h449N592o818k036Q674J244r418j459P749j36o974K996R690j339o368L298
$$ plain form
1066 -3754 2161 -3342 -9793 -4429 1416 -3322 -6129 2042 6728 165 -2891 3018 3966 -2990 -3710
1081 -3710 3514 5096 610 2665 9164 7437 1671 3342 7303 4018 315 4613 10465 7044 5028
1096 5028 9634 12285 6766 3689 7722 9259 5284 5384 11284 12525 9410 9549 12635 10765 6482
1111 6482 7467 11210 9627 7728 11431 15128 12131 9556 11725 12525 8283 6691 10500 12443 10225
1126 10225 10379 13932 13848 10757 9447 11047 9743 7645 9279 11881 11502 10266 11882 13356 10348 7282
1142 7282 8779 9537 7696 6974 9870 11515 10169 9365 9911 9424 7077 5724 6415 6831 6413 7527 9340
1159 9340 8683 7250 6553 6370 4786 3348 3573 5214 5715 5243 5653 6438 5854 3398 2234 1983 2146 1665
1177 1665 1621 2937 4080 3365 2338 2152 1394 -521 -1397 -478 -395 -688 -296 1761 1257 -1301 -1815 -1061
$$ packed form
1066c754N915n503o451N364N845m738k807Q171M686o563l056N909R48o956p20
1081c710P224J582m486K055O499j727n766J671L961l285l703M298N852l421k016
1096E028M606K651n519l077M033J537l975J00N900J241l115J39L086j870m283
1111F482R85L743j583j899L703L697k997k575K169Q00m242j592L809J943k218
1126A0225J54L553q4l091j310J600j304k098J634K602l79j236J616J474l008l066
1142G282J497P58j841p22K896J645j346q04N46m87k347j353O91M16m18J114J813
1159I340o57j433o97j83j584j438K25J641N01m72M10P85n84k456j164k51J63m81
1177A665m4J316J143p15j027j86p58j915q76R19Q3k93L92K057n04k558n14P54
$$ plain form
1195 -1061 -2370 -4777 -4483 -1568 -1784 -3230 -2725 -677 -2343 -5732 -5318 -4398 -6196 -6921 -4578 -3002
1211 -3002 -4605 -5397 -3938 -4429 -8101 -9015 -6208 -7065 -9342 -8179 -3989 -4687 -8474 -7952 -5604 -8010
1227 -8010 -11770 -9730 -7075 -9045 -10016 -6640 -5092 -8973 -10485 -7567 -7826 -12473 -12472 -7506 -7326 -10993
1243 -10993 -9586 -5203 -7156 -12183 -10920 -7929 -10315 -13500 -9705 -5557 -8849 -11104 -6972 -5681 -10967
1258 -10967 -12966 -7915 -7111 -12031 -11408 -4460 -4816 -10354 -9151 -3926 -6140 -12135 -10145 -4150 -6385
1273 -6385 -10333 -5671 -1107 -5472 -9369 -4533 -1982 -8052 -9886 -2898 -692 -6515 -6316 1052 1057 -6351
1289 -6351 -6004 572 -886 -7074 -3938 3257 871 -3761 562 4992 -203 -4609 885 4373 -1265
1304 -1265 -2967 5254 7730 425 -122 7251 6698 -1150 -326 7537 6265 140 3870 11473 7405 1322
$$ packed form
1195a061j309k407K94K915k16j446N05K048j666l389M14R20j798p25K343J576
1211c002j603p92J459m91l672r14K807q57k277J163M190o98l787N22K348k406
1227h010l760K040K655j970r71L376J548l881j512K918k59m647JM966J80l667
1243a0993J407M383j953n027J263K991k386l185L795M148l292k255M132J291n286
1258a0967j999N051Q04m920O23O948l56n538J203N225k214n995J990N995k235
1273f385l948M662M564m365l897M836K551o070j834O988K206n823J99P368Np408
1289f351L47O576j458o188L136P195k386m632M323M430n195m406N494L488n638
1304a265j702Q221K476p305n47P373n53p848Q24P863j272o125L730P603m068o083
$$ plain form
1320 1322 6135 11244 4915 307 7374 12074 5460 3206 11807 13651 5016 3723 11946 11367 2806
1335 2806 4625 13976 12244 4975 8306 15479 10617 3162 8470 14216 7748 3252 11623 16043 7973
1350 7973 4698 13077 15101 4614 3464 12839 12953 4002 5637 15228 12945 3898 6807 14161 9151
1365 9151 1365 6747 13993 7418 1683 9872 14465 5173 227 9281 11434 1365 -105 9928
1379 9928 10380 1287 1810 10743 8087 -1798 1161 9170 4006 -4031 2911 9973 2755 -3868 4043
1394 4043 8707 -1635 -6303 3210 5930 -3874 -5098 5315 5566 -5266 -4622 4777 1239 -8668 -4800
1409 -4800 4111 -1098 -8741 -1877 5051 -3729 -10130 -1944 2648 -7700 -11385 -808 2300 -8050
1423 -8050 -9560 870 362 -10540 -10042 -181 -2830 -12532 -8306 1334 -4101 -12536 -5977 1418 -7154
$$ packed form
1320A322M813N109o329m608P067M700o614k254Q601J844q635j293Q223n79q561
1335B806J819R351j732p269L331P173m862p455N308N746o468m496Q371M420q070
1350G973l275Q379K024j0487j150R375J14q951J635R591k283r047K909P354n010
1365I151p786N382P246o575n735Q189M593r292m946R054K153j0069j470J0033
1379I928M52r093N23Q933k656r885K959Q009n164q037O942P062p218o623P911
1394D043M664j0342m668R513K720r804j224J0413K51j0832O44R399l538r907L868
1409d800Q911n209p643O864O928q780o401Q186M592j0348l685J0577L108j0350
1423h050j510J0430n08j0902M98R861k649r702M226R640n435q435O559P395q572
$$ plain form
1438 -7154 -14708 -5657 31 -9269 -13506 -2675 449 -10105 -12158 -2253 -1687 -12825 -12016 -1377
1452 -1377 -3502 -12667 -8616 706 -4446 -13501 -7651 435 -7844 -14994 -5183 856 -8211 -12792 -2599
1467 -2599 875 -10064 -12547 -1916 -1231 -11675 -10581 206 -1302 -11182 -7255 1838 -3904 -12598
1481 -12598 -5846 2094 -5395 -12019 -2441 3696 -6048 -10931 -950 2706 -8410 -10256 769 1402
1495 1402 -8370 -7044 3830 1214 -8822 -4806 4267 -1369 -10206 -2684 6013 -1579 -8705 310
1509 310 6877 -3070 -8092 1683 5090 -5026 -6395 4626 5427 -4513 -3443 6884 3951 -6119
1523 -6119 -1817 7458 2448 -6353 901 9682 2204 -5019 3878 9463 260 -4992 4904 8772 -723
1538 -723 -2180 8337 8842 -1341 -787 9474 6572 -2807 1561 10996 6455 -2207 4963 12445 4789
$$ packed form
1438g154p554R051N688r300m237J0831L124j0554k053R905N66j1138Q09J0639
1452a377k125r165M051R322n152r055N850Q086q279p150R811O039r067m581J0193
1467b599L474j0939k483J0631O85j0444J094J0787j508r880L927R093n742q694
1481a2598O752P940p489o624R578O137r744m883R981L656j1116j846J1025O33
1495A402r772J326J0874k616j0036M016R073n636q837P522Q697p592p126R015
1509C10O567r947n022R775L407j0116j369J1021Q01r940J070J0327k933j0070
1523f119M302R275n010q801P254Q781p478p223Q897N585r203n252R896L868r495
1538g23j457J0517N05j0183N54J0261k902r379M368R435m541q662P170P482p656
$$ plain form
1553 4789 -2161 5886 11713 3144 -1520 8577 12433 2712 743 10615 11220 739 1601 11294 8876
1568 8876 -509 4391 13628 8281 -110 5973 13492 5824 -1451 7267 12844 4338 5 9747 13035
1583 13035 3189 1323 10142 10245 356 1652 11132 9095 113 4018 12663 7458 -1304 4374 11571
1598 11571 4621 -2480 5671 11354 3556 -1101 7293 9798 574 -1565 6949 7459 -1365 -456 8506
1613 8506 6536 -2875 501 8274 2963 -4630 336 7742 1183 -5119 1910 7372 -940 -5228 2179
1628 2179 4663 -3932 -5737 2757 3067 -5420 -4207 3798 1058 -7356 -4687 2674 -2030 -9262 -4137
1643 -4137 2983 -3139 -8767 -2603 1720 -5693 -9938 -2805 -214 -7930 -9060 -1342 -1268 -9096 -8216 -445
1659 -445 -3225 -11469 -8147 -1039 -4838 -11319 -6556 -111 -5572 -11519 -5869 -1282 -8111 -11492 -4855
$$ packed form
1553D789o950Q047N827q569m664J0097L856r721j969R872O05j0481Q62R693k418
1568H876r385M900R237n347q391O083P519p668p275Q718N577q506m333R742L288
1583A3035r846j866Q819J03r889J296R480k037q982L905Q645n205q762N678P197
1598A1571o950p101Q151N683p798m657Q394K505r224k139Q514N10q824R09Q962
1613H506j970r411L376P773n311p593M966P406o559o302P029N462q312m288P407
1628B179K484q595j805Q494L10q487J213Q005k740q414K669P361m704p232N125
1643d137P120o122n628O164M323p413m245P133K591p716j130P718P4p828Q80P771
1659d45k780q244L322P108l799o481M763O445n461n947N650M587o829l381O637
$$ plain form
1674 -4855 -2004 -9127 -10123 -2945 -2759 -10490 -9368 -2561 -4139 -11542 -8281 -900 -4391 -10619 -6316
1689 -6316 -745 -5545 -10847 -5566 -895 -6892 -9262 -3431 -618 -6778 -7813 -1443 -1072 -8153 -7376
1704 -7376 -567 -1701 -7849 -5139 1465 -1502 -7079 -3599 1340 -2508 -7007 -2342 2274 -2616 -5340
1719 -5340 413 2267 -3066 -4066 1773 1766 -4319 -3028 3711 2185 -2907 -888 4839 1732 -3294 132
1735 132 4681 1087 -2628 2054 5703 1304 -760 3876 5390 126 -511 4798 4937 167 956 6846
1751 6846 5434 107 1868 6972 4304 -246 2688 7213 3997 714 4443 7462 3301 1192 5223
1766 5223 6461 1997 1517 6461 6934 2505 2743 7328 6502 1693 2684 6862 5481 1298 3893 7236
1782 7236 5002 2242 4695 6810 3758 1526 4826 6051 2504 2081 6334 6109 2310 2577 5729 5021
$$ packed form
1674d855K851p123r96P178J86p731J122O807j578p403L261P381l491o228M303
1689f316N571m800n302N281M671n997k370N831K813o160j035O370L71p081P77
1704g376O809j134o148K710O604k967n577L480M939l848m499M665M616m890k724
1719e340N753J854n333j000N839po085J291O739j526n092K019N727l107n026L426
1735A32M549l594l715M682L649m399k064M636J514n264o37N309J39m770P89N890
1751F846j412n327J761N104k668m550K934M525l216l283L729L019m161k109M031
1766E223J238m464m80M944M73m429K38M585q26m809R91M178j381m183K595L343
1782G236k234k760K453K115l052k232L300J225l547m23M253k25l799K67L152p08
$$ plain form
1798 5021 951 2455 5951 4601 1448 3277 5928 4078 1600 3460 4752 2487 1148 4070 4962
1813 4962 1964 1629 4454 4388 745 870 3974 3302 378 1682 4328 3134 619 1653 3722 1710
1829 1710 -283 1454 2746 868 -423 2348 2682 409 -309 2300 1591 -1111 -1051 1484 944 -1109
1845 -1109 -538 1388 800 -1510 -915 412 -641 -2142 -1052 9 -1216 -1945 -706 -94 -2096 -2879
1861 -2879 -1315 -971 -2661 -3008 -1128 -1119 -2719 -3011 -1590 -2228 -3178 -3682 -2592 -2859 -3312 -2916 -2285 -3233
1879 -3233 -3800 -3173 -3368 -4330 -4172 -3849 -3376 -3967 -4118 -3239 -3482 -4265 -4618 -4243 -4263 -4759 -4598 -4136 -3973 -4167
1899 -4167 -4404 -4246 -4562 -4548 -4574 -4708 -4802 -5110 -4400 -4137 -4224 -4763 -4672 -4051 -4592 -4818 -4837 -4284 -3626 -4308 -4310 -3682
1921 -3682 -3280 -4047 -4059 -3612 -3719 -4015 -3950 -3372 -2936 -3576 -2687 -2387 -2820 -3604 -2998 -2223 -2774 -3010 -1675 -1346
$$ packed form
1798E021m070J504L496j350l153J829K651j850k478J860J292k265j339K922Q92
1813D962k998l35K825o6l643J25L104o72k924J304K646j194k515J034K069k012
1829A710j993J737J292j878j291K771L34k273p18K609p09k702O0K535n40k053
1845a109N71J926n88k310N95J327j053j501J090J061j225p29J239O12k002p83
1861b879J564L44j690l47J880Rj600k92J421o38r50n04J090k67m53L96O31r48
1879c233n67O27j95r62J58L23M73n91j51Q79k43p83l53L75k0m96J61M62J63j94
1899d167k37J58l16J4k6j34r4l08P10K63q7n39R1O21n41k26j9N53O58o82kO28
1921c682M02p67j2M47j07k96O5N78M36o40Q89L00m33p84O06P75n51k36J335L29
$$ plain form
1941 -1346 -1966 -1953 -1247 -623 -1946 -2044 -1001 -185 -820 -578 457 491 -487 -171 1015 423 -937 228 2108
1960 2108 1397 400 1425 3053 1757 556 2006 2962 1774 940 2773 3621 2101 1735 3571 3922 2137
1977 2137 2436 4177 3804 2170 3214 5365 4303 2489 3492 5375 3885 2284 3969 5599 4080
1992 4080 2975 4842 5606 4130 3216 5204 5232 3136 3572 6201 5434 3035 4498 6476 4907 2401
2008 2401 3731 5970 4120 2246 4195 6030 3704 2551 4774 5297 2871 2213 4783 4751 2050 2244
2024 2244 5023 4284 1640 2274 4944 3080 309 2032 4784 2621 435 2383 4863 1754 195
2039 195 2774 3702 348 -523 2513 2765 -233 -390 3281 2144 -1315 -396 2584 1136 -2567 -373
2055 -373 2604 -184 -2617 94 2178 -903 -3148 -182 1048 -2322 -2915 447 938 -2801 -2747 697
$$ packed form
1941a346o20J3P06O24j323r8J043Q16o35K42J035L4r78L16J186n92j360J165J880
1960B108p11r97J025J628j296j201J450R56j188q34J833Q48j520l66J836L51j785
1977B137K99J741l73j634J044K151j062j814J003J883j490j601J685J630j519
1992D080j105J867P64j476r14J988K8k096M36K629p67k399J463J978j569k506
2008B401J330K239j850j874J949J835k326j153K223N23k426o58K570l2k701J94
2024B244K779p39k644O34K670j864k771J723K752k163k186J948K480l109j559
2039A95K579R28l354q71L036K52k998j57L671j137l459R19K980j448l703K194
2055c73K977k788k433K711K084l081k245K966J230l370n93L362M91l739N4L444
$$ plain form
2071 697 -121 -4023 -2866 760 -806 -4344 -2294 744 -1781 -4765 -2080 60 -3258 -5109 -1524
2086 -1524 -271 -3833 -4665 -939 -462 -4590 -4863 -575 -1326 -5458 -4256 57 -1883 -5770 -3164 -80
2102 -80 -3029 -5881 -2995 -433 -3648 -5865 -1787 89 -4178 -5158 -1301 -900 -5298 -5120 -481 -1487
2118 -1487 -5435 -3971 101 -2156 -5636 -3408 124 -2731 -6242 -2689 -65 -3194 -5285 -1397 76
2133 76 -4144 -5165 -953 -618 -4872 -4643 69 -504 -5029 -3575 753 -1090 -5399 -3184 720 -2012
2149 -2012 -4835 -1877 1289 -2246 -4423 -411 1086 -3251 -4140 432 788 -3641 -3250 1479 772 -3931
2165 -3931 -2451 2075 143 -3995 -1300 2240 98 -3437 199 3053 -885 -3153 1024 2960 -1658
2180 -1658 -2437 2228 2932 -1642 -1206 3903 2695 -1969 -345 3976 2253 -2054 1021 4724 1998 -1432
$$ packed form
2071F97q18l902J157L626j566l538K050L038k525k984K685K140l318j851L585
2086a524J253l562q32L726M77m128k73M288p51m132J202M313j940l887K606L084
2102h0k949k852K886K562l215k217M078J876m267r80L857M01m398J78M639j006
2118a487l948J464M072k257l480K228L532k855l511L553K624l129k091L888J473
2133G6m220j021M212L35m254K29M712n73m525J454M328j843m309K215L904k732
2149b012k823K958L166l535k177M012J497m337q89M572L56m429L91M729p07m703
2165c931J480M526j932m138K695L540k142l535L636K854l938k268M177J936m618
2180a658p79M665P04m574M36N109j208m664J624M321j723m307L075L703k726l430
$$ plain form
2196 -1432 2176 5064 1205 -1033 3398 5167 840 -206 4796 5472 476 1007 5385 4753 -49 1612
2212 1612 6034 4343 75 3000 6855 3647 189 3733 6473 2985 358 4515 6902 2184 1043
2227 1043 5857 6478 1653 1693 6188 5814 1002 2393 6723 4966 886 3585 7020 3752 460 3659
2243 3659 6528 2736 544 4308 6792 1954 645 5265 5340 833 545 5485 4750 50 1078 5578
2259 5578 3540 -364 1269 5228 2104 -1313 2201 4865 993 -1403 2796 4182 -390 -1878 2808
2274 2808 3107 -1595 -1387 3211 2414 -2085 -1120 2838 945 -3435 -1433 2548 -681 -4114 -1023 1937
2290 1937 -1806 -4291 -326 991 -3293 -4476 -41 426 -4210 -4511 -56 -581 -4952 -3852 -126 -1888
2306 -1888 -5941 -3865 -103 -2799 -5872 -2642 -330 -3879 -6058 -2401 -774 -4884 -5977 -2074 -1229
$$ packed form
2196a432L608K888l859k238M431J769m327j046N002O76m996N31M378o32m802J661
2212A612M422j691m268K925L855l208l458L544K740l488k627M157K387m718j141
2227A043M814O21m825M0M495l74m812J391M330j757m080K699L435l268l292L199
2243C659K869l792k192L764K484m838j309M620P5m507k88M940p35m700J028M500
2259E578k038l904J633L959l124l417L514K664l872k396M199J386m572j488M686
2274B808K99m702K08M598p97m499R65L958j893m380K002L981l229l433L091K960
2290A937l743k485L965J317m284j183M435M67m636l01M455n25m371J100L726j762
2306a888m053K076L762k696l073L230K312l549k179L657J627m110j093L903Q45
$$ plain form
2321 -1229 -5751 -5932 -1437 -1858 -6379 -5147 -1448 -2900 -6418 -4166 -964 -3678 -6022 -3328 -696
2336 -696 -4378 -6406 -2381 -965 -4445 -5660 -1672 -903 -4937 -4984 -841 -1424 -5481 -4182 -114 -1864
2352 -1864 -5147 -2773 787 -2299 -4850 -2027 430 -2622 -4742 -603 387 -2763 -3729 300 763 -3113
2368 -3113 -3229 884 380 -3197 -1706 1926 587 -2923 -855 2399 -142 -2617 -64 2336 -658
2383 -658 -2350 1435 2895 -612 -1390 2422 2430 -1213 -969 2772 2482 -752 -34 3564 2404 -670 690
2400 690 3355 1586 -681 1644 3682 1489 -268 2513 3830 778 -144 3257 3798 560 652 4172
2416 4172 3623 440 1108 4139 3002 84 1838 4120 2111 154 2781 4396 2231 304 3156
2431 3156 4365 1184 460 3705 4235 1204 1130 3999 3812 628 1163 4204 2798 289 1858 4124
$$ packed form
2321a229m522j81M495m21m521J232L699j452l518K252L202k714k344K694K632
2336f96l682k028M025J416l480j215L988P69m034m7M143n83m057J299M068j750
2352a864l283K374L560l086k551K823K457l052k120M139R90l150r66M029M63l876
2368c113j16M113n04l577J491L632j339l510K068L254k541k475K553K400k994
2383f58j692L785J460l507p78L812Ql643K44L741k90l234P18L598j160l074J360
2400F90K665j769k267K325K038k193j757K781J317l052r22L401N41l238R2L520
2416D172n49l183O68L031j137k918J754K282k009j957K627J615k165j927K852
2431C156J209l181p24L245N30l031p4K869j87l184N35L041j406k509J569K266
$$ plain form
2447 4124 2602 289 2507 4108 1777 353 2597 3794 1324 322 3140 3587 1024 578 3281
2462 3281 2921 188 933 3117 2275 46 1426 3451 1878 -151 1647 3219 1051 -554 1725 2833
2478 2833 692 -234 2363 2231 250 -574 1874 1808 -531 264 2313 1416 -591 244 2452 597 -917
2495 -917 371 1811 -329 -1382 531 1201 -585 -1314 889 754 -1115 -1511 524 201 -1634 -1055 611
2512 611 -165 -2363 -991 261 -1119 -2552 -1427 -236 -1460 -2583 -640 -534 -2074 -2669 -1197 -892
2528 -892 -2895 -2631 -1358 -1238 -2871 -2421 -1455 -1983 -3061 -2443 -1320 -2367 -3521 -2327 -1618 -2586 -3810
2545 -3810 -2500 -1881 -2991 -3421 -2120 -1925 -3485 -3604 -2238 -2459 -3637 -3086 -2133 -2659 -3483 -3095 -2061
2562 -2061 -2625 -3527 -2601 -1838 -2773 -3241 -2584 -1902 -2692 -3315 -2159 -1493 -2664 -2615 -1960 -1631 -2605 -1981 -1429
$$ packed form
2447D124j522k313K218J601k331j424K244J197k470j002K818M47k563m46K703
2462C281l60k733P45K184q42k229J380K025j573k029J798J572k168j605K279J108
2478B833k141r26K597j32j981q24K448o6k339P95K049q97k007Q35K208j855j514
2495i17J288J440k140j053J913O70j786p29K203j35j869l96K035l23j835N79J666
2512F11p76k198J372J252j380j433J125J191j224j123J943J06j540n95J472L05
2528h92k003K64J273J20j633M50R66n28j078O18J123j047j154J194P09r68j224
2545c810J310O19j110m30J301J95j560j19J366k21j178N51R53n26q24L88J034
2562b061n64r02R26P63r35m68O57O82p90o23J156O66j171M9O55L29r74O24N52
$$ plain form
2581 -1429 -1869 -2316 -2135 -950 -1169 -2123 -1180 -674 -1476 -1801 -1027 -330 -1365 -1447 -688 -153 -873 -926 -195 -143
2601 -143 -638 -232 297 49 22 319 809 608 206 1022 1404 681 429 1244 1554 1470 1119 1518 1487 1209 1675
2622 1675 1758 2184 1740 1512 2196 2185 1660 2356 2302 2608 2018 2265 2480 2600 2090 2451 2747 2869 2769 2824 2692
2643 2692 2592 2568 2548 2820 3273 3135 2797 2886 2671 2736 2563 2726 2778 2854 2514 2512 2823 2285 2571 2669 2508 2321 2101
2666 2101 2564 2513 2243 2108 2322 2151 1869 1994 2047 1838 1960 2136 1780 1650 1345 1711 1490 1183 854 1506
2686 1506 1215 598 541 1433 1080 663 653 1487 731 210 151 972 150 -15 194 285 88 -580 201 -122 -682
2707 -682 -326 -47 -137 -1047 -983 -139 -92 -1075 -852 -280 -847 -1701 -1236 -379 -1038 -1289 -959 -657 -1455 -1586 -1059
2728 -1059 -794 -1643 -1992 -860 -787 -2165 -2089 -903 -728 -2133 -2211 -926 -1307 -2236 -1998 -792 -1529 -2098 -1462
$$ packed form
2581a429m40m47J81J185k19r54R43N06q02l25P74O97j035q2P59N35p20n3P31N2
2601a43m95M06N29k48k7K97M90k01m02Q16L82p23k52Q15L10q4l51L99l1k78M66
2622A675Q3M26m44k28O84j1n25O96n4L06n90K47K15J20n10L61K96J22j00N5j32
2643B692j00k4k0K72M53j38l38Q9k15O5j73J63N2P6l40kL11n38K86R8j61j87k20
2666B101M63n1k70j35K14j71k82J25N3k09J22J76l56j30l05L66k21l07l29O52
2686A506k91o17n7Q92l53m17j0Q34p56n21n9Q21q22j65K09R1j97o68P81l23n60
2707f82L56K79r0r10O4Q44M7r83K23N72n67q54M65Q57o59k51L30L02p98j31N27
2728a059K65q49l49J132P3j378P6J186J75j405p8J285l81r29K38J206p37n69O36
$$ plain form
2747 -1462 -992 -1988 -2603 -1208 -1016 -2263 -2489 -1229 -952 -2089 -2087 -989 -1404 -2746 -2071 -913 -1049 -2484
2765 -2484 -1948 -1053 -1472 -2573 -1667 -805 -1919 -2487 -1297 -1084 -1974 -2271 -838 -615 -2268 -2405 -882 -1027
2783 -1027 -2607 -1857 -834 -878 -2465 -1372 -251 -1561 -2293 -1313 -498 -1453 -2211 -805 -83 -1633 -2020
2800 -2020 -391 192 -2061 -1705 138 -34 -1917 -1246 326 -32 -1535 -1189 479 -671 -1841 -374
2816 -374 1007 -424 -1452 122 929 -629 -1314 497 1004 -798 -704 1112 1037 -620 -459 1610 1063
2833 1063 -600 335 1613 922 -197 753 1955 362 -472 1338 2227 445 217 1792 1967 612 341
2850 341 2240 2218 462 930 2414 2010 455 1300 2748 1794 592 1844 3303 1726 725 2494 2853
2867 2853 1521 865 2830 3298 1083 1066 3324 3066 933 1559 3210 2859 1138 1685 3731 2297 924
$$ packed form
2747a462M70r96o15J395J92j247k26J260K77j137KJ098m15j342O75J158j36j435
2765b484N36Q95m19j101R06Q62j114n68J190K13q90k97J433K23j653j37J523j45
2783a027j580P50J023m4j587J093J121j310p32R80Q15r55p58J406P22j550l87
2800b020J629N83k253L56J843j72j883O71J572l58j503L46J668j150j170J467
2816c74J381j431j028J574Q07j558o85J811N07j802R4J816p5j657J61K069n47
2833A063j663R35J278o91j119R50J202j593q34J810Q89j782k28J575J75j355k71
2850C41J899k2j756M68J484m04j555Q45J448r54j202J252J459j577j001J769L59
2867B853j332o56J965M68k215j7K258k58k133O26J651l51j721N47K046j434j373
$$ plain form
2884 924 2216 3713 1675 630 2667 3355 1318 763 2854 3177 971 1036 2560 2844 473 1187 2749
2901 2749 2076 435 1261 3074 1724 -328 1461 2652 620 -168 1386 2485 196 -390 1503 1777
2917 1777 -172 -722 1260 1086 -853 -592 1539 651 -1519 -458 1158 -97 -1669 119 1017 -903
2933 -903 -1964 -74 679 -1231 -1851 -303 314 -1871 -2019 -177 20 -2386 -2207 -81 -981 -2938 -1626
2950 -1626 -74 -1689 -3287 -1490 -487 -2289 -3385 -1520 -505 -2654 -3307 -1139 -868 -2830 -2904 -1193
2966 -1193 -1305 -2924 -2733 -985 -1630 -3417 -2645 -439 -2136 -3564 -2197 -233 -2056 -3446 -1614 -488
2982 -488 -2342 -3497 -1451 -565 -2597 -2626 -822 -787 -2795 -2253 -582 -931 -2572 -1950 87 -1206 -2875
2999 -2875 -1219 372 -1163 -2597 -700 312 -1689 -2351 -270 544 -1342 -1771 266 345 -1535 -1093
$$ packed form
2884I24J292J497k038j045K037O88k037n55K091L23k206O5J524K84k371P14J562
2901B749o73j641Q26J813j350k052J789J191k032p88J554J099k289n86J893K74
2917A777j949n50J982j74j939K61K131q88k170J061J616j255j572J788Q98j920
2933i03j061J890P53j910o20J548O17k185j48J842J97k406J79K126r00j957J312
2950a626J552j615j598J797J003j802j096J865J015k149o53K168K71j962p4J711
2966a193j12j619J91J748o45j787P72K206j697j428J367J964j823j390J832J126
2982d88j854j155K046Q86k032k9J804L5k008N42J671l49j641O22K037j293j669
2999b875J656J591j535j434J897J012k001o62K081Q14j886m29K037P9j880M42
$$ plain form
3015 -1093 781 304 -1712 -479 840 239 -1562 -262 1445 -154 -1620 347 1521 -122 -922 964
3031 964 1498 -79 -637 1407 1311 -599 -185 1697 1267 -735 668 2133 675 -724 966 2314 478
3048 478 -707 1508 2334 590 -445 1467 2089 295 -219 2047 1836 181 374 2178 1728 -296 804
3065 804 2396 1158 -181 1002 2306 932 -122 1317 2430 697 42 1819 1990 491 203 1960
3081 1960 2060 109 442 1788 1264 -377 464 2281 1391 -458 812 2472 832 -171 1201 2422
3097 2422 498 185 1558 1704 307 -164 1682 1452 -77 0 2167 1392 -333 611 2091 1016 -319
3114 -319 704 2278 951 -400 1069 1886 563 -326 1149 1674 -14 9 1254 1219 -454 -89 1612
3131 1612 1005 -676 354 1593 496 -505 130 1717 339 -887 343 1003 -253 -1038 261 930
$$ packed form
3015a093J874m77k016J233J319o01j801J300J707j599j466J967J174j643q00J886
3031I64N34j577n58K044r6j910M14J882m30k002J403J465j458j399J690J348j836
3048D78j185K215Q26j744j035J912O22j794n14K266k11j655J93J804m50k024J100
3065H04J592j238j339J183J304j374j054J439J113j733o55J777J71j499k88J757
3081A960J00j951L33J346n24j641Q41J817q90j849J270J660j640j003J372J221
3097B422j924l13J373J46j397m71J846k30j529P7K167p75j725R44J480j075j335
3114c19J023J574j327j351J469Q17j323q89J475N25j688K3J245l5j673L65J701
3131A612o07j681J030J239j097j001O35J587j378j226J230O60j256p85J299O69
$$ plain form
3147 930 -293 -662 1092 845 -825 -607 569 291 -1128 -352 869 -77 -1153 -307 335 -662 -1375 -438
3165 -438 363 -666 -1346 -276 -30 -1288 -1235 -153 -392 -1522 -1281 -385 -469 -1567 -1409 -186 -819 -1996
3183 -1996 -1434 -306 -1147 -1888 -1154 -379 -1340 -2086 -1431 -832 -1833 -1897 -712 -933 -2102 -2159 -621 -965 -2397
3202 -2397 -1944 -645 -1380 -2383 -1752 -920 -1377 -2297 -1078 -857 -1569 -2141 -1128 -762 -1711 -1770 -981 -859 -1945
3221 -1945 -1695 -483 -1058 -1651 -1597 -466 -611 -1819 -1101 -449 -637 -1338 -610 -242 -1127 -1227 -581 198 -1068
3240 -1068 -871 341 314 -780 -949 428 97 -847 -537 710 472 -502 21 693 114 19 498 806 304
3259 304 261 1027 931 127 140 1116 1135 375 582 1471 1098 389 597 1682 1572 659 1228 1579 1104 555 1239
3280 1239 1491 959 1149 1447 1466 1122 1017 1647 1780 790 970 1536 1567 1177 1196 1775 1525 939 1028 1413 1239
$$ packed form
3147I30j223l69J754k47j670K18J176k78j419P76J221r46j076Q46O42r97p13R37
3165d38Q01j029o80J070K46j258N3J082k39j130K41Q96q4j098J58J223o33j177
3183a996N62J128q41p41P34P75r61p46O55N99j001o4J185k21j169n7J538l44j432
3202b397M53J299p35j003O31Q32m57r20J219K21p12n72J013L66r49n9P89J22j086
3221a945K50J212n75n93N4J131j45j208P18O52j88p01P28L68q85j00O46P79j266
3240a068J97J212k7j094j69J377l31r44L10J247k38r74N23O72n79r5M79L08n02
3259C04m3P66r6q04J3R76J9p60K07Q89l73p09K08J085j10r13N69L51m75n49O84
3280A239K52n32J90K98J9l44j05O30J33r90J80N66L1l90J9N79k50n86Q9L85j74
$$ plain form
3301 1239 1059 1219 1454 1545 1036 1363 1542 808 936 1190 1381 609 619 1385 1292 920 766 1092 1134 831 775
3322 775 938 625 513 756 805 616 347 932 630 33 83 236 509 223 -102 415 545 71 -87 -5 68
3343 68 -193 -341 -84 -401 241 -65 -75 -213 -128 -85 -309 -358 -469 -178 -215 -458 -588 -186 -413 -447 -481 -491 -521
3366 -521 -614 -589 -389 -894 -581 -795 -487 -762 -595 -592 -428 -501 -635 -568 -152 -373 -973 -359 -428 -584 -486 -707 -692
3389 -692 -303 -661 -773 -368 -900 -571 -658 -856 -671 -801 -466 -677 -754 -616 -501 -519 -525 -776 -561 -610 -573 -910
3411 -910 -313 -377 -384 -822 -395 -413 -440 -639 -641 -566 -415 -733 -574 -351 -689 -583 -266 -195 -491 -567 -22 -355 -963
3434 -963 -325 -247 -340 -507 -329 -235 -757 -331 -303 -99 -209 -178 -302 -534 -578 -639 21 -114 -825 -336 205 125 -708
3457 -708 -299 -25 -141 -676 -392 -113 -294 -569 -153 104 -120 -268 45 -97 -557 -243 336 106 -449 -200
$$ packed form
3301A239j80J60K35R1n09L27J79p34J28K54J91p72J0P66r3l72j54L26M2l03n6
3322G75J63l13j12K43M9j89k69N85l02n97N0J53K73k86l25N17J30m74j58Q2P3
3343F8k61j48K57l17O42l06j0j38Q5M3k24m9j11K91l7k43j30M02k27l4l4j0l0
3366e21r3K5K00n05L13k14L08k75J67LJ64p3j34O7M16k21o00O14o9j56R8k21J5
3389f92L89l58j12M05n32L29q7j98J85j30L35k11p7J38J15j8ok51K15m9L7l37
3411i10N97o4pm38M27j8k7j99kP5J51l18J59K23l38J06L17P1k96p6N45l33o08
3434i63O38P8r3j67J78R4n22M26K8K04j10L1j24k32m4o1O60j35p11M89N41q0q33
3457g08M09K74j16n35K84K79j81k75M16K57k24j48L13j42m60L14N79k30n55K49
$$ plain form
3477 -200 311 223 -181 -330 501 21 -181 94 456 37 -148 406 556 155 84 539 468 438 427 849 913 78
3499 78 261 1121 532 100 712 1078 600 177 1028 1200 641 535 746 986 526 428 1516 1367 700 771 1440
3520 1440 1560 395 1062 1299 1016 475 880 1256 1300 507 1118 1405 887 920 1370 1178 534 396 1221 1247
3540 1247 472 500 1222 1024 142 87 1496 1318 265 469 1304 736 279 884 1034 764 406 727 823 145
3560 145 -139 865 727 -424 -318 799 496 -301 -46 804 414 -562 103 628 -150 -682 219 174 -518
3579 -518 -1136 -75 112 -700 -665 83 -135 -924 -1206 -166 -136 -1525 -858 -288 -361 -1386 -873 53 -728 -1407
3599 -1407 -712 -358 -1191 -1775 -545 -803 -1287 -1159 -677 -601 -1482 -1651 -518 -684 -1913 -1243 -128 -1012 -1037
3618 -1037 -1049 -406 -1039 -1517 -745 -601 -1006 -1596 -666 -302 -1048 -1167 -344 -283 -1164 -754 -68 -529 -1227 -1124
$$ packed form
3477b00N11q8m04j49Q31m80k02K75L62m19j85N54J50m01p1M55p1l0j1M22O4q35
3499G8J83Q60n89m32O12L66m78m23Q51J72n59j06K11K40m60r8J088j49o67P1O69
3520A440J20j165O67K37k83n41M05L76M4p93O11K87n18L3M50j92o44j38Q25K6
3540A247p75K8P22j98q82n5J409j78j053K04Q35n68m57O05J50k70l58L21R6o78
3560A45k84J004j38j151J06J117l03p97K55Q50l90r76O65N25p78n32R01m5o92
3579e18o18J061J87q12L5P48k18p89k82J040L0j389O67N70p3j025N13R26p81o79
3599a407O95L54q33n84J230k58m84J28M82P6q81j69J133j66j229O70J115q84k5
3618a037j2O43o33m78P72J44m05n90R30L64p46j19Q23O1q81M10O86m61o98J03
$$ plain form
3638 -1124 169 -540 -1113 -717 -132 -471 -962 -218 172 -572 -699 130 103 -818 -552 176 218 -532 -505 650
3658 650 -13 -758 -1000 510 261 -431 101 818 -14 -501 492 334 -201 -691 406 680 -107 -62 628 935
3678 935 -342 -88 889 699 -394 -177 777 409 -307 69 1316 631 -634 600 973 -166 -414 636
3696 636 981 81 -87 868 810 -381 -161 947 849 -356 -64 844 376 -397 597 1020 270 -552 236 835
3716 835 -88 -137 758 576 -17 -536 677 901 -171 -10 862 546 -565 53 1025 593 -479 411 798
3735 798 -63 -354 441 926 -131 -621 672 788 -554 -403 643 564 -371 -249 439 573 -432 164 788
3754 788 484 -442 238 761 -128 -438 375 1235 10 -588 646 893 -172 -382 615 869 -31 2 700
3773 700 851 -294 335 1306 70 -583 515 885 59 -325 560 1340 398 -72 943 1075 19 -157
$$ packed form
3638a124J293p09n73L96N85l39m91P44L90p44j27Q29k7r21K66P28M2p50K7J155
3658F50o63p45k42J510k49o92N32P17q32m87R93j58n35m90J097K74p87M5O90L07
3678I35j277K54R77j90j093K17R54l68p16L76J247o85j265J234L73j139k48J050
3696F36L45r00j68R55n8j191K20J108r8j205K92R08m68p73R94M23p50q22P88N99
3716H35r23m9Q95j82n93n19J213K24j072J61Q72l16j111O18R72m32j072Q90L87
3735G98q61k91P95M85j057m90J293J16j342J51J046p9r35J22O88J34j005N96O24
3754G88l04r26O80N23q89l10Q13Q60j225n98J234K47j065k10R97K54r00L3O98
3773G00J51j145O29R71j236o53J098L70q26l84Q85P80r42m70J015J32j056j76
$$ plain form
3791 -157 710 658 -352 66 827 555 -352 139 634 397 -657 256 802 -242 -299 209 781 -219 -441
3810 -441 353 323 -334 -428 662 742 -673 -488 206 280 -629 -575 597 -159 -508 -328 58 -226 -923 -395 41
3831 41 -800 -1022 -72 -7 -729 -946 -250 17 -1046 -841 25 -404 -1148 -849 -190 -612 -1165 -902 -506 -521 -1114
3852 -1114 -578 -103 -842 -1208 -499 -223 -813 -1336 -271 -771 -853 -756 -469 -496 -1394 -639 -84 -351 -1212 -514
3872 -514 -355 -445 -959 -458 -318 -548 -962 -229 -87 -502 -1014 -225 14 -791 -867 -93 -389 -456 -557 256 93
3893 93 -637 100 305 293 -524 274 296 -143 -237 284 590 -319 -287 305 757 198 -19 842 645 -52 206 770
3915 770 627 57 469 939 502 134 657 1020 260 -127 695 1108 373 325 655 1001 189 237 924 784 301
3936 301 562 1303 720 218 596 1179 336 371 599 786 553 117 782 599 362 52 902 628 113 532
$$ packed form
3791a57Q67n2j010M18P61k72r07M91M95k37j054R13N46j044n7N08N72j000k22
3810d41P94l0o57r4J090Q0j415J85O94P4r09N4J172p56l49J80L86k84o97N28M36
3831D1q41k22R50O5p22k17O96K67j063K05Q66m29p44K99O59m22n53K63L96j5n93
3852a114N36M75p39l66P09K76n90n23J065n00q2R7K87k7q98P55N55k67q61O98
3872e14J59r0n14N01J40k30m14P33J42m15n12P89K39q05p6P74k96o7j01Q13j63
3893I3p30P37K05j2q17P98K2m39r4N21L06r09L2N92M52n59k17Q61j97o97K58N64
3915G70j43n70M12M70m37l68N23L63p60l87Q22M13p35m8L30L46q12M8O87j40m83
3936C01K61P41n83n02L78N83q43L5K28J87k33m36O65j83k37l10Q50k74n15M19
$$ plain form
3956 532 647 534 217 410 846 751 218 291 684 50 65 620 317 215 -209 519 267 82 -148 477 436
3977 436 -127 -12 325 222 -387 -296 114 53 -206 6 290 -2 -310 -203 9 -294 -461 -124 -20 -526 -299
3998 -299 57 -173 -238 -599 204 137 -453 -537 170 169 -168 -85 -319 115 -562 100 -350 -210 -373 4 245 -401
4020 -401 -356 23 -58 -335 -325 -133 -77 -188 28 294 -62 -405 -245 -253 32 -407 -119 57 6 -452 122 -114
4042 -114 -193 -251 76 -46 -148 -99 287 -12 58 -213 -67 4 -192 -62 -18 -110 -68 -104 458 19 -278 146 96
4065 96 -173 -178 -338 -304 16 -244 -242 -292 -237 -349 -109 -64 -297 -130 -262 -58 -265 -29 11 205 -281 -232 -172 -34
4089 -34 -237 -210 -85 -519 -116 -82 -398 -436 -119 -170 -278 -384 -179 -242 -153 -313 -463 -184 -199 -436 -212 3 -307
4112 -307 -493 -402 -304 -117 -227 -387 -208 -234 -233 -466 -253 -520 -173 -268 -383 -170 -142 -544 -378 -76 -98 -111 -12
$$ packed form
3956E32J15j13l17J93M36r5n33P3L93o34J5N55l03j02m24P28k52j85k30O25m1
3977D36n63J15L37j03o09R1M10o1k59K12K84k92l08J07K12l03j67L37J04n06K27
3998b99L56k30o5l61Q03o7n90q4P07jl37Q3k34M34o77O62m50J40j63L77K41o46
4020d01M5L79q1k77J0J92N6j11K16K66l56l43J60qK85m39K88J76n1m58N74k36
4042a14p9n8L27j22j02M9L86k99P0k71J46P1j96J30M4r2M2l6N62m39k97M24n0
4065I6k69nj60L4L20k60Kn0N5j12K40M5k33J67j32K04k07K36M0J94m86M9O0J38
4089c4k03K7J25m34M03L4l16l8L17n1j08j06K05o3Q9j60j50K79j5k37K24K15l10
4112c07j86R1R8J87j10j60J79k6Jk33K13k67L47r5j15K13K8m02J66L02k2j3R9
$$ plain form
4135 -12 191 -129 -298 162 29 60 138 149 -356 -37 169 242 231 -46 283 224 -161 425 300 79 254 378
4157 378 209 295 246 176 522 481 501 134 881 648 253 736 590 409 332 465 501 602 609 400 606 528 607 439
4181 439 668 523 731 959 599 -36 370 861 643 536 523 523 257 303 478 814 224 252 500 412 640 462
4203 462 488 418 247 238 494 522 128 244 255 155 42 280 393 216 -237 266 442 87 146 337 1 202
4225 202 -316 299 85 -92 -399 -75 -240 -651 -215 -5 156 -333 -217 41 -229 -557 -622 -100 -400 -729
4245 -729 -170 -208 -508 -923 -343 -54 -662 -503 -232 -395 -868 -481 -439 -414 -595 -583 -66 -568 -657 -264 -581 -542
4267 -542 -470 -646 -213 -599 -732 -338 -384 -592 -529 -70 -74 -401 -503 -181 -370 -680 -444 -327 -46 -858 -352 -136
4289 -136 -347 -345 10 -116 -280 -477 94 135 -405 -484 216 -168 -314 38 -20 140 -254 -401 -32 95 -601 89
$$ packed form
4135a2K03l20j69M60j33L1P8J1n05L19K06P3j1k77L29n9l85N86j25k21J75J24
4157C78j69Q6m9p0L46m1K0l67P47k33l95M83j46j81p7J33L6J01Pk09K06p8P9j68
4181D39K29j45K08K28l60o35M06M91k18j07j3%k66M6J75L36n90K8K48q8K28j78
4203D62K6p0j71rK56K8l94J16J1j00j13K38J13j77m53N03J76l55N9J91l36K01
4225B02n18O15k14j77l07L24j65m11M36K10J61m89J16K58k70l28o5N22l00l29
4245g29N59l8l00m15N80K89o08J59K71j63m73L87M2K5j81J2N17n02q9L93l17L9
4267e42P2j76M33l86j33L94m6k08O3M59ml27j02L22j89l10K36J17K81q12N06K16
4289a36k11KL55j26j64j97N71M1n40p9P00l84j46L52n8J60l94j47L69J27o96O90
$$ plain form
4311 89 286 -51 -407 163 138 -149 -155 197 334 -13 13 344 184 -165 -19 323 -75 -84 -349 237 -262 -412
4333 -412 376 177 -33 55 217 291 -271 33 366 471 55 -379 238 -84 -273 53 316 127 -35 66 258
4354 258 -42 -141 147 530 -401 -112 37 173 35 -195 210 225 -160 -183 305 347 -193 46 318 278 -190 -164
4376 -164 289 133 -375 -200 323 36 82 171 600 14 -136 205 159 -99 85 170 400 -123 162 111 129 -272
4398 -272 -95 517 -68 103 54 352 -9 -204 296 753 -63 88 481 301 -58 204 692 330 118 241
4418 241 816 532 317 246 966 276 243 436 534 625 -187 263 739 87 38 506 679 302 111 532 520 -234
4440 -234 291 615 634 25 127 918 167 -158 398 371 147 -32 506 593 -118 -74 175 274 -238 -383 522 319
4462 319 -55 -394 620 75 -286 25 620 -116 -416 -28 149 -315 -367 31 127 -219 -473 -224 -71 -350
$$ packed form
4311H9J97l37l56N70k5k87oL52J37l47K6L31j60l49J46L42l98rk65N86m99j50
4333d12P88j99k10Q8J62P4n62L04L33J05m16m34O17l22j89L26K63j89j62J01J92
4354B58l00r9K88L83r31K89J49J36j38k30M05J5l85k3M88M2n40K39K72m0m68K6
4376a64M53j56n08J75N23k87M6Q9M29n86j50L41m6k58J84Q5K30n23K85n1J8m01
4398b72J77O12n85J71m9K98l61j95N00M57q16J51L93j80l59K62M88l62k12J23
4418B41N75k84k15p1P20o90l3J93R8R1q12M50M76o52m9M68J73l77j91M21j2p54
4440b34N25L24J9o09J02P91p51l25N56k7k24j79N38Q7p11M4K49R9n12j45R05k03
4462C19l74l39J014n45l61L11N95p36l00L88J77m64n2L98R6l46k54K49J53k79
$$ plain form
4482 -350 -605 -119 -434 -893 -413 -47 -659 -768 -636 -96 -587 -891 -405 -225 -458 -829 -481 -185 -947 -901
4502 -901 -339 -162 -682 -661 -433 -435 -792 -873 -494 -267 -910 -585 -330 -723 -991 -488 -137 -728 -1106 -250 -301 -592
4524 -592 -743 -650 -280 -622 -809 -284 -418 -612 -323 87 -496 -609 -292 423 -205 -401 64 298 -177 -504
4544 -504 -219 14 -209 -242 -32 -172 -59 -417 551 55 -613 62 240 216 -320 262 370 -40 -97 565 518
4565 518 293 129 319 556 108 -45 519 395 157 78 417 645 -22 345 605 875 39 582 609 922 174
4586 174 222 800 849 16 105 680 374 60 535 566 338 298 625 694 9 168 810 586 -192 534 644 442
4608 442 -105 248 783 352 2 530 711 4 146 312 329 47 -178 353 297 -231 244 255 163 -169 347
4629 347 304 125 -335 -146 272 138 -30 311 126 -421 122 184 98 35 116 47 -12 -482 -145 210 229 -381 233
$$ packed form
4482c50k55M86l15m59M80L66o12j09J32N40m91l04M86J80k33l71L48K96p62M6
4502i01N62J77n20K1K28kl57q1L79K27o43L25K55l93k68N03L51n91l78Q56n1k91
4524e92j51R3L70l42j87N25j34j94K89M10n83j13L17P15o28j96M65K34m75l27
4544e04K85K33k23l3K10j40J13l58R68m96o68O75J78k4n36N82J08m10n7O62m7
4565E18k25j64J90K37m48j53N64j24k38p9L39K28o67L67K60K70q36N43K7L13p48
4586A74M8N78M9q33Q9N75l06l14M75L1k28m0L27O9o85J59O42k24p78P26J10k02
4608D42n47L53N35m31l50N28J81p07J42J66J7k82k25N31n6n28M75J1r2l32N16
4629C47m3j79m60J89M18j34j68L41j85n47N43O2q6o3Q1o9n9m70L37L55J9o10O14
$$ plain form
4652 233 227 -33 -141 -197 242 -27 -130 -22 232 35 -140 467 212 -244 75 308 -155 -33 -345 -60 173
4673 173 -385 238 11 22 -235 -10 64 -246 -312 -22 274 19 144 269 -106 -245 -201 182 117 -110 8 230
4695 230 223 131 420 206 -65 -318 76 218 -121 5 -62 59 -396 -244 -106 -122 -223 -189 -88 131 -269 -268 -59
4718 -59 232 -292 -550 -27 -77 -381 -269 -34 -312 -361 77 -208 -475 -218 -142 -93 -349 -250 -2 -497 -667 -442
4740 -442 31 -431 -240 -458 -238 -260 -484 -645 -440 -434 -760 119 -77 -583 -503 -130 -206 -713 -556 -523 -413 -350
4762 -350 -326 -370 -301 -312 -303 -369 -204 -347 -377 -277 -142 -390 -501 -326 -186 -462 33 -74 -303 -246 39 282 -108
4785 -108 -268 361 -292 -171 -242 -118 -153 271 100 -40 -138 -151 1 -2 -5 -13 176 126 218 188 240 349 -14 143 371
4810 371 186 314 219 462 485 464 328 517 224 551 475 599 425 626 411 511 158 520 532 307 683 306
$$ packed form
4652B33ok60j08n6M39k69j03J08K54j97j75O07k55m56L19K33m63J22l12K85K33
4673A73n58O23k27J1k57K25P4l10o6K90K96k55J25J25l75j39M4L83o5k27J18K22
4695B30pr2K89k14k71k53L94J42l39J26o7J21m55J52J38j6j01L4J01K19m00JK09
4718e9K91n24k58N23n0l04J12K35k78m9M38k85k67K57P6M9k56R9K48m95j70K25
4740d42M73m62J91k18K20k2k24j61K05Ol26Q79j96n06Q0L73p6n07J57L3J10O3
4762c50K4m4O9j1Ro6J65j43l0J00J35k48j11J75J40k76M95j07k29N7K85K43l90
4785a08j60O29o53J21p1J24l5M24j71j40r8j3J52llqJ89n0R2l0N2J09l63J57K28
4810C71j85J28r5K43K3k1j36J89k93L27p6J24j74K01k15J00l53L62J2k25L76l77
$$ plain form
4832 306 562 703 451 602 403 549 509 583 596 560 628 283 434 217 274 402 766 396 661 320 379 175
4854 175 127 322 515 253 549 572 506 462 -41 52 407 106 338 -42 -41 36 -82 153 97 527 6 -328 14
4877 14 -151 -171 48 -226 -147 -194 119 -200 -94 73 -17 -527 -166 -161 -256 4 -201 -151 -108 -216 -373 -331 -385 -197
4901 -197 -436 -637 -376 -571 -508 -529 -271 -398 -544 29 -306 -290 -601 -525 -245 -315 -342 -541 -203 -317 -261 1
4923 1 -360 -203 -459 11 -113 -280 -414 -126 -502 -438 -192 -358 -61 -396 -308 -140 3 -582 -179 159 -239
4944 -239 -246 135 -184 -245 -77 -112 -36 -132 -34 61 49 -153 -51 70 -113 44 99 125 -176 -306 138 -102 -354 67
4968 67 116 62 -383 -16 -2 -225 -270 115 177 -60 -181 12 261 -50 -82 358 11 -413 -370 337 123 -269 -157
4991 -157 -149 -111 -176 187 197 -123 91 -191 170 -112 159 -49 -99 28 -179 -29 87 1 -113 167 301 -267
$$ packed form
4832C06K56J41k52J51j99J46m0P4J3l6O8l45J51k17N7J28L64l70K65l41N9k04
4854A75m8J95J93k62K96K3o6m4n03R3L55l01K32l80JP7j18K35n6M30n21l34L42
4877A4j65k0K19k74P9m7L13l19J06J67r0n10L61Nr5K60k05N0M3j08j57M2n4J88
4901a97k39k01K61j95O3k1K58j27j46N73l35J6l11P6K80p0k7j99L38j14N6K62
4923Al61J57k56M70j24j67j34K88l76O4K46j66K97l35Q8J68J43n85M03L38l98
4944b39pL81l19o1J68l5P6r6R8R5j2k02J02J21j83J57N5K6l01j30M44k40k52M21
4968F7M9n4m45L67J4k23m5L85O2k37j21J93K49l11l2M40l47m24M3P07k14l92J12
4991a57QL8o5L63J0l20K14k82L61k82K71k08n0J27k07J50J16q6j14K80J34n68
$$ plain form
5013 -267 38 -8 -184 -256 -135 296 -72 -308 -317 169 -230 83 45 2 39 -279 353 -44 -208 -372 150 224 135
5036 135 381 207 125 -71 18 198 271 -18 3 -148 341 51 124 113 354 31 384 371 44 129 328 267 -128
5059 -128 28 212 509 123 74 364 343 305 379 248 340 236 459 264 94 347 698 253 366 331 697 390
5081 390 154 355 258 480 -109 386 715 175 327 371 633 108 98 288 536 220 270 314 464 13 -27 401
5103 401 74 -88 -56 692 140 22 -54 168 -28 -136 -42 465 -56 -232 73 -106 24 -77 126 -104 -244
5124 -244 -199 189 37 -401 -322 297 -164 -64 -558 -216 -158 -332 -464 13 -482 -716 -222 7 -636 -525 8
5145 8 48 -662 -370 130 -266 -540 -562 -463 -220 -355 -587 -227 -563 -992 -575 -133 -592 -596 -282 -71 -269 -556
5167 -556 -385 -161 -202 -446 -103 -330 -516 -353 -203 -72 -418 -241 -114 -264 -826 -313 -221 102 -127 -248 -98
$$ packed form
5013b67L05m6j76p2J21M31l68k36rM86l99L13l8m3L7l18O32l97j64j64N22P4q9
5036A35K46j74q2j96Q9J80P3k89K1j51M89k90P3j1K41l23L53j3l27Q5J99o1l95
5059a28J56J84K97l86m9K90k1l8P4j31R2j04K23j95j70K53L51m45J13l5L66l07
5081C90k36K01r7K22n89M95L29n40J52M4K62n25j0J90K48l16N0M4J50m51m0M28
5103D01l27j62L2P48n52j18p6K22j96j08R4N07n21j76L05j79J30j01K03k30j40
5124b44M5L88j52m38P9O19m61J00m94L42N8j74j32M77m95k34M94K29o43J11N33
5145HM0p10K92N00l96k74k2R9K43j35k32L60l36m29M17M42m59mL14K11j98k87
5167e56J71K24m1k44L43k27j86J63J50J31l46J77J27j50n62N13R2L23k29j21J50
$$ plain form
5188 -98 -190 -227 -179 89 6 60 13 -31 -75 -210 25 137 110 300 296 244 -69 158 261 256 -126 1 403 -88 -216
5213 -216 -36 497 49 38 494 -45 222 343 251 371 -1 -60 422 212 13 345 114 196 11 75 461 310
5235 310 -82 408 275 395 174 90 497 -72 -73 409 410 108 196 535 416 283 -115 233 135 172 89 393 -269
5258 -269 25 327 287 279 -60 354 306 338 98 239 -94 148 -87 140 160 171 -23 -74 136 -346 211 29 -71
5281 -71 -20 125 297 32 3 156 303 -30 -61 -107 22 -133 -133 126 -122 -226 -220 105 -89 -310 31 205 -40
5304 -40 -53 -139 310 -15 -186 251 -196 -308 -61 59 330 174 133 359 178 -377 79 77 56 51 153 -68 -195
5327 -195 196 504 263 60 -77 410 476 68 301 174 -40 -67 -24 -76 -178 -275 241 -10 -64 31 -73 359
5349 359 -1 -34 15 -23 43 222 435 -93 -357 80 386 16 -231 -69 53 -114 -104 -132 -131 -41 -171 89 106
$$ packed form
5188i8r2l7M8K68q3N4m7m4m4j35K35J12k7J90mn2l13K27J03nl82J27M02m91j28
5213b16J80N33m48j1M56n39K67J21r2J20l72n9M82k10j99L32k31Q2j85O4L86j51
5235C10l92M90j33J20k21q4M07n69jM82Jl02Q8L39j19j33l98L48r8L7q3L04o62
5258b69K94L02m0ql39M14m8L2k40J41l33K42k35K27K0J1j94n1K10m82N57j82j00
5281g1N1J45J72k65k9J53J47l33l1m6J29j55%K59k48j04OL25j94k21L41J74k45
5304d0j3q6M49l25j71M37m47j12K47J20K71j56m1K26j81n55M56kk1nJ02k21j27
5327a95L91L08k41k03j37M87O6m08K33j27k14k7M3n2j02r7N16k51n4R5j04M32
5349C59l60l3M9l8O6J79K13n28k64M37L06l70k47J62J22j67J0k8JR0j30K60J7
$$ plain form
5372 106 -267 -538 -215 -72 105 -92 -314 103 -78 -30 -196 -325 -426 -392 123 -347 -269 -270 16 -281 -466 -66
5394 -66 187 -299 -193 -261 -391 -256 -447 -233 103 -297 -463 235 -79 -472 -508 -185 -90 -451 -471 -236 -524 -359
5416 -359 -29 -127 -424 -238 -70 -21 -245 -357 -92 -258 -298 -372 153 -207 -287 -231 -290 259 -65 -237 -72 -369
5438 -369 -35 27 -195 187 154 93 81 158 -10 465 -13 -140 -67 278 110 -232 66 498 168 345 125 354
5460 354 270 221 131 121 337 64 195 187 665 373 435 123 575 98 469 287 228 375 305 261 297 368 572 320
5484 320 520 297 231 325 499 511 501 386 341 177 402 499 339 277 258 -10 570 264 211 -30 337 499 249
5507 249 112 -25 -15 -12 221 -60 129 302 -240 221 65 495 10 -189 160 -143 -193 -47 -143 -172 -129 43
5529 43 -116 -260 194 -4 -242 -132 -174 -98 -85 -44 -151 -209 -330 -185 -273 -21 -474 -36 46 -34 -216 -70 -400
$$ packed form
5372A06l73k71L23J43J77j97k22M17j81M8j66j29j01L4N15m70P8jK86k97j85M00
5394f6K53m86J06o8j30J35j91K14L36m00j66O98l14l93l6L23R5l61k0K35k88J65
5416c59L30r8k97J86J68M9k24j12K65j66m0p4N25l60q0N6n9N49l24j72J65k97
5438c69L34O2k22L82l3o1j2P7j68M75m78j27P3L45j68l42K98M32l30J77k20K29
5460C54q4m9r0j0K16k73J31qM78k92O2l12M52m77L71j82n9J47p0m4L6P1K04k52
5484C20K00k23o6R4J74J2j0j15m5j64K25R7j60o2j9k68N80l06n3k41L67J62k50
5507B49j37j37J0LK33k81J89J73n42M61j56M30m85j99L49l03n0J46r6k9M3J72
5529D3j59j44M54j98k38J10m2P6J3M1j07n8j21J45q8K52m53M38Q2q0j82J46l30
$$ plain form
5552 -400 -77 -109 -196 -214 -222 -87 -37 -131 -326 -156 -169 -131 84 29 -191 -21 -156 -142 -250 -193 -73 -153 -31 -494
5576 -494 -180 219 -402 118 -435 -218 -115 -565 -248 138 -322 -134 -26 -26 -159 -3 37 -334 -99 20 -218
5597 -218 -203 -71 44 127 -7 -80 -38 -63 -150 -96 -201 52 -271 -30 -80 2 162 3 216 224 33 7 -243 -203
5621 -203 -56 74 108 223 201 128 -150 73 -312 43 -32 42 49 -215 21 -197 -187 -245 -164 -57 -168 49 163
5644 163 6 -80 -98 87 -71 -65 -69 -127 -108 -79 -151 -132 92 -350 87 -197 -74 -136 -50 -183 3 -66 -269 -204 -293
5669 -293 24 128 -219 -22 -64 31 6 138 -112 -233 238 102 187 8 205 -134 -77 115 4 103 96 130 283
5692 283 98 239 187 -117 119 -57 123 34 31 212 -78 -39 -161 -208 120 375 7 141 106 275 -70 41
5714 41 266 -11 -119 232 426 178 179 416 247 363 130 270 283 175 143 401 209 373 48 341 -173 468
$$ packed form
5552d00L23l2q7j8qJ35N0r4j95J70j3L8K15n5k20J70j35J4j08N7J20q0J22m63
5576d94L14L99o21N20n53K17J03m50L17L86m60J88J08%j33J56M0l71K35J19k38
5597b18J5J32J15Q3j34p3M2k5q7N4j05K53l23K41n0Q2J60j59K13Qj91k6k50M0
5621b03J47J30L4J15k2p3k78K23l85L55p5P4Pk64K36k18J0n8Q1J07j11K17J14
5644A63j57q6j8J85j58Omn8J9K9p2J9K24m42M37k84J23o2Q6j33J86o9k03O5q9
5669b93L17J04l47J97m2R5k5J32k50j21M71j36Q5j79J97l39N7J92j11R9pL4J53
5692B83j85J41n2l04K36j76J80q9lJ81k90L9j22m7L28K55l68J34l5J69l45J11
5714D1K25k77j08L51J94k48JK37j69J16k33J40J3j08l2K58j92J64l25K93n14O41
$$ plain form
5736 468 156 305 239 264 7 486 62 222 4 177 -67 -224 408 294 216 56 -48 164 221 171 29 196
5758 196 192 174 81 -78 120 -91 -83 -260 -215 -475 155 7 -249 207 125 -123 -349 -140 -118 -1 -119 -369 -188
5781 -188 110 -145 -140 -217 -358 -405 -24 -81 -311 -343 -374 -354 -570 -196 -102 -410 -363 216 -342 -336 -277 -22 -105 -89 -168
5806 -168 11 -565 -307 -189 -113 -183 -307 -346 -228 -212 72 -114 -22 -331 -192 -388 -677 -255 -289 122 -259 -233
5828 -233 -25 174 -356 -303 -368 239 -34 -192 80 34 218 -234 195 -1 16 221 -297 117 112 117 237 -24 27
5851 27 294 276 103 122 140 71 271 197 221 153 239 5 131 52 -45 307 -153 458 109 -32 182 256 242 273 84
5876 84 147 369 460 106 41 115 153 337 -112 270 178 55 190 270 163 87 127 -188 -91 123 94 348 149 120
5900 120 -130 263 416 -103 16 -110 293 -75 30 313 134 93 -194 389 268 -242 5 190 137 21 301
$$ packed form
5736D68l12J49o6K5k57M79m24J60k18J73k44j57O32j14p8j60j04K12N7n0j42J67
5758A96mj8r3j59J98k11Qj77M5k60O30j48k56M56q2k48k26K09K2J17j18k50J81
5781a88K98k55Np7j41m7L81n7k30l2l1K0k16L74R4l08M7N79n58ON9K55q3J6p9
5806a68J79n76K58J18P6p0j24l9J18J6K84j86R2l09J39j96k89M22l4M11l81K6
5828b33K08J99n30N3o5O07k73j58K72m6J84m52M29j96J7K05n18M14nNJ20k61N1
5851B7K67j8j73J9J8o9K00p4K4o8Q6k34J26p9r7L52m60O11l49j41K14P4j4L1j89
5876H4O3K22R1l54o5P4L8J84m49L82r2j23J35Q0j07p6M0l15R7K14k9K54j99k9
5900A20k50L93J53n19J19j26M03l68J05K83j79m1k87N83j21n10K47J85n3j16K80
$$ plain form
5921 301 100 -286 -13 -230 110 -331 60 -128 -24 -268 -483 142 -79 -275 -102 165 -27 3 -72 -60 -338
5942 -338 -123 87 120 -25 -16 -228 93 -209 120 183 32 69 -200 -81 64 -9 -223 170 51 -198 -29 147
5964 147 -204 -95 -86 330 -73 -93 -84 201 93 -144 -64 54 290 171 -12 221 -416 184 182 -209 -121 294 48
5987 48 -70 298 70 38 -191 59 248 127 146 168 -88 286 85 247 110 179 -246 -77 40 -372 163 218
6009 218 -86 -74 240 -77 413 76 -335 -13 -75 -180 -14 106 -191 -184 -167 234 -44 -156 -219 -95 -221 -458
6031 -458 -347 127 20 -191 -33 98 -281 66 -243 -484 84 -509 -150 2 -73 -188 -69 35 -566 -525 -213
6052 -213 -275 -154 -69 40 -380 -288 -445 -115 -498 -163 -60 -284 54 -273 -153 -94 -178 71 -86 -14 -124 -127 111
6075 111 -3 -25 -313 -156 -85 -58 -50 -94 -218 -355 124 51 27 147 -91 35 -180 84 93 70 -380 -46 304 262
$$ packed form
5921C01k01l86K73k17L40m41L91j88J04k44k15O25k21j96J73K67j92L0p5J2k78
5942c38K15K10L3j45Rk12L21l02L29O3j51L7k69J19J45p3k14L93j19k49J69J76
5964A47l51J09RM16m03k0RK85j08k37Q0J18K36j19j83K33o37O00kl91Q8M15k46
5987D8j18L68k28l2k29K50J89j21J9K2k56L74k01J62j37O9m25J69J17m12N35N5
6009B18l04J2L14l17M90l37m11L22o2j05J66J20k97PJ7M01k78j12o3J24j26k37
6031d58J11M74j07k11J58J31l79L47l09k41N68n93L59J52p5j15J19J04o01M1L12
6052b13o2J21Q5J09m20R2j57L30l83L35J03k24L38l27J20N9q4K49j57P2j10lK38
6075A11j14k2k88J57P1K7Qm4j24j37M79p3k4J20k38J26k15K64Rk3m50L34L50m2
$$ plain form
6099 262 136 9 262 79 248 256 74 263 290 258 135 250 207 108 -26 377 243 133 222 17 96 206 419
6122 419 98 453 409 333 439 70 201 299 237 337 461 -58 -155 374 101 -121 277 639 172 23 135 142
6144 142 262 42 325 214 32 -40 -155 23 87 41 142 430 -123 268 139 -55 74 139 -155 39 341
6165 341 -48 107 64 -117 3 -122 -160 163 -36 -296 32 -180 24 -1 103 -265 -22 63 -237 -272 -3 -42
6187 -42 -1 -14 -38 -72 -330 -26 330 -45 -388 -297 -405 -39 -261 136 -175 -17 -310 -26 -282 -326 -317 -329 -230 -249
6211 -249 -161 -132 -208 -256 -297 -40 -146 -408 -27 -43 -96 -53 57 -126 66 96 170 109 -11 283 -170 -157 201 -60
6235 -60 20 -123 -134 -92 301 -138 27 -93 305 -106 62 209 -8 -128 17 34 166 62 -184 280 -25 -163
6257 -163 -409 114 115 -202 -92 21 -195 211 121 326 46 -53 91 -18 -98 271 85 33 -129 87 37 152
$$ packed form
6099B62j26j27K53j83J69Qj82J89K7l2j23J15m3r9j34M03j34j10Q9k05P9J10K13
6122D19l21L55m4p6J06l69J31R8o2J00J24n19r7N29k73k22L98L62m67j49J12P
6144A42J20k20K83j11j82p2j15J78O4m6J01K88n53L91j29j94J29O5k94J94L02
6165C41l89J55m3j81J20j25l8L23j99k60L28k12K04k5J04l68K43Q5l00l5K69l9
6187d2M1j3k4l4k58L04L56l75l43R1j08L66k22L97l11J58k93K84k56m4Rj2R9j9
6211b49Q8K9p6m8m1K57j06k62L81j6n3M3J10j83J92L0P4o1j20K94m53J3L58k61
6235f0Q0j43j1M2L93m39J65j20L98m11J68J47k17j20J45J7J32j04k46M64l05j38
6257a63k46N23Jl17J10J13k16M06r0K05k80r9J44j09q0L69j86n2j62K16n0J15
$$ plain form
6279 152 -85 47 169 142 -121 -223 86 5 127 -31 -106 -101 199 -3 -234 -265 96 128 -214 -49 -208 -81
6301 -81 151 20 -200 -351 -46 315 -167 -357 -102 39 -310 45 178 -240 -104 -39 -12 -378 -237 94 138
6322 138 -77 7 154 -229 25 69 180 -142 103 51 -267 -85 8 -258 -43 104 81 34 -195 -24 -340 226
6344 226 380 -44 -34 86 -165 -169 16 -103 246 -109 160 339 57 333 -66 -49 301 -4 480 498 -83 326
6366 326 -89 -10 248 394 -31 -47 588 35 57 237 107 52 107 -19 87 134 214 166 210 -117 173 192 3
6389 3 366 230 199 114 87 47 143 44 -17 244 29 89 -95 87 72 78 488 254 70 255 96 105 -102 -16 -82 -215
6415 -215 -146 -109 -252 -104 -1 -185 -84 13 -68 -64 118 -56 -282 -438 -187 -181 -193 -22 -368 -257 -151 -145 28 -129
6439 -129 -72 -100 -241 -227 -5 -150 -80 -98 -33 -282 149 -48 -223 4 -335 -232 77 -155 -438 -143 -99 115
$$ packed form
6279A52k37J32J22k7k63j02L09q1J22j58p5NL00k02k31l1L61L2l42J65j59J27
6301h1K32j31k20j51L05L61m82j90K55J41l49L55J33m18J36O5K7l66J41L31M4
6322A38k15Q4J47l83K54M4J11l22K45n2l18J82R3k66K15J47k3m7k29J71l16N66
6344B26J54m24J0J20k51mJ85j19L49l55K69J79k82K76l99J7L50l05M84J8n81M09
6366C26m15P9K58J46m25j6O35n53K2J80j30n5N5j26J06M7Q0m8M4l27K90J9j89
6389CL63j36l1q5k7m0R6r9o1K61k15O0j84J82j5OM10k34j84J85j59Rk07Q6o6j33
6415b15O9L7j43J48J03j84J01R7q1MJ82j74k26j56K51Oj2J71l46J11J06OJ73j57
6439a29N7k8j41J4K22j45P0j8O5k49M31j97j75K27l39J03L09k32k83K95M4K14
$$ plain form
6461 115 -203 -299 -80 -240 -268 -183 -47 -133 -265 -47 -51 -34 -170 45 -113 291 -62 -219 70 29 -29 31 -234
6484 -234 -27 14 -38 179 -170 20 43 218 41 12 -90 229 -93 162 -80 181 198 413 120 120 -22 83
6506 83 12 269 259 157 -138 -230 -82 331 -118 168 -266 232 64 -44 301 106 113 22 10 331 226 -4 53
6529 53 -40 103 135 188 180 111 229 223 103 71 173 -13 248 -71 19 14 -169 264 21 123 -246 -52 -129 -48 -39 -118
6555 -118 205 263 80 -337 -57 -36 323 89 -159 -140 -67 44 49 101 61 66 -144 37 -2 -144 -140 -74 33 -280 -28
6580 -28 -43 38 -15 -80 -54 -142 -346 -192 -128 -12 -273 134 22 4 569 -45 188 -48 -178 248 57 -147 202
6603 202 -15 97 -148 -180 21 191 225 187 210 31 -107 101 59 94 -64 37 109 -28 190 265 563 208 163
6626 163 -105 -188 404 -349 -130 76 423 -82 189 115 111 -163 10 191 45 53 -6 228 62 -68 -74 392 194
$$ packed form
6461A15l18r6K19j60k8Q5J36q6j32K18mJ7j36K15j58M04l53j57K89m1n8O0k65
6484b34K07M1n2K17l49J90K3J75j77k9j02L19l22K55k42K61J7K15k93%j42J05
6506H3p1K57j0j02k95r2J48M13m49K86m34M98j68j08L45j95Pr1j2L21j05k30N7
6529E3r3J43L2N3qo9J18oj20l2J02j86K61l19R0nj83M33k43J02l69J94p7Q1Rp9
6555a18L23N8j83m17K80K1L59k34k48J9P3J11NN2m0Nk10J81l9j42MO6J07l13K52
6580b8j5Q1n3o5K6q8k04J54O4J16k61M07j12j8N65o14K33k36j30M26j91k04L49
6603B02k17J12k45l2K01J70L4l8K3j79j38K08m2L5j58J01P2j37K18P5K98l55m5
6626A63k68q3N92p53K19K06L47n05K71p4mk74J73J81j46Qn9K34j66j30oM66j98
$$ plain form
6649 194 -114 123 240 -325 163 -119 -107 -136 308 185 -113 -229 -156 175 244 -5 -22 127 -81 28 3 187
6671 187 106 -120 133 -61 4 210 60 21 -80 -236 -139 -99 -39 -390 -9 125 114 -52 -182 -253 -67 -257 -101
6694 -101 -135 -472 -290 -329 144 -290 -21 31 -208 -319 -20 23 -66 -46 -131 57 -237 -545 276 94 -453 -95
6716 -95 190 48 -12 -178 -39 -271 -190 5 -307 11 -327 44 -9 -76 -23 217 276 -262 213 -363 -368 -160 -36
6739 -36 -88 89 -65 112 205 -28 254 161 348 213 87 61 173 316 -55 16 172 -302 127 170 -292 305
6761 305 238 67 130 309 2 19 179 263 202 432 117 -143 127 103 134 296 276 -16 439 -176 194 358 -118
6784 -118 190 296 511 87 122 134 -15 -197 -62 194 -54 -33 362 20 -43 37 181 -118 66 12 -308 54
6806 54 -202 217 66 116 -259 92 239 0 6 -72 -68 -70 -84 75 -265 -231 -210 -266 -84 -80 27 -283 -250 -145 152
$$ packed form
6649A94l08K37J17n65M88k82J2k9M44j23k98j16P3L31O9k49j7J49k08J09k5J84
6671A87q1k26K53j94O5K06j50l9j01j56R7M0O0l51L81J34j1j66j30p1J86j90J56
6694a01l4l37J82l9M73m34K69N2k39j11K99M3q9K0q5J88k94l08Q21j82n47L58
6716i5K85j42o0j66J39k32Q1J95l12L18l38L71n3o7N3K40N9n38M75n76nK08J24
6739c6n2J77j54J77R3k33K82r3J87j35j26k6J12J43l71P1J56m74M29M3m62N97
6761C05o7j71O3J79l07J7J60Q4o1K30l15k60K70k4L1J62k0k92M55o15L70J64m76
6784a18L08J06K15m24L5J2j49j82J35K56k48K1L95l42o3Q0J44k99J84n4l20L62
6806E4k56M19j51N0l75L51J47k39Op8Mkj4J59l40L4K1n6J82MJ07l10L3J05K97
$$ plain form
6831 152 -92 -30 -201 224 -373 -440 -221 29 168 144 103 71 -351 3 312 74 -254 -55 -156 137 -94 -50
6853 -50 275 -2 -205 -411 203 14 -214 220 111 279 -210 73 148 253 -108 77 9 168 95 15 164 -52
6875 -52 -131 -28 47 -95 -86 -47 172 224 -93 -334 176 -257 -322 -96 -24 117 122 -139 61 119 182 -75 -13 -10 79 279
6901 279 -101 -20 -292 -11 132 347 387 137 86 375 15 -219 94 43 308 -21 -17 294 182 -129 147 42
6923 42 66 97 -327 -22 25 173 71 -94 -50 -21 98 -200 39 -191 -123 -100 -215 -126 83 227 -112 -159 -327
6946 -327 -221 -161 22 -70 -130 -185 65 -217 94 -311 79 -67 -153 254 19 -32 -55 -104 40 -215 -75 59 223
6969 223 163 -222 -96 -153 392 29 -215 -218 135 -30 -181 108 -5 280 69 -348 29 -110 48 242 -93
6990 -93 -113 -97 203 125 222 -318 239 -28 130 -24 -42 49 118 248 -10 21 -194 -107 2 -91 -119 83 250 -113
$$ packed form
6831A52k44O2j71M25n97o7K19K50J39k4m1l2m22L54L09k38l28J99j01K93k31M4
6853e0L25k77k03k06O14j89k28M34j09J68m89K83P5J05l61J85o8J59p3q0J49k16
6875e2p9J03P5j42RL9K19N2l17k41N10m33o5K26P2J41Nk61K00N8O3k57O2LQ9K00
6901B79l80Q1k72K81J43K15M0k50n1K89l60k34L13n1K65l29ML11j12l11K76j05
6923D2K4L1m24L05M7J48j02j65M4K9J19k98K39k30O8K3j15Q9K09J44l39m7j68
6946c27J06O0J83r2o0n5K50k82L11m05L90j46q6M07k35n1k3m9J44k55J40J34J64
6969B23o0l85J26n7N45l63k44lL53j65j51K89j13K85k11m17L77j39J58J94l35
6990i3k0J6L00p8R7n40N57k67J58j54j8R1O9J30k58L1k15Q7J09r3k8K02J67l63
$$ plain form
7014 -113 303 243 -133 254 102 249 30 21 148 188 129 145 -23 236 129 195 373 312 -7 369 201 158 192
7037 192 395 278 107 100 34 -29 106 5 -187 394 -47 160 -132 -85 -109 139 196 -82 -322 -93 76 37 39
7060 39 24 -36 -156 -49 141 -148 -123 -220 222 172 -272 -570 12 -162 -308 -108 -22 -75 -53 -182 -112 -65 -165 186
7084 186 -147 -44 16 -90 -118 -253 -112 82 -125 -248 25 -112 -155 328 -110 155 -238 -105 -94 -201 101
7105 101 -337 -322 -53 145 -167 -11 38 -25 -218 -340 150 -162 135 119 455 -29 -247 -179 -109 77 -148 -332
7127 -332 68 40 -265 -157 -199 -41 -53 -291 -101 126 -208 248 130 190 29 -148 287 188 34 71 459 224
7149 224 -126 94 -77 355 232 -317 88 136 -20 123 37 154 333 -172 -81 -141 66 286 469 -117 116
7170 116 116 53 166 1 55 144 83 41 297 12 116 -53 -87 88 -34 -122 -148 105 -51 -142 197 -67 126 -256
$$ packed form
7014a13M16o0l76L87j52J47k19rJ27M0n9J6j68K59j07O6J78o1l19L76j68m3L4
7037A92K03j17j71po6o3J35j01j92N81m41K07k92M7k4K48N7k78k40K29J69l9K
7060C9j5o0j20J07J90k89K5r7M42n0m44k98N82j74j46K00Q6n3K2j29P0M7j00L51
7084A86l33J03O0j06k8j35J41J94k07j23K73j37m3M83m38K65l93J33J1j07L02
7105A01m38J5K69J98l12J56M9o3j93j22M90l12K97j6L36m84k18O8P0J86k25j84
7127c32M00k8l05J08m2J58j2k38J90K27l34M56j18O0j61j77M35r9j54L7L88k35
7149B24l50K20j71M32j23n49M05M8j56J43q6J17J79n05R1o0K07K20J83n86K33
7170A16%o3J13j65N4Q9o1m2K56k85J04j69l4J75j22q8k6K53j56r1L39k64J93l82
$$ plain form
7194 -256 -337 57 147 -187 187 28 -105 143 -162 -94 35 -81 -101 -238 54 97 94 36 -106 -100 252 174 5 -78
7218 -78 -123 -103 56 -33 -216 -187 -98 214 -106 -275 -167 -7 -72 105 12 256 -221 376 307 155 -25 112 -261
7241 -261 -39 34 -12 -173 42 73 -162 -21 165 536 -160 -142 -131 275 107 87 97 -73 117 -71 -58 -94 -11
7264 -11 -236 -22 142 270 26 -192 -24 44 -126 188 -149 30 18 90 -10 171 54 -288 251 -247 -32
7285 -32 73 498 8 -23 -77 218 258 -161 212 -280 85 52 -132 90 -113 190 242 -79 205 30 -86 -112
7307 -112 87 272 6 -131 -14 -68 67 -201 44 244 -119 -201 -39 -71 -132 88 169 -68 -80 -312 -264 -334 196
7330 196 -164 -203 -87 -44 -330 3 17 -20 -142 -212 97 -282 -138 -366 -233 -233 -161 19 98 24 42 -308 -170 48
7354 48 158 -234 -150 -9 -17 -39 -29 75 -65 -23 -307 -94 73 -183 -4 -147 -189 -32 -106 456 -103 271 -82
$$ packed form
7194b56q1L94R0l34L74j59j33K48l05O8J29j16k0j37K92M3ln8j42OL52p8j69q3
7218g8m5K0J59q9j83K9Q9L12l20j69J08J60o5J77r3K44m77N97o9j52j80J37l73
7241b61K22P3m6j61K15L1k35J41J86L71o96J8J1M06j68k0J0j70J90j88J3l6Q3
7264a1k25K14J64J28k44k18J68O8j70L14l37J79j2P2j00J81j17l42N39m98K15
7285c2J05M25m90l1n4K95M0m19L73m92L65l3j84K22k03L03N2l21K84j75j16k6
7307a12J99J85k66j37J17n4J35k68K45K00l63q2J62l2o1K20Q1k37j2k32M8p0N30
7330A96l60l9J16M3k86L33J4l7j22p0L09l79J44k28J33%P2J80P9p4J8l50J38K18
7354D8J10l92Q4J41qk2J0J04j40M2k84K13J67k56J79j43m2J57p4N62n59L74l53
$$ plain form
7377 -82 -3 218 188 160 -85 -131 43 -111 -118 48 -143 -78 -34 215 59 107 -301 260 250 4 74 283 -24 120
7401 120 108 186 148 -10 301 488 33 200 120 17 16 168 215 -68 329 -242 109 -141 324 -1 -191 139
7423 139 -84 545 10 79 151 154 145 246 -156 170 254 94 -58 -22 325 157 233 80 -12 -5 24 380 -180 65
7447 65 -365 17 63 -41 65 8 63 147 246 -23 -169 132 35 -270 -69 122 -262 -12 -55 105 267 -54 22
7470 22 391 37 -81 194 -267 -240 264 100 -164 -236 -24 -35 142 -17 29 263 -5 6 -8 -81 -139 6 10 -136
7494 -136 -99 92 -109 -13 -219 -59 -7 -33 100 212 380 -357 -145 -9 -223 81 97 193 421 -108 76 -25
7516 -25 45 229 228 201 -7 -1 133 43 274 -9 55 -173 132 105 -257 293 50 35 -53 -8 120 176 231 57 -176
7541 -176 425 32 224 53 -154 -30 84 198 181 339 223 100 -24 225 -113 119 -23 -8 1 115 -63
$$ packed form
7377h2P9K21l0k8k45m6J74j54pJ66j91O5M4K49j56M8m08N61j0k46P0K09l07J44
7401A20j2P8l8j58L11J87m55J67q0j03jJ52M7k83L97n71L51k50M65l25j90L30
7423A39k23O29n35O9P2LrJ01m02L26Q4j60j52L6L47j68P6j53r2PK9L56n60K45
7447F5m30L82M6j04J06n7N5Q4R9k69j46L01r7l05K01J91l84K50m3J60J62l21P6
7470B2L69l54j18K75m61K7N04j64k64p2K12j1J77j59M6K34k68J1j4p3n8J45Mj46
7494a36L7J91k01R6k06J60N2k6J33J12J68p37K12J36k14L04J6R6K28n29J84j01
7516b5P0J84jk7k08OJ34r0K31k83O4k28L05k7l62N50k43j5q8M5J28N6N5j74k33
7541a76O01l93J92j71k07J24J14J14j7J58j16j23j24K49l38K32j42J5RJ14j78
$$ plain form
7562 -63 30 171 -334 76 67 247 193 -41 48 207 89 186 13 -6 153 189 -39 -233 -64 -315 191 -196 -89
7585 -89 30 -219 -12 -212 -33 -677 -126 326 -266 0 -93 112 -126 -66 -139 -97 103 -384 245 38 15 -177
7607 -177 -249 -187 -86 -332 45 -191 82 -7 -74 186 -73 -246 127 137 17 -131 -56 125 54 71 -42 -169 -167
7630 -167 -151 6 207 115 -107 -48 106 -165 254 87 150 252 -79 21 -64 -30 39 195 294 30 -124 134 305
7653 305 -65 124 -124 61 -210 -13 -31 120 161 -26 92 4 474 -288 -247 -171 36 71 -129 434 89 -20
7675 -20 -278 213 -1 268 234 43 -89 -161 151 72 20 370 117 145 -130 245 -240 21 -9 -168 80 -150
7697 -150 -238 81 241 -247 238 16 131 211 418 -231 283 -71 -66 -65 -3 130 8 -207 -21 76 -74 -14 -267
7720 -267 -68 33 27 -118 -134 -231 -308 -341 21 -288 -191 32 242 -58 297 -61 -31 45 -53 -45 -291 -25 7 -283
$$ packed form
7562f3R3J41n05M10rJ80n4k34Q9J59j18R7j73j9J59L6k28j94J69k51N06l87J07
7585h9J19k49K07k00J79o44N51M52n92K66r3K05k38O0p3M2K00m87O29k07k3j92
7607a77p2O2J01k46L77k36K73q9o7K60k59j73L73J0j20j48P5J81p1J7j13j27K
7630a67J6J57K01r2k22N9J54k71M19j67O3J02l31J00q5L4O9J56R9k64j54K58J71
7653C05l70J89k48J85k71J97j8J51M1j87J18q8M70p62M1P6K07L5k00N63l45j09
7675b0k58M91k14K69l4j91j32p2L12p9n2L50k53K8k75L75m85K61l0j59K48k30
7697a50q8L19J60m88M85k22J15Q0K07o49N14l54NJO2J33j22k15J86R7j50O0k53
7720b67J99J01oj45j6r7p7l3L62l09R7K23K10l00L55l58L0P6r8Qk46K66L2k90
$$ plain form
7744 -283 48 88 -263 83 18 -297 -43 187 113 -271 -175 -41 -68 -125 -185 -167 -11 52 -6 -496 275 -36 183
7767 183 42 -64 151 -316 -61 -121 143 -53 52 17 -36 -126 57 38 30 259 -190 -160 216 107 -98 147 303
7790 303 -69 91 143 138 214 300 23 187 171 138 7 -84 -67 -169 369 9 -32 155 -138 16 -7 52 -83 -79 270
7815 270 166 201 78 31 30 -98 32 261 -10 -265 257 -60 112 -68 -22 -372 50 132 -209 99 150 41
7837 41 57 -187 3 -32 53 112 -316 9 119 7 13 -218 -79 250 -80 -38 -48 104 -244 -131 -31 -34 212 -90
7861 -90 -66 107 -48 -142 255 22 -114 -312 28 -295 -28 -446 -120 108 -16 95 -40 -32 -201 90 -169 -78
7883 -78 -50 -282 208 -457 -80 11 -86 496 -208 39 -111 383 -10 249 2 3 113 -149 -29 -109 -121 104 71
7906 71 51 177 -155 -139 -22 8 130 127 -5 81 224 -280 -50 51 -49 60 51 155 201 113 -132 -194 27 14
$$ packed form
7744b83L31M0l51L46o5l15K54K30p4l84R6J34k7n7o0J8J56O3n8m90P71l11K19
7767A83j41j06K15m67K55o0K64j96J05l5n3r0J83j9qK29m49L0L76j09k05K45J56
7790C03l72J60N2nP6Q6k77J64j6l3j31r1J7j02N38l60m1J87k93J54k3N9j35ML49
7815B70j04L5j23m7jj28J30K29k71k55N22l17J72j80M6l50M22Q2l41L08N1j09
7837D1J6k44J90l5Q5N9m28L25J10j12Ok31J39L29l30M2j0J52l48J13J00lK46l02
7861i0K4J73j55r4L97k33j36j98L40l23K67m18L26K28j24J11j35Qj69K91k59R1
7883g8K8k32M90o65L77R1r7N82p04K47j50M94l93K59k47JJ10k62J20q0j2K25l3
7906G1k0J26l32J6J17L0J22lj32Q6J43n04K30J01j00J09rJ04M6q8k45o2K21j3
$$ plain form
7930 14 -31 68 179 -20 126 -157 162 46 -9 -111 78 93 -34 -13 -29 -199 200 94 -107 22 120 250 57
7953 57 155 41 120 -328 30 140 60 -124 144 -109 163 45 147 -98 -142 93 -98 -153 128 116 -159 65
7975 65 -155 131 86 -11 -50 46 228 133 58 -186 -46 196 -384 -137 -292 259 -56 -47 -162 -91 -208 -88 255
7998 255 -319 -150 83 72 -107 50 -238 -503 -9 -224 -201 -108 117 0 -3 -189 58 85 18 54 -104 -36 -190
8021 -190 -238 218 -166 -79 -48 -57 -118 53 -25 236 210 -158 -67 -106 199 -255 234 -139 51 -12 -57 239 105 11
8045 11 180 161 -71 5 -104 -140 -35 339 -100 -32 -190 146 91 268 -59 3 210 249 106 355 378 6 146
8068 146 22 112 -58 -255 -166 4 -162 -118 167 103 -375 -82 399 -4 249 -29 -177 -213 28 -91 -1 -195
8090 -195 -254 80 31 80 205 -50 -47 -9 -143 187 -149 -36 -275 92 -339 -126 -252 163 -215 200 120 127 -11
$$ packed form
7930A4m5R9J11j99J46k83L19j16n5j02J89J5j27K1j6j70L99j06k01J29R8J30j93
7953E7R8j14P9m48L58J10q0j84K68k53K72j18J02k45m4K35j91n5K81j2k75K24
7975F5k20K86m5r7l9R6J82r5p5k44J40K42n80K47j55N51l15Rj15P1j17J20L43
7998B55n74J69K33j1j79J57k88k65M94k15K3R3K25j17lj86K47K7o7L6j58O8j54
8021a90m8M56l84Q7L1ro1J71p8K61k6l68R1l9L05m54M89l73J90o3m5K96j34r4
8045A1J69j9k32P6j09l6J05L74m39O8j58L36n5J77l27O2K07L9j43K49K3l72J40
8068A46j24R0j70j97Q9J70j66M4K85o4m78K93M81m03K53k78j48l6K41j19R0j94
8090a95n9L34m9M9J25k55LL8j34L30l36J13k39L67m31K13j26M15l78M15q0Pj38
$$ plain form
8113 -11 5 -207 -45 -122 62 -176 -104 67 15 95 -33 115 -47 62 -102 -356 -156 -106 -332 15 150 -68
8135 -68 -214 -76 -44 128 97 50 -94 -224 86 -20 201 -134 4 203 28 146 148 -99 47 72 33 -172 31
8158 31 80 590 -190 20 54 215 210 -43 121 -271 193 -110 -5 270 -22 67 -158 67 54 261 131 234
8180 234 -36 27 -70 -179 -6 -237 -64 299 -3 -222 145
$$ packed form
8113a1J6k12J62p7J84k38P2J71n2Q0j28J48j62J09j64k54K00N0k26L47J35k18
8135f8j46J38L2J72l1m7j44j30L10j06K21l35J38J99j75J18Kk47J46K5l9k05K03
8158C1M9N10p80K10L4J61nk53J64l92M64l03J05K75k92Q9k25K25j3K07j30J03
8180B34k70O3r7j09J73k31J73L63l02k19L67
8191A45
$$ Imaginary data points
##PAGE= N=2
##DATA TABLE= (X++(I..I)), XYDATA
$$ plain form
0 0 0 0 0 0 0 0 0 0 0 0 -8 8 -8 8 -8 16 -16 16 -24 24 -32 37 -40 48 -56 64 -72 82 -93 105 -117 133 -149
33 -149 165 -188 205 -230 256 -284 314 -348 386 -428 471 -525 584 -649 721 -807 908 -1030 1172
52 1172 -1353 1583 -1889 2314 -2953 4020 -6122 11843 -58052 -195098 -92566 -41089 -107054
65 -107054 -111032 20284 59067 -28521 -60587 -14247 -66875 -167633 -143264 -57118 -84778 -128810
77 -128810 -44615 34626 -49393 -137573 -81061 -36303 -129397 -182256 -88570 -28473 -95532 -118168
89 -118168 -42239 -39277 -131941 -142704 -74276 -92837 -160824 -113804 -23248 -58763 -131878 -85501
101 -85501 -28137 -105074 -183733 -124696 -63688 -118145 -144271 -53709 -7783 -79375 -107855 -51039
113 -51039 -67055 -161645 -160891 -74846 -75715 -129346 -74583 18826 -18542 -104834 -79537 -34462 -104666
$$ packed form
0@%%%%%%%%%%qJ6j6J6j6K4l2L2m0M8n6O9p7Q8j04J20j36J54j75J98k22K50k82
33a49L14l53L93m35M86n40N98o62P34q14Q99r96J109j233J370j528J715j938K202
52A172k525K936l472M203n267O973j0142J7965o9895j37046J02532N1477o5965
65a07054l978J31316L8783q7588l2066M6340n2628j00758K4369Q6146k7660m4032
77a28810Q4195P9241q4019q8180N6512M4758r3094n2859R3686O0097o7059k2636
89a18168P5929K962r2664j0763O8428j8561o7987M7020R0556l5515p3115M6377
101h5501N7364p6937p8659N9037O1008n4457k6126R0562M5926p1592k8480N6816
113e1039j6016r4590P54Q6045q69n3631N4763R3409l7368q6292K5297M5075p0204
$$ plain form
126 -104666 -168603 -98402 -25342 -62895 -80195 1064 26767 -61312 -98903 -40020 -43340 -118968
138 -118968 -98937 3343 11355 -52898 -26510 40307 -6578 -92445 -62681 928 -34422 -71602
150 -71602 1796 63644 9434 -33377 18611 32655 -46922 -68909 8591 34641 -17264 -1235
162 -1235 79340 71408 -5852 -3301 46490 11693 -47787 -3952 67465 45810 13775 69245 108344
175 108344 44271 -5395 36670 54658 -3306 -10201 68075 96053 49495 53672 109343 88187
187 88187 14358 17383 67587 46190 5555 55459 119980 90586 47690 83977 107450 43847
199 43847 2391 52766 83733 43177 42594 110070 122274 60843 49451 90150 68467 7772
211 7772 27257 90800 81341 44412 81853 127125 81665 25445 50572 76879 31139 7597
$$ packed form
126a04666o3937P0201P3060l7553j7300Q1259K5703q8079l7591N8883l320p5628
138a18968K0031J02280Q012o4253K6388O6817m6885q5867K9764O3609l5350l7180
150g1602P3398O1848n4210m2811N1988J4044p9577k1987P7500K6050n1905J6029
162a235Q0575p932p7260K551M9791l4797n9480M3835P1417k1655l2035N5470L9099
175A08344o4073m9666M2065J7988n7964o895P8276K7978m6558M177N5671k1156
187H8187p3829L025N0204k1397m0635M9904O4521k9394m2896L6287K3473o3603
199D3847m1456N0375L0967m0556n83O7476J2204o1431j1392M0699k1683o0695
211G772J9485O3543r459l6929L7441M5272m5460n6220K5127K6307m5740k3542
$$ plain form
223 7597 66756 103829 65594 53231 97209 93275 27391 12704 55299 50036 9399 34750 94487
236 94487 83414 38160 54097 81148 37591 -11291 16542 51473 25888 11539 59154 83543
248 83543 40535 16089 42479 35802 -14562 -17091 29126 34534 5173 22970 62830 40304 -8953
261 -8953 -3019 19270 -10458 -39115 -4432 31838 11651 -4874 24377 29898 -17285 -40701 -14546
274 -14546 -12009 -43107 -33080 13280 14845 -19414 -14963 7522 -19898 -63424 -51376 -20586 -35406
287 -35406 -51063 -17011 10168 -18411 -44042 -27203 -26375 -65446 -77058 -42174 -29567 -50250
299 -50250 -42138 -7973 -15908 -56444 -60276 -40678 -57792 -85778 -65200 -29496 -36377 -52885 -33326
312 -33326 -19639 -50423 -77342 -63274 -53997 -73831 -73340 -38409 -25022 -45334 -48798 -31252 -43493
$$ packed form
223G597N9159L7073l8235j2363M3978l934o5884j4687M2595n263m0637K5351N9737
236I4487j1073m5254J5937K7051m3557m8882K7833L4931k5585j4349M7615K4389
248H3543m3008k4446K6390o677n0364k529M6217N408k9361J7797L9860k2526m9257
261h953N934K2289k9728k8657L4683L6270k0187j6525K9251N521m7183k3416K6155
274a4546K537l1098J0027M6360J565l4259M451K2485k7420m3526J2048L0790j4820
287c5406j5657L4052K7179k8579k5631J6839Q28l9071j1612L4884J2607k0683
299e0250Q112L4165p935m0536l832J9598j7114k7986K0578L5704o881j6508J9559
312c3326J3687l0784k6919J4068R277j9834M91L4931J3387k0312l464J7546j2241
$$ plain form
325 -43493 -76993 -77488 -53577 -54925 -66224 -45861 -18910 -28686 -49590 -44455 -39715 -61788 -75883
338 -75883 -56078 -39244 -45355 -40995 -17925 -15278 -39123 -47429 -37342 -44745 -61841 -51752 -24639
351 -24639 -19759 -27559 -16286 -4449 -19926 -40373 -36429 -28733 -37310 -36860 -14042 1752 -5286 -7590
365 -7590 2500 -3523 -25123 -29610 -14603 -11436 -16151 -2188 19388 19365 6004 6064 9524 -3494
379 -3494 -15305 -5891 9166 11044 14556 29991 36410 23755 13958 16010 12906 1990 5895 23949
393 23949 33861 32716 37505 45413 39277 23635 18301 21551 21005 21130 32225 45703 49034 47298 47645
408 47645 43721 32078 24419 26221 30489 33607 41064 51946 56946 52877 46636 41899 35864 28600
422 28600 27489 33442 41421 47884 52839 54812 52457 45552 37111 30444 27751 28926 33502 41138 47915
$$ packed form
325d3493l3500m95K3911j348j1299K0363K6951r776k0904N135M740k2073j4095
338g5883J9805J6834o111M360K3070K647k3845q306J0087p403j7096J0089K7113
351b4639M880p800J1273J1837j5477k0447L944P696q577M50K2818J5794p038k304
365g590J0090o023k1600m487J5007L167m715J3963K1576k3j3361O0L460j3018
379c494j1811R414J5057J878L512J5435O419j2655r797K052l104j0916L905J8054
393B3949R912j145M789P908o136j5642n334L250n46J25J1095J3478L331j736L47
408D7645l924j1643p659J802M268L118P457J0882N000m069o241m737o035p264
422B8600j111N953P979O463M955J973k355o905q441o667k693J175M576P636O777
$$ plain form
437 47915 50734 49335 45159 38388 29000 22705 22976 26434 30303 35408 42954 45752 39970 31895 26797
452 26797 21133 13605 12306 19716 26667 28893 32202 35020 29577 17994 11806 9569 4305 2178 10815
467 10815 20853 20577 18475 21111 18362 4496 -6387 -3657 -2156 -5845 -2138 10413 14379 6761
481 6761 2834 3913 -5620 -19824 -19443 -9463 -10524 -13274 -2156 7392 -1959 -14195 -13011 -13059 -26944
496 -26944 -34201 -21115 -11223 -16664 -16485 -4597 -5653 -23328 -30900 -23895 -28895 -39791 -32608 -14741
510 -14741 -15263 -24712 -18117 -10910 -25872 -42737 -37214 -28210 -37049 -41000 -22805 -11435 -23062 -30214
524 -30214 -21588 -24556 -43649 -47303 -32289 -29686 -38854 -29159 -11615 -17597 -34733 -31927 -24020 -37806
538 -37806 -51177 -37107 -20874 -28229 -32775 -16426 -9924 -28976 -39258 -28350 -28002 -43722 -39732
$$ packed form
437D7915K819j399m176o771r388o295K71L458L869N105P546K798n782q075n098
452B6797n664p528j299P410O951K226L309K818n443j1583o188k237n264k127Q637
467A0815J0038k76k102K636k749j3866j0883K730J501l689L707J2551L966p618
481F761l927J079r533j4204L81R980j061k750J1118R548r351j2236J184m8j3885
496b6944p257J3086R892n441J79J1888j056j7675p572P005n000j0896P183J7867
510a4741n22r449O595P207j4962j6865N523R004q839l951J8195J1370j1627p152
524c0214Q626k968j9093l654J5014K603r168R695J7544n982j7136K806P907j3786
538c7806j3371J4070J6233p355m546J6349O502j9052j0282J0908L48j5720L990
$$ plain form
551 -39732 -17372 -14227 -27336 -21083 -6474 -18441 -39363 -32778 -18473 -28370 -37031 -18008 -530
564 -530 -12710 -23703 -9309 -5673 -27795 -35245 -15901 -9790 -23850 -18037 5910 5006 -16529 -14146
578 -14146 933 -10209 -30207 -17568 4957 -2287 -13612 4402 19793 901 -15864 -1097
590 -1097 6473 -12979 -16747 9115 18732 1712 2929 24385 18663 -7388 -5693 15085 8255 -8668
604 -8668 7669 32069 22489 4856 18757 31281 9468 -6336 12653 26156 9423 7279 33244
617 33244 39813 16667 13084 32297 26309 1136 7534 33329 29479 12139 26920 47917 32219
630 32219 10130 22888 35813 16115 4531 28445 43493 25115 19643 42253 43766 15607
642 15607 11290 33367 30488 8633 17954 46022 39287 17061 27715 45175 26057 3249 19293
$$ packed form
551c9732K2360L145j3109O253J4609j1967k0922O585J4305r897q661J9023J7478
564e30j2180j0993J4394L636k2122p450J9344O111j4060N813K3947r04k1535K383
578a4146J5079j1142j9998J2639K2525p244j1325J8014J5391j8892j6765J4767
590a097P570j9452l768K5862R617j7020J217K1456n722k6051J695K0778o830j6923
604h668J6337K4400r580j7633J3901J2524k1813j5804J8989J3503j6733k144K5965
617C3244O569k3146l583J9213n988k5173O398K5795l850j7340J4781K0997j5698
630C2219k2089J2758J2925j9698j1584K3914J5048j8378n472K2610J513k8159
642A5607m317K2077k879k1855R321K8068o735k2226J0654J7460j9118k2808J6044
$$ plain form
655 19293 36746 20081 8797 33772 47365 22804 11920 32468 32691 4672 2550 29520 30036
668 30036 7626 16017 41519 30533 2538 10173 29364 11735 -8978 10839 31743 14327
680 14327 597 22156 31618 3554 -9704 12477 15863 -9249 -8415 20662 20817 -5242 -1231
693 -1231 21020 7748 -20620 -10944 11193 -2527 -20464 -352 19152 -925 -18606 -245
705 -245 7110 -20245 -29820 -4609 2281 -20746 -19740 7006 3250 -25202 -23516 -1642 -13249 -38297
719 -38297 -24394 277 -12415 -30418 -12420 3698 -20076 -38669 -19314 -9462 -32995 -39287
731 -39287 -10371 -3592 -28394 -29580 -5265 -11141 -40980 -37085 -11548 -19627 -41518 -26443 -642
744 -642 -14972 -37132 -21630 -6207 -29253 -45999 -22620 -8269 -29782 -35228 -7909 -2471 -30366
$$ packed form
655A9293J7453j6665j1284K4975J3593k4561j0884K0548K23k8019k122K6970N16
668C0036k2410Q391K5502j0986k7995P635J9191j7629k0713J9817K0904j7416
680A4327j3730K1559R462k8064j3258K2181L386k5112Q34K9077J55k6059M011
693a231K2251j3272k8368R676K2137j3720j7937K0112J9504k0077j7681J8361
705b45P355k7355r575K5211O890k3027J006K6746l756k8452J686K1874j1607k5048
719c8297J3903K4671j2692j8003J7998J6118k3774j8593J9355R852k3533o292
731c9287K8916O779k4802j186K4315n876k9839L895K5537q079k1891J5075K5801
744f42j4330k2160J5502J5423k3046j6746K3379J4351k1513n446K7319N438k7895
$$ plain form
757 -30366 -34271 -9993 -13893 -40696 -34234 -5131 -10658 -32625 -19292 3301 -13190 -36326 -21107
770 -21107 -3755 -23366 -36183 -10978 4164 -16901 -25131 -793 2578 -25474 -28921 -3313 -3594
783 -3594 -26338 -18159 10022 3492 -20127 -9973 9534 -6514 -27276 -9831 9678 -6723 -17804
796 -17804 5834 18594 -4921 -15029 6960 10191 -15132 -15176 12058 13248 -8427 -1468 23215
809 23215 13845 -11194 -1689 18319 4544 -13272 6088 25854 9628 -3261 17111 26394 1903
822 1903 -7943 15216 20790 -1696 -389 26923 27142 3028 6598 28714 18655 -5450 5078
835 5078 27202 16086 -291 17638 35450 17149 1325 19337 28426 5665 -2110 22339 29397
848 29397 8583 8197 32322 29812 4501 6432 27074 19655 -1272 10646 32563 21980 5175
$$ packed form
757c0366l905K4278l900k6803O462K9103n527k1967J3333K2593j6491k3136J5219
770b1107J7352j9611j2817K5205J5142k1065q230K4338L371k8052l447K5608k81
783c594k2744Q179K8181o530k3619J0154J9507j6048k0762J7445J9509j6401j1081
796a7804K3638J2760k3515j0108K1989L231k5323m4K7234J190k1675O959K4683
809B3215r370k5039R505K0008j3775j7816J9360J9766j6226j2889K0372R283k4491
822A903r846K3159N574k2486J307K7312K19k4114L570K2116j0059k4105J0528
835E078K2124j1116j6377J7929J7812j8301j5824J8012R089k2761p775K4449P058
848B9397k0814l86K4125k510k5311J931K0642p419k0927J1918K1917j0583j6805
$$ plain form
861 5175 19635 33387 14178 -966 16125 26231 7010 1573 24941 31145 9614 6588 26334
874 26334 22799 -572 2280 23471 17964 541 11502 30460 18286 286 12342 23627 6222
887 6222 -5937 12377 22956 6112 340 20622 23774 1321 -2864 15563 13492 -7027 -2350
900 -2350 18828 14018 -3920 4901 20145 6924 -10814 598 13292 -1370 -11934 6438 17076
913 17076 -638 -8262 8221 10530 -10942 -13961 4750 4847 -12532 -8285 11158 5565 -13346 -8012
927 -8012 6119 -5350 -20773 -9347 4583 -7414 -16876 -1476 6472 -11130 -19755 -4853 -2431
940 -2431 -20182 -21319 -2407 -1132 -17444 -14730 886 -5965 -23361 -18567 -4791 -13687 -25634
953 -25634 -13285 -751 -12181 -22174 -9814 -4353 -20482 -27254 -12312 -7982 -22398 -22483 -5412
$$ packed form
861E175J4460J3752j9209j5144J7091J0106j9221n437K3368O204k1531l026J9746
874B6334l535k3371K852K1191n507j7423J0961J8958j2174j8000J2056J1285j7405
887F222j2159J8314J0579j6844n772K0282L152k2453m185J8427k071k0519M677
900b350K1178m810j7938Q821J5244j3221j7738J1412J2694j4662j0564J8372J0638
913A7076j7714p624J6483K309k1472l019J8711R7j7379M247J9443n593j8911N334
927h012J4131j1469j5423J1426J3930j1997r462J5400P948j7602q625J4902K422
940b431j7751j137J8912J275j6312K714J5616o851j7396M794J3776q896j1947
953b5634J2349J2534j1430r993J2360N461j6129o772J4942M330j4416q5J7071
$$ plain form
966 -5412 -5218 -21405 -20497 -7049 -13029 -27467 -21191 -7241 -13690 -23781 -12761 -2462 -14416 -24187
980 -24187 -13549 -7558 -21404 -25341 -9813 -4897 -17537 -18443 -4201 -5239 -20544 -20055 -6837 -10152
994 -10152 -21642 -14879 -1101 -6732 -16383 -8641 -459 -11461 -19752 -9426 -1990 -11840 -14829 -906
1008 -906 3334 -8685 -11123 110 -429 -12966 -11025 1522 281 -8737 -2695 7519 2230 -7313
1022 -7313 -1374 5446 -2994 -8420 1730 8993 1084 -1877 8223 11311 310 -2624 7252 7582
1036 7582 -1414 1558 12310 11604 3755 7207 14929 8675 536 6244 13009 7436 3517 12800 18208
1051 18208 10764 6523 14114 15688 5802 4642 13706 15279 8412 10516 18995 17300 8879 10739 16240
1066 16240 11657 5832 11284 18420 13926 9870 16076 19536 11880 7718 13221 15444 8749 7987 16094
$$ packed form
966e412J94j6187R08J3448n980j4438O276J3950o449j0091J1020J0299j1954r771
980b4187J0638N991j3846l937J5528M916j2640r06J4242j038j5305M89J3218l315
994a0152j1490O763J3778n631r651P742Q182j1002q291J0326P436r850k989J3923
1008i06M240j2019k438J1233n39j2537J941J2547j241r018O042J0214n289r543
1022g313N939O820q440n426J0150P263p909k961J0100L088j1001k934R876L30
1036G582q996K972J0752p06p849L452P722o254q139N708O765n573l919R283N408
1051A8208p444m241P591J574r886j160R064J573o867K104Q479j695q421J860N501
1066A6240m583n825N452P136m494m056O206L460p656m162N503K223o695p62Q107
$$ plain form
1081 16094 17722 11341 11282 16908 14344 7200 8438 13331 11170 7223 11726 16452 12403 8327 11266
1096 11266 13183 7439 4264 8431 11359 7217 6838 11698 11999 6728 5429 8125 6479 2012 3532
1111 3532 7789 6683 4134 6478 8739 4589 1028 2480 3587 311 -664 3265 5227 2112 1312
1126 1312 3703 2477 -1747 -2664 -807 -1171 -2787 -1250 1385 402 -1824 -1100 -1171 -4147 -6212 -4616
1142 -4616 -3045 -4073 -4577 -2216 -1483 -3766 -6009 -5178 -5998 -7653 -8181 -6054 -5157 -5748 -5306 -4666 -5687
1159 -5687 -7833 -8337 -8216 -8667 -9605 -8381 -6546 -6291 -7089 -7537 -7481 -8221 -10323 -11148 -10205 -9024 -9064 -8669 -7253
1178 -7253 -6954 -8312 -9633 -10146 -10045 -11223 -10925 -9259 -8300 -8758 -8561 -7470 -8001 -10477 -10839 -9362 -9852
1195 -9852 -11205 -9542 -6578 -6620 -8878 -8460 -7218 -8591 -11234 -10237 -8191 -8711 -9075 -6534 -4668 -6810
$$ packed form
1081A6094J628o381n9N626k564p144J238M893k161l947M503M726m049m076K939
1096A1266J917n744l175M167K928m142l79M860L01n271j299K696j646m467J520
1111C532M257j106k549K344K261m150l561J452J107l276r75L929J962l115q00
1126A312K391j226m224r17J857l64j616J537K635r83k226P24p1k976k065J596
1142d616J571j028n04K361P33k283k243Q31q20j655n28K127Q97n91M42O40j021
1159e687k146n04J21m51r38J224J835K55p98m48N6p40k102q25R43J181m0L95J416
1178g253K99j358j321n13J01j178K98J666R59m58J97J091n31k476l62J477m90
1195i852j353J663K964m2k258M18J242j373k643R97K046n20l64K541J866k142
$$ plain form
1211 -6810 -8297 -6612 -6835 -9997 -9583 -5925 -5173 -7253 -6075 -2104 -3601 -7470 -7028 -4226 -6022 -8047
1227 -8047 -5415 -1595 -3189 -4497 -1739 -908 -4009 -5811 -2385 -1826 -5216 -3977 1354 1589 -2483 -1678
1243 -1678 2596 559 -4025 -2384 2287 947 -2008 1995 6006 2886 -222 3415 5235 542 -1369
1258 -1369 4278 6349 1853 2378 8731 8573 2421 2398 8133 6685 815 3841 10192 8539 3832 7698
1274 7698 11864 7275 2870 7249 10349 5476 4125 11094 13149 7226 5906 12624 12212 4792 4878 12095
1290 12095 11382 5241 8219 14991 12413 6004 9278 13992 8947 4198 9600 13834 7944 5774 13281
1305 13281 15101 7350 5327 12269 12024 4187 4984 13011 12237 5349 7436 14140 9937 2651 6665
1320 6665 11843 5948 1511 8639 12873 5570 2330 9822 11022 1916 -131 8140 8395 36 1327
$$ packed form
1211f810j487J685k23l162M14L658P52k080J178L971j497l869M42K802j796k025
1227h047K632L820j594j308K758Q31l101j802L426N59l390J239N331K35m072Q05
1243a678M274k037m584J641M671j340k955M003M011l120l108L637J820m693j911
1258a369N647K071m496N25O353j58o152k3N735j448n870L026O351j653m707L866
1274G698M166m589m405M379L100m873j351O969K055n923j320O718m12p420Q6P217
1290A2095p13o141K978O772k578o409L274M714n045m749N402M234n890k170P507
1305A3281J820p751k023O942k45p837P97Q027p74o888K087O704m203p286M014
1320F665N178n895m437P128M234p303l240P492J200r106k047Q271K55q359J291
$$ plain form
1335 1327 9559 7988 -450 1218 7816 3575 -4494 383 6977 1030 -4109 3060 7574 -1035 -5971
1350 -5971 1988 4290 -5335 -6952 2508 3378 -5661 -5810 3582 1343 -8530 -6391 1034 -2686 -10619
1365 -10619 -5095 2350 -4143 -10417 -3256 1063 -7910 -13056 -4301 -875 -10246 -12117 -2040 -783
1379 -783 -10850 -11044 -2306 -4124 -14048 -11202 -2480 -6367 -13735 -8291 -977 -7694 -14658 -7455 -2563
1394 -2563 -11535 -15790 -5852 -1967 -11438 -13244 -3259 -2421 -13629 -13140 -3376 -5448 -14783 -11003 -1120
1409 -1120 -5498 -13763 -7625 -274 -8115 -15173 -6508 -602 -9603 -13881 -3327 674 -9345 -11872
1423 -11872 -1322 -460 -11665 -11099 -313 -1529 -11268 -7213 2840 -1944 -11200 -5192 2837 -4863
1437 -4863 -11918 -2639 4461 -4691 -9352 921 5179 -5639 -8554 1839 3319 -7103 -6385 4754
$$ packed form
1335A327Q232j571q438J668O598m241q069M877O594n947n139P169M514q609m936
1350e971P959K302r625j617R460Q70r039j49R392k239r873K139P425l720p933
1365a0619N524P445o493o274P161M319q973n146Q755L426r371j871J0077J257
1379g83j0067j94Q738j818r924K846Q722l887p368N444P314o717o964P203M892
1394b563q972m255R938L885r471j806R985Q38j1208M89R764k072r335L780R883
1409a120m378q265O138P351p841p058Q665N906r001m278J0554M001j0019k527
1423a1872J0550Q62j1205N66J0786j216r739M055J0053m784r256O008Q029p700
1437d863p055R279P100r152m661J0273M258j0818k915J0393J480j0422P18J1139
$$ plain form
1451 4754 3417 -5883 -2865 6844 1885 -7251 -1423 6836 183 -6773 2288 9241 89 -5089 4500
1466 4500 8338 -2431 -4967 6033 7767 -2675 -1644 9096 7426 -2615 94 9723 4606 -4360
1480 -4360 2134 10893 3924 -2840 6178 12119 2699 -3326 6958 10910 577 -1628 9104 11226
1494 11226 630 1194 11260 9244 -1277 1951 11503 6837 -1845 4875 13613 6557 -1122 7596
1508 7596 13656 3491 -1944 7772 12606 2617 121 10849 12098 1719 1149 11517 9444 -1013
1522 -1013 2436 12818 8313 -1004 5309 13681 6161 -2164 5972 12431 3531 -1965 7937 12299 2844
1537 2844 11 9780 10656 86 -95 9832 7900 -1532 1748 11774 6905 -2145 3496 11381 3463
1552 3463 -4395 3718 9859 1707 -3384 5961 9656 69 -2854 6319 6761 -3262 -2800 6826 5134
$$ packed form
1451D754j337r300L018R709m959r136N828Q259o653o956R061O953r152n178R589
1466D500L838j0769k536J1000J734j0442J031J0740j670j0041K709R629n117q966
1480d360O494Q759o969o764R018N941r420o025J0284L952j0333k205J0732K122
1494A1226j0596N64J0066k016j0521L228R552m666q682O720Q738p056p679Q718
1508G596O060j0165n435R716M834r989k496J0728J249j0379n70J0368k073j0457
1522a013L449J0382m505r317O313Q372p520q325Q136O459q900n496R902M362r455
1537B844k833R769Q76j0570j81R927j932r432L280J0026m869r050N641P885p918
1552C463p858Q113O141q152n091R345L695r587k923R173M42j0023M62R626j692
$$ plain form
1567 5134 -4310 -929 8013 3016 -6429 -841 6865 -425 -7622 127 6735 -1865 -7035 2137 5117
1582 5117 -4359 -7575 1809 2606 -7156 -6504 2986 1528 -8195 -4987 3154 -1562 -10470 -5424 2701
1597 2701 -3944 -10857 -3118 2851 -5216 -11243 -3147 510 -8479 -11422 -2122 -663 -9459 -9327 -383
1612 -383 -2263 -11673 -9046 -817 -4811 -13149 -7847 -79 -5880 -12632 -5673 -143 -7855 -13038 -5382
1627 -5382 -1847 -9892 -11714 -3026 -2058 -10483 -9798 -1711 -3643 -11935 -9279 -982 -4907 -12007 -7050
1642 -7050 772 -5125 -11426 -5199 45 -7066 -11151 -3860 -37 -7164 -8827 -910 -188 -8186 -7333
1657 -7333 181 -1399 -8934 -5697 2225 -1105 -7930 -2900 3579 -1767 -7753 -2127 3668 -2905 -6442
1672 -6442 954 4102 -2541 -4218 3130 3544 -3631 -3260 3939 3670 -3553 -682 6815 3939 -3074 882
$$ packed form
1567E134r444L381Q942m997r445N588P706p290p197P749O608q600n170R172K980
1582E117r476l216R384P97r762O52R490j458r723L208Q141m716q908N046Q125
1597B701o645o913P739N969q067o027Q096L657q989k943R300J459q796J32Q944
1612c83j880r410K627Q229l994q338N302P768n801o752O959N530p712n183P656
1627e382L535q045j822Q688R68q425O85Q087j932q292K656Q297l925p100M957
1642g050P822n897o301O227N244p111m085P291L823p127j663P917P22p998Q53
1657g333P514j580p535L237P922l330o825N030O479n346n986N626N795o573l537
1672f442P396L148o643j677P348M14p175L71P199k69p223K871P497k876p013L956
$$ plain form
1688 882 6928 2507 -2974 2477 7599 2508 -882 5286 8369 1932 -166 6687 6953 276 814 8006
1704 8006 7374 994 2967 9649 6377 214 3890 9132 5368 769 5632 9846 5287 1766 7065
1719 7065 9239 3467 1561 7525 8261 2770 3054 9307 8171 1877 4157 9480 6644 951 4037
1734 4037 9017 5595 1698 5599 9085 4766 1473 5949 7600 2565 1447 6586 7274 1751 2212
1749 2212 7597 6279 754 1987 6704 4364 -194 2520 7056 4008 159 3104 6181 2160 -825
1764 -825 3019 4557 951 -127 4093 4421 -401 -583 4053 2934 -2257 -1016 3738 2085 -1959 -296
1780 -296 3728 949 -2367 -309 2511 -890 -2752 487 1861 -1654 -2575 1163 1283 -3149 -3189 798
1796 798 -169 -4062 -3314 670 -210 -3644 -2358 88 -1721 -4290 -2407 -709 -2998 -4393 -1616 -507
$$ packed form
1688H82O046m421n481N451N122n091l390O168L083o437k098O853K66o677N38P192
1704H006o32o380J973O682l272o163L676N242l764m599M863M214m559l521N299
1719G065K174n772j906N964P36n491K84O253j136o294K280N323k836n693L086
1734D037M980l422l897L901L486m319l293M476J651n035j118N139O88n523M61
1749B212N385j318n525J233M717k340m558K714M536l048l849K945L077m021k985
1764h25L844J538l606j078M220L28m822j82M636j119n191J241M754j653m044J663
1780b96M024k779l316K058K820l401j862L239J374l515r21L738J20m432m0L987
1796G98r67l893P48L984q80l434J286K446j809k569J883J698k289j395K777J109
$$ plain form
1812 -507 -3382 -4373 -1515 -1361 -5073 -4741 -1909 -1745 -4845 -3916 -1168 -2312 -5102 -4033 -2352 -3557
1828 -3557 -5749 -4087 -2099 -3674 -4564 -3020 -2140 -4760 -5569 -3358 -2926 -5373 -5277 -2759 -2660 -5127 -4588
1845 -4588 -2839 -3291 -5467 -5080 -3219 -4094 -5032 -4022 -2608 -3676 -4775 -3150 -3029 -4810 -5221 -3552
$$ packed form
1812e07k875r91K858J54l712L32K832J64l100R29K748j144k790J069J681j205
1828c557k192J662J988j575q90J544Q80k620q09K211M32k447R6K518R9k467N39
1845d588J749m52k176L87J861q75r38J010J414j068j099J625J21j781m11J669
$$ [...]
8191b41
##END NTUPLES=NMR FID
##END=
