##TITLE=1H_LR-666-1
 CDCl3, 8 sc, 
 4.4.2019
##JCAMPDX= 6.0         $$ Bruker NMR JCAMP-DX V2.0
##DATA TYPE= NMR FID
##DATA CLASS= NTUPLES
##ORIGIN= UXNMR, Bruker Analytische Messtechnik GmbH
##OWNER= root
$$ XWIN-NMR		Version 3.5
$$ Thu Apr  4 14:52:23 2019 Russian Standard Time (UT+4h)  she@DPX200
##.OBSERVE FREQUENCY= 200.1316
##.OBSERVE NUCLEUS= ^1H
##.DELAY= (6, 6)
##.ACQUISITION MODE= SIMULTANEOUS
##.ACQUISITION SCHEME= undefined
##.AVERAGES= 8
##.DIGITISER RES= 18
##SPECTROMETER/DATA SYSTEM= spect
##.PULSE SEQUENCE= zg30
##.SOLVENT NAME= CDCl3
##.SHIFT REFERENCE= (INTERNAL, CDCl3, 0, 15.7039)
##AUDIT TRAIL= $$ (NUMBER, WHEN, WHO, WHERE, WHAT)
$$ ##TITLE= Audit trail, XWIN-NMR		Version 3.5
$$ ##JCAMPDX= 5.01
$$ ##ORIGIN= Bruker BioSpin GmbH
$$ ##OWNER= she
$$ F:/spectra/data/she/nmr/H-F/1/audita.txt
$$ ##AUDIT TRAIL=  $$ (NUMBER, WHEN, WHO, WHERE, WHAT)
(   1,<2019-04-04 14:51:08.62 +0400>,<she>,<DPX200>,
      <created by zg, POWCHK disabled, PULCHK disabled
       configuration hash MD5:
       00 E9 B6 7A A2 85 ED C7 34 08 36 98 17 FE 4E 26
       data hash MD5: 16K
       54 D6 29 6C 0D 8B 96 4D DD C2 37 DD 0F 80 D9 69>)
$$ ##END=
$$ 
$$ hash MD5
$$ 3E 40 E2 5D E1 16 48 EF 06 83 29 62 28 A0 60 73
##$RELAX= 
##$RELAX= 
##$RELAX= 
##$RELAX= 
##$RELAX= 
##$RELAX= 
$$ Bruker specific parameters
$$ --------------------------
##$DU= <F:/spectra>
##$EXPNO= 1
##$NAME= <H-F>
##$PROCNO= 1
##$TYPE= <nmr>
##$USER= <she>
##$AMP= (0..31)
100 100 100 100 100 100 100 100 100 100 100 100 100 100 100 100 100 100 
100 100 100 100 100 100 100 100 100 100 100 100 100 100 
##$AQSEQ= 0
##$AQ_mod= 1
##$AUNM= <au_zg>
##$AUTOPOS= <>
##$BF1= 200.13
##$BF2= 200.13
##$BF3= 200.13
##$BF4= 200.13
##$BF5= 200.13
##$BF6= 200.13
##$BF7= 200.13
##$BF8= 200.13
##$BYTORDA= 1
##$CFDGTYP= 0
##$CFRGTYP= 5
##$CHEMSTR= <none>
##$CNST= (0..31)
1 1 145 1 1 1 1 1 1 1 1 1 1 1 1 1 1 1 1 1 1 1 1 1 1 1 1 1 1 1 1 1 
##$CPDPRG= <>
##$CPDPRG1= <>
##$CPDPRG2= <>
##$CPDPRG3= <>
##$CPDPRG4= <mlev>
##$CPDPRG5= <mlev>
##$CPDPRG6= <mlev>
##$CPDPRG7= <mlev>
##$CPDPRG8= <mlev>
##$CPDPRGB= <>
##$CPDPRGT= <>
##$D= (0..31)
0 1.2 0 0 0 0 0 0 0 0 0 0.03 0 0 0 0 0 0 0 0 0 0 0 0 0 0 0 0 0 0 0 0 
##$DATE= 1554375068
##$DBL= (0..7)
120 120 120 120 120 120 120 120 
##$DBP= (0..7)
150 150 150 150 150 150 150 150 
##$DBP07= 0
##$DBPNAM0= <>
##$DBPNAM1= <>
##$DBPNAM2= <>
##$DBPNAM3= <>
##$DBPNAM4= <>
##$DBPNAM5= <>
##$DBPNAM6= <>
##$DBPNAM7= <>
##$DBPOAL= (0..7)
0.5 0.5 0.5 0.5 0.5 0.5 0.5 0.5 
##$DBPOFFS= (0..7)
0 0 0 0 0 0 0 0 
##$DE= 6
##$DECBNUC= <off>
##$DECIM= 24
##$DECNUC= <off>
##$DECSTAT= 4
##$DIGMOD= 1
##$DIGTYP= 9
##$DL= (0..7)
0 120 120 120 120 120 120 120 
##$DP= (0..7)
150 150 150 150 150 150 150 150 
##$DP07= 0
##$DPNAME0= <>
##$DPNAME1= <>
##$DPNAME2= <>
##$DPNAME3= <>
##$DPNAME4= <>
##$DPNAME5= <>
##$DPNAME6= <>
##$DPNAME7= <>
##$DPOAL= (0..7)
0.5 0.5 0.5 0.5 0.5 0.5 0.5 0.5 
##$DPOFFS= (0..7)
0 0 0 0 0 0 0 0 
##$DQDMODE= 0
##$DR= 18
##$DS= 0
##$DSLIST= <SSSSSSSSSSSSSSS>
##$DSPFIRM= 0
$$ [...]
##$SUBNAM2= <"">
##$SUBNAM3= <"">
##$SUBNAM4= <"">
##$SUBNAM5= <"">
##$SUBNAM6= <"">
##$SUBNAM7= <"">
##$SUBNAM8= <"">
##$SUBNAM9= <"">
##$SW= 24.9336934301222
##$SWIBOX= (0..15)
0 0 2 0 0 0 0 0 0 0 0 0 0 0 0 0 
##$SW_h= 4990.01996007984
##$TD= 16384
##$TD0= 1
##$TE= 0
##$TE2= 300
##$TE3= 300
##$TEG= 300
##$TL= (0..7)
0 120 120 120 120 120 120 120 
##$TP= (0..7)
150 150 150 150 150 150 150 150 
##$TP07= 0
##$TPNAME0= <>
##$TPNAME1= <>
##$TPNAME2= <>
##$TPNAME3= <>
##$TPNAME4= <>
##$TPNAME5= <>
##$TPNAME6= <>
##$TPNAME7= <>
##$TPOAL= (0..7)
0.5 0.5 0.5 0.5 0.5 0.5 0.5 0.5 
##$TPOFFS= (0..7)
0 0 0 0 0 0 0 0 
##$TUNHIN= 0
##$TUNHOUT= 0
##$TUNXOUT= 0
##$USERA1= <user>
##$USERA2= <user>
##$USERA3= <user>
##$USERA4= <user>
##$USERA5= <user>
##$V9= 5
##$VALIST= <valist>
##$VCLIST= <CCCCCCCCCCCCCCC>
##$VD= 0
##$VDLIST= <DDDDDDDDDDDDDDD>
##$VPLIST= <PPPPPPPPPPPPPPP>
##$VTLIST= <TTTTTTTTTTTTTTT>
##$WBST= 1024
##$WBSW= 4
##$XGAIN= (0..3)
0 0 0 0 
##$XL= 0
##$YL= 0
##$YMAX_a= 90674
##$YMIN_a= -80689
##$ZGOPTNS= <>
##$ZL1= 120
##$ZL2= 120
##$ZL3= 120
##$ZL4= 120
##$ABSF1= 10
##$ABSF2= 0
##$ABSG= 5
##$ABSL= 3
##$ALPHA= 0
##$AQORDER= 0
##$ASSFAC= 0
##$ASSFACI= 0
##$ASSFACX= 0
##$ASSWID= 0
##$AUNMP= <proc_1d>
##$AZFE= 0.1
##$AZFW= 0.1
##$BCFW= 1
##$BC_mod= 2
##$BYTORDP= 1
##$COROFFS= 0
##$CY= 11.3945322036743
##$DATMOD= 1
##$DC= 2
##$DFILT= <>
##$DTYPP= 0
##$F1P= 18.9103706918063
##$F2P= -1.10871071338519
##$FCOR= 0.5
##$FTSIZE= 0
##$FT_mod= 4
##$GAMMA= 1
##$GB= 0.15
##$INTBC= 1
##$INTSCL= 1
##$ISEN= 128
##$LB= 0.24
##$LEV0= 0
##$LPBIN= 0
##$MAXI= 10000
##$MC2= 0
##$MEAN= 0
##$ME_mod= 0
##$MI= 1.114404
##$NCOEF= 0
##$NC_proc= 0
##$NLEV= 6
##$NOISF1= 3.799351
##$NOISF2= 2.8
##$NSP= 1
##$NTH_PI= 0
##$NZP= 0
##$OFFSET= 15.70392
##$PC= 1
##$PHC0= -8848.855
##$PHC1= 13.60024
##$PH_mod= 1
##$PKNL= yes
##$PPARMOD= 0
##$PSCAL= 0
##$PSIGN= 0
##$REVERSE= no
##$SF= 200.130013532006
##$SI= 16384
##$SIGF1= 3
##$SIGF2= 2
##$SINO= 400
##$SIOLD= 16384
##$SREGLST= <1H.CDCl3>
##$SSB= 0
##$STSI= 0
##$STSR= 0
##$SW_p= 3612.71676300578
##$SYMM= 0
##$S_DEV= 0
##$TDeff= 0
##$TDoff= 0
##$TI= <>
##$TILT= no
##$TM1= 0
##$TM2= 0
##$TOPLEV= 0
##$USERP1= <user>
##$USERP2= <user>
##$USERP3= <user>
##$USERP4= <user>
##$USERP5= <user>
##$WDW= 1
##$XDIM= 8192
##$YMAX_p= 0
##$YMIN_p= 0
$$ End of Bruker specific parameters
$$ ---------------------------------
##NTUPLES= NMR FID
##VAR_NAME=  TIME,          FID/REAL,        FID/IMAG
##SYMBOL=    X,             R,               I
##VAR_TYPE=  INDEPENDENT,   DEPENDENT,       DEPENDENT
##VAR_FORM=  AFFN,          ASDF,            ASDF
##VAR_DIM=   8192,          8192,            8192
##UNITS=     SECONDS,       ARBITRARY UNITS, ARBITRARY UNITS
##FACTOR=    0.0002004,     1,               1
##FIRST=     0,             0,               0
##LAST=      1.6414764,     0,               0
##MIN=       0,             -80689,          0
##MAX=       1.6414764,     90674,           0
$$ Real data points
##PAGE= N=1
##DATA TABLE= (X++(R..R)), XYDATA
0 0 0 0 0 0 0 0 0 0 0 -8 8 -8 8 -8 16 -16 16 -24 24 -32 35 -41 48 -57 65 -73 84 -96 109 -121 136 -155 174
33 174 -195 217 -242 270 -300 333 -368 408 -451 500 -554 614 -680 756 -842 942 -1055 1191
51 1191 -1354 1555 -1804 2135 -2584 3240 -4297 6285 -11386 56435 90674 33843 33921 15695
65 15695 5461 3611 24305 20575 6411 -13160 -26511 -48975 -59158 -58141 -51903 -52160 -49127 -53253
79 -53253 -65795 -76349 -72338 -64222 -53974 -38594 -17249 -6363 -6701 -7659 -3050 1463 8858 24481
93 24481 46426 61625 65008 61689 55575 45589 36977 37429 47665 58231 62815 61000 49717 28625
107 28625 7580 -6475 -14960 -17056 -11888 -9937 -20517 -36234 -47847 -58007 -65885 -61448 -44595
120 -44595 -33317 -33524 -35282 -39056 -48855 -54489 -45556 -26804 -8512 8656 22254 24487 19663 16810
134 16810 18196 22132 34122 50246 60164 58389 52380 44540 32369 21616 21574 29531 33101 31372
148 31372 27011 17574 994 -16033 -25154 -26173 -23845 -21450 -20910 -24660 -34698 -46449 -53955 -53803
162 -53803 -46534 -33334 -19769 -12947 -12682 -15804 -20851 -26082 -22213 -7273 8656 19847 28989 33712
176 33712 28902 19794 18327 25498 32671 39428 47078 48294 37962 24389 13811 6651 4770 9741
190 9741 15648 15446 10008 1380 -12961 -27333 -32507 -29422 -25101 -22154 -18362 -18451 -27318 -38311 -41819
205 -41819 -37955 -31014 -21088 -7823 1176 1098 -3886 -7928 -8630 -5488 3158 15285 26243 30834 29751
220 29751 23892 16976 14525 17740 23873 29449 33644 34078 25352 10892 1142 -2761 -4759 -3733 2705
235 2705 6994 1928 -9265 -18376 -25376 -30748 -29518 -21678 -14761 -12404 -14008 -18974 -26010 -29405 -26115
250 -26115 -18414 -8891 2303 9649 9304 3068 569 634 1884 8270 19510 28602 29320 24910 19793
265 19793 13915 8536 8935 14939 21073 22944 20424 12801 2771 -6995 -11901 -12623 -9247 -4025 -1581
280 -1581 -4932 -12701 -20000 -25500 -28624 -25915 -17374 -8710 -6390 -7915 -10597 -14054 -18086 -16801 -7627
295 -7627 3272 10696 14806 15514 11698 6255 3942 6863 12523 19977 25409 25583 20802 14105 7467
310 7467 1820 1105 6654 11689 11354 8027 3259 -5196 -15567 -20146 -16883 -11786 -8527 -6364 -6323 -11164
326 -11164 -18441 -23205 -22303 -17141 -9645 -2210 2200 2252 -732 -4448 -7040 -4889 2788 11270 16978 19262
342 19262 19028 14655 7097 3335 6362 11111 14620 17405 18087 13478 4130 -3776 -6207 -6038 -3740 225
358 225 2968 747 -5088 -11903 -18133 -20007 -16962 -11384 -6362 -3087 -2187 -5756 -11696 -14646 -11354 -6368
374 -6368 -877 5694 11543 11158 5318 1130 191 1609 5171 11420 17307 18258 14829 8357 2126 -1349
390 -1349 -1119 2237 5964 8873 8549 3790 -4678 -10495 -11757 -10956 -8677 -3573 807 -188 -5727 -10644
406 -10644 -13159 -14009 -11539 -5587 1907 5347 4094 759 -2649 -5347 -4799 -420 5399 10904 13510
421 13510 12349 6713 2122 -40 -516 1567 6611 11607 11268 6129 1343 -2959 -7063 -7931 -4212 1602
437 1602 3799 2221 -1036 -5195 -9824 -12600 -10251 -5256 -76 3180 3141 -226 -4047 -6486 -7192 -4772
453 -4772 1049 6995 9283 7444 4581 1013 -2979 -4259 -504 5569 9006 8941 7412 3644 -1893 -6317
469 -6317 -5798 -1917 2050 4462 4657 1732 -2664 -7013 -9531 -9211 -4403 1193 3709 3030 1341 -2031
485 -2031 -6491 -8489 -5662 -81 3500 5706 6353 4420 -375 -4393 -3923 -443 3086 5987 7651 6883
501 6883 3029 -1663 -4909 -4938 -2509 1413 4334 4870 3571 564 -4789 -8186 -6465 -2981 238 2357
517 2357 4064 2376 -2293 -6659 -7030 -4670 -1794 1830 5723 6662 3567 -357 -3092 -4216 -2204 987
533 987 4361 6462 6326 3733 -766 -4253 -3693 -1112 981 3746 6288 5627 700 -4262 -5726 -5405
549 -5405 -4266 -1220 2764 4412 2282 -1634 -4006 -5530 -5310 -3188 762 3599 3893 2043 -1490 -4453
565 -4453 -5198 -3533 -1138 2070 5847 6438 3450 -501 -1815 -2291 -2880 -467 4232 5797 3985 1374
581 1374 -941 -2934 -4268 -2042 1346 4175 5365 4499 1083 -2666 -4630 -5026 -3976 -818 2515 3307
597 3307 1291 -1228 -2737 -4204 -4827 -2806 1430 3598 2889 963 -847 -3690 -5364 -4388 -957 2546
613 2546 4556 4926 3444 1133 -1073 -2068 -1169 1221 4283 5413 4459 2332 273 -1720 -3294 -1836
629 -1836 1823 4094 4018 2811 1491 -1935 -5050 -5681 -3604 -1608 143 355 28 -2373 -4936 -5915 -5251
646 -5251 -3047 -95 2022 2480 1199 -226 -2416 -4097 -2922 916 3248 4697 6037 6107 3340 588
662 588 76 1995 3580 4444 5816 5435 2983 -704 -2734 -3053 -2383 -535 1157 2232 874 -1117 -4391
679 -4391 -6878 -6858 -5573 -3877 -2389 -1287 -709 -2344 -5199 -5164 -3268 -1299 343 3494 5581 4497
695 4497 2046 684 377 1459 2696 5240 7819 7044 6080 3909 2120 1129 1514 2389 2267 4005 3163
712 3163 244 -3753 -5469 -5518 -5842 -5253 -2432 -335 -2077 -4110 -5606 -6244 -6714 -6025 -3459 -678 930
729 930 343 -504 -846 -1289 -292 2205 4281 6860 8291 6895 4783 3792 3176 2082 2618 5030 6328
746 6328 5293 3295 1478 -216 -2564 -3423 -2166 -560 -883 -1743 -3320 -5781 -7728 -8842 -7905 -5911
762 -5911 -3980 -2190 -2511 -3469 -3695 -3760 -3898 -2934 727 3135 3600 3193 4141 3190 1618 1848 4103 6649
780 6649 7570 7879 7572 5780 3234 1138 703 1207 1969 2435 1854 107 -1384 -3654 -5832 -5915 -4416 -2920
798 -2920 -2976 -3299 -3373 -4625 -7152 -7639 -5886 -3478 -2162 -158 1070 945 -388 -1070 -661 1495 3053
815 3053 4952 5920 6246 5322 3581 2165 2099 3112 4420 4536 4829 4910 2915 1 -2109 -1971 -1638 -1822
833 -1822 -1321 -514 -1353 -3892 -5780 -5810 -5673 -5213 -3711 -2301 -965 -1695 -3109 -4066 -4329 -2842 -1388 192
851 192 2215 3529 2720 1381 792 1022 2294 2595 4142 5585 5713 3724 2193 1041 943 474 1435 2788
869 2788 3421 1908 405 -1506 -2163 -3151 -2924 -2136 -1060 -551 -1515 -2858 -4070 -4209 -4640 -3901 -2423 -212
887 -212 269 -894 -1725 -1708 -1832 -2230 -930 1650 2623 2701 2205 1731 1457 463 942 2315 3819 4487 4289
906 4289 2661 1879 1017 -42 -334 1245 2536 2393 1507 329 -407 -2221 -3375 -2967 -1400 -846 -1146
923 -1146 -1467 -1478 -3376 -4650 -4634 -3452 -2002 -822 -435 -225 -1094 -1774 -2300 -2083 -224 1401 2802 2568
941 2568 3046 2685 1165 51 915 3137 3693 4022 4313 4018 2249 896 275 251 939 1100 1511 1084 273
960 273 -1502 -3284 -3568 -3409 -2557 -2205 -2122 -1630 -2187 -3862 -5116 -4399 -3181 -2437 -1535 14 1022 163
978 163 -1153 -918 203 758 1853 3845 4954 4592 3604 2781 2516 2433 2933 3639 4185 4669 3422 1471
996 1471 -203 -560 -736 -1229 -983 126 -164 -1957 -3856 -4661 -4722 -5393 -4578 -3096 -2071 -2063 -2692 -3304 -3391
1015 -3391 -3310 -2176 -1081 738 1997 2887 2416 1746 1749 2061 2133 3257 5006 5650 4750 3808 3001 2168 920
1034 920 981 1954 3068 2257 692 -532 -1770 -3478 -4059 -3506 -2497 -2069 -2356 -2944 -3751 -4531 -4812 -5064
1052 -5064 -3723 -1929 -586 -308 -390 -253 -497 -788 -195 1919 3660 3932 4069 4467 3858 2240 1650 2660
1070 2660 3651 4239 4208 3589 2515 1286 -484 -1458 -1363 -212 -92 -470 -988 -2045 -3352 -4994 -4991 -4032 -2564
1089 -2564 -2575 -1468 -1448 -1977 -3252 -3633 -2434 -1012 373 1370 2423 2344 1676 659 266 1415 2317 3087
1107 3087 3878 4263 3805 2525 586 138 750 1445 1725 1832 1855 449 -1507 -2718 -2591 -2312 -2150 -1499
1125 -1499 -163 -740 -1980 -3027 -3280 -3331 -2680 -1356 216 566 524 -220 -1641 -1243 -683 563 1021 2692
1143 2692 3440 2883 1569 387 285 542 456 1844 2850 3001 1542 236 -150 -1012 -1016 -341 853 1358
1161 1358 844 -387 -1448 -2398 -2287 -2317 -1449 -28 959 334 -660 -1546 -1795 -2160 -2056 -513 1208 1625
1179 1625 659 -48 -584 -1340 -1887 -463 1113 2307 2414 1538 680 -58 -933 -1101 -576 1778 2634 2210
1197 2210 1124 105 -200 -1100 -1086 385 1824 1932 1296 449 -171 -1831 -2405 -2156 -640 386 847 280
1215 280 -341 -1270 -2477 -2800 -1994 -732 634 729 -69 -222 -1277 -2358 -2374 -747 1036 1526 2079 1890
1233 1890 1655 257 -950 -463 1360 2091 2448 2893 2522 802 -271 -895 -274 592 1411 1784 1622 907
1251 907 -465 -2613 -3080 -2286 -1399 -499 -447 105 -661 -2383 -3387 -2800 -1591 -799 137 1236 1723 -142
1269 -142 -824 -1455 -846 369 1506 2650 3463 3217 2072 849 -22 802 1305 2020 2376 3425 1819 -165
1287 -165 -1263 -1672 -1103 -1251 -226 1000 850 -998 -2603 -3252 -3584 -3277 -2384 -1201 -285 -248 -871 -2012
1305 -2012 -2462 -1554 -874 462 1682 2865 2666 1638 219 132 35 980 2271 3540 3946 2989 1487 945
1323 945 220 -457 22 1047 2042 1186 -82 -1444 -2406 -2867 -2823 -2159 -845 78 -37 -1105 -2184 -2990
1341 -2990 -2981 -2773 -1498 744 1410 762 215 -201 -815 -1011 -51 1740 3131 3357 2759 1651 702 -68 17
1360 17 303 1788 2600 2233 1541 422 -894 -2035 -1831 -1209 235 482 -296 -1069 -1644 -2677 -3269 -2871
1378 -2871 -1238 2 415 403 -22 -605 -1802 -2032 -832 177 1458 2149 1765 1466 95 -264 -617 101
1396 101 1506 2253 2109 2076 1163 -468 -1483 -1437 -49 548 856 1081 928 -612 -1901 -2424 -1782 -789 -244
1415 -244 600 1304 587 -719 -1874 -2136 -1448 -219 634 1387 1476 1025 -444 -1166 -1192 -86 594 648 1597
1434 1597 1493 510 -1069 -1568 -1382 -498 -110 872 1601 1191 106 -1109 -1846 -1198 -518 620 1056 1792
1452 1792 1421 33 -1210 -1173 -316 136 871 2146 2313 1071 -346 -1142 -1137 -1122 -532 732 1354 1090 -380
1471 -380 -1208 -2104 -1885 -1634 -978 206 1177 547 -444 -1434 -1919 -1321 -1081 104 1272 1968 1420 289 -254
1490 -254 -566 -732 194 1869 2376 2575 1452 853 -115 -672 -419 17 1280 1894 1442 415 -895 -2046
1508 -2046 -2664 -2170 -1528 -96 515 -236 -1210 -1826 -2286 -2848 -2293 -542 609 891 450 207 -492 -1401 -1330
1527 -1330 51 1505 2618 2779 2089 1539 722 81 -37 988 1849 2744 2065 1211 657 -839 -1853 -1389
1545 -1389 -470 565 524 345 -129 -1559 -2796 -3332 -2334 -1250 -166 344 -14 -452 -1363 -2105 -2200 -638
1563 -638 428 1721 1694 1261 1280 114 -619 -367 955 1810 2250 2305 2334 1312 -16 -1061 -556 208 668
1582 668 985 1406 633 -972 -1742 -2134 -1748 -980 -348 155 383 -455 -1405 -2450 -2294 -1427 -505 813 1256
1601 1256 1387 482 -963 -1503 -717 247 490 1755 2250 1990 936 -427 -744 -525 67 910 1917 2194
1619 2194 1396 -406 -1357 -1730 -934 -310 341 1324 1294 302 -963 -1655 -1406 -1056 -362 584 1651 1000 -110
1638 -110 -942 -1423 -1151 -842 -72 993 1570 1110 195 -888 -1071 -1035 -689 395 1030 1440 841 -496 -732
1657 -732 -1092 -795 -1175 593 1634 1292 336 -304 -529 -986 -1123 103 1449 1779 1547 940 -268 -827
1675 -827 -931 -559 -179 1033 1572 1150 69 -817 -1555 -1462 -1306 -137 920 874 -132 -449 -1437 -2177 -1879
1694 -1879 -1168 150 956 914 655 -122 -879 -1096 -993 233 1347 2090 1843 1604 821 -105 -522 -272 1213
1713 1213 2167 1732 1500 802 262 -991 -1484 -1011 29 419 159 226 -326 -1423 -2387 -2361 -1650 -558 -98
1732 -98 147 -212 -458 -1300 -2041 -1468 -343 930 1445 1370 1375 1042 53 -324 68 1100 1651 1894 2329 1889
1752 1889 495 -173 -456 -25 604 574 1102 855 37 -1015 -2040 -2136 -1324 -890 -295 -320 -405 -1006 -2068 -2297
1772 -2297 -2099 -962 -205 140 1236 1162 -36 -215 -631 405 555 1223 2115 2282 1921 1193 24 59 468
1791 468 523 1138 1832 1866 650 -425 -1142 -1148 -896 -729 -258 488 179 -882 -2093 -2048 -1929 -1668 -903 180
1811 180 570 133 -384 -1042 -817 -457 -427 587 1771 2416 1664 475 138 -3 252 517 1087 1777 1931
1830 1931 970 303 -325 -928 -595 75 646 1036 186 -563 -848 -1773 -1923 -1577 -542 187 610 -94 -559
1849 -559 -1024 -997 -1281 -877 644 890 1164 324 183 18 -449 -568 110 1203 1459 1292 986 70 -339 -841
1869 -841 -558 86 712 1099 671 261 -537 -941 -1245 -1015 101 744 714 72 5 -594 -912 -1473 -592 461
1889 461 903 735 672 257 -707 -797 -943 143 790 783 1053 774 178 -436 -865 -1014 -25 608 224 706 179
1910 179 -122 -1064 -1230 -929 -91 508 379 774 682 -385 -938 -939 -57 512 990 1478 839 516 -109 -673 -855
1931 -855 65 413 499 527 536 -202 -844 -1487 -1072 -322 -172 -231 632 305 -716 -915 -1124 -661 -252 28 709
1952 709 803 399 -389 -579 -328 -4 623 1156 1540 1516 1029 149 -265 8 442 749 810 987 831 90 -638
1973 -638 -1023 -752 -819 -354 237 343 -430 -1199 -1542 -1395 -939 -951 -476 518 524 73 -259 -634 -588 -166 372 730
1995 730 1502 1431 979 540 291 663 564 809 1500 1653 1322 451 53 -575 -469 -507 195 190 171 -369 -896 -1423
2017 -1423 -1442 -1525 -1274 -734 -177 -362 -590 -672 -1081 -834 -1104 -316 757 1153 1213 941 552 48 68 196 999
2038 999 1613 1498 1088 1087 701 329 -202 123 485 1004 324 210 -123 -805 -1265 -1507 -1425 -387 -300 -300 -830 -830
2060 -830 -1417 -1686 -1240 -671 20 256 430 158 442 -371 -265 -53 874 1270 1274 1326 938 598 408 -6 490
2081 490 780 719 671 897 310 -546 -761 -821 -563 -168 -87 -28 -15 -502 -1115 -1410 -633 -482 -66 -104 172 210 -308
2104 -308 -647 -822 -107 180 700 1000 976 704 314 -189 -75 452 647 792 797 1006 365 -169 -623 -521 -532
2125 -532 205 213 463 331 -211 -980 -650 -606 -410 -285 94 163 788 23 -662 -468 -154 -277 -296 653 920 397
2147 397 -43 -212 -260 156 -355 250 744 483 293 -394 -626 -407 -350 -263 61 196 346 -248 -629 -341 -711
2168 -711 -305 -150 568 852 350 64 -35 85 -171 -23 528 862 752 418 219 -54 -228 -188 -398 231 321
2189 321 152 -108 -607 -576 -766 -1036 -425 92 83 -268 -411 -595 -714 -728 -528 -110 394 316 98 323 161 116
2211 116 298 103 870 1091 1118 874 130 187 -180 45 147 553 613 298 -101 21 -504 -626 -600 -499 -187
2232 -187 -179 -143 -566 -693 -1094 -1206 -887 -252 72 -245 111 -17 99 -250 -89 53 512 879 671 680 737 623
2254 623 255 411 448 463 841 434 349 179 -269 -473 -180 -155 -231 -350 -239 -50 -586 -1200 -1150 -1115 -649 -503
2276 -503 -500 17 -253 -442 -956 -392 52 426 357 531 459 1047 243 394 354 838 655 545 1051 801 395 -121
2298 -121 32 227 16 51 194 88 -179 -429 -998 -479 -548 -716 -578 -416 -441 -259 -397 -783 -400 -547 -197
2319 -197 -311 285 208 31 81 213 166 410 446 626 457 474 449 151 338 50 14 -129 492 281 -9 -427
2341 -427 -391 -11 -441 -556 -2 43 -219 -439 -364 -276 23 -237 -4 308 368 453 -106 -12 179 216 33 328 489
2364 489 605 261 117 -38 -38 -27 -100 213 348 -144 -236 -575 -278 -331 -287 -396 -98 183 -298 -207 -158 -203 -291 -234
2388 -234 -101 100 497 502 -8 182 469 404 237 165 617 422 43 157 269 212 98 -257 45 -424 -49 -102
2410 -102 -143 -414 -443 -396 -499 -590 -385 -422 -548 -60 -225 -383 -532 542 124 163 129 499 248 160 293 502
2432 502 500 586 638 683 341 373 -116 493 167 -59 20 19 -342 -345 -574 -751 -733 -394 -585 -535 -605 -468 -525 -405 -523
2457 -523 -652 -70 -90 131 587 134 392 258 372 685 776 486 771 879 502 241 291 611 469 13 492
2478 492 352 216 -208 -482 -304 -320 -42 -471 -265 -685 -469 -528 -842 -439 -349 -533 -365 -268 -78 -187 -39
2499 -39 -265 200 89 383 622 380 646 381 412 439 645 571 560 439 489 223 107 -247 249 199 -8 -641
2521 -641 -271 -42 -532 -682 -192 -367 -543 -148 -593 -293 -373 -518 -134 -197 214 157 270 52 589 184 212
2542 212 177 317 354 371 449 290 426 67 241 194 460 -56 -153 -222 -109 -98 -323 -236 -239 -279 -187 -434 -19 11 -47
2567 -47 -489 -303 153 74 -132 79 52 260 44 32 266 361 127 45 -179 306 80 113 -30 59 21 -222 -262
2590 -262 175 21 -108 -435 -73 -400 -269 -207 -173 63 -186 5 -137 302 -155 45 298 182 374 338 256
2611 256 160 225 -162 448 325 42 212 -16 -152 286 -235 -315 -273 -68 -124 -459 -324 -218 -131 -245 -466 -200
2633 -200 -42 -323 -343 -263 115 65 47 269 116 524 213 551 393 527 328 250 46 201 472 -84 62 -149
2655 -149 -11 -347 -284 -187 224 -373 -235 -378 -549 -565 -503 -422 -420 -554 -231 -600 -51 -186 62 -25 -195 201 341
2678 341 329 401 522 354 357 261 630 468 619 313 701 207 112 -76 190 97 2 -13 -270 -242 -587 -543 -633 -541
2702 -541 -667 -423 -384 -585 -471 -278 -695 -465 -173 85 37 223 234 361 460 442 757 831 631 738 825 707
2724 707 457 394 148 207 522 176 31 141 -316 -78 -204 -268 -626 -507 -741 -510 -398 -771 -770 -841 -323 -669
2746 -669 -589 -41 112 -118 -214 -43 385 348 304 138 666 717 386 665 468 470 383 182 485 451 301 4 101
2769 101 86 72 -245 -581 -468 -212 -750 -683 -531 -403 -409 -389 -446 -9 -250 -315 -533 -493 -76 -119 52 228 44
2792 44 545 129 180 189 147 443 282 413 352 27 1 253 60 150 -69 -138 64 70 -401 -227 -311 -466 -595 -419
2816 -419 -14 -183 -398 -293 -323 -466 -81 97 -66 -108 88 201 -132 -165 13 1 274 100 501 514 258 -108
2838 -108 380 425 189 344 -209 153 97 99 -324 -150 237 -193 -33 23 85 -740 -457 -50 -50 -446 -245 -606 209
2861 209 197 2 8 122 -174 -89 -40 210 208 17 213 219 -21 -137 -305 -104 23 -26 284 -419 -23 -545 -209
2884 -209 -225 -324 14 25 44 17 141 -186 -105 -74 337 76 247 107 -48 -78 -75 92 80 53 264 -2 204 79
2908 79 -443 -345 -499 -388 92 -289 -303 79 -203 -260 -382 -212 -215 181 139 60 -49 46 -111 40 122 465 642
2931 642 278 423 196 309 -70 -43 376 375 -60 119 278 375 68 -422 -404 -198 -115 -248 -326 -477 -596 -632 -575
2954 -575 -221 -104 -271 -510 -26 -149 -237 -174 -100 25 180 107 393 595 281 417 -9 311 726 233 196 265
2976 265 493 333 268 222 301 31 -164 290 -9 117 -647 -762 -518 -615 -579 -479 -403 -381 -410 -260 -525 -85 -191
2999 -191 -95 51 261 411 -76 -324 292 380 222 352 709 479 504 362 341 567 436 155 434 193 77
3020 77 202 -180 -245 -205 -63 -725 -360 -482 -462 -538 -640 -356 -763 -623 -282 -86 -170 23 151 -107 33 10
3042 10 20 649 445 738 199 573 418 271 387 532 558 263 221 -33 72 51 -421 -435 -190 -309 238 -59
3064 -59 -215 -373 -588 -471 -712 -194 -21 -411 -75 -531 -115 -153 -350 -361 176 230 -1 145 268 477 225
3085 225 51 48 170 289 159 185 382 180 -57 -18 183 36 425 -159 -54 1 -205 -443 -211 84 -134 159
3107 159 -135 24 75 -242 125 -158 51 14 268 137 -107 271 -374 -82 48 -297 511 -36 12 1 45 -381
3129 -381 -54 -148 -178 221 -45 -229 36 -291 -176 -267 205 24 -75 335 -24 11 137 125 169 313 344 631 542
3152 542 232 26 -142 215 -50 156 189 336 307 21 -202 -189 -87 72 29 -333 -239 -151 -161 -492 -228 -275 -52
3175 -52 -101 31 -52 145 -73 -151 -219 314 116 -21 457 581 160 57 -63 144 118 118 317 306 212 -210 -166 28
3199 28 43 -349 -686 -221 -258 -226 -619 -354 -498 -453 -628 -227 -16 106 -230 -255 -106 238 123 122 363 649 433
3222 433 200 350 504 -5 -128 219 444 788 85 333 -17 -142 -68 -120 -106 -311 -262 -441 -279 -524 -244
3243 -244 -654 -572 -203 -123 -16 -160 -517 -83 -144 -315 123 118 332 399 242 385 342 58 302 476 456 265 459
3266 459 183 186 63 -35 97 -60 -3 157 -38 -380 -343 -85 -376 -39 -178 -199 -238 -296 -161 -195 -313 -204 -73
3289 -73 53 284 153 57 -194 47 125 436 519 766 339 83 239 407 508 -6 -45 256 184 -55 213 157
3311 157 207 -371 -231 -211 -194 -161 16 -26 -100 -545 -225 243 -73 69 86 -435 -23 -183 -68 -113 6 405 173
3334 173 120 337 282 98 225 219 445 236 -35 161 315 -154 -89 -71 -18 -238 125 -107 -210 -25 243 -70
3356 -70 -301 -341 -55 -43 130 -6 193 -28 -230 298 81 -182 118 458 106 333 -14 12 167 27 123 -51
3378 -51 -62 281 -249 -367 -239 -195 -152 -173 -57 192 -331 -115 -3 20 -214 -490 94 107 327 82 126 2 212
3401 212 141 553 266 329 -23 146 16 -161 -28 -43 314 9 75 -30 39 -257 -101 -74 -55 -145 -102 -22 -197
3424 -197 -600 -7 -208 -112 -220 158 95 -24 -213 428 345 264 89 137 427 262 204 577 231 150 628 95
3446 95 285 399 268 -26 -31 -156 -207 -721 17 -232 -157 -464 -42 -186 -344 -585 -538 -282 158 -350 -138 -140 35
3469 35 170 -129 -92 90 349 367 474 412 325 289 382 395 319 327 323 325 587 3 -38 -142 -393 -73 -353 -108 -250
3494 -250 33 -430 -380 -166 -80 -190 -269 -146 -208 -17 -333 -12 -312 59 186 30 311 375 49 395 471 500
3516 500 400 275 170 476 385 190 24 303 219 -160 -11 133 99 -327 -359 -179 -287 -194 -249 -235 -289 -318 -88
3539 -88 -469 -436 -57 4 -69 -121 -133 -169 96 -164 -93 -145 72 248 -222 261 132 62 -258 98 173 198 -67 203
3563 203 51 -98 -102 345 212 296 -238 -7 75 114 -445 -183 -15 -189 -300 122 361 227 291 -107 -115 173 177
3586 177 -244 -129 39 128 -8 46 -74 254 -169 -30 216 -139 42 78 -195 76 18 175 -279 244 -101
3607 -101 -74 -164 -213 102 -177 -203 154 225 358 -174 -31 34 -105 -421 115 53 181 0 -192 -15 -179 -236 -253
3630 -253 -136 91 -149 -188 -152 -15 -170 -301 -15 -275 8 -41 -117 117 79 -44 -35 -13 21 272 477 412 177
3653 177 126 54 87 376 260 244 200 144 313 -42 -180 -29 25 64 248 -203 -149 -323 -545 -425 -493 -178 -233 -154
3677 -154 -210 -176 -443 -370 196 -102 394 149 391 185 224 203 -52 -9 134 284 25 234 236 132 362 124 104
3700 104 237 -122 -331 -124 119 -51 -266 -253 106 -419 -324 -242 -242 -383 -275 -153 -317 61 -338 -168 -58 -44
3722 -44 107 32 -168 41 300 333 366 302 330 79 -92 632 407 228 307 141 -41 195 -254 -184 -197 -3 -183
3745 -183 -270 30 -169 -534 -737 -180 -529 -177 -288 -478 -215 -272 77 -119 -300 85 -303 331 327 433 385 217
3767 217 226 296 -1 73 261 303 425 294 152 73 239 -148 106 285 -192 -177 -161 -218 -97 -110 10 -363 -350 -171
3791 -171 -459 -163 -138 18 -68 13 -3 64 175 -39 48 240 252 93 -122 208 28 69 1 -154 -50 -123 365
3814 365 -122 102 201 123 -41 -65 -264 -81 -156 -2 -181 -173 -63 -62 -246 -170 -207 4 -58 -156 97 -391 154 3
3838 3 165 -148 105 232 345 -110 194 -279 24 9 3 -32 45 -104 -322 74 -56 -70 -128 -13 249 146 -23
3861 -23 242 60 -95 -129 -77 -161 264 130 96 39 15 197 101 -81 -239 70 233 306 265 -6 -63 -283 -54 34
3885 34 -71 24 -136 93 -228 -559 -181 -33 -162 67 -238 104 -221 -40 -138 -169 -115 176 100 -4 -47 300
3907 300 154 169 637 212 238 83 68 148 191 -138 81 -4 148 -240 -105 44 135 -337 -436 -173 32 -180 -178
3930 -178 228 -285 -188 -369 -215 -177 18 376 224 -28 -73 36 285 16 126 83 66 253 129 235 153 3
3952 3 -13 -10 -144 271 -177 -192 -87 -124 -190 -82 -199 -209 -340 -119 -263 -315 -202 224 -13 -360 226 188 138 12
3976 12 352 312 154 288 197 566 316 233 331 317 113 -158 394 351 309 49 -7 173 -90 -122 -438 51 -268
3999 -268 117 48 -199 -129 -99 -400 -161 -344 -229 -10 -220 -72 -34 37 28 172 126 95 -38 271 -79 288 15
4022 15 22 201 211 391 312 -48 -156 -198 -186 217 -50 -117 -70 -214 -388 -178 -227 -101 -127 56 -154 -44 9 -26
4046 -26 -186 -170 -178 -158 92 328 123 -23 366 23 124 101 500 80 287 90 -20 -94 -139 -52 -81 -283 -84
4069 -84 78 -58 -8 139 -142 -162 -416 -107 389 -142 144 121 -62 -125 -106 144 295 -153 -72 10 153 13 -34
4092 -34 -52 -260 111 34 40 174 -209 -245 -180 -230 161 94 -122 -179 -37 114 -394 -64 73 -19 120 48 -158 227
4116 227 -308 -107 -245 55 79 245 125 160 2 -90 209 72 226 150 122 179 181 101 182 -166 -195 -26 84 -30
4140 -30 12 -109 -85 173 -503 -104 -152 -91 145 120 -138 -149 141 130 -85 232 218 -33 390 -61 176 124 160 83
4164 83 249 210 -116 134 26 115 -255 199 -140 -197 -356 -235 -50 -277 -421 -64 -98 -137 -39 -125 -116 136 15
4187 15 -169 6 35 34 -4 265 169 118 -11 455 -120 373 441 429 403 224 -87 -21 170 -145 -21 -191 -201 80
4211 80 -85 -42 26 -188 -144 -41 -30 -255 -348 124 46 31 -88 -153 -41 223 -157 100 80 71 300 68 162 126 150
4236 150 -71 -34 15 -72 144 -195 164 37 -208 37 -174 -68 -133 -120 -58 0 141 -107 -389 15 117 -188
4258 -188 -48 0 -221 -210 -150 17 169 -82 95 168 146 83 165 -99 74 200 118 -26 -235 173 55 3 -105
4281 -105 173 -75 189 24 -310 28 86 41 -227 86 -399 -319 -381 -120 -294 -170 -48 -468 4 121 -48
4302 -48 -116 114 -87 125 -150 -95 -123 39 26 81 -145 -238 90 300 -116 -173 -230 94 77 -116 -188 -378 -81 82
4326 82 -8 116 65 -169 106 89 135 127 -176 -184 -35 22 -38 104 130 158 84 -55 -190 -104 153 22 75 -69 171
4351 171 7 260 27 -75 110 -114 -87 -22 -63 -80 -247 -246 142 -410 46 159 -211 59 232 163 -76 389
4373 389 62 121 84 127 265 -238 -101 -8 282 -36 -115 230 131 31 55 -258 77 -235 -309 -102 -153 -314 -237
4396 -237 -46 -36 243 -188 -47 -87 -53 3 -22 -43 -75 396 9 -36 145 235 72 183 14 -79 -91 160 49 231
4420 231 -79 142 258 -89 30 -49 -223 -543 -47 46 -133 -35 9 64 -414 -26 194 -28 -81 -193 150 5
4442 5 -269 -96 340 294 -82 215 218 19 228 113 28 72 150 149 247 -30 176 -235 -99 108 56 -209 -310 62
4466 62 -240 -115 -386 -194 -151 -46 63 -404 -144 186 -234 -150 -87 346 86 123 188 -123 -113 160 535 215
4488 215 -53 37 136 263 108 -95 -116 -24 126 -152 -58 69 13 -394 -230 -349 -181 13 104 -309 207 -85
4510 -85 -195 -304 -2 -171 -74 -60 -193 322 30 49 -1 -8 291 -21 -196 232 228 45 5 129 358 -65 152
4533 152 -73 10 122 61 172 -236 -223 -353 -459 -214 95 -2 -375 -160 -212 -140 -168 -133 222 -32 417 -23 95
4556 95 182 182 136 -124 137 -354 -4 41 91 12 -234 -21 -13 105 -322 363 78 -170 -209 -42 -38 -162 -61 183
4580 183 -74 -103 -97 -171 14 -252 -93 -299 240 -90 186 -93 -185 336 -23 227 -106 -213 62 190 -198 -80
4602 -80 90 261 123 329 -74 121 268 -323 -24 -140 -102 83 17 47 137 -137 -116 -147 -7 72 -246 -112 146
4625 146 -3 152 -269 -129 2 138 105 -74 291 180 34 -161 23 -193 -31 -87 -374 116 -55 -385 -92
4646 -92 31 -44 -139 -160 48 147 -292 -195 -389 95 -274 41 151 30 212 146 -55 435 300 149 -110 -60 188
4669 188 272 -264 -11 -120 129 -89 -294 -179 242 -278 -356 -38 -110 43 30 63 -81 -314 -242 -269 -106 139
4691 139 -170 180 71 -108 128 97 118 27 42 202 88 95 -175 -8 66 115 132 97 72 -105 113 93 -4 -164
4715 -164 -185 -181 -343 84 -188 -187 -206 -51 11 -153 -169 11 -182 -43 -76 39 -186 179 199 -106 191 270 -190 -276
4739 -276 238 164 -38 183 38 34 59 -18 -52 213 -2 -192 96 -74 -83 53 131 -250 -484 -159 -105 -157 -283 -173
4763 -173 -237 -126 -118 -179 96 -24 -13 43 43 198 368 -108 232 345 -107 38 142 -143 22 -69 51 65 -65
4786 -65 -245 42 386 201 -31 13 -31 282 -305 -325 -88 -56 -208 -340 -1 -261 -395 81 159 -74 29 -139
4808 -139 394 -99 -86 203 172 38 59 20 18 254 -170 -161 -131 -32 -33 10 -362 -40 62 -232 245 61 -76 -211
4832 -211 40 -52 -147 56 -76 64 149 -170 80 -24 315 245 -1 175 83 134 77 -46 277 57 67 49 -78
4855 -78 -3 72 128 -229 70 -41 -186 87 -236 -33 -106 -196 -35 -23 129 -254 -36 278 359 23 175 153 98
4878 98 -119 123 104 -41 228 -213 38 -26 55 92 -222 131 -409 169 -58 -78 58 108 -220 -143 -189 -347 -230
4901 -230 -181 -116 -208 43 -69 -210 5 -244 -99 6 226 330 112 -27 218 258 -121 194 55 -269 82
4922 82 -155 342 170 -130 82 134 46 -152 -186 199 -117 -13 21 -38 -82 -346 -52 -97 -129 -306 -215 -118 126 -40
4946 -40 174 254 -210 -339 -78 35 53 56 -128 -68 192 48 -47 283 66 190 143 198 -101 -81 -314 -98 -378
4969 -378 2 -351 -149 29 -392 -145 -38 109 -370 59 -25 258 -95 -199 -322 156 -50 332 49 190
4989 190 125 -90 -205 238 -57 236 -1 -4 31 -180 -98 166 -118 251 54 191 -133 -61 14 11 -28 17 -297 -124
5013 -124 -61 -10 227 -22 -8 153 96 -316 -244 -217 166 226 -33 -228 12 454 102 -21 336 93 -161 44
5035 44 -251 176 -280 116 -211 -296 107 -100 -133 38 -183 -317 68 78 4 -103 -223 -253 179 -148 -37 -117
5057 -117 -269 -173 309 -254 -100 73 29 10 -249 189 -70 -127 44 110 14 284 125 50 -53 -16 93 73 -12
5080 -12 -56 -159 29 28 -36 301 -29 74 134 -195 194 114 28 -192 77 102 238 169 182 -25 340 253 -101 58
5104 58 73 105 -94 -163 -153 -11 -50 -456 139 38 -123 3 -72 139 127 132 -83 -179 -201 -52 -5 191 -103 72
5128 72 -176 49 312 79 84 126 288 157 432 241 94 -45 -105 -331 86 -297 -81 -213 -10 -57 6 -77 183
5151 183 171 -200 -223 -151 26 -54 -128 -243 -103 -112 -5 262 37 99 4 1 13 123 147 -80 178 239 -58 -41 -101
5176 -101 49 75 -61 -81 52 -51 -268 117 104 -139 13 237 -171 -205 168 -132 -78 -59 218 -472 -426 125
5198 125 -189 -32 83 77 145 65 200 203 -126 170 206 221 64 204 -86 -15 193 24 133 281 83 -49 -113
5221 -113 -22 -66 128 28 10 -130 -19 -99 97 -139 -203 23 286 -376 -104 200 11 132 158 18 86 -197
5243 -197 348 -131 19 238 84 -35 82 253 27 -72 -45 274 89 -98 52 123 -204 -118 -243 178 -135
5264 -135 -379 43 2 69 -30 -68 -132 25 77 -35 171 165 94 -113 212 298 257 76 -44 36 -106 -133 -138 345 110
5289 110 -147 228 163 -29 209 -4 -45 -311 47 104 -5 310 108 11 -38 -29 -143 -239 -11 -28 -13 -304 -165
5312 -165 262 103 309 -178 27 269 -338 -37 -58 245 295 -62 10 34 -124 54 -157 -96 -64 61 -267 -322
5334 -322 -157 57 -132 78 -17 -92 95 -139 -79 174 129 231 -5 206 355 133 -280 33 100 2 115 197
5356 197 93 270 -82 -258 138 87 295 -174 -130 -539 122 33 45 91 79 -46 -253 111 63 127 234 67 -318
5379 -318 76 -17 131 40 185 240 262 149 92 -116 -275 -68 230 2 -35 120 96 -245 91 -102 -87 -17 14
5402 14 -122 -231 -92 -130 -61 61 257 49 121 -184 -105 -289 -166 -41 -10 -182 -106 -86 -367 140 256 34 171
5425 171 224 -23 280 82 98 496 17 -92 162 362 30 -3 -82 -10 -61 -168 -273 61 153 245 -13 -202 -147
5448 -147 -53 -173 -155 -169 51 186 -2 219 -7 -24 470 104 -218 -217 391 127 29 49 107 -102 -181 -66 9 108
5472 108 226 -102 -106 -261 -42 215 82 71 -216 -88 -47 16 -48 -95 201 138 -352 -135 139 160 44 159 292
5495 292 -59 104 156 187 34 -340 -113 27 201 37 353 209 232 -32 -358 -83 -96 -191 -96 62 13 -51 -41
5518 -41 -71 -18 -56 70 -317 169 144 144 -209 17 126 -198 -131 -201 -22 32 -22 -129 -173 131 144 -24 104 87 -135
5543 -135 -100 58 135 43 -46 -238 -157 -46 157 -308 -35 -180 119 -128 -292 -45 223 -157 227 59 215 -20
5565 -20 -302 304 386 64 23 -304 166 -94 -16 220 -339 -196 219 20 -6 -257 216 -361 187 -75 64 -203
5587 -203 -98 156 -246 -257 -79 -3 -149 -35 -231 -162 -203 27 338 -39 -568 46 146 92 304 66 -181 136
5609 136 87 -293 -93 162 161 293 35 311 -114 -244 16 -100 123 -206 51 -156 -428 -313 136 -102 88
5630 88 -50 55 -111 25 153 -324 84 234 68 49 -97 26 68 13 28 -84 381 275 187 141 -85 -102 194
5653 194 -90 -222 49 168 -59 -162 131 43 -60 29 -195 -24 -2 26 195 -7 87 -138 377 -127 144 -96
5675 -96 -253 269 170 44 66 34 337 -72 132 16 260 234 -82 -171 -41 246 -123 256 -137 -48 15 58 -117
5698 -117 -68 37 87 137 -187 215 -77 -378 174 -115 -119 213 -260 82 75 161 130 83 112 -11 212 172 97 114 -63
5723 -63 128 -12 274 -26 -38 176 -23 230 -130 125 -37 -33 -110 -252 -113 -75 -201 -137 51 72 -39 78 -89
5746 -89 16 239 171 -147 -23 111 119 3 -42 148 271 48 -198 -5 -71 -174 -3 76 298 13 -296 42
5768 42 -5 150 -173 -322 -101 -201 -112 134 -79 201 -240 -107 -23 -79 187 144 -24 414 -50 93 132 -181
5790 -181 -170 105 77 -61 -158 91 31 179 -178 -172 -49 -39 114 -7 3 -10 -128 58 -90 -12 -30 -93 170 -63
5814 -63 -166 -152 16 -141 -161 85 -312 -166 15 26 56 -65 -160 72 126 111 -117 86 -129 -62 -103 -290 2
5837 2 -365 -148 217 -188 78 119 -120 48 102 -13 -298 65 79 204 211 31 -210 -171 132 -78 -14 294 236
5860 236 -77 31 145 112 38 -156 -335 -167 198 -40 152 -121 1 81 264 -99 34 -194 -207 -7 -204
5881 -204 177 -299 -247 164 -45 194 -93 88 -4 165 225 231 108 -213 -21 -186 31 -230 -214 98 78 -173
5903 -173 -362 67 -124 -207 99 -261 -40 -141 -4 -87 -35 -74 -104 131 -73 223 -106 -175 -49 -39 122 90 256
5926 256 -181 289 -63 229 177 26 -79 17 162 48 267 77 -133 -219 -2 -238 -24 -41 -48 -122 -338 120
5948 120 -112 -5 -50 120 -37 123 5 59 -55 204 286 338 16 -372 52 -142 -142 -36 -99 -50 -162 -36 85
5971 85 9 -133 299 -247 -263 44 -117 -68 -20 -170 92 58 72 26 -165 -1 -1 184 -118 -188 56 163 -47 -108
5995 -108 74 -181 118 204 -151 -91 85 201 -15 71 100 -33 -3 162 47 258 65 -268 -174 -97 224 -115
6017 -115 -11 -221 -137 -215 -280 103 123 -187 144 144 196 86 -134 128 220 -103 -1 360 -330 130 166 116 -169
6040 -169 -20 111 171 5 17 -78 -112 -181 -3 -103 -275 -35 179 -54 -149 -122 12 -14 -92 -206 100 -262 -191
6063 -191 -249 -307 -7 -81 135 -162 -6 118 16 74 -241 -27 -242 259 20 27 98 -228 145 97 57 -92 72
6086 72 -150 176 48 -242 -336 -95 -127 -65 -108 136 83 55 284 -7 -14 178 -37 15 -274 -259 298 -50 46 -22
6110 -22 25 -211 -54 147 69 71 88 277 -81 245 73 -211 -22 -223 -293 -130 27 319 170 -361 -225 208
6132 208 -151 -57 -170 -1 423 142 -68 61 -65 -25 69 264 19 79 -130 321 -243 272 300 -243 24 21
6154 21 -201 56 -76 -67 129 -4 196 135 22 134 -209 8 -57 -237 -182 -170 93 78 275 261 13 -12 -219
6177 -219 -38 346 158 120 -48 130 -69 -22 61 -102 -11 -177 -114 153 100 -111 -52 -58 258 74 59 -152 16
6200 16 -243 307 104 -70 121 -25 -119 147 -60 135 58 52 193 -13 35 85 125 -143 85 83 35 -211 -80 112
6224 112 -50 -198 2 108 -38 318 -169 -8 85 -163 25 -175 30 -236 -156 60 -332 -152 -21 -183 162
6245 162 -169 49 -253 148 108 -177 226 346 106 -50 112 209 211 61 108 96 45 -221 49 -95 25 -144
6267 -144 238 29 -54 -84 -244 64 95 87 -13 -81 -370 -64 50 67 129 -436 71 -50 167 119 191 209 230 117
6291 117 -14 9 -9 -101 5 247 -242 -218 56 -340 -25 -130 19 101 114 -98 1 -39 74 153 34 143 77
6314 77 -124 130 65 -253 -78 302 -158 187 463 -30 129 66 -191 -414 -86 46 97 -120 235 72 -85
6335 -85 105 -247 11 58 47 -320 -6 42 -284 32 109 305 30 14 -40 57 130 144 -42 147 113 -148 -23 -366
6359 -366 -463 37 21 -90 -147 -79 -42 198 273 53 155 228 59 57 -33 -301 84 127 -51 -70 -102 0 208 29
6383 29 -135 114 102 -105 -49 -105 147 -20 327 -103 -118 332 250 127 -31 -232 -63 131 -134 60 127 -26
6405 -26 -78 -156 -114 134 -24 117 2 -61 -235 -105 -364 10 -457 120 -3 -124 -147 44 -265 -19 14 226
6427 226 45 -166 -45 -42 147 9 294 73 62 129 77 -64 -168 -49 -126 131 -19 -293 -105 89 40 -242
6449 -242 -33 -185 127 45 192 85 -544 148 -96 -221 81 -32 35 57 166 -7 12 -17 46 -34 191 57
6471 57 -30 129 31 -158 189 -97 -315 82 -114 -219 -271 -11 -210 -44 -120 -64 -75 -74 34 -124 113 367 -137
6494 -137 -194 -29 287 -42 -67 -3 80 -55 -259 -284 208 101 87 293 28 68 105 -157 -28 -77 71 0 38 -22
6518 -22 -50 3 -150 15 -101 -211 -80 140 -103 -44 -419 -264 -358 29 39 98 316 -258 46 88 1 135 -11
6541 -11 -140 257 -76 -167 10 78 -14 -82 42 251 321 60 -231 -101 144 202 94 104 -229 -17 -104 149 -167
6564 -167 -31 -91 -87 -72 -45 -16 -198 59 -114 98 -1 123 91 146 199 -152 278 -45 63 209 68 11 19 188
6588 188 84 -128 -11 -287 -4 4 -137 -142 19 -48 -180 77 -24 -9 82 -242 -55 -108 111 -227 38 -34 196
6611 196 -88 -226 271 -34 94 167 -8 -250 80 -250 130 -92 160 73 170 129 -2 138 -127 5 -130
6632 -130 -35 -239 -135 54 4 -154 11 -5 -168 45 -43 -374 -17 -82 17 407 -90 17 262 -245 -65 9
6654 9 -118 23 106 37 -137 -121 207 303 -163 -177 -425 -151 88 185 -354 -167 361 -358 68 -89 173 -83 15
6677 15 -301 131 -99 -43 -111 -65 -37 340 114 268 101 95 361 154 -35 -129 161 16 -10 278 62 64 107 -187
6701 -187 -250 184 -151 -230 66 218 -281 53 218 -24 123 65 -195 -122 -221 -5 53 -4 -95 1 -114 -128 -97 185
6725 185 -8 148 -22 -223 -226 165 55 115 -37 -74 -54 85 -239 23 89 -1 55 -42 -67 103 -288 -386 145 39
6749 39 35 -100 45 -277 162 74 -118 122 -11 -137 6 -3 -90 -168 -187 140 -89 -106 234 22 13 97 44 -55 310
6774 310 -29 28 -69 -120 -380 -72 226 103 -120 35 -201 -187 -231 371 159 -116 -141 221 -19 -314 122 -72
6796 -72 136 -22 15 63 -99 -36 -289 -51 119 -164 85 -84 -140 24 74 -55 133 -46 -122 21 164 -63
6818 -63 -7 -437 16 66 120 -68 71 -420 -315 -133 3 125 312 -63 -328 -105 58 -81 -97 128 -75 197
6840 197 39 -169 -35 109 295 140 41 -49 57 167 -97 -169 -47 -286 -346 -59 116 -213 46 -216 86
6861 86 27 -128 206 -103 298 -227 -159 -28 59 194 -139 -54 -7 203 100 130 104 -241 7 -49 170 -135 -134 54
6885 54 -192 -46 -218 -152 -171 -66 -12 -167 117 -239 -116 -123 124 264 234 78 108 -122 107 -42 -181 67 28
6908 28 -243 -284 57 183 103 -80 -26 45 -74 75 -38 225 21 307 -183 20 -141 -47 -351 -94 -5 -125
6930 -125 -159 -161 -93 -66 297 -232 79 118 207 -44 191 -6 -187 239 -39 -283 153 130 118 10 -106 261 28
6953 28 -224 121 134 -58 3 -294 -3 -141 40 -205 220 -145 -143 -58 -99 289 -157 -186 -102 29 83 -35 -356
6976 -356 104 150 -73 -211 83 -104 129 -62 -236 -401 -445 4 14 49 46 -151 -7 -96 138 23 100 47 126
6999 126 44 273 40 -158 96 -38 28 161 66 -109 126 4 133 151 49 -5 192 -43 312 -257 -240 -269
7021 -269 -78 -152 -84 181 -9 100 -93 -122 163 -154 -39 154 -122 13 -64 144 294 -324 14 12 80 236
7043 236 -106 394 200 -75 119 -111 -145 -80 40 139 353 22 -57 269 -209 -82 5 195 208 210 -420 117 11
7066 11 -4 -73 83 170 184 -162 22 -162 -134 66 -45 -25 108 -69 228 -172 -291 -20 86 124 -120 72 -32
7089 -32 147 -180 -19 -12 -98 -238 169 126 -8 -24 90 154 87 234 68 -184 -85 173 29 -5 -7 -166 -8 1 -227
7114 -227 129 -87 -153 211 137 88 -180 36 72 69 -16 -110 565 265 206 -147 -34 -334 280 -23 104 -5 44
7137 44 131 -85 -231 -82 -151 -170 37 -52 717 -6 201 145 -155 -39 203 92 -66 174 222 -183 214 266 44
7160 44 -22 -83 -85 -165 88 2 -72 -1 -23 214 -55 112 118 -153 -100 67 104 9 33 -60 52 -61 201 -185 12 -130
7186 -130 -318 101 -269 144 79 244 59 33 228 -34 16 108 69 129 286 102 86 -34 -41 81 -128 126 -148
7209 -148 -179 157 91 -158 -234 -33 230 -2 -178 365 -217 17 -278 -317 136 34 -297 -56 62 -392 306
7230 306 -99 170 2 -36 128 -46 47 265 -90 22 99 -46 24 -145 -103 -36 129 -107 234 -248 -72 136
7252 136 265 -74 -171 355 279 -179 336 -139 -175 244 128 27 150 23 -62 -183 -53 227 -67 -410 50
7273 50 56 208 -53 -153 96 -100 115 97 20 66 -351 182 95 82 60 -10 -29 42 -182 63 107 190 108 -201 -112
7298 -112 -560 222 193 -238 66 -75 -22 -59 460 77 -87 68 -110 -144 -114 -275 21 63 66 98 102 -210 114 -328
7322 -328 153 220 -378 -110 -35 -164 -148 -295 -89 69 -244 -73 19 86 -60 121 -35 30 469 190 73 59
7344 59 -56 18 163 328 128 26 141 277 23 8 -186 -154 29 -169 187 -191 190 102 -124 225 39 -35
7366 -35 75 -135 -21 106 -109 280 4 -141 191 131 -221 -108 74 -182 -1 106 26 42 -41 -12 -84 -5 66
7389 66 20 228 92 95 91 -325 -60 509 100 111 -73 -120 197 -72 -26 -349 393 -95 -26 146 -72 -147 -155 -14
7413 -14 -30 187 -108 21 -50 -105 -287 156 -262 26 512 -15 -150 359 37 297 -58 -30 -164 52 38 -107
7435 -107 -91 239 49 -123 -258 73 -341 -97 62 -165 24 -67 -69 -253 141 -84 208 -227 140 270 -83
7456 -83 138 -4 71 -76 -18 -60 -67 -169 38 -310 -274 -148 -204 -53 -66 -392 67 -45 249 45 45 239 -235 83
7480 83 394 -344 221 -134 218 186 104 81 -213 345 -131 22 24 171 -262 9 -394 -363 33 176 -2 5 63
7503 63 -56 151 -253 167 -64 165 133 -36 101 -116 -58 122 -175 157 -158 -75 21 -183 -74 -245 -264 -78
7525 -78 -158 77 -174 -3 34 -371 29 157 10 43 -206 -45 -7 -183 159 113 -41 -71 144 -46 259 74
7547 74 140 183 215 108 -70 -483 50 175 15 -46 -35 5 -127 -82 -105 -427 -109 -88 -3 123 -25 -55 182 -65
7571 -65 -34 -91 -72 -259 -113 -21 30 -80 -48 -211 -135 -107 -26 -56 153 113 54 -348 236 -73 104 -265 2 -32 118
7596 118 -133 28 303 -7 157 112 99 -40 271 79 -131 19 159 123 122 -63 -84 -48 -116 -50 -238 -259 28
7619 28 108 162 -236 354 105 -21 -38 264 -31 95 -39 194 -74 211 -295 18 155 43 -25 7 -170 198
7641 198 -23 147 -393 162 36 -117 65 124 -184 90 -153 67 165 -13 36 -113 79 -345 -329 -15 -308
7662 -308 -43 -40 113 8 115 158 -421 -42 -58 117 -303 161 -85 145 96 -185 13 215 -154 150 41 -113
7684 -113 -261 32 -229 -104 -33 21 -168 -227 43 32 121 62 99 -296 48 130 -98 30 232 169 167 -119 -76 -28
7708 -28 -126 -276 -244 -6 -240 -32 -89 -90 3 -11 85 -237 225 185 -166 15 3 141 132 -81 191 167 23 -39 -99
7733 -99 -320 -146 -57 159 -1 179 189 -12 331 -79 -3 -228 -373 -287 -250 -45 -118 -163 100 43 -33 104 -291
7756 -291 -249 383 -65 58 199 122 119 -63 -43 -139 -116 -36 -165 124 -2 -76 138 115 -209 -161 -21 50 -292 213
7780 213 -152 -97 54 105 -244 -31 -141 -261 -47 113 -24 -194 -42 168 -32 -131 189 -45 159 9 140
7801 140 -122 128 94 -42 -24 -81 239 98 120 72 142 262 210 188 -175 115 41 77 -176 178 18 -82 44
7824 44 11 72 235 -206 -145 -219 54 14 141 -145 -223 9 -37 207 86 204 -134 203 55 -123 -134 -190 -64
7847 -64 -101 212 129 49 195 168 -87 -212 -15 -90 150 78 245 109 -90 32 -123 -237 -33 -307 112 -124
7869 -124 -43 -143 -115 173 203 27 72 178 171 -192 118 181 44 51 -15 -224 325 240 165 -76 169 -195 -27 -198
7893 -198 -99 115 69 -293 143 -4 -236 86 66 53 -101 140 -53 -65 -73 157 48 84 147 149 -254 247 199 -2
7917 -2 126 -92 200 158 -494 -323 73 222 51 -50 134 163 -256 76 60 1 -33 -32 -260 64 142 -88 -4 -59
7941 -59 -125 23 89 -61 167 -7 305 28 -84 -131 169 -33 37 2 -132 -207 -140 -59 -42 -304 -175 94 -19
7964 -19 103 85 -103 -260 37 177 -166 -12 40 -11 -23 107 125 -233 -244 -172 140 29 -205 112 -160 -127 42
7987 42 138 -69 16 36 -117 -334 88 -344 -95 209 117 28 -42 28 -24 348 -235 195 112 -289 -84 53 39 -392
8011 -392 -65 232 56 -34 -148 273 99 -81 -20 -158 56 256 23 258 23 264 -187 83 -419 187 167
8032 167 163 -59 -24 -12 179 87 145 -215 -181 208 -258 -91 -111 -55 110 256 146 340 -8 -6 -128 154 343 -192
8056 -192 -57 206 57 -60 23 34 47 -129 76 -13 44 -43 -67 234 -268 -141 162 45 -51 43 146 -32 368
8079 368 -261 36 -19 -92 199 99 -4 -105 -173 -243 163 200 116 -122 237 -128 -11 -171 418 201 265 97
8101 97 -74 -57 34 -128 77 117 -63 101 -119 99 289 -242 263 -417 -15 -40 115 -205 12 120 309 90
8123 90 -33 66 -40 179 54 73 -20 256 74 -75 -127 -202 155 -329 -93 -82 -136 -66 -131 -92 55 151 -76 -82 37
8148 37 28 15 101 15 41 47 -279 260 142 -102 45 -221 150 130 -38 107 -49 -33 -55 178 -368 -80 -153 -148 15
8173 15 0 106 -380 104 -78 94 250 197 -104 -130 -83 113 136 -103 -154 -167 156 -320
8191c20
$$ Imaginary data points
##PAGE= N=2
##DATA TABLE= (X++(I..I)), XYDATA
0 0 0 0 0 0 0 0 0 0 0 0 0 0 0 0 -8 8 -8 8 -8 8 -16 16 -16 19 -24 27 -31 35 -39 43 -50 57 -60 68 -77 86 -95
37 -95 107 -117 132 -144 160 -176 196 -216 241 -267 299 -333 375 -423 483 -557 652 -776 950 -1210
57 -1210 1638 -2478 4744 -22483 -80689 -69613 -64144 -62464 -55330 -36525 -40534 -60564 -73642 -73389
71 -73389 -74270 -65261 -45536 -27975 -21281 -16318 -13829 -15685 -12205 5834 26449 40362 52568 64624
85 64624 63861 53214 46318 48745 52474 55947 62420 67900 62208 44441 24599 9922 -1005 -7453
99 -7453 -6051 666 1715 -7039 -22370 -41563 -60545 -71151 -69659 -61519 -51614 -41190 -36863 -43948
113 -43948 -52094 -50186 -41887 -31614 -14592 7427 17446 12962 8913 8593 9150 14372 32468 53386
127 53386 63892 65821 62431 50356 35803 29444 30421 33071 37327 40835 34062 16131 -1327 -13040
141 -13040 -22930 -28249 -23303 -14737 -15112 -23972 -32870 -42946 -53040 -58150 -52425 -40588 -29678 -24151
155 -24151 -22031 -23531 -26922 -27797 -21013 -7333 8880 23320 31385 30915 24125 18635 16122 17546 26533
170 26533 41981 51434 49731 43778 35387 22624 11076 9453 16259 18897 15953 11509 1975 -14659
184 -14659 -28627 -33252 -31507 -26583 -19879 -15277 -19897 -28825 -36227 -42639 -44115 -36110 -22166 -12037
198 -12037 -7853 -5545 -6193 -11580 -14412 -7583 6004 17935 26885 33371 33984 26336 17345 13957 16600
213 16600 22588 29532 35192 35269 28217 17649 7183 329 -670 3271 6762 6491 1846 -6478 -18555
228 -18555 -30661 -33710 -28573 -22834 -17992 -12900 -11470 -18750 -27846 -30920 -27329 -21731 -12619 -542
242 -542 5955 5048 1006 -2113 -3576 349 10148 20743 27884 31321 29907 21869 12781 10041 13231
257 13231 15771 19959 24927 24524 15091 3395 -3791 -8333 -9706 -6683 -860 1123 -3681 -11960 -20721
272 -20721 -27825 -29913 -26652 -19805 -12481 -7219 -6880 -12137 -17507 -19121 -16092 -10093 -1775 8712 14485
287 14485 12673 7446 4809 4737 5702 11183 21214 28119 27687 22506 16769 9508 3810 3897 8226 12449
303 12449 14413 12308 4933 -5011 -12614 -15632 -16022 -12832 -6459 -3211 -7200 -13810 -18766 -22733 -25273
318 -25273 -21486 -11192 -2932 -489 -734 -2309 -6116 -9528 -7216 588 9411 16060 19139 18014 12835
333 12835 8020 5443 5901 10349 17475 21847 19914 14442 8245 912 -5339 -5789 -1148 3342 3746 862
349 862 -3312 -10608 -18625 -21025 -17321 -11936 -7507 -4476 -4105 -8064 -13461 -16182 -15447 -10141 -1807 5304
365 5304 8576 8059 5613 1792 -2035 -603 6427 13290 16573 17735 17013 11383 3198 -159 2092 5371
381 5371 7901 11027 10949 5711 -2382 -8663 -11790 -10591 -7145 -2653 -405 -1350 -4811 -10641 -16320 -16737
397 -16737 -12142 -6125 -1231 2489 3823 273 -5772 -7885 -5176 -865 4076 10270 14018 12682 6909
412 6909 2533 -60 423 3784 8407 12233 12533 9365 3484 -3348 -6395 -5148 -2204 406 3942 4674
428 4674 -166 -7115 -11404 -11888 -10743 -7400 -1510 3102 2383 -2346 -6033 -8341 -8867 -6259 -631 5477
444 5477 8441 7999 4814 -106 -2942 -2332 669 4526 9485 11560 8669 2895 -1417 -3652 -4378 -2838
460 -2838 2842 7312 6274 2070 -2170 -5658 -8992 -9416 -5133 196 3039 2904 88 -3391 -7517 -8424
476 -8424 -6267 -1646 3734 7243 6388 2357 -753 -2907 -4187 -2629 2534 7797 8932 6546 3779
491 3779 193 -3318 -4876 -1290 3345 5404 5515 4057 173 -4400 -7677 -7296 -3742 375 3683 3956
507 3956 1517 -1932 -4971 -7196 -6612 -2538 2736 4484 3894 2542 62 -4065 -5766 -2406 2535 5287
523 5287 6681 7014 4600 -299 -4012 -4413 -2161 1311 4665 5874 4652 1722 -2240 -5432 -5828 -2721
539 -2721 1294 2966 3385 2575 -516 -5318 -7927 -6105 -2608 169 2412 4586 3559 -551 -4003 -4538
555 -4538 -3346 -849 1856 4788 5317 3069 -570 -3404 -4165 -1974 1645 4034 5864 6376 3873 -815
571 -815 -3915 -3703 -1848 -416 2117 4661 4187 515 -3126 -4170 -3712 -2729 118 3295 4380 2444
587 2444 -948 -4126 -6114 -5247 -2921 9 2874 4304 2700 -961 -3300 -3341 -2474 -1246 1648 5109
603 5109 5022 2115 -1153 -1982 -2953 -2304 697 4383 6403 5547 3002 132 -1563 -2495 -1877 378 2936
620 2936 4128 2880 -360 -2850 -4039 -4259 -3431 -563 2568 2878 440 -2256 -4062 -5801 -6774 -4692
636 -4692 -694 1714 1922 816 -44 -2020 -3165 -2279 484 3642 5093 5099 3555 1299 -144 -1074 -466
653 -466 2172 5738 6992 5209 3610 2104 -1023 -2961 -1941 442 2051 1354 364 -1309 -4178 -6611
669 -6611 -6650 -4541 -2297 -769 259 -476 -2309 -4708 -5894 -5444 -3284 76 2194 2745 2589 2215 610
686 610 -565 925 4284 6153 6605 7112 6512 3532 271 -352 1052 2051 3001 4335 4005 2097 -976
703 -976 -3715 -4874 -4652 -2881 -2093 -1874 -2553 -4031 -5901 -8818 -7741 -4747 -3098 -1735 617 1616 -783
720 -783 -2901 -2562 -1088 370 2357 5377 6686 6125 4122 2870 2509 3466 4556 6085 7114 6940 5304
737 5304 1803 -908 -2143 -1851 -1888 -1134 -9 -90 -2650 -5701 -6593 -6508 -6885 -6188 -3630 -2126 -2776 -4573
755 -4573 -5360 -5859 -5090 -3433 -587 1865 4098 4493 3365 2319 1859 2838 3617 5134 7457 8505 6587
772 6587 4802 3827 2912 1747 1611 3930 4957 3002 1294 -812 -2871 -5143 -5856 -5085 -3188 -2889 -2900
789 -2900 -4191 -5971 -6229 -6771 -6521 -4753 -1931 -63 -320 -1315 -1220 -1460 -2342 -735 2552 5110 5610 5663
807 5663 5502 4733 2821 2251 3366 5433 5337 5488 4279 2763 911 -997 -1984 -1442 198 214 -268 -1539
825 -1539 -2650 -4910 -6946 -6801 -5122 -3434 -3301 -2758 -2072 -2672 -4762 -4853 -2943 -1330 446 1727 2627
842 2627 2737 1506 577 408 1699 3322 4684 5665 5700 5319 2894 1195 1036 1856 2570 2751 3076 3152 1099
861 1099 -1842 -3374 -3120 -2323 -1887 -1177 -299 -626 -2790 -4595 -5025 -4507 -3845 -2789 -1484 -343 -463 -1563
879 -1563 -2356 -2622 -1379 -27 861 2481 3778 3289 1226 418 932 1613 1996 2954 4625 4912 3390 1593
897 1593 1032 458 251 712 1899 2316 1786 355 -1646 -2354 -2561 -2574 -2163 -988 89 -691 -2754 -3597
915 -3597 -3562 -4103 -3902 -2487 -162 453 -1090 -1499 -1613 -2126 -2052 -712 1356 2739 3142 2632 2016 992
933 992 704 1031 1973 3699 4898 4563 3474 2225 1723 118 -231 711 2153 2090 1146 -131 -503 -2248
951 -2248 -4062 -3531 -2154 -1626 -1802 -1500 -2384 -3620 -4529 -4546 -4065 -2126 -661 -266 -284 -352 -922 -1559 -1377
970 -1377 602 2483 3480 3909 4284 3923 2644 1144 2185 3378 3693 4238 4429 4010 1949 313 -579
987 -579 -582 55 8 -68 -96 -1314 -2689 -4210 -5349 -4553 -3704 -3205 -3015 -1942 -2465 -3657 -4677 -3998 -2302
1006 -2302 -1557 -424 1341 2385 1547 995 753 1442 2058 3397 4732 5216 5286 4450 2969 1998 1833 2669
1024 2669 2679 2695 3001 2256 -159 -1633 -2468 -2878 -3279 -2864 -1673 -1400 -2855 -4244 -4517 -5179 -4958 -4180 -2458
1043 -2458 -1012 -347 -1046 -1465 -1528 -1017 -221 860 2619 4039 4453 3601 2517 2822 2937 2606 3375 4675
1061 4675 5117 3845 2587 1571 374 -746 -1033 -191 392 -158 -989 -1751 -3403 -4365 -4934 -4376 -3107
1078 -3107 -2018 -1883 -2214 -2758 -2925 -3167 -3356 -1992 -92 1366 1517 1381 1463 1086 182 950 2712 3926
1096 3926 4134 4398 4072 3002 1383 472 721 1586 2333 2374 1330 816 -835 -1921 -2774 -2551 -1607 -1054
1114 -1054 -1436 -1424 -1782 -2827 -4372 -4245 -2480 -1215 -593 -369 786 -145 -1501 -1849 -1177 208 1463
1131 1463 2565 2891 2672 2049 761 124 835 1986 2711 2706 3124 2720 834 -921 -907 -538 88 308 1009
1150 1009 1398 295 -1552 -2637 -2100 -2059 -1358 -296 427 328 -885 -2527 -3046 -2369 -1331 -583 534 1449
1168 1449 1326 736 -1064 -1259 -916 -354 385 1670 2622 1934 110 -501 -609 -502 137 1318 2383 2822
1186 2822 1255 378 -1005 -1100 -805 -256 533 2060 2059 341 -982 -2008 -1334 -1515 -879 323 1914 704
1204 704 -929 -1780 -1966 -2431 -2211 -831 986 1070 450 -237 -1324 -1697 -1418 -941 722 1754 2246 1466
1222 1466 183 -168 -441 -560 330 2178 3322 3236 1894 1223 172 -675 -1076 10 1540 1619 1353 489
1240 489 -533 -1618 -2716 -1775 -593 402 612 -188 -918 -2115 -3182 -3298 -2553 -1058 191 881 283
1257 283 342 -745 -1518 -1546 -57 1696 2307 2628 2361 1701 -37 -481 63 1277 2304 3070 2999 2431 1072
1276 1072 -538 -1682 -1239 -268 541 605 -182 -693 -1863 -3632 -4029 -2722 -1564 -998 -306 -107 -918 -2315
1294 -2315 -3180 -2866 -1301 -368 778 2134 2336 1782 230 -33 263 1505 2645 3228 3392 3469 2174 -39
1312 -39 -260 107 568 1024 1860 2082 1143 -459 -2314 -2576 -2615 -1895 -1088 -419 -348 -1239 -2845 -3691 -3345 -2580
1332 -2580 -1488 -226 690 1104 250 -814 -1516 -836 -125 1078 2381 3411 3032 1279 830 778 903 933
1350 933 1882 3007 3291 2125 372 -881 -1684 -1612 -1281 -34 1023 797 -376 -1642 -2744 -3003 -2753
1367 -2753 -2159 -547 444 121 -977 -1784 -1939 -1869 -1849 46 1660 2407 1904 822 415 131 -158 -175 1506
1386 1506 2922 2871 2121 944 -113 -654 -1167 -765 737 1524 1348 384 -597 -1364 -2271 -2552 -1453 254
1404 254 529 492 -333 -733 -1727 -2081 -1700 -37 891 1524 1400 579 -248 -1260 -1360 -287 886 1996 2143
1423 2143 1438 865 184 -933 -1516 -341 858 1347 1209 1288 552 -799 -1869 -1664 -542 842 621 1422
1441 1422 1004 -160 -894 -1774 -1095 -138 898 1512 1291 1134 90 -901 -1434 -993 296 905 996 924 587
1460 587 -1154 -2351 -1833 -1227 -447 186 1102 815 -223 -1235 -1899 -1729 -744 263 935 1298 1346 514 -1004
1479 -1004 -1448 -650 810 1416 1840 2984 2154 815 -269 -635 -68 139 1125 1725 2008 766 -905 -1489
1497 -1489 -1626 -1723 -758 -99 484 474 -780 -2126 -2648 -2376 -1722 -1112 150 1086 598 -87 -1229 -1255 -769
1516 -769 -384 772 2147 3047 2208 1048 380 -74 394 850 1819 2534 2689 1597 389 -634 -1242 -985
1534 -985 -879 359 1344 709 -543 -1751 -2486 -2765 -2688 -1587 24 72 -267 -1427 -1516 -2054 -2320 -1800 76
1553 76 1190 1477 1206 332 278 -480 -529 733 1822 2389 2943 2006 804 184 -372 -568 142 1266 1989
1572 1989 1183 369 -446 -1103 -1953 -2293 -1193 -66 252 80 -673 -1910 -2296 -2415 -1796 -451 610 1036
1590 1036 697 311 -568 -1053 -1207 -279 1119 1987 1931 1770 1245 359 -593 -640 559 1148 1771 1817 1445 343
1610 343 -821 -1705 -1012 -56 531 974 841 84 -1084 -2100 -2480 -1338 -69 502 727 648 524 -1028
1628 -1028 -1672 -1693 -547 200 759 1386 1567 291 -735 -1522 -1105 -462 475 1141 1481 1101 92 -949
1646 -949 -1550 -1145 -239 462 946 1452 725 -241 -1188 -1528 -892 -7 640 1632 1730 706 -633 -991 -1174 -656
1666 -656 197 1075 1606 1425 269 -776 -1169 -1521 -703 -150 1084 1208 837 -210 -1384 -1696 -1238 -1422
1684 -1422 -162 1212 1054 796 -623 -1095 -1052 -1006 -133 908 2302 1837 1282 305 -36 -213 -228 514 1552
1703 1552 2403 1999 1070 -304 -854 -897 -524 -156 697 1049 500 -488 -1344 -1801 -2177 -1881 -722 15 450
1722 450 -253 -947 -1367 -2024 -1838 -986 687 1527 1139 1222 248 68 -189 -109 976 1879 2581 1989 1511 804
1742 804 271 -752 -434 568 1387 1290 718 11 -944 -1771 -1877 -1417 -828 0 39 -328 -1211 -1885 -2850 -2439
1762 -2439 -1455 -70 372 442 305 110 -576 -787 -815 530 1626 2152 2091 1987 966 408 -196 349 920
1781 920 1633 1984 1669 1173 -9 -896 -1196 -708 -506 -52 20 83 -653 -1679 -2408 -2432 -1524 -910 -724 -50
1801 -50 147 -424 -1273 -1538 -1400 -300 668 922 1294 1396 912 176 -375 651 833 1489 2085 1968 1391 317
1821 317 -414 -893 -432 101 499 789 676 205 -1213 -1922 -1517 -1495 -807 -431 259 148 -880 -1662 -1694 -1467
1841 -1467 -1005 -95 604 1319 830 -14 -206 -373 61 123 800 1523 1833 1317 68 -149 -162 -162 -25 791 1229
1862 1229 950 239 -557 -772 -1065 -987 -763 428 351 276 -264 -813 -1152 -1115 -824 -325 455 905 656 -92 -451
1883 -451 -730 -707 -622 759 1253 1379 818 25 -62 -577 -801 18 565 1241 817 216 55 -659 -870 -1092 -154
1904 -154 890 885 933 171 -495 -692 -946 -943 317 1097 872 871 284 -231 -905 -477 -445 670 748 730 462 145
1926 145 -319 -1705 -1056 -489 370 313 339 -93 -406 -980 -1466 -903 -130 318 398 215 544 173 -999 -869
1946 -869 -526 632 1066 921 1286 1154 365 -221 -349 127 634 918 1212 986 278 -286 -1037 -923 -241 9
1966 9 145 290 57 -486 -1643 -1671 -1321 -536 -412 -169 51 432 -677 -1086 -829 -479 168 631 1043 1165
1986 1165 1075 659 -8 50 255 1120 1416 1676 1069 1130 -68 -658 -451 -130 65 325 445 688 -538 -1303
2006 -1303 -1630 -1359 -1124 -904 -418 -161 -124 -1225 -1269 -1357 -796 -504 111 650 1087 591 48 -117 238 379
2026 379 698 1219 1744 1599 1231 869 126 158 251 753 780 861 777 -287 -692 -1084 -1057 -849 -782 -55 7 -788
2048 -788 -1024 -1356 -1441 -1545 -1146 -581 486 350 44 -16 -121 -196 -451 57 1028 1436 1297 915 404 479 461
2069 461 176 859 1306 1034 1217 343 -75 -370 -449 -765 -278 175 17 -364 -758 -1109 -1334 -1342 -1039 -322 -28
2090 -28 -182 -175 -305 -370 -690 -789 -12 706 741 750 529 569 -19 41 55 820 951 1122 777 864 245 -310 -401 -445 599
2115 599 528 338 186 183 -812 -973 -1182 -645 -481 151 25 -54 -58 -747 -833 -636 -430 28 369 542 384 132
2137 132 -429 -491 -176 515 443 478 543 747 103 -431 -245 -93 94 -11 370 439 -163 -491 -650 -882 -101 48
2159 48 227 414 524 98 -328 -348 -217 381 417 596 842 589 -274 -65 -53 -10 100 471 707 569 283 -344
2181 -344 -811 -573 -461 -281 171 9 169 -323 -883 -765 -270 -396 -128 4 406 148 -106 -85 -182 87 -53
2202 -53 360 780 886 553 370 363 -64 108 240 352 725 375 80 -278 -306 -733 -563 -686 -174 208 -23
2223 -23 -558 -1353 -795 -1116 -738 -368 167 232 11 -570 -307 -261 -183 -8 276 842 595 649 432 470 171 313
2245 313 554 884 887 752 629 435 6 -245 -527 -117 -132 -144 -376 -420 -620 -828 -825 -1080 -567 -25 -71 -608 -550
2268 -550 -388 -687 -431 -169 16 310 780 78 439 534 306 453 425 1092 654 657 624 602 415 78 17 -37 734
2291 734 553 187 -6 -202 -660 -649 -578 -381 -528 -606 -466 -652 -699 -864 -763 -639 -158 147 -69 328 363 146
2313 146 -1 240 604 625 474 423 868 519 562 40 -83 747 319 368 248 8 67 -9 -496 -538 -337 -220
2335 -220 -105 9 -226 -399 -554 -631 -421 -179 -168 95 381 -183 -97 -52 22 297 389 318 677 515 3 -30 152
2358 152 17 345 -77 176 235 205 -84 -621 -400 -123 -355 -182 365 -110 114 -602 -646 -121 -297 -308 -154
2379 -154 329 387 -73 -94 379 227 249 279 287 480 283 326 228 49 111 -47 116 148 117 -133 -533 -494 -443 -662
2403 -662 -461 -525 45 -227 -571 -362 -326 -221 -369 -247 -11 484 537 131 478 211 462 134 745 876 725
2424 725 407 356 408 447 259 -66 554 193 155 -38 -440 -31 -170 -721 -583 -548 -407 -559 -787 -763 -626 -493
2446 -493 -785 -419 8 -44 -59 -343 220 657 -241 178 554 829 298 524 702 392 599 523 707 532 352
2467 352 506 456 347 -293 19 -177 -437 -23 -325 -250 -339 -409 -790 -1048 -944 -522 -567 -810 -555 -291 -343 -50
2489 -50 -392 483 185 450 -18 430 452 503 431 232 381 553 317 437 428 485 -113 -255 155 234 106 -174 -12
2512 -12 -387 -495 -738 -623 -262 -357 -607 -789 -445 -387 -447 -458 -123 218 13 227 134 303 198 -47 112 326
2534 326 154 590 505 570 375 266 85 57 232 -51 -189 -54 116 19 -416 -539 -113 -185 -446 -224 40 -351
2556 -351 -468 -465 74 -124 -351 -31 -373 250 392 2 -213 155 613 307 412 262 511 308 -368 159 196
2577 196 243 239 -18 -152 309 -98 -328 -108 -92 -242 -315 41 -121 41 -457 -383 -258 -126 -142 -78 462 156 218
2600 218 37 1 348 302 158 -250 194 -77 175 257 161 80 -13 -85 -80 14 -373 -547 -430 -440 -54 -167 -260 62
2624 62 -49 -104 -326 -146 2 107 188 70 455 292 89 215 90 379 413 653 374 324 215 116 80 196
2646 196 -123 -420 1 -165 -422 -283 -534 -366 -589 -494 -719 -130 -146 -365 -648 -291 -3 -313 -127 69 223
2667 223 154 368 -84 220 221 325 344 468 399 470 106 388 375 206 187 285 57 188 -200 -150 -275 -488 -828
2690 -828 -506 -495 -333 -146 -511 -362 -603 -433 -153 -417 -36 105 118 -97 248 166 337 418 645 929 720
2711 720 539 305 505 439 456 341 589 477 245 -96 105 -43 -145 -600 -434 -179 -178 -259 -559 -571 -510 -898
2733 -898 -891 -538 -403 -314 -216 -107 -247 -259 -12 -67 573 265 373 586 525 479 330 233 433 659 496 385 299
2756 299 359 356 -93 -183 -192 -21 -244 -149 -425 -477 -336 -524 -618 -363 -361 -572 -342 -249 -460 -431 -585 -124 -10 248
2780 248 -24 504 310 458 130 440 420 795 736 567 359 565 217 411 338 134 274 -4 116 -85 -176
2801 -176 -569 -499 -253 -413 -616 -377 -64 -50 -289 -580 -437 -190 -123 -216 -66 342 -23 -95 -47 294 341 283 310
2824 310 616 329 217 33 232 256 294 184 -54 229 181 -210 -414 34 110 34 -132 -59 342 -312 -480 -242
2846 -242 -153 -66 -308 73 -30 254 -70 -198 -138 116 10 237 344 414 262 51 -21 -62 187 5 -29 159
2868 159 -19 -222 -178 149 -43 -63 -99 -100 456 -155 84 -257 -94 -168 124 -28 360 650 1 188 147 82 14
2891 14 215 433 56 243 111 -45 -306 -390 -395 -319 148 94 -124 -122 -265 -281 -222 -343 -285 -166 49 304 21 82
2915 82 145 -296 -87 106 374 439 174 58 339 388 330 -21 245 387 47 62 39 -50 6 34 43 39 -103 -471 -322
2940 -322 -374 -582 -386 -719 -198 -166 -59 72 -445 -351 -210 -420 39 44 222 74 280 159 238 349 299 568
2962 568 721 471 296 524 455 655 202 176 330 252 -41 -446 230 67 -459 -633 -223 -135 -430 -428 -401 -398 -267
2985 -267 -619 -565 -246 -169 164 90 -23 71 -91 64 -36 422 225 589 563 543 638 626 167 569 667 480 622
3008 622 226 608 181 -315 -244 -350 -505 -228 -37 -85 -597 -849 -439 -771 -386 -209 -458 -258 -474 -155 -157
3029 -157 -92 290 123 -48 307 667 839 329 329 611 377 315 326 571 540 446 281 190 8 -229 -28 -136 137
3052 137 180 -199 -153 -241 -581 -329 -423 -234 -62 -74 -273 -574 -225 -190 -274 -178 213 276 -190 400 268 301 173
3075 173 403 173 555 391 300 119 387 110 -9 108 15 22 190 -246 -333 -146 -407 -309 -340 -3 -76 -21 -621
3098 -621 -314 -460 17 -124 -77 -148 180 178 176 283 91 72 -453 -11 61 179 -41 -10 115 26 -232 -78 102
3121 102 96 -141 -238 -8 -303 -117 -417 -2 -95 -128 69 -81 -29 -13 -245 -164 28 76 302 183 207 206 -63 291
3145 291 -272 177 57 -93 236 -92 -143 -276 -348 -42 39 58 -482 -649 -295 -81 -419 -108 107 -131 -216 197
3167 197 218 -101 -211 -28 237 218 261 306 105 482 189 -26 184 45 245 150 172 540 173 -112 -157 -344
3189 -344 240 -141 -349 -237 132 -300 -537 -657 -173 -373 -355 -247 -225 -133 -198 47 -321 170 -382 -257 29
3210 29 571 333 131 129 268 661 398 575 236 408 345 37 161 -68 -16 211 50 -21 147 -347 -565 -311
3232 -311 -190 -344 -449 -272 76 -110 -413 -67 -264 -69 -56 157 189 61 235 -71 350 208 284 316 528
3253 528 610 438 667 178 379 35 58 71 317 576 306 61 -239 -215 -122 -177 -212 65 -174 -244 -316 -330 -550
3276 -550 -542 -380 -444 38 -238 -12 44 29 195 -40 258 463 323 303 536 158 65 413 74 319 391 199 245
3299 245 55 167 11 -149 -307 15 -270 -242 -527 -150 -265 -256 -147 -99 -78 16 -354 -158 38 -248 -283 -84
3321 -84 283 205 241 1 337 264 156 -29 247 381 378 257 406 57 171 -138 -11 -77 201 262 -112 90 -281
3344 -281 -478 -254 -368 154 -64 -422 50 108 30 -142 -33 173 239 50 -77 249 -67 166 -276 -5 -186
3365 -186 192 66 -159 -44 48 -115 -48 -404 -177 -164 -170 -234 -155 169 -25 -238 -282 20 -270 -77 158 115 38
3388 38 2 103 42 156 208 62 373 218 -4 -2 291 401 208 64 67 206 -64 -325 -380 -235 -256 -381 -142
3411 -142 -80 -255 -197 -353 -677 -297 -247 -79 5 261 98 145 -162 -93 238 131 77 366 272 349 288 214 327 145
3435 145 366 426 536 -53 -23 -93 54 160 -664 -123 -92 -252 -315 -421 -145 -341 -437 -477 -324 -387 -78 -166 98
3458 98 -52 -272 90 315 247 639 261 424 326 240 305 145 366 688 360 423 222 79 94 197 164 -52 138
3481 138 169 -247 -342 -283 -390 -506 -592 -423 -242 -323 -715 -579 -680 -358 146 -64 115 128 -19 97 91 446 5
3504 5 -149 389 385 292 190 371 330 -39 -69 291 345 248 -5 -40 -48 -284 -233 -342 -120 -112 -80 -354 -179 -212 -629 -445
3530 -445 -400 -448 -195 8 -155 37 -167 -443 88 378 254 177 180 252 -3 291 296 82 99 196 348 -11 148
3553 148 124 -308 -323 -302 11 88 -133 -63 25 -32 -456 -268 -159 3 -6 -184 -204 113 -154 -78 -244 241 73 -289
3577 -289 279 183 95 -112 167 -133 -168 -39 -39 -147 -110 19 -52 -80 -39 87 -26 -170 -97 321 -111 -110 158 -140
3601 -140 106 -333 2 291 235 242 -196 262 -98 -61 -74 221 157 -39 -62 -470 86 -153 -213 -191 129 103 -309
3624 -309 -334 -61 -363 -282 -226 232 -11 60 -77 -158 63 66 -190 -22 196 236 -51 -30 100 256 344 50 645
3647 645 546 201 182 -63 424 67 169 -215 -282 -177 -394 -137 34 -38 -114 -290 -176 -106 -28 -363 -269 -54 -289
3670 -289 -461 -217 250 20 11 146 146 252 303 154 159 84 247 285 584 241 399 21 183 -1 273 157 -322
3693 -322 115 262 -175 -460 -467 -267 -41 -116 -591 -291 -363 -159 -605 -158 -96 -226 159 -348 29 -217 29 228
3715 228 212 396 235 36 618 423 403 352 281 503 423 362 327 53 -147 -23 38 -315 -231 -168 -185 -159 -35 -319
3739 -319 -627 -241 -367 -449 -145 212 -45 -208 -408 -331 102 -239 179 -68 263 290 41 22 114 363 336 518
3761 518 357 392 111 248 -33 100 281 125 -6 77 -168 -198 -507 -34 -91 -646 -286 -506 -277 -412 -145
3782 -145 -82 -172 -34 -21 -190 204 -16 -62 -74 -310 36 296 104 374 448 385 319 90 424 58 171 193 89
3805 89 383 64 210 -116 -213 -201 42 -332 187 78 47 -32 -317 -29 -107 33 -212 183 176 88 15 -345 186
3828 186 -106 -74 330 -202 -145 55 -217 -32 -140 -149 -106 205 136 -135 -207 107 -82 -111 -116 -73 -132 86 56 -173
3852 -173 -166 -161 -2 -122 35 80 176 -5 190 45 61 -100 -96 132 -47 -246 30 -79 -19 -111 -60 110 -62 -140
3876 -140 19 -247 -77 -238 -64 76 -67 -148 -135 -120 170 -16 -206 -141 -247 358 -183 191 204 403 304 -287
3898 -287 311 187 162 -23 208 160 -235 34 -221 48 -29 28 -30 -240 26 -91 99 -273 168 -91 -349 -298
3920 -298 -147 -179 219 -277 -340 99 -56 -3 51 266 315 437 310 156 215 451 335 395 430 133 -100 4 -270
3943 -270 71 -120 220 -105 -75 402 -437 -38 -98 -82 -301 -402 -40 32 -296 -157 -43 -45 -156 -34 117 -326
3965 -326 -106 280 406 295 368 314 488 253 287 177 -63 241 -12 183 51 86 125 -54 -131 -591 -101 -182
3987 -182 -413 -6 -322 -354 -375 -354 -365 -451 -75 63 -129 8 -271 -170 -236 -49 281 69 147 261 67 195
4009 195 58 218 346 365 274 -32 179 135 45 8 28 -244 167 84 -171 -319 -125 284 -454 -257 -254 -264 -176 -312
4033 -312 -144 -100 -126 7 24 31 -140 -158 316 154 -146 -165 265 163 255 29 96 306 126 73 4 264 -232 -14
4057 -14 -30 260 6 160 -178 83 187 -134 -47 316 275 -46 -107 -13 -87 2 258 -205 21 -78 116 -194 -52
4080 -52 -229 -189 161 156 164 297 169 309 116 -316 -173 33 -185 -147 -91 47 55 -179 86 -69 -29 60 81 149 -120
4105 -120 6 -196 79 -94 -161 199 56 16 -1 206 305 90 29 148 -57 -51 -31 -27 -77 -184 -85 -240 -24 -188
4129 -188 -149 -46 -189 37 -126 -216 -336 39 213 -138 -6 79 12 -114 25 292 -7 425 -69 -18 -24 151
4151 151 -117 111 -19 18 139 146 317 93 305 -168 131 -229 16 38 129 -134 -33 7 -248 -55 -368 -194
4173 -194 -159 -14 169 -157 -37 76 -100 76 46 282 29 73 92 446 116 268 24 255 -48 338 40
4194 40 260 184 -133 56 -196 154 -130 143 -11 -36 -231 -522 -426 -279 191 -173 -40 -70 -96 -171 -198 -60 114
4217 114 34 159 264 145 3 237 -129 -24 151 253 342 293 122 467 5 239 195 -163 28 192 -133
4238 -133 170 -62 -171 -182 -197 -156 4 43 -128 -313 -250 -283 -252 -215 80 363 -33 53 120 99 157 370 286 89
4262 89 281 -118 -2 132 275 154 30 58 201 219 177 12 55 135 -166 13 -214 -184 -223 -309 -275 -156 -534
4285 -534 21 289 -113 -285 -31 192 8 -45 120 -14 -255 320 35 141 277 82 -211 311 171 284
4305 284 155 233 -58 -187 -69 -239 70 -90 301 -94 -250 -183 -195 -18 36 -97 -157 -210 -93 82 -80 -146
4327 -146 228 195 156 -125 333 143 393 283 -40 246 121 70 33 91 -319 -14 -27 -231 -47 -32 203 81
4349 81 65 -133 -230 -76 -130 -290 -78 -52 -127 51 -209 -160 126 -22 -74 159 129 80 -172 81 52 -258 96 -174
4373 -174 51 43 297 -89 -330 -189 61 -291 -122 -32 -227 310 -235 -222 -172 -213 -159 -166 -245 3 -50 -158 -252 -138
4397 -138 -63 -23 23 241 324 266 -36 37 133 27 94 -300 19 -143 142 159 179 -7 -87 123 -169 20 -154 -34
4421 -34 -85 -168 269 253 78 89 65 33 -93 -169 80 -156 -25 10 108 291 277 232 15 97 -198 55 112 133 -131
4446 -131 -22 31 174 -115 -240 149 38 99 37 -193 -474 -272 -176 -178 -22 -36 -104 -277 -186 236 -257 -358 -64
4469 -64 110 -66 354 52 101 -157 -95 199 422 74 147 116 226 -50 27 -128 93 -158 -36 194 119 -49
4491 -49 -13 -6 -81 -113 -39 -601 -127 -259 -40 197 -174 -215 4 -82 -173 253 161 -166 -245 -101 153 224 97 -46
4515 -46 -33 149 177 131 163 269 13 55 -117 252 -97 385 -5 -110 -157 -50 -271 -58 -162 -129 210 157 -246
4538 -246 -148 368 -188 -57 154 256 177 -156 11 101 -215 -55 163 67 25 40 -89 102 243 -75 326 -111
4560 -111 -180 11 42 156 74 -122 80 95 -163 -63 85 -188 7 -220 15 65 156 232 -31 -60 -13 -103 -20 -70
4584 -70 81 202 -28 -91 -63 69 15 68 -8 79 34 -171 -169 3 11 148 -91 -148 -214 62 39 80 173 -447 -184 -70
4610 -70 -57 -7 68 27 -102 -150 -78 -5 127 -23 172 -61 112 309 -161 56 170 228 295 102 -36 -71 -154 -239
4634 -239 -228 -353 -37 -24 -79 125 86 -275 271 207 -169 -20 -47 -76 26 228 -1 211 22 64 227 106 515
4657 515 122 39 251 -97 164 43 -9 110 387 46 24 -150 -89 -254 -54 -201 -113 -160 -259 -371 -119 -106 195
4680 195 -59 -286 37 19 33 -444 166 213 52 -15 252 -45 136 304 -125 -33 126 -212 -49 -153 145 72
4702 72 278 -117 -227 -103 -207 -129 -231 83 9 -107 -99 -143 -316 -354 -156 41 173 -147 66 -26 261 7 -234
4725 -234 -21 93 136 24 -7 230 259 132 77 -107 272 -57 182 -96 349 44 172 145 22 -223 -67 -164
4747 -164 222 -152 -297 -35 -199 143 -198 55 38 -15 -219 -291 -185 -64 202 60 -57 390 -376 156 81
4768 81 157 266 364 -163 104 318 -32 -426 -238 -76 111 -27 6 293 138 -116 -47 -242 -161 243 -57 211
4790 211 -43 7 193 -330 -10 12 76 -55 -309 326 30 354 183 327 50 -316 52 123 7 -128 -95 127
4812 127 -15 -146 -225 -403 -6 -211 -314 49 86 -234 -70 -132 -34 21 302 -174 -190 -97 -52 -86 -17 443 101
4835 101 115 -52 272 139 -37 66 9 -26 -40 127 -272 -95 -216 292 168 -55 108 6 -199 -12 32 -190
4857 -190 35 -292 -151 -168 53 -175 -105 29 -209 13 -72 41 -119 46 -47 40 192 165 -127 -46 85 67 236
4880 236 136 87 -60 -37 -167 -168 75 84 -55 284 39 -360 4 -150 -31 117 56 273 -170 262 -173 9
4902 9 125 -319 114 -15 -40 -111 -57 63 232 324 42 0 -31 12 45 157 122 67 -145 34 -178 196 -289 61
4926 61 -124 221 234 81 48 7 -147 -251 305 319 -104 141 -149 41 -101 81 38 131 155 -101 -63 116 270
4949 270 -59 172 -129 -72 -244 180 -47 40 72 13 -247 2 -4 45 170 -21 -194 -249 -216 -177 -213 469 -40 -161
4973 -161 -291 201 -106 -96 37 349 184 199 154 -101 274 39 154 127 181 275 -164 217 -76 69 -151 99
4995 99 169 -35 125 23 188 -214 -390 -447 18 41 -318 -227 -208 162 3 87 -250 263 -4 -407 -217 47
5017 47 37 -72 26 422 220 12 180 -154 40 118 -11 -138 -64 -63 12 -89 -416 84 86 -354 -146 208 -120
5040 -120 -185 -164 165 -78 -137 -130 -13 -381 -341 -61 -115 -40 -62 376 -156 -212 -32 -175 238 252 169 4 190 -223
5064 -223 81 48 119 -225 -232 -43 8 -137 308 224 -223 64 9 84 121 281 17 -93 219 128 147 83 71 -124
5088 -124 78 -92 193 17 42 -106 106 101 128 -106 40 -51 -153 -225 9 -186 -17 -50 -10 -116 -212 43 -150
5111 -150 -150 -328 -100 -243 -233 -251 22 100 164 257 -136 142 -23 -100 -77 -82 148 365 -57 311 36 -60 49 20
5135 20 56 15 107 -232 -76 -65 -428 -287 -114 -229 131 55 -77 22 32 -194 -236 180 -377 28 191 174 -83
5158 -83 69 68 189 148 -99 212 150 163 28 -5 85 109 -30 112 -37 -56 90 105 -3 -329 40 -266 209 -155
5182 -155 140 -260 64 352 12 108 192 148 -254 -17 157 -145 155 -212 -60 514 357 -212 314 -58 -40
5203 -40 238 -119 -89 -191 144 -258 -137 -315 -113 -307 -44 121 -28 -5 61 -511 -126 -190 -262 -148 535 118
5225 118 -84 -304 -168 50 30 -61 265 297 262 259 10 76 6 104 22 -121 267 111 -49 92 -422 -161 -243 310
5249 310 -59 292 75 -100 149 -246 119 152 7 -75 -139 3 418 -109 168 -99 -24 -135 114 -8 -153
5270 -153 -128 14 130 -49 230 22 69 -86 -89 228 216 180 -6 -270 245 -353 -21 -312 -23 -109 -9 -63 100
5293 100 -8 -20 458 -29 56 -10 -137 42 92 -55 -301 139 35 -43 26 134 -126 99 48 -32 -16 -73 159
5316 159 -179 41 61 -99 -129 12 -399 -59 27 291 189 45 -238 -74 55 67 -69 -107 306 265 -220 -288
5338 -288 153 -109 -46 -228 -31 346 62 59 2 231 44 -148 -66 92 75 -53 -190 59 48 -80 -147 -154 -1
5361 -1 -170 -194 -21 9 -347 59 159 -19 -42 79 150 185 -1 -98 48 29 143 355 277 98 -16 -53 -68 215
5385 215 57 -204 268 -88 78 26 -242 -15 2 -83 78 124 -3 63 161 73 -148 75 202 41 70 277 229
5408 229 -289 162 75 87 233 -365 244 265 129 -127 227 140 159 -368 42 76 225 25 -157 -127 103 -73
5430 -73 -173 -115 156 136 -63 -225 -229 -28 -66 -373 154 -43 221 420 -355 180 421 -185 121 370 -138 172
5452 172 38 -130 -15 35 174 8 106 231 -55 219 -357 -106 -57 -137 40 -132 11 -70 -113 -58 -124 64 48
5475 48 40 228 64 154 -37 2 -94 -144 -92 94 -32 159 240 -6 124 212 15 117 -365 114 -356 -19 -36 56
5499 56 122 -106 -78 -126 45 -156 362 -41 -195 -287 -10 -192 -28 -297 -67 -293 -148 -150 -162 16 -230 22 135
5522 135 229 -12 181 -66 -288 -56 139 54 -114 -13 -248 -423 -160 -141 329 39 107 -24 91 -20 -112 -24
5544 -24 123 65 -50 -158 123 133 -213 138 -10 -116 -21 21 88 56 -104 85 16 222 -58 -30 -140 -217 179
5567 179 341 -210 -307 -147 -89 -286 -56 -140 197 209 -96 -248 -227 -151 -228 -168 -83 -193 -27 64 -159 -122 3 354
5591 354 -64 47 366 18 421 48 106 63 149 344 292 -274 -59 -58 -128 -172 -73 -201 -336 -133 83 -69 -270
5614 -270 28 -60 -168 -23 -136 -210 -24 55 -88 -9 -59 325 -141 285 -344 56 53 229 261 -54 25 49 -131
5637 -131 222 26 174 -80 -100 -212 71 52 -64 66 -86 -11 -213 158 -274 -126 82 31 -242 17 9 -380
5659 -380 115 -187 -20 37 -187 141 -58 91 -236 322 386 154 155 -81 20 -60 -236 116 -82 -108 199 -262
5681 -262 81 17 -199 -85 29 13 299 27 -18 131 -230 -88 61 -11 -55 -42 63 -45 127 91 20 -82 69
5704 69 151 304 -136 154 32 76 138 181 -30 331 -45 -301 123 -104 150 166 -171 38 -391 38 -29 -100 119
5727 119 -19 -58 -405 190 -501 244 235 16 -21 420 195 86 162 207 81 -274 -76 140 164 164 45 -291 2
5750 2 29 367 80 26 301 -204 -100 -59 93 115 -111 9 248 64 50 -156 -3 415 -33 231 8 -3 182
5773 182 -73 206 343 79 67 -65 -91 -99 -74 23 102 -189 302 -212 184 -27 -95 218 -71 -19 -189 -44 -62
5796 -62 17 18 -479 -157 -9 -94 -179 201 114 276 295 180 122 -196 224 -11 -77 139 140 173 338 -133 -83 79 48
5821 48 325 5 1 -36 -241 -6 -165 406 96 -15 -56 -399 -7 271 218 -100 4 -89 345 270 -348 190 25
5844 25 31 543 205 -96 44 279 -52 -39 144 -144 96 -65 -45 152 -145 -412 -251 -21 98 84 -248 -74
5866 -74 -22 -146 17 -94 -246 -40 -160 323 98 0 -4 -162 246 -196 -236 -43 -107 191 15 -69 121 -4 22
5889 22 176 293 -9 125 -128 -17 84 -279 -96 138 -16 -167 -117 113 -171 -83 25 4 204 -331 173
5910 173 -104 92 98 -39 186 65 -161 225 110 -71 270 28 165 100 51 -61 339 168 -46 130 -309
5931 -309 -161 124 -36 -13 71 52 -219 321 -240 -279 -348 -116 -70 -188 -201 -125 218 -92 6 51 51 -70 135 -21
5955 -21 126 -56 56 354 -80 -78 -141 -177 -268 43 -151 261 201 137 32 -108 -304 96 -110 0 92 260 -6
5978 -6 -329 120 127 -231 -33 -117 -170 -36 -54 121 -10 -152 210 265 -314 -7 -38 35 -59 231 -130 259 55 -47
6002 -47 176 153 -76 -180 -176 128 -180 -255 -238 -104 86 -13 142 17 17 8 -159 181 79 -16 -52 -125 9 -135 -98
6027 -98 -177 162 -171 192 -58 -133 -9 -9 -70 -114 -11 43 -28 63 -106 -347 -67 -190 -33 -164 92 -168 -131 -111
6051 -111 55 -77 -22 122 -106 1 -68 16 206 -191 -292 -13 -58 -117 114 -117 255 -76 -113 84 117 144 -162
6074 -162 90 -211 -434 -124 67 -205 213 197 -313 96 -29 -108 -348 33 56 -288 -67 -288 67 -166 -4
6095 -4 -64 171 59 -62 181 -318 -156 -37 -451 277 64 82 225 -384 -239 181 144 201 -101 -239 0 -229
6117 -229 149 -110 -18 75 61 -93 78 96 -144 135 50 -148 10 -175 -64 263 -115 -25 61 484 -322 224
6139 224 126 -102 155 48 25 -94 310 -237 47 -119 139 27 -173 -196 -159 -36 -69 -54 -169 -137 -86 53 83
6162 83 114 -227 50 -37 50 9 -32 -55 -198 85 82 295 74 4 -236 -257 -322 -256 -97 -238 -60 -11 190 -49 -102
6187 -102 -115 -361 17 -126 -259 -122 72 -68 83 -287 -291 -75 112 -312 296 -15 238 206 60 -171 80
6208 80 202 234 180 288 138 -167 -66 -41 -154 -281 -46 91 -151 -96 -451 -184 193 -136 24 37 -36 347
6230 347 -23 -4 97 -235 253 81 347 345 120 103 128 142 -107 -12 324 -145 96 158 -180 -246 171 230 -140
6253 -140 -63 -77 237 57 -346 -291 4 -14 231 -243 32 -94 -254 -72 30 136 -15 -53 244 47 196 345
6275 345 -189 -131 223 49 122 161 259 -217 53 89 -181 -248 -29 -140 57 27 -80 174 78 -189 282 -81 -150
6298 -150 -100 54 13 -200 54 -97 142 39 480 173 -86 -258 -182 -143 90 -98 134 228 180 -112 -62 -210
6320 -210 -24 -341 154 130 163 120 -36 35 81 323 -281 42 -102 -50 -41 28 -220 28 -94 -246 -126 -285 16
6343 16 -98 -180 53 139 128 48 379 -160 119 -101 -171 206 172 19 -137 130 -14 -18 126 87 -11 -92 120 -84
6367 -84 -230 -259 -195 304 -174 -32 -250 52 -215 293 75 201 -82 13 -7 47 206 59 -232 342 48 72
6389 72 41 130 -68 212 3 363 -295 -11 72 -6 95 160 -211 30 -53 -116 -93 -147 -80 202 -279 -173 -205 302
6413 302 -86 -23 16 232 -42 -82 -23 -123 24 -112 236 292 6 44 107 -14 292 -54 424 142 10 -297
6435 -297 -81 -116 99 43 177 -38 -339 202 -44 -90 -63 -163 52 137 182 65 424 -144 -169 37 -245 -18
6457 -18 233 44 177 44 -219 -79 51 -140 -100 -46 -26 441 27 134 28 268 105 296 -133 -180 -126 -21
6479 -21 -97 255 -180 38 61 -33 -17 482 -48 153 -182 -195 179 -120 27 288 99 -144 -211 158 -210 -103
6501 -103 -31 151 176 -37 109 106 201 -182 186 -172 -37 42 -94 -100 101 150 -218 -15 -28 -199 20 -102 -190 6
6525 6 -170 -173 2 -22 -109 196 -296 174 -174 -12 -11 168 -147 -220 3 17 66 217 -111 64 22 -1 -34 270 39
6550 39 167 133 37 -102 -357 -96 -40 246 102 -314 98 274 -69 146 -115 58 -4 -225 79 -157 24 23
6572 23 -21 405 344 10 82 -294 -242 111 99 33 83 -275 -131 -110 107 -29 -207 88 -46 -69 136 -146 -276
6595 -276 23 147 -133 -34 -66 -313 -22 -5 2 69 -52 -64 -180 0 -13 -31 -182 -198 321 71 260 -216 -79
6618 -79 -34 -48 -42 119 -206 -70 -72 129 -139 107 111 -57 223 -199 71 46 86 -40 46 -356 -112 179 -99 -323
6642 -323 -178 27 -115 -2 -50 -52 -41 -74 146 -72 -95 114 -11 -10 -204 -49 -239 313 59 13 -286 39 -138
6665 -138 275 213 241 -236 54 -292 -221 204 96 -138 -146 -197 24 124 -302 -127 -40 195 -104 251 -44 28 -169
6688 -169 -116 -86 157 109 -158 25 164 -114 250 -207 -46 144 -274 -437 -1 -257 123 -171 -94 -137 -14 204
6710 204 -22 266 -56 -220 -93 -241 193 182 -233 -158 287 -9 -137 -49 -238 -115 17 208 134 -138 16
6731 16 -72 -72 79 -43 190 -58 -302 17 45 205 133 79 71 -182 -49 38 -82 22 -221 64 54 247 116 95
6755 95 -143 -259 -9 -188 328 210 245 337 -160 -305 -146 -303 104 353 -51 39 -153 -109 67 -78 200 150
6777 150 -217 65 -56 -119 -10 143 -75 -281 -58 -41 -56 75 -90 -192 -48 310 -156 89 -153 -7 239
6798 239 -34 267 219 -103 51 -93 83 215 95 -131 260 152 -120 103 -196 -106 150 -20 -162 29 -151
6819 -151 -46 -296 -279 105 -156 -30 437 -194 -50 -29 85 -110 80 -12 -265 50 48 235 -194 65 115 31
6841 31 -34 -7 208 -8 -122 -122 -227 339 152 397 3 256 -114 181 -180 -68 -108 239 82 -212 117 -124
6863 -124 44 247 -9 -57 -190 48 271 -225 301 -165 -238 -241 -42 7 49 -229 7 -161 -79 168 124 316 -36
6886 -36 -240 -182 96 -32 -248 -210 166 -143 -274 184 14 66 20 -46 -175 -374 -58 -24 -379 -243 -247 -33 59
6909 59 -156 -54 -235 -248 198 231 -51 -116 -94 -66 8 320 79 64 61 171 282 -14 144 201 92 -15 86 67
6933 67 -222 -223 -133 -2 -119 -214 -241 220 282 134 36 70 228 123 -58 163 133 82 0 62 49 40 -291 99 -74
6958 -74 -105 106 21 171 -78 169 -219 193 28 -21 -191 -64 -139 39 -13 -10 -180 -82 158 -24 129 10 123
6981 123 -3 -73 -105 106 -7 138 -189 -37 88 -48 -152 91 12 -85 -197 -156 -164 -82 352 62 -20 15 -75 -243
7005 -243 102 195 48 -30 26 79 -42 203 -65 -22 265 -19 -105 14 48 -285 -215 48 -136 38 294 -32 -161
7028 -161 228 -157 -87 349 83 37 221 -38 -222 169 -118 176 -80 -73 -184 -45 237 42 -123 -130 143 132
7050 132 217 55 47 43 46 66 -12 457 188 -49 148 136 149 24 -104 -178 108 -74 105 -8 -211 -16 142 -187
7074 -187 352 -62 21 -72 -123 -243 -116 -320 -74 -124 37 206 20 -6 -271 60 83 -100 -112 -39 111 -1 16
7097 16 -421 95 -14 67 -240 105 266 44 -47 94 200 85 -142 -248 -27 73 226 -10 14 -51 -255 -209
7119 -209 -185 -134 151 -192 45 -150 82 -130 -23 276 72 111 -158 236 -319 -217 -147 -271 229 -136 -107 -134
7141 -134 -385 -138 13 -165 -80 469 41 221 159 140 342 87 -266 47 -190 103 9 -174 -457 48 272
7162 272 -334 -143 -114 -1 62 -63 -163 -209 -152 -88 6 203 43 0 -125 -45 102 -4 19 -9 -122 -2 79 337
7186 337 -49 -42 41 86 154 -126 -51 -21 -52 -56 -116 -65 59 -3 65 -41 -359 -254 50 -84 31 161 77 188 188 99
7212 99 -47 17 -101 112 89 62 185 148 -3 188 12 -168 -82 -63 -62 145 416 -22 158 78 -31 9 -109 -89
7236 -89 39 129 -27 -262 182 -138 360 221 130 -14 50 -161 -87 80 -70 340 129 177 -96 91 142 195 152
7259 152 188 89 50 107 202 -85 109 -291 -331 -110 -144 -341 184 29 -106 -11 -85 97 304 -53 21 287 145
7282 145 -3 186 122 -128 -164 -49 174 84 -359 -11 -395 122 185 -235 -28 15 73 -223 -291 217 253 70 -159
7305 -159 -37 94 -186 -82 239 242 257 251 -87 339 -95 63 -63 -81 193 12 193 480 204 -217 -132 43
7327 43 197 -31 -173 96 -45 -236 -255 31 -2 -22 -79 -166 139 157 -134 -117 -102 166 181 -11 -63 166 -212 -53
7351 -53 -26 -242 -43 368 -213 29 214 118 -24 39 -20 91 344 -268 -137 -273 102 -22 36 -70 214 50
7373 50 60 189 -276 159 -14 98 183 -177 -149 -97 34 -102 247 253 290 6 -263 -14 124 -91 -63 40 111
7396 111 39 -379 168 196 256 202 -168 1 7 -110 -244 216 348 -325 -67 86 168 -187 105 435 23 136
7418 136 -325 -286 -64 11 273 62 206 170 111 -56 -21 -133 47 -1 239 -227 -83 -13 307 -30 -29 -92 -1 -62
7442 -62 -82 -35 -171 329 -208 147 55 -204 -153 -10 218 45 -13 -93 48 358 97 146 -113 199 137 -299 -293 -234
7466 -234 289 -42 -347 -101 327 -19 74 120 94 -118 242 -168 -103 -2 -199 -64 -94 174 0 23 -1 -97 -4
7489 -4 -22 -126 2 -414 -96 -31 -77 -4 58 261 -305 23 303 206 22 41 -99 -73 -249 -37 -297 128 -124
7512 -124 -5 -120 -142 -109 -343 -109 -209 -19 54 -148 -133 -145 -138 -276 -102 -130 -14 -268 14 -51 187 24 317
7535 317 85 119 -123 117 115 -26 22 75 -224 -175 66 -89 56 204 158 -72 -316 -10 66 237 89 62 -76
7558 -76 -190 -176 -83 -87 -131 -140 -67 -261 80 -281 -311 -31 -90 -264 -187 -49 -170 -110 132 22 -155 -81 -79 62 -128
7583 -128 176 40 114 -119 -149 136 -144 -3 129 -95 -37 370 -46 62 -2 -164 186 -14 188 138 -54 -44
7605 -44 101 -65 195 -138 42 -6 -141 189 205 98 81 -79 199 148 -338 34 34 -95 93 71 -154 -92 -146
7628 -146 79 -71 -142 237 146 33 289 -223 -236 286 236 135 2 145 14 16 22 128 -224 96 -171 -300 68
7651 68 -28 -301 44 -38 125 134 33 -166 -5 94 28 123 52 -185 -578 -137 191 78 -112 -216 27 -18 -56 -214
7675 -214 22 -90 190 -41 -135 48 -9 -139 -9 342 -24 164 -276 78 463 28 -58 -61 114 70 -176 185
7697 185 -104 -285 8 172 178 34 -27 -142 44 224 -36 -65 99 -56 95 65 189 21 -209 128 -75 -493
7719 -493 243 562 40 160 -69 -164 43 -48 -208 25 -5 -190 204 122 270 81 -28 -74 -189 -59 -22 -56
7741 -56 26 4 232 16 2 8 236 -59 106 -130 -7 114 120 -166 -90 277 176 49 108 82 56 129 -210 194
7765 194 117 -368 -182 37 -111 -22 58 51 92 118 -145 213 -405 -43 -354 -36 -34 -157 -58 -105 -177 38 26 23 337
7790 337 -115 -54 384 291 -394 7 245 139 -212 -173 -141 -143 -62 116 -54 -277 -86 34 -27 -44 201 151 198 72
7814 72 -78 63 89 56 -36 81 50 23 39 -174 85 85 243 27 187 -88 61 305 133 -18 -46 132 -29
7837 -29 204 53 -6 29 36 110 268 -70 123 -13 151 -46 62 -275 -279 122 140 221 -54 0 -11 -105 -7 228 163
7862 163 149 -116 221 71 -85 -17 151 -342 -149 251 -105 93 241 57 -507 142 30 -121 -116 -92 380 292
7884 292 120 -12 -39 -79 11 22 -56 -140 -167 214 74 83 32 -87 -20 174 -74 213 5 138 -203 87 -33 128
7908 128 270 -143 142 72 160 -107 -3 -214 -68 -113 85 -58 -79 -571 217 -37 30 -122 35 137 -40 97
7930 97 164 115 -180 -78 -44 -117 207 85 -152 101 -258 140 -132 213 44 -230 203 137 166 -115 -23 -223 -87
7953 -87 183 -10 -49 -202 136 -172 95 51 -128 105 -18 -179 -208 144 109 -18 -228 -9 39 148 283 36
7975 36 -171 38 -59 64 107 -51 -132 133 224 171 88 -359 154 -76 24 -80 -92 63 299 -249 106 -44 25
7998 25 243 -508 182 93 39 147 130 308 -364 -207 -16 -104 -180 -40 107 -171 0 -158 173 -352 76 109
8020 109 335 194 -133 313 -256 -60 267 59 -45 -124 -21 -153 -102 12 220 70 247 357 28 -110 47
8041 47 77 64 85 -55 -34 -79 -218 238 -60 -34 -11 225 15 79 -51 206 118 142 156 -170 135 -209 13 -107
8065 -107 252 55 -66 9 235 194 -71 -111 -6 352 -126 131 -54 3 121 144 366 115 -282 -90 430 123
8087 123 230 258 180 82 120 -60 -229 104 240 253 -131 -36 -46 154 -325 -186 135 -150 140 -176 -258 -4 -189
8110 -189 -171 18 178 -76 118 -24 74 -134 11 -24 -163 363 -48 11 -123 263 3 123 -43 -10 125 88
8132 88 -94 139 -183 331 -89 -80 -27 8 -65 -14 169 139 268 -52 -300 -147 -10 197 226 60 -160 55 100
8155 100 77 35 -372 -8 229 80 29 12 -26 23 -26 25 325 -174 -183 -17 16 -364 -183 -93 -28 -203 27 -179
8179 -179 -304 -259 -281 -46 181 235 137 294 117 39 75 460
8191D60
##END NTUPLES=NMR FID
##END=
