##TITLE=1H_LR-664-RM3AK
 CDCl3, 8 sc, 
 2.4.2019
##JCAMPDX= 6.0         $$ Bruker NMR JCAMP-DX V2.0
##DATA TYPE= NMR FID
##DATA CLASS= NTUPLES
##ORIGIN= UXNMR, Bruker Analytische Messtechnik GmbH
##OWNER= root
$$ XWIN-NMR		Version 3.5
$$ Tue Apr  2 15:22:36 2019 Russian Standard Time (UT+4h)  she@DPX200
##.OBSERVE FREQUENCY= 200.1316
##.OBSERVE NUCLEUS= ^1H
##.DELAY= (6, 6)
##.ACQUISITION MODE= SIMULTANEOUS
##.ACQUISITION SCHEME= undefined
##.AVERAGES= 8
##.DIGITISER RES= 18
##SPECTROMETER/DATA SYSTEM= spect
##.PULSE SEQUENCE= zg30
##.SOLVENT NAME= CDCl3
##.SHIFT REFERENCE= (INTERNAL, CDCl3, 0, 15.7039)
##AUDIT TRAIL= $$ (NUMBER, WHEN, WHO, WHERE, WHAT)
$$ ##TITLE= Audit trail, XWIN-NMR		Version 3.5
$$ ##JCAMPDX= 5.01
$$ ##ORIGIN= Bruker BioSpin GmbH
$$ ##OWNER= she
$$ F:/spectra/data/she/nmr/H-F/1/audita.txt
$$ ##AUDIT TRAIL=  $$ (NUMBER, WHEN, WHO, WHERE, WHAT)
(   1,<2019-04-02 15:21:34.00 +0400>,<she>,<DPX200>,
      <created by zg, POWCHK disabled, PULCHK disabled
       configuration hash MD5:
       00 E9 B6 7A A2 85 ED C7 34 08 36 98 17 FE 4E 26
       data hash MD5: 16K
       7A F6 B2 6B 77 22 D6 16 89 62 6A FD E3 54 C8 0C>)
$$ ##END=
$$ 
$$ hash MD5
$$ 10 16 54 FD 0B E7 F7 78 7C C7 DF 08 1B 7E F2 A0
##$RELAX= 
##$RELAX= 
##$RELAX= 
##$RELAX= 
##$RELAX= 
##$RELAX= 
$$ Bruker specific parameters
$$ --------------------------
##$DU= <F:/spectra>
##$EXPNO= 1
##$NAME= <H-F>
##$PROCNO= 1
##$TYPE= <nmr>
##$USER= <she>
##$AMP= (0..31)
100 100 100 100 100 100 100 100 100 100 100 100 100 100 100 100 100 100 
100 100 100 100 100 100 100 100 100 100 100 100 100 100 
##$AQSEQ= 0
##$AQ_mod= 1
##$AUNM= <au_zg>
##$AUTOPOS= <>
##$BF1= 200.13
##$BF2= 200.13
##$BF3= 200.13
##$BF4= 200.13
##$BF5= 200.13
##$BF6= 200.13
##$BF7= 200.13
##$BF8= 200.13
##$BYTORDA= 1
##$CFDGTYP= 0
##$CFRGTYP= 5
##$CHEMSTR= <none>
##$CNST= (0..31)
1 1 145 1 1 1 1 1 1 1 1 1 1 1 1 1 1 1 1 1 1 1 1 1 1 1 1 1 1 1 1 1 
##$CPDPRG= <>
##$CPDPRG1= <>
##$CPDPRG2= <>
##$CPDPRG3= <>
##$CPDPRG4= <mlev>
##$CPDPRG5= <mlev>
##$CPDPRG6= <mlev>
##$CPDPRG7= <mlev>
##$CPDPRG8= <mlev>
##$CPDPRGB= <>
##$CPDPRGT= <>
##$D= (0..31)
0 1.2 0 0 0 0 0 0 0 0 0 0.03 0 0 0 0 0 0 0 0 0 0 0 0 0 0 0 0 0 0 0 0 
##$DATE= 1554204093
##$DBL= (0..7)
120 120 120 120 120 120 120 120 
##$DBP= (0..7)
150 150 150 150 150 150 150 150 
##$DBP07= 0
##$DBPNAM0= <>
##$DBPNAM1= <>
##$DBPNAM2= <>
##$DBPNAM3= <>
##$DBPNAM4= <>
##$DBPNAM5= <>
##$DBPNAM6= <>
##$DBPNAM7= <>
##$DBPOAL= (0..7)
0.5 0.5 0.5 0.5 0.5 0.5 0.5 0.5 
##$DBPOFFS= (0..7)
0 0 0 0 0 0 0 0 
##$DE= 6
##$DECBNUC= <off>
##$DECIM= 24
##$DECNUC= <off>
##$DECSTAT= 4
##$DIGMOD= 1
##$DIGTYP= 9
##$DL= (0..7)
0 120 120 120 120 120 120 120 
##$DP= (0..7)
150 150 150 150 150 150 150 150 
##$DP07= 0
##$DPNAME0= <>
##$DPNAME1= <>
##$DPNAME2= <>
##$DPNAME3= <>
##$DPNAME4= <>
##$DPNAME5= <>
##$DPNAME6= <>
##$DPNAME7= <>
##$DPOAL= (0..7)
0.5 0.5 0.5 0.5 0.5 0.5 0.5 0.5 
##$DPOFFS= (0..7)
0 0 0 0 0 0 0 0 
##$DQDMODE= 0
##$DR= 18
##$DS= 0
##$DSLIST= <SSSSSSSSSSSSSSS>
##$DSPFIRM= 0
$$ [...]
##$SUBNAM2= <"">
##$SUBNAM3= <"">
##$SUBNAM4= <"">
##$SUBNAM5= <"">
##$SUBNAM6= <"">
##$SUBNAM7= <"">
##$SUBNAM8= <"">
##$SUBNAM9= <"">
##$SW= 24.9336934301222
##$SWIBOX= (0..15)
0 0 2 0 0 0 0 0 0 0 0 0 0 0 0 0 
##$SW_h= 4990.01996007984
##$TD= 16384
##$TD0= 1
##$TE= 0
##$TE2= 300
##$TE3= 300
##$TEG= 300
##$TL= (0..7)
0 120 120 120 120 120 120 120 
##$TP= (0..7)
150 150 150 150 150 150 150 150 
##$TP07= 0
##$TPNAME0= <>
##$TPNAME1= <>
##$TPNAME2= <>
##$TPNAME3= <>
##$TPNAME4= <>
##$TPNAME5= <>
##$TPNAME6= <>
##$TPNAME7= <>
##$TPOAL= (0..7)
0.5 0.5 0.5 0.5 0.5 0.5 0.5 0.5 
##$TPOFFS= (0..7)
0 0 0 0 0 0 0 0 
##$TUNHIN= 0
##$TUNHOUT= 0
##$TUNXOUT= 0
##$USERA1= <user>
##$USERA2= <user>
##$USERA3= <user>
##$USERA4= <user>
##$USERA5= <user>
##$V9= 5
##$VALIST= <valist>
##$VCLIST= <CCCCCCCCCCCCCCC>
##$VD= 0
##$VDLIST= <DDDDDDDDDDDDDDD>
##$VPLIST= <PPPPPPPPPPPPPPP>
##$VTLIST= <TTTTTTTTTTTTTTT>
##$WBST= 1024
##$WBSW= 4
##$XGAIN= (0..3)
0 0 0 0 
##$XL= 0
##$YL= 0
##$YMAX_a= 484635
##$YMIN_a= -756518
##$ZGOPTNS= <>
##$ZL1= 120
##$ZL2= 120
##$ZL3= 120
##$ZL4= 120
##$ABSF1= 10
##$ABSF2= 0
##$ABSG= 5
##$ABSL= 3
##$ALPHA= 0
##$AQORDER= 0
##$ASSFAC= 0
##$ASSFACI= 0
##$ASSFACX= 0
##$ASSWID= 0
##$AUNMP= <proc_1d>
##$AZFE= 0.1
##$AZFW= 0.1
##$BCFW= 1
##$BC_mod= 2
##$BYTORDP= 1
##$COROFFS= 0
##$CY= 11.3945322036743
##$DATMOD= 1
##$DC= 2
##$DFILT= <>
##$DTYPP= 0
##$F1P= 18.9103706918063
##$F2P= -1.10871071338519
##$FCOR= 0.5
##$FTSIZE= 0
##$FT_mod= 4
##$GAMMA= 1
##$GB= 0.15
##$INTBC= 1
##$INTSCL= 1
##$ISEN= 128
##$LB= 0.24
##$LEV0= 0
##$LPBIN= 0
##$MAXI= 10000
##$MC2= 0
##$MEAN= 0
##$ME_mod= 0
##$MI= 1.114404
##$NCOEF= 0
##$NC_proc= 0
##$NLEV= 6
##$NOISF1= 3.799351
##$NOISF2= 2.8
##$NSP= 1
##$NTH_PI= 0
##$NZP= 0
##$OFFSET= 15.70392
##$PC= 1
##$PHC0= -9215.394
##$PHC1= 20.00025
##$PH_mod= 1
##$PKNL= yes
##$PPARMOD= 0
##$PSCAL= 0
##$PSIGN= 0
##$REVERSE= no
##$SF= 200.130013532006
##$SI= 16384
##$SIGF1= 3
##$SIGF2= 2
##$SINO= 400
##$SIOLD= 16384
##$SREGLST= <1H.CDCl3>
##$SSB= 0
##$STSI= 0
##$STSR= 0
##$SW_p= 3612.71676300578
##$SYMM= 0
##$S_DEV= 0
##$TDeff= 0
##$TDoff= 0
##$TI= <>
##$TILT= no
##$TM1= 0
##$TM2= 0
##$TOPLEV= 0
##$USERP1= <user>
##$USERP2= <user>
##$USERP3= <user>
##$USERP4= <user>
##$USERP5= <user>
##$WDW= 1
##$XDIM= 8192
##$YMAX_p= 0
##$YMIN_p= 0
$$ End of Bruker specific parameters
$$ ---------------------------------
##NTUPLES= NMR FID
##VAR_NAME=  TIME,          FID/REAL,        FID/IMAG
##SYMBOL=    X,             R,               I
##VAR_TYPE=  INDEPENDENT,   DEPENDENT,       DEPENDENT
##VAR_FORM=  AFFN,          ASDF,            ASDF
##VAR_DIM=   8192,          8192,            8192
##UNITS=     SECONDS,       ARBITRARY UNITS, ARBITRARY UNITS
##FACTOR=    0.0002004,     1,               1
##FIRST=     0,             0,               0
##LAST=      1.6414764,     0,               0
##MIN=       0,             -756518,         0
##MAX=       1.6414764,     484635,          0
$$ Real data points
##PAGE= N=1
##DATA TABLE= (X++(R..R)), XYDATA
$$ [...]
2237d108K219M687j305l727J295K930j645k299K343K400j303l107Q89K285j49
2252A405j412J036P67j646j754J873L110n00m739j406L726K250j748j915J4l57
2268a296j248K013M190k386o084J22O339J886l474k387P60K80L51L475R98m575
2284a036l143L101N095m28l269j796j39J249L059M38k718k697L90K647Q01l92
2300A162j429j902p57L345K387k444l269P09K365k81q52J639m09k367J68K761
2316H26J238j759k029J305J162p14l30J615L53j848j949J758L416o46l568j006
2332b176K157O90j367J262J060k979l787L423N418j526o359m03M597J217k211
2347i84P03J044l545j992N503M770l999o845K199N830P34k875o40M11j708J33
$$ y = [-4108, -1889, 2798, 1493, -2234, -939, 1991, 346, -1953, 390, 2790, 1487, -1620, -731, 1554, 1405, -7, 1029, 1796, 150, -1604, 269, 3379, 2879, -1860, -3266, 460, 2710, 962, -953, -939, -1296, -2544, -531, 3659, 1273, -4811, -4689, 1650, 3536, 62, -2325, -1565, -1285, -934, 2541, 3539, -1036, -4179, -1078, 4017, 3589, 320, -1476, -1615, -366, 2693, 3131, 413, -2284, -1894, 753, 1554, 1162, -267, -2169, -2926, 419, 2806, 362, -2907, -2198, 167, -114, -966, 673, 264, -2103, -1935, 826, 2064, 305, -1724, -419, 743, 29, -301, 1314, 1667, -181, -2130, -372, 3044, 2398, -1170, -2176, -19, 671, -696, 566, 1626, -1353, -5140, -1717, 3701, 2175, -4184, -4587, 10, 1227, -984, -281, 763, -2782, -4774, 729, 5499, 1500, -5345, -3146, 2684, 3418, 543, -97, 314, -1394, -1261]
2363a261L813K217m602m296K324N016J77l962j363J082P31k17Q57J046k276k865
2379c579J440M002k51l394p16K142P31j127M96J525j093k576J262K758K98j863
2395E5j40r2lK65Q97Q67q51k093O2J429J749n10k457j801J321K609L12j782j062
2414a225l25l92J903K707o63m909j002M142L519k002l244p9J379J011O49J404
2430B873r65m158k24M637K983l429m064Q89L241rj335O8J72k305n65L504J991
2447C304l679l941K315M505j262l565J315K147j864j605K459K938k802l094K141
2462f88L425j666k418J721K440k306k338K895K649k156l307J202K562p13j468
2477a66J205P47k326j517K747K440k614l059J50L000J040j266j186j02n98N35
$$ y = [-1261, 2552, 4769, 167, -4129, -1805, 3211, 3388, -574, -1937, -855, -124, -341, 516, 1562, -714, -3579, -2139, 1863, 1612, -1782, -2498, -356, 375, -752, -256, 1269, 176, -2400, -1138, 1620, 1918, 55, -85, -177, -180, 85, 982, 1849, 998, -1095, -1033, 396, 2145, 1635, -822, -2623, -1302, 1307, 1619, -163, -1225, -1550, -1942, -39, 2668, 2005, -2904, -3906, 236, 3755, 1753, -1491, -1570, -191, 820, 1469, 2873, 1908, -2250, -2474, 2163, 5146, 1717, -2347, -1458, 1783, 1774, 439, 507, 679, -1626, -2191, 1313, 3304, -375, -4316, -2001, 2504, 1242, -2323, -1008, 1139, -725, -2330, 129, 3067, 265, -2829, -688, 2737, 1071, -1347, 374, 2814, 508, -1830, 1065, 3714, 1558, -1749, -547, 2015, 1302, -166, 1039, 1786, -540, -2057, 690, 3130, 516, -2543, -2393, 607, 1647, 381, -805, -907, -1505, -970]
2493i70K184J000k138k727J156L367J299k236k129L34J262J440k06p93j036p20
2509i13Q50J915K93k135j855M00K533O54j827j457K65J046o4J2L73o8k006J58
2527a826K323Q44j972j259J903R73j076r30J803J044j931j169K194J172j742j466
2543a115J595J371k354p74K491Q50k656k473K729K299j734k781J288J960j850
2558a154o28K231M11l418j020L641K475k647k722J450K636r27j062J220O4j970
2574a420J37K850J547k959k502K104K099k64k169L19M02q58K79J265L16k396j062
2591b312J679K102j309j756J64J077Q9m12L55K42n83m75R69N56k95p50O5J056
2609D62j63k76P7M26L1j76l80k64O62J28j73q78J82K53q0n9L64o61r28J78J830
$$ y = [-970, 1214, 2214, 76, -2651, -1495, 1872, 3171, 935, -1194, -860, 402, 1842, 1636, 843, -193, -913, -63, 1852, 2145, 10, -1845, -1445, 1088, 1742, -85, -1542, -1277, -231, -295, -283, 90, 22, -1984, -1826, 497, 1341, -631, -1890, 13, 986, -90, -1020, 783, 1827, -104, -1273, 921, 2093, 351, -1115, 480, 1851, -503, -1277, 1214, 2064, -592, -3065, -336, 1963, 229, -2552, -1264, 696, -1154, -1782, 449, 860, -2558, -3578, 63, 2538, -109, -2831, -1381, 1255, 328, -734, 486, 550, -1420, -1283, 1567, 3114, 155, -2347, -243, 1856, 1592, -577, -258, 144, -714, -435, 830, 1146, -1250, -2312, -633, 1469, 160, -1596, -1432, -355, -266, -678, -323, -81, -664, -1139, -170, 386, 91, -659, -594, 462, 299, 23, 100, 526, 557, 381, 1, -263, 399, 527, 354, -524, -342, -89, -169, -228, 136, -525, -1453, -1275, 555]
2630E55J43j671j394J223J900p13q46M18N02j084L49J999K87k742o88K696J862
2647B796k092j647J025J319q85m80J425k21k035k62K381M84k238j621K097J148
2663A194j245j085J044N18j891J10J674M39j961m66K154J122j916r21J192J332
2679A294j362n76J009J060j366o24J362O05j550l20J815N06j733r36J326L66r93
2696a17l15O78o7j145M56J065n82j216N51J148k00j82l56o4j22J241L43p86p86
2715d56N87Q48N9r4m73k54o1P95N51p52r41j39P60K72m20n10m06N77L22m47j06
2736b88j74q33J70J207J92j221r35Q78J668o10j348Q74J256j019q72J819L22j654
2754e68P5J499R63k331k27J778P09k096j96R47L79j277K77J202p93j575P97J732
$$ y = [555, 698, -973, -2367, -1144, 756, 43, -803, -385, 117, -967, -618, 1381, 1668, -1074, -1762, 934, 2796, 704, -943, 82, 1401, 516, 36, 1461, 1240, -795, -1057, 1324, 1808, -430, -2051, 46, 1194, -51, -1136, -92, 426, -1465, -1355, 319, 758, -1203, -1669, 485, 1607, -309, -1230, -38, 1294, -68, -644, 365, 1425, 59, -565, 797, 1402, -148, -468, 1347, 1853, 120, -816, 510, 876, -117, -432, 246, 179, -966, -510, 555, -27, -1243, -692, 456, 256, 74, -282, -346, -468, 773, 1116, 330, -456, 131, 979, 1038, 944, 471, 217, 156, 951, 1502, 750, -191, -330, 430, 702, 282, -228, -634, -57, 265, -182, -288, -462, -1295, -1125, 82, 274, -947, -1882, -1004, 664, 54, -1294, -420, 836, -183, -1055, 764, 1086, -568, -493, 1006, 1969, -362, -589, 1189, 1898, -198, -394, 553, 932, -345, -68, 1134, 341, -1234, -437, 1295]
2772A295p08j635l96J810j83m45j81j04P0K76K45Q09p46r72l22J764J281j578
2790B80j557R40J208j75n92M9k21j092P24J713j40k072n33J674O50j255l63N19
2808b43o96l87J243N63j611q02J402Q74o33l41J52K18m71J240M16r37q07J262
2826D42P91r60l44P87L45r25K71P14q67l98O68O78r03j101N72J046l23p68m2l85
2846g02N56J02K80p54l79j45M03J309K72j813r07J275K000p40j383M60M68p56
2864d54L22J922m93k775m26L687O31k718p24J419Mj317J091J230k180j650J370
2881a061K662j034j756j35J135N94n69M44M0q32j46R85J122o24j221K60R52O24
2899A440l49p92M75J86o41k50P09M56j423k35J102J01j410J18J291l51j454J32
$$ y = [1295, 587, -1048, -1444, 366, 183, -262, -443, -547, -477, -201, 44, 853, 107, -865, -1187, 577, 1858, 280, -1277, -337, 871, 696, 104, 153, -68, -1160, -436, 1277, 1137, -935, -1468, 206, 856, -399, -762, -243, -939, -1326, -83, 480, -1131, -1933, -531, 343, -290, -631, -479, -261, -732, 508, 924, -13, -820, 442, 1233, 273, -71, 716, 1061, 136, 407, 1121, 254, -144, 524, 1202, 299, -802, -230, 816, 493, -275, -317, -702, -146, -44, 236, -518, -897, -1042, -639, 670, 942, -871, -1778, -503, 1497, 757, -626, -166, 302, -454, -132, 1790, 1297, -1478, -1904, 1783, 2414, -304, -1028, 391, 395, -922, 169, 1399, -781, -2431, -1061, 1601, 567, -1189, -1324, -189, 405, -164, 280, 320, -512, -658, 327, 1449, 825, -396, -136, 816, 1440, 1091, 299, 774, 960, 319, 69, 778, 1234, -189, -424, 678, 779, -631, -513, 778, 427, -1027, -895]
2917h95J353l72m45k22N40q58Q7K067m79j611J0J260L18pk62k62q60O59J583M86
2937B090k578q38J759Q10q59J47l0j237n29J661J581j715k229N04K001N0q94R4
2955b12m96m71N5J531L38j076j363N79K068r6j016q56R42Q64k92l25R68k46k004
2974a108N22K194K01k430l18J798K21k011N74J789o46k785R92K244q15j839O45
2991g72J582j386j484J889J226j233j853J075J797m35o55J2J42m04L21J014M11
3008A247j290q60N01J597M33j650j061L57P26M69j66m75r48m51O97J868n72j519
3026a097j133J133J084j2l05o04k97j2J338L97q59k41j10M31R30N88n54j146r3
3045e62J667R7j096m48R76m61r19Q92R92q45j615M56J908j307q58R06L46r46j250
$$ y = [-895, 458, 86, -359, -581, -41, -899, -812, 1255, 776, -835, -825, 435, 753, 746, 484, 222, -638, 21, 1604, 2090, -488, -1326, 433, 1243, 384, 531, 501, -736, -1265, 396, 1977, 262, -1967, -1463, 538, 588, -306, -212, -708, -1179, -1124, 407, 745, -331, -1694, -1115, 953, 857, -159, -1015, -73, 791, 499, 174, 1142, 896, -1108, -586, 1608, 1809, -621, -939, 859, 1080, -931, -357, 1432, 786, -1999, -1007, 1237, 422, -1417, -772, 810, -576, -2060, -171, 1055, -178, -2031, -956, 841, 406, -249, -237, -95, -499, -178, 836, 1247, -43, -903, -402, 1195, 1628, -22, -1083, -726, 0, 469, 303, -172, -1120, -1571, -874, 994, 422, -1097, -2230, -1097, -13, -25, -330, -934, -1231, -1243, 95, 492, -367, -608, -718, -287, 643, 1231, 677, -469, -562, 1105, 1202, 106, -342, 634, 173, -746, 146, 1138, 293, -1322, -866, 1042, -265, -1123, -217, 129, -817, -2067]
3064b067J542J449j218j741J024J203k57m41N37K98j207m53J659J842j462k065
3080a357O62J595O95j467k86K23l49o04J668J104j516k545R41K903m42k363l3
3097a171J347m90n95J414P46j824j576J761K100p87j681j13J389o9l24P81m8j081
3115b21K44P25O76o64r35N04M85m74L11m74M58o15k03L9j74P34p27j51j20P3M04
3136a05J85M7n58p6j9R02K89l58n25m37P20Q93R1p62o66N61O18LM62n24j004o49
3158i12J712J461j602j558J01J415K97q01l9j97j224J72J989R19j763j968J248
3175g50J610j05j787R50N89p64j18J336Q63k216q20J998J223j255j352O89J201
3192A292r28p66J103P01j389p09Q40R76j215j036J388N83j148r51J352O64q20
$$ y = [-2067, -525, 924, -294, -2035, -1011, 192, -65, -506, 31, 329, -878, -1331, 328, 2170, 708, -1357, -695, 900, 1595, 128, -158, 65, -284, -888, 780, 1884, 368, -2177, -1236, 1667, 1225, -1138, -1171, 176, -314, -909, 505, 1251, -573, -2149, -388, 1712, 925, -756, -869, 520, 451, 127, 908, 860, -221, 23, 748, 1424, 760, -175, 329, 814, 340, 651, 177, 635, 20, -183, -144, -318, 416, -311, -462, -582, -509, -105, 80, 127, -431, -507, -526, 376, 665, 307, -218, -655, 65, 958, 1049, 287, -379, 182, 800, 803, 1265, 741, -263, -912, 800, 2261, 659, -899, -798, 617, 914, 113, 74, -123, -1347, -1175, 814, 1733, -30, -1998, -750, 860, 755, -1032, -82, 507, -257, -375, 961, 1824, -392, -1212, 786, 2009, 754, -598, 91, 1292, 364, -402, 701, 1402, 13, -696, 144, 1120, -95, -1131, 257, 840, -308, -1259, 93, 757, -63]
3209f3r48M28O04l29o6P74j93j450M54J510Q26j252j247M20J484K7m92l64m90
3228c67J5O03Q48l97j295l55O62J194l02p97o90k62M81J166k48j296j90N02Q98
3247A70K0m75k31l47L48Q95P37j149r44Q62J053k75q11J73N25k54k15P92Q3j348
3267c91m16J169O81j309r53R60J095j017r24Q03M58n70l87N66M38r11p42J774
3285C24J55j287m61J185P29o77o43O13N44l89j74P22L8j567J99J803N71j584j187
3304a086P29P70j59m21J12j62r76O72J204k64j354o82J274O81Rj060l8K91N90
3323A30K12L60o69j054O44J256P3r06m65M74P75k23m73N3l52k24Q25Ln17l85M60
3344cJ87l60J75k2l42j35L34kl16l81L33Q86o28o30M42N80K22o42N22k0l96J2
$$ y = [-63, -1011, -583, 21, -308, -374, 400, 207, -1243, -789, 721, 1547, 295, -952, -532, 952, 979, 487, 123, -367, -352, 251, 1099, 702, -593, -948, -286, 908, 606, -191, -881, -1143, -662, 504, 256, -1040, -1230, -728, 170, 190, -285, -516, -863, -515, 380, 1117, -32, -976, -114, 939, 664, -147, 26, 551, 297, 82, 874, 957, -391, -807, 362, 1043, -266, -1219, -259, 836, -181, -1105, -302, 156, -414, -801, -235, 203, -708, -1450, 324, 479, -808, -1269, -84, 645, -32, -675, -62, 482, 93, -81, 641, 679, -888, -689, 1114, 1685, 101, -1086, -357, 413, 254, -167, -55, -217, -1193, -521, 683, 419, -935, -1617, -343, 338, 347, -713, -751, -460, 130, 342, 702, 33, -1021, -377, 879, 952, 46, -419, 55, 830, 607, 134, 187, -165, -389, 436, 439, -78, -463, -3, 184, -176, -1, -23, -365, -500, -166, -168, -484, -865, -532, 354, -274, -904, -462, 118, 340, -302, 220, 200, -196, -184]
3366a84J198j91q14m03P50P62o36m93j87N18k97L03L50m04j027l15J331M39r64
3385b64p44L72R14j36q76O80j95o34M05J006M07j543k26J277P98r90l67Q09l52
3404C41J65k14O81m66j006N10P58l41p26o1K88N6j30j57rj11k43M8N04l71m90
3425i74O26J52j25j61l25R54m1K03l38J00M5J03J13K46j78m38K75P15j81n21k41
3446IJ31L47P4k39l66n44J04J127m53p48k63N88K45n42M76O5o80k34R81Q38j235
3467c19o91R94O49p28q5N31j67n44O81P24n64o53L5N82O6n10l10j6J12j11l7j64
3489e25L0P1m09O66J06n07p53J018O61o27n43J30P42o8k73L63L78p59L9J455m07
3510G88j054q5J212J23p11j00N77o16j80R53k62o03q06Q61P57n58p01J26l65J57
$$ y = [-184, 1014, 823, 9, -394, 356, 1118, 482, -11, -198, 320, 23, 326, 676, 272, -755, -1070, 261, 700, -264, -1008, -636, 278, 142, -734, -54, -249, -883, -478, 528, 935, -608, -834, 443, 1241, 251, -116, 693, 341, 506, 292, 973, 507, -499, 11, 769, 428, -298, -359, -71, -15, -145, -302, -311, -422, -665, -617, -113, -484, -974, -348, -196, -321, -482, -807, 147, 106, 309, -29, 71, 116, 219, 332, 578, 400, -38, 237, 952, 771, 250, 9, 140, 487, 561, 322, -44, -588, -484, 643, 190, -558, -821, -233, 12, -530, -54, 11, -669, -903, 78, 916, -319, -1010, -16, 633, -95, -180, 351, 184, -360, 321, 1045, 481, -172, -137, 445, 511, 1, -309, -325, -213, -324, -361, -525, -495, -424, -833, -167, -61, -568, -1321, -303, 358, -269, -812, -682, 60, -8, -281, 82, 460, -299, -260, 1195, 788, -266, -351, 861, 984, 273, 173, 750, 134, -46, 907, 645, 42, -764, 97, 854, 296, -405, -279, -644, -487]
3530d87O48K42r66k17M83M53j03k00J17p06L77P47J35n14m96Q04J95R8j90k96
3550A24M8l2M06km51p67O67M09l36j95r9j21l0N37K24j051k1N16J12l08O3K91
3572a6l32J44M14M70j101R0R58M31q42k17O38r0m17M75K01o06o86J044O35p02
3592D91p20p3N59K7n3j43l73k98N43N01j51l23n88o8N99P74n97q35K05R27K88
3613F92o36q2J04l47M23J221k40j414j77P90O40j004k48O38m07n55R27P74j178
3632g9p40N70Q77p76o72M21K29m05p1Q16o40j61N14K4k78L3N74j91l68P49l06
3653A20K17n40N28O60q65m01N96N24n18k14j21j34p1P40l9r94j19N20k26J45L06
3674A14n92k41K0R05rm81l89J49J31L88N76l88q45j05J537k4j007j40O24J60o13
$$ y = [-487, 161, 403, -563, -780, -297, 156, 53, -147, -30, -736, -359, 388, 523, 9, -487, 317, 512, 610, 420, 124, 172, 140, 546, 544, 93, -674, -7, 402, 66, -129, -228, -349, -379, 158, 382, -669, -690, -174, -62, -370, -307, -16, -348, -204, 210, 680, -421, -331, 627, 1058, 216, -1, 637, 547, 130, 605, 806, 200, -486, 558, 1193, 491, -229, -302, 257, 284, 231, 88, -285, -583, -40, 461, 310, -13, -601, -669, -70, 704, 107, -728, -523, 404, 692, 56, -26, 78, -269, 154, 1375, 1135, -279, -456, 334, 974, -30, -278, 360, -47, -602, 325, 1099, -79, -819, -249, 628, -148, -820, -399, -170, -575, -646, 170, -470, -631, -117, -93, -371, -338, 236, 45, -323, 426, 120, 337, -203, 325, 985, 120, -281, 315, 839, 321, 107, -14, -148, -219, 521, 482, -512, -631, -111, -337, -192, 114, -478, -719, -699, 206, 197, -284, -673, -524, -393, -5, 571, 183, -662, -767, 770, 746, -261, -401, 223, 383, -230]
3695b30O76N36j132q12R25R99j010n55L05J91m47K1O46m08m04m54P66M63q64K04
3715e84r2N94l45m2Q4L65J15l25j35P64l03m9K69p8jl78K45M60k8q16J2N28J3
3738B73n33r5M98n23Q5M76k23q51l69Q46L27p4l71J34l42Q8R76K26r73k38N44
3759a19O61j76k22j87l63K96M53O52q67k96r6N47Q0n23l5j00j45K24N64m11k41
3780c04m51O46M61l20o08P0p0M32j06J10R9K99m67N5O36M4o70N47O42o11q89O42
3802A87P84l42q93J47Q15l30l15L62J77r86o13J313N93j014j074M53R95J4m38
3821a65J71k63n21K69J327l01j055j15O09P29j00j35n94N2J04N01Q08j107o34
3840d20O17M63N26p08q50l6N33j08J35n97j8LK49O80j96o70r9L84J2m02K48L97
$$ y = [-230, 446, 982, -150, -962, -37, 962, -48, -603, -298, -107, -554, -533, 113, -295, -699, -1153, -387, 76, -788, -584, -676, -82, -427, -469, -385, -20, 95, -230, -365, 399, 96, 47, 316, 238, 237, -141, 104, 564, 536, -280, -268, 260, 273, -260, -355, 143, -380, -295, 181, -42, -893, -1262, -416, -89, -163, -534, -400, -742, -654, 322, 548, -425, -663, -119, 542, 366, 144, -43, -406, -110, 343, 995, 128, -168, -264, 283, 363, -160, -195, -295, -440, -216, 348, -63, -304, -755, -109, 352, 32, -576, -506, -576, -144, -250, -140, -41, 258, -209, -154, 482, 526, -144, 403, 1045, 434, -455, 187, 971, 629, -264, -117, 698, 368, 53, 415, 592, -394, -1007, 306, 899, -115, -1189, -736, 259, 273, -165, 6, -257, -778, -509, 818, 517, -538, -653, -44, 685, 585, 450, -144, -92, 12, 513, 1321, 214, -420, 197, 660, 1186, 478, -372, -408, 125, 17, 152, -445, -463, -460, -211, 469, 273, -397, -496, -112, -100, -502, -254, 143]
3862A43j59P0L36Nn30J76N39L65j079L9M88J81k44J29k83j6r2N34J78p80n95K10
3884c85J203n04p65k10K85L32J76j68K07r74L8N83O73m39j111O45Q41n0K2j04
3904B95K5q31N17J017n5j229m47J277O02m53j069L42K37k09J61K93m35o32k84
3923h78J051Q7n99n72N00L65l20J82J20O6o07M41L03k0n25K59P56J67p70K3J19
3944A48J98j2j1N0j91m19M20M42n64o27K66P10l61j73j40K6mK18q6k14o23Q0Q66
3967aN66q03n39N05K36L50M55n31m58m29R73N51m89o08k0R78j26m93K58o3p93
3988d81O16O03Kp94p63P60N81l70r23M83o8K10n7L39l4o41J43L74M53p29l71P55
4010H8L16l99l60N73L65l93K59M09n79n85J93P62J60q98j65O05K7o8n00K16j4
$$ y = [143, -16, 54, 390, 395, -135, 41, 580, 945, -134, -95, 393, 574, 330, 459, 176, 160, 68, 602, 780, 0, -595, -385, 818, 314, -451, -661, -376, -44, 132, -36, 171, -803, -765, -182, 491, 52, -1059, -414, 427, 377, 399, 295, 320, -511, 6, 1023, 968, -261, -708, 569, 1171, 718, -351, -9, 228, 19, 180, 473, 38, -594, -878, 173, 260, -339, -911, -411, -46, -366, -184, -64, 2, -605, -164, 139, 119, -406, -147, 609, 776, 6, 29, 148, 346, 334, 323, 373, 182, -237, 183, 625, 61, -566, -300, 410, 49, -124, -264, -238, -242, -24, -110, -324, -947, -867, -1, 565, -238, -777, -272, -36, 314, 769, 238, -220, -649, 324, 875, 386, -222, -242, 736, 610, 117, 375, 312, -481, 135, 738, 740, -54, -817, -57, 524, 154, -769, -286, -354, -144, -201, 138, 104, -537, -394, -20, 433, -296, -667, 88, 404, 5, -355, 218, 583, 190, 449, 858, 279, -306, -113, 649, 809, -89, -254, 351, 378, 310, -190, 26, 12]
4031A2m55L28K88l99o75M43O46j64l22l07N82J34O5J29n6m96L9L29R18o60l88
4052iL9Q4M22j20J52p06J04l4N35J85j150R0N23L26o45J9k00L08l57K82J15m45
4074d82j55O65J65R2l06k82M64M1l26K45L37n56k0M18M12r14M38p7O69m62m96
4095a30m3N43j16l57N23j58p43k2P49O1j016q1M76N97m08l54K64k90L5L80M80
4116C90k97m68J45O00J76p03q9M23O8j3O3j25j86k91O34M73m01p56J27L13K42
4137C25m87n85J16K46P4L14J42n43j42R1M42K68j096L60M37Q6k95K39K43m44L6
4158a73M25L59p81J82M20K60l62l47R9K00m73M90O4p19l6N14M30p89m85J32N44
4179d6j69K03j83l6l48K81O37n7p46j6O53J66l14k70J59L19J97J14J27n11O5l91
$$ y = [12, -443, -115, 173, -226, -901, -458, 188, 24, -298, -605, -23, 111, 176, 305, 249, -247, -208, 121, 1039, 379, -9, 30, 114, 536, 416, 568, -138, -34, -68, 467, 652, -498, -408, 115, 441, -204, -185, -385, -77, -434, -152, -37, -482, -637, 28, 193, 285, -21, -303, 161, 202, -124, 121, 458, -98, -118, 300, 712, -202, 236, 159, 828, 366, -130, -173, 370, 254, -103, 420, 262, -481, -503, 246, 307, -709, -790, -314, 283, -125, -479, -215, -505, -470, -90, 390, 93, -375, -230, 370, 546, -157, -246, 177, 245, 232, 295, 170, -16, -307, 327, 800, 399, -357, -230, 83, 325, -162, -747, -631, -385, -311, 3, 145, -398, -540, -449, -7, 261, -835, -475, -38, 48, -247, -8, 235, -209, -173, 252, 611, -170, 12, 432, 692, 330, -17, 82, 282, -191, 299, 363, -356, -392, 122, 552, -237, -722, -590, -46, -215, -12, -195, -231, -579, -298, 339, 282, -464, -480, 173, 339, 25, -245, -86, 233, 430, 544, 671, 160, 225, -166]
4201a66P23p4m85m63K15Q77l55m20J85Ko72N36M08l19r50J64R31K13q18k75R12
4222A69m89L6N70J24o44k03M72O27k99o17M74k7n5j40R6Q6k12J77M64m36j48N6
4244H1l39M72m5m50JK13K58o3l14LJ32l14M51m4m7l97L85O31j42m22n22N89J1
4267A28L59Q9l35l3k93R05K41j142l41M72K8K16k29L26q56l69O31O02m95n11N03
4288a04J02j83L13j23l43l14M96K65J87l35JM90j21j52LK51l66K12J13N8l55k17
4310a22K76J01k01j07j3O4M25j97o24K10l0P5j49L54J70o34J28L64P0m88j97P77
4332B52J51n84J6L92K9n10Q87J92o80l59M41M07l42l87K79j62k19M03L71m73n33
4353d29R9K53J19k93j8l48K95L67N6K8p09L85L16j24j1Q7o7k34M51J27Rk26K2
$$ y = [-166, 557, 483, -2, -465, -250, 627, 272, -148, 37, 39, -633, -97, 311, -8, -958, -794, 137, 350, -468, -743, 169, -320, -284, 286, 410, -234, -437, 35, 662, 363, -254, 220, 193, 138, -2, 94, 180, -32, 145, 609, 173, 25, 81, -258, 214, 169, -281, -280, -67, 191, 128, -186, -183, -51, -365, 86, 42, -5, -402, -17, 614, 472, 50, -472, 117, 128, 487, 576, 241, 208, -85, 820, 1061, -81, -422, 50, 78, 294, 65, 391, -465, -834, -203, 399, -96, -607, -104, -2, -185, 128, 5, -338, -652, -156, 109, 296, -39, -38, 452, 331, 179, 182, 433, 67, 279, 392, 450, 95, -122, 154, 255, 54, -53, -66, -2, 423, 226, -398, -188, -218, -143, -292, 62, 232, -402, -274, 90, 160, -328, -525, 252, 403, -181, -165, 227, 256, -254, 633, 825, 145, -214, 227, 634, 292, -95, 184, 22, -197, 206, 577, 104, -429, -330, -77, 42, -251, -269, -617, -322, 45, 101, 129, -580, -195, 121, -3, -14, 73, 6, -228, 223, 350, 359, 133, 155]
4376A55O2M9m7J64m15kL74Q6k67l35Q6r2l98N97k0l07j0j8M47m99r5M69j35k33
4400c84Q0PK62m23M06K93k53o1K29J49k24j82L98PP0m25N36k84l74M10K3l4m51
4423b25J2J75J22j16q4j55J45p2OM02k32j38m43M38K95N4l84m30P48jl03N48m9
4446C13j51l56M97N27o54m37L61K37j22l15J78J64l14j74K33o7k50K16O1J00k65
4467b18m2n7K50r6l5J44m33N68N3j87j30N53l85J66J75k27P4J80K26j05l11J34
4489B97K6K49l77N4k41Rq8o0J80j51j98r9J74J72n6j12l01j80N50L18k75l52L59
4512a02M33n15J30O32p24j72M29K50n24J02K62J57n74M44J6J57m39n2L07j38k03
4533a24j6O9j46O7j30K16j87L3j82K59L22o10L74r1%j00J84M19l62J51l55K46
$$ y = [155, 217, 266, 219, 383, -32, -34, 340, 426, 159, -176, -90, -182, -580, 17, -3, -310, -320, -338, 109, -390, -485, -16, -151, -384, -304, -297, -35, -458, -52, 241, -12, -73, 156, 305, 81, -101, 297, 304, 374, -51, 485, 201, -173, 237, 260, 226, -225, -213, -38, 84, -32, -116, -271, -126, -198, -192, 210, -22, -160, -603, -165, 130, 184, -200, -630, 118, 117, -186, 362, 313, 162, -194, 303, 830, 176, -261, 100, 337, 215, -100, 78, 242, -72, -246, -13, -80, -330, -114, -53, 47, -218, -260, -317, -67, -163, -198, -54, -487, 81, 134, -53, -183, 370, -15, 151, 326, 99, 173, 353, 579, 474, 163, 297, 323, 572, 195, 249, 8, 17, -71, -131, 49, -102, -300, -399, -225, -53, -109, -221, -522, -702, -152, 166, -109, -461, -102, 331, -184, -54, 578, -146, -318, 111, 361, -163, -61, 201, 358, -216, 228, 244, 401, -38, -90, 217, 79, -124, -140, -71, -217, -150, -280, -64, -251, -218, -400, -141, 181, -429, -55, -146, -146, -246, -62, 357, -5, 146, -209, 37]
4555C7O9l4j51J93J60k33K31L69k53o87R1J70J20n7o5k44K88j76p2L53o68L14
4577b45n0K81l83l2R9J92j14J59K10k30o3J73O17l49l49M79n77K59J07Q2N6l2
4599B90k60K11k65M9J22j53L8J61k74j9l2J1k81K62j40K99l13K90O4k97J9K37
4621A9J03j86n4K22J30pj81K99j40m89L03N18R3m51j27k78O27j36n28L23k72r
4643b21R1J78p0j99m18N40J20l84J04j17L17P6N3J00mk70J8M36K86l17j44l8J93
4666C30m31N65k44k51J25L2K11l73k19K41p9K67k78Q6r6o7k28M25n2l57L50k5
4688f8P4j02mJ27O8k41J36O0m8J14K02j2L4l78K67L79k49q5k06K78k84K45j37
4711A70j59m72K07M47K72q16k33M69j35P7l0M0l69k2N47J35K7k07j46K36J19L31
$$ y = [37, 106, 72, -79, 114, 274, 41, 272, 641, 388, -299, -208, -38, 82, 25, -40, -284, 4, -172, -244, 109, -559, -245, -295, -14, -397, -429, -330, -138, -252, -93, 117, -113, -176, -3, 614, 265, -84, 395, -182, 77, 184, 266, 322, 290, 30, 241, -24, 25, 147, -6, 32, 193, -81, -100, -132, -121, -402, -140, -280, 19, -294, -4, 60, -237, -218, 19, 122, -64, -118, 104, 234, 227, 46, 345, 205, -284, 19, 537, 630, 179, 52, -226, 401, 265, -263, 60, -212, -221, -130, 48, -22, -221, -639, -99, 21, -363, -259, -376, -59, 17, 70, 170, 166, -104, -86, 350, 636, 319, 175, 137, 330, -101, 464, 220, -31, 94, 126, 337, -36, -255, -14, -93, 174, -104, -18, -114, -181, -409, 16, -36, -393, -43, -68, 6, -96, -100, 27, 95, -146, -10, 50, 2, 116, 318, 306, 340, -38, 229, 608, 359, 274, 68, 346, 62, 307, 170, 11, -461, -254, 193, 465, -351, -584, -115, -250, -173, -203, -163, -532, -554, -7, 128, 155, -52, -198, 38, 157, 488]
4733D88m57J12o3j17q1M15l4m59K83J17L7p0m75j10Q82n32j89R4K51O4l84P2k13
4756c69M3n7L27J5l62J69J87K23l01l07O13j9j48K10k0k44NP6L58q3M7l40n0P6
4780D9P3o6P0k78j13N38k01j55j85O6L9k8M3Jj26j58L03mJ62m07M22J59p8j12
4804A4n3O0J33o3J03J55l56j91M94J00l27k17N7M75l19k26J62k54k7q3O76m00
4826h7O7l10J30L54m72J05K39j58k1j56J13N7N4K67K32j44j16l62L06J47k97M8
4848dN5L35l87P8oJ79o77J48L75Pn27K43n0M63o16L7M02m16J52K42K10l75p0K67
4872F5K94l25l51QL62L40j39n6m29J14J61R8J70m79M17N5p0o7q8J6l5j19p9p9
4896b16l2j8j45M69k18j16j99K59J21O9q1K36l32l3M44l1J60n21L78K79m73J60
$$ y = [488, 31, 143, 80, -37, -118, 297, 263, -196, 87, 204, 241, 171, -304, -414, 468, -64, -253, -159, 92, 156, -228, -156, -369, -326, -383, -56, -41, -403, -234, -47, 176, -125, -432, 181, 162, 14, 224, 204, -40, -35, 41, 399, 316, 363, 23, -27, 49, 122, 56, 126, -152, -265, 273, 72, -83, -268, -202, -163, -191, -148, -147, -273, -431, -128, -132, 30, -377, 45, 204, 126, 14, -39, 21, 154, 91, 194, 349, -7, -198, 296, 396, 69, -148, -91, 384, 65, -161, 1, -253, -280, -363, 313, -87, -20, -330, -200, 154, -318, -213, 26, -132, -153, -309, -196, -139, -85, 182, 414, 270, 154, -208, 98, 245, -52, -4, 51, 386, -1, 77, 71, 250, -427, -279, 96, 103, -424, -181, -231, 232, -384, -347, 55, -361, -209, 33, 243, -132, -202, 65, 359, 34, -317, -309, 53, 393, 254, 198, -231, -117, 44, 142, 312, -167, 250, 305, 235, 168, 80, 96, 61, -58, -137, -216, -248, -266, -411, 58, -160, -276, -475, -216, -95, -26, -107, 129, -203, -236, 208, 177, 337, -184, 194, 473, 0, 160]
4918A60j1L1J11m38N28P2n78J7J49N06n59k64J08J26l50M02L1n52p1L38M42r6
4940A02k76m9J5J57j01J05J13k89M1J83J64j14k95J75R2K78k72k71K07K26j71
4961B0m09M03P6q0k35L01k14m64J89K36K77o34M01K52l41n0L87k00l27r3N45K19
4983B59j46j70K31J12j15J76k87J97q0P0j3K52o33j09L50L8n1j21N7m83M38K29
5005B01j32n99J35J85K30p3J44l22j98L00J84o5pJ4j56M31j5k16j92L45K25l2
5027C87l39l1k4M52l36J48j84o58J44L79L08m71L0k6L1q9L80Nk42k94L59o9J15
5050b5R1n90P93k89l4K4J78m58L82p9Q8j3J67K49l86p5L63l02K45k92J18l42r4
5073b81M05l41o2K32L3m84K69K36o4j42K7JK17j75L20O9l77J19J90j2Q9l15L16
$$ y = [160, 149, 180, 291, -147, 381, 453, -125, -108, 41, 547, -12, -276, -168, -42, -392, 10, 41, -511, -582, -244, 198, 102, -174, -223, -208, -51, -152, -47, 66, -223, -182, 1, 165, 51, -244, -69, 23, 301, 29, -242, -35, 191, 20, -389, 14, 90, 10, -225, 76, -138, -602, -413, -177, 100, -534, -133, 119, -222, -272, 115, -85, -412, -505, 40, 259, 113, -57, 174, 286, 171, 347, 60, 257, 177, 247, 234, 486, -147, -256, 94, 132, 81, -40, 17, -466, -28, 201, 69, -530, -395, -210, 20, -53, 91, -231, -429, -129, 55, -10, -17, -3, -159, 272, 257, 41, -151, 194, 419, 387, 48, 17, -7, 445, 109, 257, 73, -585, -441, -62, 246, -225, -195, -221, -190, -279, 101, 106, -136, -430, -71, -140, -25, 66, -524, 269, -20, -54, -30, 148, -310, 72, -7, 81, 68, 235, 484, 98, 23, 386, 84, 329, 37, 155, -187, -281, 124, -217, -279, -47, -14, -498, -229, 7, -57, -199, -172, -171, 46, -129, 191, 260, -117, 2, 192, 180, 269, -46, 270]
5096B70m2M1k10K40k06j33N58j73j19m61J03p9N19k82R9o6o63M79J08j20M1j06
5118b02J61j02j27J52qN9j89L36p1j01K62k12K05q1L60k39r4L36l67j24M05k52
5140A07k17K42j3k34M9J92k66K40j15l45O16k14k26M9j98L39j59j02L84k56M1
5161h6K59P7l44J15J67O1J6R0nj87j60j47M03jj73R9o6J0J67k70Q4m08J32J78
5185A1mj62j44M50l06K55j08M1l28mM23j02k48J29M79l39m54L54O2M9O9n5m43
5208c75N09N7P0j30j94J71Kj7r3j14j24j9K03j90l4L6R4K82l56N61j45k93l54
5231d53M57J27j76k28nK95L0j47N66l01m4j46J51p5J90MN0k68L6P8r0l31J52J57
5255B9l33O7J02o1n8K54P6j52j80M95l16k76M9N52l84%R4J72j86J87j43K64q4
$$ y = [270, 228, 269, 59, 299, 93, -40, 518, 345, 226, -235, -132, -211, 308, 26, 125, 59, -604, -125, -17, -137, -96, -202, -41, -143, -270, -118, -126, -67, -256, 80, 9, -92, 170, -42, 163, 82, 442, 203, 109, 445, 78, -46, 359, 107, -110, 132, 119, -115, -66, 126, -140, 100, -15, -360, 256, 42, -184, -135, -333, 6, -153, -255, 129, -127, -86, 173, 250, -94, 21, 188, 249, 265, 355, 350, 163, 3, -144, 259, 258, 85, 184, 118, 128, 295, 25, 109, -299, -167, 11, 7, -155, -299, 151, -155, 100, -8, 33, -295, -299, 124, 22, -226, -97, 382, 43, -411, -57, 5, 54, 123, 68, -375, 134, 191, 261, 131, -63, 108, 110, 93, 0, -114, -238, -257, -54, -244, -278, -242, -148, 134, -222, 339, 194, -99, -453, 4, 131, -45, -273, -278, 17, 47, -100, 466, 165, 121, -25, 126, 51, 241, 245, 295, 27, 63, 141, 51, -280, -128, 29, -304, -237, -135, -196, -254, 0, 76, -76, -256, 239, -77, -353, -304, 248, -136, -136, -42, 130, -56, 131, -12, 252, 168]
5278A68%j2j18J63n59O40m05J86j97L87l32L5j25R5k8L0k62o7J47J73J64k57o
5301a80r4J65k2L12l02MK89j68r5K94k53J24K20k14L85j53j47j02J8J51J95k50
5323A77k30K40m33J08J85j99p8J83J44K0k44K58j14k25R9j92K22k25L28p8n6J02
5345hJ57o7J53l14L22l4J26k94K43k64M0O6j1K36m39K46r0J3K2k35O9Q8k08J78
5369eR2l55Q3k01K83P1j34J29j24q3N40m82K54O1j10o4L49Lk83Q1l85K59J26j0
5393I5M8j59k91K45K84l02J82k26K15R4l28j24L07lj39k2J04l47L8K55K65kMj54
5417C9J30q5L46k67k47M52qk91j4j93j8K11J28k76%p2K11j40LK16n55J36J56L16
5441A78k56j14K33j30J75J83l30k27K57o3O6qN9J04PQ4j51q3k45N71m52M5J97
$$ y = [168, 168, 156, 38, 201, -358, 282, -123, 63, -134, 253, -79, -44, -169, -74, -102, -72, -334, -401, -254, -81, 83, -174, -180, -274, -109, -131, 181, -121, -117, 172, 4, -91, 203, -50, 74, 294, 80, 465, 312, 165, 63, 81, 232, 427, 177, -53, 187, -246, -138, 47, -152, -230, -47, 97, 117, -127, 131, 17, -208, -109, -301, -79, -304, 24, -54, -110, -8, 149, 82, 235, -79, 243, 209, 335, 41, 284, 20, 60, 126, 115, 351, -88, 158, 68, 81, 103, -132, -63, 25, -183, -5, 87, -268, -185, -386, -103, -32, -166, -37, -161, -244, 296, -186, 68, 129, 19, -45, 304, 307, 24, 105, -280, -21, 105, 95, 143, -16, -307, -62, 222, -80, 102, -124, 91, 185, -143, -267, 40, 37, -102, -124, -20, -367, -329, -74, 191, 189, 193, 39, 169, 84, 430, 163, -84, 368, 360, 69, 55, -138, -156, 55, 183, -93, -93, -165, 46, -94, -91, 125, -430, -294, -138, 178, -78, -192, 41, -89, 86, 269, -61, -288, -31, -94, -28, -36, 23, 127, 134, 218, 67, -16, -261, 310, -142, -97, 100]
5464A00j36m81L37M51o0j25j24K0N3j1j60o6j29L46o0k79J39p2n0L05j58l9J88
5487a1J16k34O6L82j42Q2k78J69K79j61j16j26j9K56j24j67J34K12l64M7J09j33
5509b3o4ko3j00J96M5k43J32J10N5j25O1k40M41m34L1J70J08J9L5j23N7J82m55
5533b30J51K18l05q2L97j87J21j23R5j01J84R0j89o3j57k5L08L5m2k29l9L42j22
5556D7K7j87nJ25k98N20K31m30J11j20R5J58O1j98K4k3o5M1k19k5J5K69j51k54
5580b51J52p3K41m19K44k27O4K61qJ73l12K8K0J6j35K27j0K72j2n5m0l88M14o9
5604A13j83O72m17m06K18k03K47L5O2j63k9K20j50l75j69P19j62j73J22j93j67
5625c82m7M64J24k82O5J6k21J58O7K49l56K48R6o4Q2l7Q4J2k43j2k08M9Q8K17
$$ y = [100, -36, -517, -180, 271, 211, 86, -38, -18, 35, 24, -136, -202, -331, 15, -45, -324, -185, -257, -307, -2, -160, -199, -11, 105, -129, -63, 319, 177, 259, -19, 150, 429, 268, 152, 26, 7, 263, 139, -28, 106, 318, -46, 1, 110, -23, -87, -89, -152, -252, -56, -11, -254, -122, -12, 43, -82, -21, -261, 180, -254, -223, -53, 55, 74, 109, -14, 43, 225, -230, -79, 139, -166, -248, 149, -38, 83, -40, 55, -46, 138, 228, 39, -24, -181, -206, 102, 137, 95, -134, -173, 169, 47, 74, -113, -118, 7, -291, 229, 460, 30, 141, 21, 116, 274, 335, 137, 161, 138, 73, 114, -105, -130, -115, 154, 3, -251, -99, -172, 69, -350, -106, -333, -269, -8, -16, 157, -155, -127, -107, -91, -226, 1, -9, 263, 251, 196, 156, -232, 182, 113, -70, 602, 185, -221, -3, -206, 41, 76, 138, -25, -54, 166, 16, -359, -528, 191, 29, -144, -22, -215, -382, -429, 35, 159, -123, -58, -42, -263, -105, -38, 211, -145, 103, 199, 135, 217, 180, 264, 276, 33, 21, -187, -138, -50, 167]
5649A67k07k38J63M8J66l7k43n8L00j43N4o3n8j87O7Q0N4n0n5M21k26J93l89K35
5673fJ15k04L93j48j04q9M39m48j63J67J13P0l67k3M28l35L58k89K71j57l47P4
5695b52L02j77j95O5N14k38k28J82K23p0L9j19j03Q7K80l33o6O8J49J60j96k51
5717a59L99j79J71J55n07k2K09l36J80P4J84j33j02K61k51N4j77J23J72j64M64
5738D16k34m26J29M66j82P8r9l05L29k52J86j37ll6L34l96J3p9R1K42l77J84J08
5761E0k42K20m3k47j6J09K48j89J87j25K07j41Q2r6J21j89m6M21K4k84P9N4l96
5784b12N02k9l70K26j22k75M44l15J1K03j54j44j21M25k06l8o3M22m55P8j4L76
5806A69k29l13L12L52m04l12N28rj36J54j53K35m2M5j95N2lJ21j39J35o0N9L1
$$ y = [167, -40, -278, -115, -67, 99, 62, -181, -239, 61, -82, -28, -91, -149, -336, -269, -189, -135, -185, -240, 181, -45, 148, -241, -6, 109, -95, 298, 150, 46, -43, 396, -52, -215, -48, 65, 135, -232, -255, 173, -162, 196, -93, 178, 21, -326, -252, 50, -127, -322, -257, 257, 19, -209, -27, 196, 126, 165, 46, -57, 30, 310, -23, -89, -21, 128, 288, 92, -159, 240, 61, 232, 387, -120, -142, 67, -269, -89, -15, 169, 36, -66, 195, -56, -2, -179, -56, 116, -48, 416, 182, -244, -115, 351, 169, 247, 148, -157, 172, -80, 106, -31, -34, -70, 264, -132, -119, -198, -107, 135, -242, -58, 50, -192, 28, -15, -262, -278, -169, 79, -110, 77, -48, 159, 18, 100, 4, 125, -64, -110, 311, 335, 51, 130, 184, -212, 290, 261, -109, 117, -5, -280, 164, -151, -140, 63, -91, -235, -356, 69, -137, -175, -238, 184, -271, -193, -207, 169, -60, -373, -61, 291, -113, -425, 103, 94, -42, 112, -41, 194, 152, 197, 2, 54, 51, 172, 33, 168, 108, 167, 198]
5829A98p27O08l11J46J50j60k50M21J29l31J3k16K46P2K1o6P6RJ69l4k52L54k75
5852a0L11k53p6J35J48k00j69K60j49M5k45M86k69k63O06k39k8j00K15m38J74
5873e9L2k54K56j96j1J45L2l72K65Q7M02p6k25O0J99k01o3n3J76q4Q3k11j28J61
5897c5J17O7q5n1m1m9J32R9j9j39J55Lk48Q8J40j71K57j64p0l5L3N6k13k3M06
5922B10k37q6O3K41M6n3J10M4j41j92L4j22j54J86o7L95k73k91L35j56J10j29
5944a27K69k14N6J3j41K25l53j18M65r0m4J04j20J93Q4l88L61j28J92l7P5k55
5966B2P2J5r3j4k0L97n17N20m81K34J69l34KO0j0J95k8l42K36j76J13j2j64J99
5990D3j84J67J8R2j40k5KL05l65K89j10mj11M50l48k92K06l6K21j75P6kk48J55
$$ y = [198, -529, 79, -232, -86, 64, -96, -346, 75, 204, -127, -114, -330, -84, -12, 9, -57, 19, 28, 197, 163, -89, 265, -10, 301, 48, -28, 107, 255, 55, -114, 146, -3, 42, -203, 283, 14, -249, 357, 118, 90, -10, 205, -233, -59, -27, -281, -25, -221, -232, -87, -55, -427, -162, -75, 327, 251, 26, 86, 285, 84, 21, -32, 144, 60, 143, -68, -196, -35, 82, 149, 64, 13, -28, -77, 55, 154, 135, -4, 151, 154, -94, -6, 134, -37, 220, 56, -14, -49, -16, 40, -173, -196, 210, -27, -113, -50, 191, 237, 184, 294, 338, 197, 5, 39, -83, -237, -51, -118, 277, 4, -287, 48, -108, 2, -127, 142, -72, -16, -3, -144, 81, -272, -390, 75, -15, -59, 45, -75, 118, 202, -186, 175, 47, 239, 202, 277, 22, 94, 109, 16, 2, -18, 379, -138, 382, -99, 135, 304, -30, -28, 32, 22, 217, 189, -153, 83, -93, 20, 8, -156, 43, -141, 26, 44, 136, -4, -29, -27, 278, -87, 202, 92, 88, -23, 427, 79, -213, -7, -43, 178, 3, 79, 77, -171, -16]
6014a6r5r3R6n3J77mj69jRO9O8m8j20J13L8J84q6r1J06%L47l77J18j99L71m14
6040g0K83j38R3j51j57j43L30J37k89L52l65k2K91j00O5k05J03L16k27j70K01
6061A34k59J38j04RK71k10L97k80k26M33k54J58O2j46o0j2K2L30j25l13M11k99
6083G7k42j56M3O5N1J40k63PK98j09M4j56P2J16l4j02J32O1j8J29R0l78J84r4
6107d3J03K23k24J17j83qK39m46KN31l66p6P6J69j66j18J33l53K92k25J28J58
6129c7O9k12J24r6JL20k93q7L27Nq3L04l95m3J39P7J40N5k81j97J51P9r6k74K74
6154b9J93k1k68k01L09n0K30j74m04K48j01O1k0M37l86L14l07J46OL4k8Q9P4J15
6178B67k45r6k1J46P3j7k39L41j85K7R7K07n92j3J25M77n75j51K85l04L3K87l06
$$ y = [-16, -111, -204, -108, -161, 16, 12, -157, -158, -149, -80, -12, -60, -180, -67, -29, 155, 69, -22, 84, 84, 431, 54, 172, -27, 344, -70, 213, 75, 168, 17, -140, -283, 47, 184, -105, 247, -118, -140, 151, 51, 116, -89, 14, 330, 103, -67, 134, -125, 13, -91, -82, 189, -21, 376, 96, -130, 303, 49, 207, 269, 123, 63, 51, 73, 403, 278, -35, 376, 77, -165, -321, -278, -213, -162, -22, -285, -278, 20, -89, -45, -201, -129, -13, -47, -149, -17, 44, 26, 155, 245, -133, 51, -43, 60, 283, 59, 176, -7, -15, 224, -222, -220, 311, -55, -131, -55, 114, -52, -170, -37, -390, -98, -323, -195, -37, 32, -180, -56, -152, -151, 169, -124, -211, 116, 121, 38, 342, -53, -96, 43, 120, 260, 315, 34, -163, -12, 67, -29, -303, -29, 164, 143, -125, -326, -17, -67, 163, -11, -415, -167, -268, -207, -227, 210, -176, 138, -169, -23, -17, 17, -11, 78, 152, 267, 22, -74, -95, 51, 124, 107, -132, 209, 24, 51, 148, 355, -237, -250, -125, 352, -223, -374, -89, -393, -360, -73, -379]
6201c79N24m41lK07j5L4m6p0P3Q0R5M0k69K03nk2O1j77K74K12j06j54k44J00N
6226b3L45m21q2J59j55K09r0j89J24LQ4K2L19n07J00J80J8M8o1J6j8L8j8j5j34
6251d8r4L27k55K22r7j11R5PO9r1j03n1K7L70o9l72L4K48k03o6K32k99l8L33j45
6276g8P1r0PJ47j24K42J60k04j36J4L3j01n9L79J07k14k39k16K54O6R3j59m3p3
6300a63j37mL62J25N2k34r3J54k97K24k08L51l40K53R2j09j38j33K52O3J07Ok41
6323e6J94M7j84R6J5j69p4M96n97n8M98k74K2m0j01R5p6o0J06j47M36Q8n67L4
6347b76J58L1j8P3j85J11L33k80pnK68k30J30N2j32K78j92Qj07K07j75P2N7j57
6371A4j98j60L39j0Q2m30M77k94J00J51K42l53P9j24j20O9l9N2M74l35J9J85j20
$$ y = [-379, 145, -296, -299, -92, -107, -73, -119, -189, -116, -36, 59, 99, -170, 33, 28, 6, 67, -110, 164, 376, 270, 116, -128, -28, -23, 322, -99, -181, -22, -177, 32, -58, -247, -123, -120, -36, -14, 305, -202, -102, 78, 96, 144, 83, 99, 81, 119, 101, 86, -48, -142, 185, -70, 152, 55, -56, 39, 46, 115, 24, -79, -130, -103, 267, 198, -174, -140, 108, -95, -161, 71, -228, -266, 67, -78, -7, -97, -90, 57, -67, 175, 335, 131, -5, 9, 42, -59, -118, 261, 368, 154, -85, -301, -47, 19, 112, -47, -90, -163, -300, -304, 58, 183, 235, 1, -92, 62, -235, -11, -219, 132, -208, 45, 137, 28, -110, -243, 9, 72, 179, 185, -56, 138, 185, 1, 97, 112, -57, -131, 365, -232, -290, 208, -66, -44, -84, -185, -90, -166, -226, -120, -267, 169, 257, -310, -276, -118, -87, -105, -32, -217, -106, 227, -53, -60, -65, 203, -27, 103, 155, 23, 301, 109, 117, 10, 217, 42, 114, 171, 14, -184, -344, -5, -15, 67, -363, 114, -180, -80, 71, 313, -40, 39, -85, -205, -136, -175, -123, 351, 16, 35, 220, 100]
6394A00j48K19n1k21K30qJ63j72j0l17K28N5O7k03L6j43L3N5q4L86l30k21L63
6417B7J02k88K1K74j97L82l01J72J62k61j15%K76j27j90K10J5J10r7k29k01L22
6439F7j08K50l39k06K4n6K54O0r9k05J06P1O5r9K08j8K00n06L40J78l2M2j62J02
6463A37k67K50K3n41L31K53m34L65n41L93J03k28J9K83L09m56j32L14k39j66J31
6484i3n1j69K97j47J13j05M9L30l56N5L6J86j23L7j85L03m7j26NMr1J04K52r6
6508A82q7m6L80m59J48L1M2j92M6K83j81m08L8J40K76n8j13o07K98J21L75k26
6530a7j59J26q7J46Q8J66k12N5l44L28LJ57M1J9r5J18l35J79k54K08j08lj25k72
6554c77M33k73M3L60j69j3m63P15l1l31j35j57M64k11N02k69o8r2K52n2J3j18
$$ y = [100, -48, 171, 120, -101, 129, 121, 284, 112, 102, -215, 13, 68, 135, -68, -32, -175, -142, -87, -171, 215, -115, -336, 27, 129, -159, -138, 136, -61, 321, 20, 192, 354, 93, -22, -22, 254, 127, -63, 147, 162, 272, 175, -54, -255, 67, -41, 209, -130, -336, -312, -368, -114, -54, -153, -358, -252, -181, -116, -215, -7, -25, 175, -331, 9, 187, 155, 197, 35, 137, -130, 120, 143, -398, -67, 186, -248, 117, -424, -31, 72, -156, -137, 146, 455, -1, -133, 181, -58, -224, -93, -144, -313, -16, -163, -50, -155, -106, 224, -132, -77, -41, 145, 22, 59, -126, 177, 130, 4, 9, 13, -78, 26, 278, 182, 95, 49, 429, -30, 118, 149, 191, -1, 45, 328, 147, -261, -223, -83, 193, 135, 22, -585, -287, -166, 209, -17, -176, -50, -137, 9, 97, 263, 51, 106, -238, 90, 93, 250, 291, 310, 215, 333, -2, 177, -77, 131, 23, 20, -105, -377, 56, -217, -174, 186, 17, 4, -459, 256, 225, -106, -241, -398, 66, -145, 357, 88, 20, -72, 180, 128, 141, 23]
6576B3J90j41k5m9j0J92m8r1j2j34M59n66L10k41j39M75r0k15J23j54J75j04O
6599f6J25J41k91j11K82j75M05k55M8J4j76J09M50m48J02j70K01j28P3l78P59
6620E11j79l66Q2l2j66J73m0Nrj4l0J89j86j44K72k81L44j36p2J33J17j38O2n0
6644D5P0l4n7j63M23l39M9J40P1o7J03m74J96j72N9M73n35K28l7m8L3J7K08m28
6668b39J81j49O5J65k88k01N90J18l28M32m26Q0p4K5l2K90K3p6m6j23J75r3l6
6691C3j2M2m3j35N4N2K4J83j53k0l5k16Q7l42M87n1K1P5J0M7j13j91P20o28m2
6716a46Q2J66K27j87k34L60J17l73P9J67j04l90L12M2p6J04n56K58K48p4L3q0
6738b5P3l72L12J32k67j74K59J32K16o5k34q9M01k23k42K50m1L02qn8pl04J8N3
$$ y = [23, 213, 72, 47, -2, -12, 180, 132, 41, 29, -105, 354, -212, 98, -143, -282, 193, 103, -112, 11, -143, 32, -72, -66, 59, 200, -91, -202, 80, -95, 310, 55, 103, 117, -59, 50, 500, 52, 154, -16, 185, 57, 130, -248, 511, 332, -34, 48, 16, -150, 23, -17, -12, -21, -35, -65, 124, -62, -206, 66, -215, 129, -7, -79, 54, 171, 33, 95, 45, 115, 81, 24, -139, 284, -55, -6, 134, 205, 138, 241, -233, -37, -209, -150, 323, -212, 16, -21, -69, -36, -19, 189, -239, -58, -207, -142, 23, -265, -466, 124, 242, -86, 346, -80, 0, -74, -49, -81, 209, 232, 156, 110, -13, 162, 69, 33, 21, 63, 20, -115, -61, -9, 15, 198, 45, 25, -10, -226, -139, -481, 6, -45, -24, 51, 61, 108, -5, -196, 524, -104, -146, -64, 102, 329, 142, -92, 268, 385, 12, 91, 258, 154, -236, 76, 118, 42, 146, -410, -152, 96, 22, 55, -25, 48, -324, -12, 120, -147, -321, -62, 70, 286, 221, -13, -102, 299, 76, -166, 84, 43, 345, 337, 279, 272, -32, -14, 39]
6762C9l55M38J06k98M79l81j52K84L9l00K43j05M7j59n5l8q1J73o9N8P9R4L1R1
6786B08J57o87K48Q0j42J37J08j0M2R7n5k31j6j67L02j51k6j6K01k16K06K26l52
6809e7J9k36L41K21k37k18J23q5R5N8o0K18o1M6j83l1J92P4r6J34l45J94k59o2
6833b15J15J79j11J37j71n4L46k16k32J09o6p3J49K85k46N1J69k23P9N2nk36M85
6856C08n48K3M03j14K87m87k0M35n54J32Q2J22j90J93J97k08j83J79N3j22LQJ02
6879A01l7K1l84J22K74j54P0J43j56k85L70k53p6J91j42K72k23N20k18lk54KK29
6902A30j16O5K5j59j02j03K41J98m85m9L17j7J18L5k18O1L3L4J01j76j38K25J77
6925A97J07n49K99k91K81l20J88J09N8P2K19j87j64K06J16l93k83J31K55K3ql83
$$ y = [39, -316, 122, 228, -70, 409, 28, -124, 160, 199, -101, 142, 37, 84, -75, -130, -168, -249, -76, -145, -87, -8, 86, 117, 208, 365, -322, -74, 6, -136, 1, 109, 99, 141, 238, 183, -48, -64, -231, 71, -80, -106, -122, 79, -137, 69, 295, -57, -38, -274, 67, 288, 51, -167, -44, -129, -34, 24, -36, 182, 121, 167, -16, -47, 145, 219, 123, 257, -88, 106, -153, -215, -100, 79, -32, 105, -66, -120, 226, 10, -222, -113, -179, -252, -103, 182, -64, -13, 156, -67, 12, 64, 59, -177, 308, -240, -217, 186, 72, 359, -128, -148, 287, -267, -135, -53, 69, -121, 72, 269, 61, -122, 57, 110, -12, -9, -1, 101, 64, 85, -299, -177, 97, -57, 13, 156, 0, -285, 85, -168, -244, -53, -195, 77, -146, 374, 156, 153, -101, -99, 130, 14, 79, 104, -55, -157, -260, -19, 179, -306, -355, -38, -55, 63, 98, -120, -59, -26, 8, 109, -67, -205, 20, 197, 304, -245, 54, -237, 44, -276, -88, 21, 79, 151, 370, 183, 19, 225, 341, -52, -335, -204, 51, 74, 66, -317]
6947c17L06K08l47K93o9l85K01j64N06k64j93J06j06J59j3j03K11R4k50J19k4
6968c2J51J17j41j26Q0J6n4N0k25K98l0k65K29N7l06J73J36j07j0n8J41m12L83
6991F5r1l32N04n5Jl16p0M85n67M96q9K7k7J93%o2l5j68K16J12k11j40L83o18
7015b99K04L6L76m91K29N8j27j5j69K24j40J6n1L12k83j66j75L70K36j91K00j38
7037A6J14M2J9p7j10n6r6K67j14M63m68j39K59Q3j54j35J55J51k34J54l86K95
7059D9k19l3L7K59j81q3k37M51K3qj80K8k7J83J1j8n4J35j54J10J16o9Kk5J85
7084C01j52R1j87J53m54P8K67j51j35K13J75l64J24l52L26J53m07L68l06N1j46
7105c54L24k5J33O1k08K07j85J54l32L18l05J4M28P0p2J02j17k80J09k39M08n9
$$ y = [-317, -11, 197, -150, 143, 74, -311, -110, -274, 232, -32, -225, -119, -225, -66, -79, -182, 29, 123, -127, -8, -32, 119, 236, 95, -31, 49, 65, 11, 61, -164, 134, 104, -161, 68, 125, -181, -8, 128, 21, 11, -47, 94, -318, 65, -26, -358, 146, 91, 92, -224, -294, 191, -376, 120, 31, 58, 31, 224, 224, 162, 127, -41, 175, 287, 76, -64, 319, -299, -95, -59, 317, -174, 55, 113, -14, -29, -198, 26, -114, -98, -149, 163, -120, -286, -461, -91, 145, -46, 154, 16, 130, 172, 191, 114, 4, -52, -148, 119, 5, 468, 0, -139, 120, 203, 49, -86, 69, 220, -14, 140, -246, 49, -170, -203, -166, 93, -88, -171, -408, 43, 66, 58, -122, -94, -121, 62, 73, 55, 1, 136, -18, 92, 208, 139, 141, 116, 301, 149, 240, 53, 206, -248, -170, 97, -54, -189, 24, 199, -165, -41, -393, -67, 86, -321, 47, -259, -208, -354, -30, -55, 78, 139, -69, 138, -47, 107, -225, 93, -212, -198, 230, 300, 228, 330, 213, -67, 42, -197, 211, 152]
7127A52k40K62j42j39J12P2n6l4j26J62m12O00l16l36L44M8J32l51L88m61L00
7148d1J67j22p2q1L33J60j88j10J32N6k07J53o0m7j60k23O68k67L8j81r1j58m4
7171c45L63j91M4q3L87m23L88l89J72O7k55L92R1K8j87k27K12oK2j74J12L31j45
7194A84m57L92j02m6J7J4J49l05J12o8L48l36k4j30J98M1j78J91K20O5rj51j51
7217b6J82j06Q9L4r1J6K9O1j48q8k0K8J96k35J26O8Rl9j26J59j16K34m65J49J34
7242E4o1l9J55k99J35l74K81J99J78N5m89J03m5J35pN3j6K20o8k91J80M69n20
7265Hk66K76k10JK46l8K7m59M44j17j39J15J42J18r3k92K02O5j44J80k02R9J07
7288G0j18k8K37k35J20n8J82j01m10K58N2KK9j97L30o5l3O6l78N85m08k90O75
$$ y = [152, -88, 174, 32, -107, 5, 77, 21, -13, -139, 23, -389, 211, -105, -441, -97, -49, 83, -268, 120, -341, -41, 126, 4, -68, -149, 184, 344, 156, 46, 178, 234, 27, 180, 120, 73, -87, -310, 358, 91, 129, -52, -143, -301, -345, 18, -173, -129, -212, 175, -248, 140, -249, -77, -10, -265, 127, 218, 246, 59, -168, 44, 38, 60, -114, -2, 329, 184, -273, 119, 17, -29, -12, 2, 151, -154, -42, -110, 238, -98, -122, -252, -54, -13, -191, 0, 220, 285, 276, 125, -26, 156, 50, 139, 173, 82, 98, 127, 188, 40, -48, -68, -40, 156, -79, 47, 115, 124, 85, -41, 118, 2, 236, -229, -80, 54, -7, -46, 109, -190, -55, -429, -148, 51, 229, 284, -205, -102, -147, -12, -19, 34, 18, 238, 170, -121, 59, 528, 8, -258, 18, -192, -191, 55, 17, 44, -415, 29, -88, -227, -112, 30, 148, 55, -237, -35, 30, -114, 66, -136, -37, 70, -48, -76, 161, -74, 46, -12, 170, 69, -341, -83, -31, -29, 0, -197, 133, 68, 35, 101, -277, 308, -100, -390, 285]
7311B85n67J03M02k13m56N62k33L55m06K25n1k3K40n11O18k90L25l41k00K80N4
7332A58j61Q6j32r0K39r2J37p5j75K53r3n7J06J68k66oQ2j75k49M23j45k57j78
7355d99N69j64Q7p0P5l9k11M01j11Q4P7l38J8K2L99l63J33j32J59j01M6j74j24
7378b56K21K64j17k69K42m97L93P2K7N7m98M07k49K08L04o9l27m2M01k40J51R8
7400B81J41l92l0J70j85k9l8K70k27j03K63k32K90l99Q2L2J17j54J79J1j30J67
7422H4k39l54M39J61J68k05N6J16k57j05j3J86l22K39k51L44J95J14k7m15k9K56
7444A41k79L53j05q7l1p9l8J77k69K01k79K88q8j81L18k69P1rn9K87l03L80k17
7467g7L16Q8k69l0N7l45K08K60m68L63J18N0j12M4o5j65k3k5rk45L93r5k4J58
$$ y = [285, -282, -179, 223, 10, -446, 116, -117, 238, -168, 57, 6, -17, 223, -288, 330, 40, 365, 24, -176, 104, 158, -3, 83, -49, -139, 100, 8, 145, 70, -105, 148, 55, -2, 104, 272, 6, 0, 82, -93, -342, 81, -64, -321, -499, 70, -94, -7, -77, -2, -41, -252, 149, 38, 122, 199, -139, -121, -99, 300, -63, 70, -62, 97, -4, 42, -132, -256, -35, 229, 112, -157, 85, -412, -19, 53, 80, 137, -361, 46, -203, 5, 309, 240, -87, -129, 272, 32, 183, 281, 422, 30, 0, 170, -15, -44, -82, 188, -39, -142, 121, -111, 179, -220, -138, -106, 11, -143, 36, 47, -83, 84, -155, -509, -70, 91, 259, 54, 110, 226, -31, -136, -149, 37, -285, -46, -297, 47, 242, 356, 329, -86, -115, 141, -138, 215, 110, 23, -8, -87, -125, 52, -217, -16, -295, -7, -95, -276, 42, -227, -156, -165, -224, 63, -240, 140, -77, 239, 327, 58, 28, 85, -260, -52, 208, -260, 103, 221, 271, 159, 203, 138, -27, -50, -75, -84, -329, 64, -31, -55, 103]
7491A03j59k39K09M8J68p2j36l8J54N4K13k80P1L5j61j8J92kJ24k06N7j55M22
7514C84k14k60K71k6j95J18n3j05R8j13j13L2J56k22K7K45l2K40j66j44k17M18
7536A29k89O8j33j09K76q8K23M3Q2k02j32L32J2j32Q1k7l1j0J25j96L4j16o0J04
7560a6K63l32L05M0j90r0M1m26M6M67k59Q1j98L97K9Q9j76l1Q0o9j15L4p7O9q0
7585a18L83j53l72J80L18m28L45J3k52j84Q1N4J68k8L6j9r5J66k5k48J38J47j86
7608g9R3J90l74J3K90l87K46L77k69J5j10m1r7K97l38J88j42o4K3K48J01k09%
7631b9Q8J2l07p6L53j75J26l87K16R7M95o49R8R0L3L22n08L47M5n7O5M0k97Q9
7655C1J84j55m3K73k45K86m18L25j86p2k93K48r4L22j36j27J28n8J79l5j84j87
$$ y = [103, -56, -295, -86, -38, 130, 58, -78, -116, 38, 92, 305, 25, 96, 131, -30, -48, 144, 142, 266, 60, 117, -38, 384, 170, -90, 181, 155, -40, 78, 25, -80, 18, -95, -208, -176, -20, -242, -215, 30, -2, 238, 72, -72, -289, 129, -160, -92, -225, -334, -58, -146, 77, 120, 202, 0, -132, 200, 212, 80, 161, 134, 103, 93, 218, 22, 56, -60, -120, -16, 247, -85, 220, 260, 70, -20, 21, -405, -359, 108, -151, -70, -268, 129, 158, 247, 71, 40, 120, 51, -64, -30, -107, -38, -118, 265, 112, -260, -80, 238, -190, 155, 168, -84, -268, -187, -133, 35, 7, 43, 24, -71, 95, 70, -178, -40, 107, -79, 14, 204, -170, -157, 133, -254, -8, 369, 100, 115, 5, -36, -133, 164, -174, 14, -128, -192, -169, 79, 180, -29, -29, 59, 71, -236, -312, 41, -134, -8, -395, -179, -82, 413, -236, -138, -48, -15, 307, -201, 146, 191, 134, 199, 239, -58, 31, 215, 60, 17, 290, 45, 331, -87, 238, 52, -20, -313, -65, -159, 163, 27, -100, 28, -30, 149, 114, -70, -257]
7677b57R9M81l34j2J92r2n7J12O3j20K0j41J15mK50k40j49K09j6k0j53K54m8j76
7701b4K6j10K52j37j92K49p4R0o9k42M47l95%J50J19l42J0J08J94j35K70Q5k20
7724F0O9P3P1l45j7L34l18L07k19j18K05m11L44j56J96m22Q98o91J52k56J92j3
7746f5O7j53M8J21m20K21L9K13j22L09k31k5m0O3K8N2qM8rJ42q8j03p5j90L54
7771A76P4k45N3j32q2k2K67j59R2Ol1j05j92L84k88M5L34O9m20J05K8k38K30r3
7795a44J96o5K92k63J10J46k98J41k36l7K37O7P1j17k12qM4J34p0j1j53m0K37
7818B1L0j78L16O0m91L13j39J85J12k89j57J3K98PN6R0k35R4n9O7k14L93r6r9
7842I8k54L95l50k2n4L06j3j72O2j33L48j33j73J89j68k31K25m2k7k55L39p4K04
$$ y = [-257, -158, 323, -11, -23, 169, 77, 20, 132, 195, 75, 95, -46, 69, 65, 315, 75, -74, 135, 119, 99, -54, 200, 152, -24, 2, -108, 144, 7, -185, 64, -10, 80, 11, -231, 216, -179, -179, -29, 90, -252, -242, -134, 60, -75, 195, 280, 60, 129, 202, 273, -72, -89, 245, -73, 234, 15, -103, 102, -309, 35, -121, 75, -347, 551, -140, 12, -244, -52, -65, 2, -151, -103, 18, -402, -181, -142, 71, -51, 258, 27, 2, -38, 25, 53, 105, 97, 145, 136, 278, 190, 87, 12, -178, 176, 250, 5, 58, -74, -156, -178, 89, -70, 22, 28, -3, -108, -300, 84, -204, -159, 175, 244, -176, -71, -43, -281, -51, -144, 52, -13, 279, 16, 126, 272, -26, 115, -121, -158, 79, 146, 217, 100, -112, -120, -76, 58, -12, -23, -176, -216, 21, 51, -127, 189, 249, -242, 71, -68, 117, 229, -60, -217, -204, 94, 101, 157, 247, 12, 106, 47, 114, -100, 293, 197, 98, -156, 239, -111, -133, -187, 119, 106, -66, -4, -137, 211, 78, -95, 94, -74, -305, -80, -122, -149, -404, -65, -139, 65]
7865F5p9J46Qj96J57L9j91L01m40L32o9l8j60J43K13k72j37J12j11O1J15Ok51
7888b46j52M92j5J07l17K05p8J67k07K64k2k04K18l79K13q1Q3J14m8J83l38j72
7910b13q5K10M64o05N0M66j39k5j34J51j90J62k62P9J26m8l05J48k3J38j65K07
7932Gj38P3k37Q8J45J96k04j02J44n6K45j5k10L02l16J17P9O7l10k44M79k23Q0
7955c3M8l18K74L8j08m7K23J84o22M12k76j85M58j52N5m2L5l3J40o6K54j24K34
7978C49l73O9j48L55j24K07pl08j53L30j73j58J09j16L27k60p3J83M2j90Q9j07
8000a30K85m27L67Lj52J6k02K79n1K0N5J16k04l0J56Q0k45J40j43J99j51j65J50
8023c4R9J97j82n6K01j7m83L84k7j19K56j94m36O28k48j82J97N7q9Q9k6l17L94
$$ y = [65, -14, 132, 140, -56, 101, 140, -51, 250, -190, 142, 73, 35, -125, 18, 231, -41, -178, -66, -177, -116, -1, 5, -246, -398, 94, 79, 186, -131, 74, -4, 163, -44, 220, 198, -6, 212, -167, 46, -35, 48, 162, 114, 297, -41, -213, -298, -88, 376, -229, -179, 287, 148, 123, -11, 140, -50, 112, -150, -71, 55, 7, -298, -150, -173, -35, -200, 7, -131, -58, -295, -207, -62, 134, -70, -172, -28, -84, 161, 146, -64, 238, -78, 39, 118, 185, -125, -369, 110, -113, -33, 15, -303, -29, 9, -99, -146, 77, 261, -361, 51, -225, -410, 48, -104, -49, -91, -56, -89, 51, -15, 239, 115, 349, -24, 45, -103, 252, 128, 335, 328, 20, -133, 197, 24, -134, -25, -141, 186, -74, -147, 36, 78, -112, -23, -130, 155, -272, 95, 98, -54, -38, -240, 39, -12, 8, 63, 179, -25, -55, 101, 181, -64, 76, -67, 132, -19, -184, -34, 65, 262, 80, 24, 225, 208, -275, 109, 82, -37, 219, 25, -411, 217, -31, -213, -16, 41, -48, 41, 15, -302, 92]
8046I2j82N39k02j18j64J86O1o9q5J33j66j34K08k08k4k5L7J56k84K22j33K52
8068I2l3l14K89m2L3m2J43j55j5j80J11J97l22K07j09R3q5n3J34M56L1m36o8q
8092g6K41l79J79J0J89m19p2K79L44k69j32J13r5j00K10n0j72L22n0q7j5l19L05
8115d3M8J44l65J40j55M03Q2J3k39o6Q1J75j85R3J18j32K40m03M3j06j70R7L9
8138a48P4j10K08K9p9r4J52Q9k31J98k83M38m67L51n26L13L42o05N25r3k43n7
8160b17J15N0K27j17J9R8k59o1K43j57N9j07K01Ok78L18j62j91K4J95q7k04L14
8183B9J3K1k27j30L85k14J69J38
$$ y = [92, -90, 449, 247, 129, -35, 151, 212, 143, 58, 191, 25, -109, 99, -109, -133, -158, -121, 35, -249, -27, -160, 92, 59, -255, 34, -8, 25, -17, 126, -29, -44, -224, -113, 84, -238, -31, -140, -47, -132, -185, -51, 405, 436, 0, -68, -76, 165, -214, -35, -25, 164, -255, -327, -48, 296, 27, -105, 8, -87, -187, 23, -27, -199, 123, 73, -14, -29, -348, -43, 5, 149, -216, -76, -231, 172, 254, 267, 28, -38, 43, 218, 33, 126, 244, 112, 352, -51, -8, -114, -284, -187, -148, -74, -184, 24, 53, -26, -120, 32, 121, -110, 88, -195, 243, -224, 127, -399, -86, 256, -349, 176, 83, -160, -217, -102, -52, 175, 58, 77, 175, -84, -145, 98, -59, 0, -107, 94, 100, -178, 140, -22, -213, -189, 6, -81, -285, 29, 42, 63, -164, -294, 91, -123, 46, 184]
8191A84
$$ Imaginary data points
##PAGE= N=2
##DATA TABLE= (X++(I..I)), XYDATA
0@%%%Oj4QqJ6j6J6k4L2m0M8n6P2q8J00j16J43j67J88k17K54k93L34l78M31m92
29b61N52o20P00p83Q71r72J083j203J334j478J639j817K010k224K464k729L027
46A593l369L757m203M725n342O092p020Q198r760J1928j5142K0403l0460N6237
60C7637k35399n58756N85640O13095j88387m14717M7598M3945j85403J34404N01260
71C80917l9696o81176k52834O05828M70515l11604m44142P1396K20614k3521P764
82D061K05150l0050l77466j28919L98731L09504k48147l53466P7683K49179k1367
93H4893j24562Q7270Q5239j82002j62423J84593K47420r3698k55302k0807J45332
104d047K6144m3930O4639M6522j51272j61680J12437K69462N7162k31648k13100
$$ y = [0, 0, 0, 0, 6, -8, 0, -8, 8, -8, 8, -16, 16, -24, 24, -32, 40, -48, 52, -64, 79, -88, 100, -117, 137, -156, 178, -200, 231, -261, 291, -329, 371, -412, 459, -513, 570, -633, 701, -777, 862, -955, 1055, -1169, 1295, -1434, 1593, -1776, 1981, -2222, 2503, -2839, 3253, -3767, 4431, -5329, 6599, -8543, 11860, -18600, 37637, -197762, -756518, -170878, 442217, 253830, -160887, -113289, -69344, -254747, -120343, 380917, 341221, -339955, -592789, 13039, 483554, 171950, -272192, -200796, 19818, -3703, 4061, 209211, 179161, -198305, -327224, 71507, 381011, 132864, -220602, -142919, 106260, 84893, -39669, 47601, 132840, -49162, -211585, -26992, 220428, 126730, -128572, -149379, -4047, 22097, -21833, 42806, 89328, -61944, -223624, -111187, 158275, 215437, -16211, -229311]
115b29311N8704K24564J19869p1503j36746r1328j9312J08410K24690Q1946k73446
126c463l32045J09493M42098J43651l27266k78027R0490J77630M3049N6702M0440
137A62752k27935k88287J77435M86227L7214m93680k44306L17825K77498j23788
147H0955j29567P5945n9333k01761J30112L87599l3901m72448j25316M16497K25270
158B94052k73672j83222J85573P2353k04145P171K91265O210l54670p9793L40250
169A01372J36850k71797j24920K23224P2971k38798n3640K75121Q3081k81841
179g8377j41834K23027J50138j48704q9882J32080J5057j93293n043K71707Q2851
190B17727k81980j89327J89116K24969n3443j42110q283J0191m7822O4405J75246
$$ y = [-229311, -170607, 53957, 173826, 102323, -34423, -125751, -145063, -36653, 188037, 269983, -3463, -335508, -226015, 216083, 359734, 32468, -245559, -155069, 22561, 65610, 122312, 162752, -65183, -353470, -176035, 310192, 347406, -146274, -390580, -72755, 204743, 80955, -48612, 27333, -32000, -233761, -103649, 283950, 250049, -222399, -347715, 68782, 294052, 20380, -162842, 22731, 95084, -109061, -101890, 189375, 195585, -159085, -238878, 101372, 238222, -33575, -158495, 64729, 137700, -101098, -154738, 120383, 203464, -78377, -220211, 2816, 152954, 4250, -85632, 46448, 61505, -131788, -136831, 134876, 217727, -64253, -253580, -64464, 160505, 107062, -35048, -43331, -33140, -80962, -16557, 158689]
201A58689r839k51894j27544J98423K31029m8034k06949q2229P6093R7635N3986
212H9366K129p9845j18524j2249J44360J35442n5183j85580p7682J24719J54264
223A21217j0944j30290o2519M5772M5306J2714L2277O703r5512q2884R2631J51323
235A25794l9558j67314j3177J34664K0214j03929J0814J09407l7116j42457L0829
246g1829J67578l300j58379j1402J30981r168j23089M5535J56671n1921k00954
257a29277J5411K14487M2189j73422o4469J08306K6401p8035M3281J13413q0426
268C7859j89496M6495K39133L5845k16366j02794J32577R3719n9135k0549N1964
279D9252n7875j18655P3301J97310j4246k22277p0042J71137J08993q4689p4272
$$ y = [158689, 148850, -103044, -230588, -32165, 198864, 150830, -56119, -138348, -62255, 35380, 89366, 91495, 11650, -106874, -119123, 25237, 160679, 105496, -80084, -157766, -33047, 121217, 110273, -20017, -82536, -36764, 8542, 21256, 53533, 60236, -35276, -118160, -25529, 125794, 86236, -81078, -94255, 40409, 60623, -43306, -32492, 76915, 39799, -102658, -71829, 95749, 92449, -65930, -77332, 53649, 44481, -78608, -33073, 123598, 71677, -129277, -113866, 100621, 142810, -30612, -95081, 13225, 39626, -38409, 4872, 118285, 37859, -151637, -105142, 133991, 169836, -46530, -149324, -16747, 76972, 17837, -2712, 49252, -8623, -127278, -53977, 143333, 129087, -93190, -163232, 7905, 116898, 32209, -42063]
290d2063L2182j82m6134N4944J06281m4477j53586j1040J46459O5778r1374p3750
302e6962L3589L7734j1909N429L0469k0789o1426j000O7818L1743m7537m6379
314c9220J6671L5907k779j9783O650J5850j4292k8650O868L9371J3076l1776k8086
327c0193J3905K3971k45l966J2007n222l9072j1133N8583M8576m7051p7313J2153
340d5000P5677J9156m4883j8850J3003j6160j2139N3738M6019o5955r1308L8261
352d8441J10820L167r2598k7274N1978J3052k5907K5531L3156n5535o7553N5458
364b4146R9981k5534j04169o594Q1467J7958n0595r68L7307k3729m6444L7973
376g493O7546l0509q0909J2425P6660J374o2607k738M9166m436m6405J1366M8170
$$ y = [-42063, -9881, -10063, -56197, -1253, 105028, 60551, -93035, -104075, 42384, 108162, 16788, -56962, -23373, 14361, 2452, 7881, 38350, 17561, -43865, -44865, 22953, 54696, 7159, -39220, -22549, 13358, 10579, -9204, -2554, 13296, -996, -29646, -22778, 16593, 29669, -2107, -30193, -16288, 7683, 7438, 3472, 15479, 10257, -28815, -39948, 18635, 67211, 20160, -57153, -45000, 30677, 49833, 4950, -13900, -897, -17057, -29196, 24542, 70561, 4606, -86702, -48441, 62379, 65546, -27052, -54326, -2348, 10704, -15203, 10328, 43484, -12051, -79604, -24146, 75835, 50301, -53868, -60462, 21005, 38963, -11632, -12600, 24707, 978, -45466, -7493, 60053, 29544, -51365, -38940, 37720, 39094, -23513, -26251, 22915, 18479, -27926, -16560, 31610]
389C1610j1787m9879Q275M6441p626m3842R926M3562r165m5919K907M5570O200
402B6273l4711j0927K1037M839j1650P796J5672j6121k8115J0818L8204O239l3619
415d265k1898J4941K2930M347r037j0853q978L31J5673J6185n741k3451j3392
428b3208J4386K5482N212k1282k1014O615K1930P549r917q229j845l083L198J6986
442A2780P035k1496k0216J5264K6254n928k2778J415J4839n411j1757J1669J4590
455A6260j5909k0471J2688K2871q632j9592P821J6038j2028j6069J5657K1548
467B0182j4244k5218P396K4759j102j5891K680R057j1503q358J9713J7880k0365
480D986k7975J0282K9359J528j9914o325N338j758L27J5325M797k3326k0015J7288
$$ y = [31610, 19823, -30056, -21781, 24660, 17034, -26808, -16882, 26680, 17515, -28404, -25497, 20073, 26273, -8438, -19365, 1672, 6511, -5139, 2657, 18329, 2208, -25907, -15089, 23115, 29354, -4265, -26163, -11222, 11708, 16055, 7018, -3835, -12813, -12482, 3191, 19376, 13635, -9816, -23208, -8822, 16660, 21872, 590, -20424, -13809, 8121, 15670, 5753, -2476, -4321, -7404, -4206, 12780, 19815, -1681, -21897, -6633, 19621, 13693, -9085, -7670, 7169, 1758, -9999, 1670, 16260, 351, -20120, -7432, 15439, 6807, -12785, -4964, 11074, -954, -17023, -1366, 20182, 5938, -19280, -11884, 12875, 11773, -4118, -1438, 7619, -3884, -12242, 7471, 25351, 4986, -22989, -12707, 16652, 18180, -1734, -8059, -2721, -4479, -4152, 11173, 15970, -7356, -27371, -10083]
494a0083K9321k023k5636j0593J0283R897L520L516m849j6841o265K0321K1226
507B1794q551k5722n985J6809J3363n72o580q093p777L549J6850Q697j3182j8132
521a3532L06J4194R718k939r921r182r07R936Q959j328r283p715k94Q257J0374
536F643P04j2420j0453O180J2515K826l720k900m855m501P430J5127J334j7039
550c129j0801R763J2792J419m581n413o934l149J0545J4403k602j9933j1848J1384
564h084J8006K485j3616j1007n44N198R180Q819m168k0614j0945J8888K4688m796
578A3490k4222p571J1915Q576L287N080n283k0082n079K5429K0494j5926k5558
591a5450J369J7253N551k117N12p508j4048K869K1714Q634j6946j7980M044J4736
$$ y = [-10083, 19238, 17215, -8421, -19014, -8731, 1166, 4686, 8202, 3353, -13488, -19753, 568, 21794, 13243, -12479, -18464, -1655, 11708, 11136, 4556, -3537, -11314, -7765, 9085, 17782, 4600, -13532, -13226, 968, 10686, 7747, -2174, -11356, -12263, -2327, 6632, 5304, -3979, -11694, -11988, -3731, 6643, 7347, -5073, -15526, -9346, 3169, 5995, 2275, -625, -5480, -9981, -2551, 12576, 13910, -3129, -13930, -4167, 8625, 10044, 5463, 50, -6884, -10033, 512, 14915, 12313, -7620, -19468, -8084, 9922, 12407, -1209, -12216, -12760, -7562, 1618, 10437, 6269, -14345, -25290, -6402, 18286, 13490, -10732, -18303, -6388, 2188, 5475, 10555, 5272, -14810, -19889, 5540, 26034, 10108, -15450, -14081, 3172, 8723, 6606, 7118, -390, -14438, -11569, 10145, 18779, 1833, -16147, -12103, 2633]
605B633O094l682n835m577l309L062J0676O769q009j4692j197J4579R555o033
619F034q065n76k17j195P286J0313n015j8157m240J5164J1788m927j0477m219
633f503q58K725J0052O797q450j6921l788J5497J6707l047j7763j1502R286J4043
647F275M852l669o572r635l239J5701K0159o520k8185p978K2995J7422q849j2112
661F45p16k107l200J2364J5798j1078k7254j727K5904J2436j6268j4654M218N829
675A90k668K096R969l190j8824n266K1264J4049j5017j6182Q275J2351p516o765
689g234J4590Q630k0581j4529K0103K0425j3504j7502Q288Q824j1041k361K0455
702A4563M254k7717j4943K3560K2284j0765j9389j756O089J445O473R723o268
$$ y = [2633, 8727, 5045, -790, -5367, -8676, -5614, 5062, 11831, 3822, -10870, -12067, 2512, 12067, 6034, -2031, -2607, -2824, -4019, 3267, 13580, 8565, -9592, -13832, 1332, 13120, 8193, -2284, -6503, -7361, -4636, 5416, 12213, 3763, -13158, -16946, -1449, 15258, 12211, -5552, -17054, -7768, 6275, 11127, 7458, 886, -8749, -11988, 3713, 23872, 17352, -10833, -18811, 4184, 21606, 12757, 645, -71, -2178, -5378, 6986, 22784, 11706, -15548, -17275, 8629, 21065, 4797, -9857, -5639, 190, -2478, -382, 9587, 6397, -12427, -17693, 3571, 17620, 2603, -13579, -5304, 7047, -469, -7234, 7356, 15986, -4595, -19124, 979, 21404, 7900, -9602, -1314, 7510, -3531, -5892, 14563, 18817, -8900, -23843, -283, 22001, 11236, -8153, -9909, -3820, -2375, 4098, 13821, 7553]
715G553k1957o776K2221K3499p036k7826j0660J7843J9565m79j0163o552o569
728g337j957J6672K1310j0582l4227p287L0579K0196j4971j9681p98M005J081
741b997R021R275j2400k2914J82K3420J2822j3244j8863j439J1993P774k671l117
755c158J030m730p619P130J9402L21k2549p907K0288J0413j4516k773J7075l687
769H720k5079L622L3998M831l2775j2797K2438J0469j2928P53J2577j3401k5094
782b4666J2700L7877n74l9095j6985K4394K1839o225j0825j629o633r728J4928
795d622K9452l707m0708j7571L4226L3605j3906l0088j733J1739M2N818J7832
808B0379o740l6848r384M0555K7275k6583l3696P521K0884O68k636N960p053k0838
$$ y = [7553, -14404, -21180, 1041, 24540, 17504, -10322, -20982, -3139, 16426, 15947, 5784, -768, -7337, -9294, 7378, 28688, 18106, -16121, -23408, 7171, 27367, 12396, -7285, -8083, -4078, -2997, 6024, 15299, 2899, -20015, -19833, 3587, 16409, 3165, -15698, -17137, -5144, 2630, -41, -3158, -2128, -6858, -14477, -7347, 12055, 12376, -10173, -18080, 2208, 12621, -1895, -4668, 12407, 8720, -16359, -12737, 21261, 26092, -6683, -19480, 2958, 13427, 499, 1252, 13829, 428, -24666, -11966, 25911, 25337, -13758, -30743, -6349, 15490, 9265, -1560, -3189, -9822, -19550, -4622, 24830, 21123, -19585, -37156, -2930, 30675, 16769, -13319, -15052, -3313, -3271, 2547, 20379, 13639, -23209, -32593, 7962, 35237, 8654, -25042, -17521, 3363, 4031, 1395, 7355, 302, -20536]
822b0536N38K8394J2961k1690k1340P060J7999L660o042k749q8m352k101R200
836I14J1411l718j5896n145J2974J0373n285n963K896j702r035L003J8481M208
850A7516k1164j6138J2082J9359J310j2330p433k167M1P395J4634J268k2802j9270
864b7699J5264L1814L730k8918j7655J3204J6117J166J041J64j7194j7185K0574
877e577L6705o479m2381j2076L0994J9154j3158r332M277r322j1122K0185K6228
890B8096j4833l7346J87L3163J1465j9795j0065P471J18o664R420J4918q424k2806
904a5095m6K3139Q735j5727r518R259M497r240n32J5766K183k0010r455J7110
918A066J3732r901j0348M667R48q559M566J7659j302k4046r890J9395J7457o056
$$ y = [-20536, -19998, 8396, 21357, -333, -21673, -14613, 3386, 7046, 1004, -1745, -1833, -6185, -8286, 914, 12325, 8607, -7289, -12434, 540, 10913, 5628, -335, 2561, 859, -8176, -5173, 13308, 17516, -3648, -19786, -7704, 11655, 12965, 635, -6798, -8965, -8924, -1529, 13105, 14373, -8429, -27699, -12435, 19379, 23109, -5809, -23464, -10260, 5857, 7023, 8064, 8228, -8966, -26151, -5577, 31128, 24649, -17732, -29808, 1186, 20340, 7182, -2150, 2127, -7195, -18317, 1868, 28096, 13263, -24083, -23896, 9267, 20732, 937, -9128, -1657, -1539, -8203, 1217, 16135, 7711, -15095, -15141, 7998, 16733, 1006, -8512, 747, 5244, -3996, -4528, 11238, 13421, -6589, -16044, 1066, 14798, 4897, -5451, -784, 164, -8395, -3829, 13830, 12528, -11518, -21408, -2013, 15444, 9388]
932I388j3479m988K96N048J2229O480j2305j7576J31J9263J4764n546j8837j1370
946a6502R501J8968O011j2245j3774k935Q137J1285P403p829j9065p288J7670
959f63J8851o214k0116n925R828P882J106k7m170j0515k687J4420J2704q714j6591
974a0831L22J3780L988o747n05M257m224p281O252J2409l185j3774j019J0764
988D206Q09p241L255P142p340j3416O277J8024j215j7376m977J0064M572k972
1002a88K505J864j0825q679J2707J8409n361k0691n371J4727J0647k491m736l950
1016a433n906J041J3851J0059j2146j8478J418J8082R156q924j1238k551K805
1029d264N933P141o82j2690r207P500J4104J392j1603p371K019O686M779K93m905
$$ y = [9388, -4091, -9079, -8783, -3735, 8494, 14974, 2669, -14907, -14776, 4487, 19251, 13705, -5132, -16502, -7001, 11967, 17978, 5733, -8041, -10976, -2839, 8446, 15849, 8020, -11045, -18333, -663, 18188, 11974, -8142, -14067, -4239, 3643, 4749, 4722, 552, -9963, -12650, 1770, 14474, 5760, -10831, -10509, 3271, 7259, 512, 7, 4264, 40, -7241, -989, 11420, 8235, -5539, -6558, 4206, 5015, -2226, 1029, 8171, 831, -12585, -6308, 11716, 10501, -6875, -11852, -1788, 2784, -188, 2317, 4181, -6644, -15323, -2616, 15793, 10432, -10259, -15630, -903, 9744, 7253, 2517, -1433, -7339, -6298, 7553, 17612, 5466, -13012, -11594, 6488, 15644, 6720, -4518, -7069, -4264, 1669, 8810, 8128, -4562, -13769, -6269, 7835, 9227, -2376, -9747, -7728, -1042, 3737, 4030, -875]
1044h75o316O03P649M240k360n107j765K073M009K893j889m397p30M024J234k579
1060G07K01K450k056m023J177N083j32m548q26J853j586j627M806L594o486q078
1076i491M670J0146M14q719k908L896J579O73L750Q96q121n878Q958J1389l529
1091G725j2837j812Q733M748k846j286m63n508j702R346P364q834j2912L198J2710
1106E624J531q276l339K563n03m69N637K458q385p313P708J0197l183r172j21
1121e043O301R21k187J463J393m346j717N550M271n042n172K948M804j570l662
1136a088O14K062j170j595J615K67j993j91J430N83k260p72J857J471q41j650
1152a661n78J413K056J082k128k467J375K860J168j640j588o7M10J122K268q01
$$ y = [-875, -7191, -6588, 1061, 5301, 2941, -2166, -3931, -1858, 2151, 5044, 3155, -1242, -1972, 2052, 3286, 707, 908, 3358, 1302, -2721, -1544, 3539, 3407, -1141, -1967, -114, -1700, -3327, 1479, 5073, -1413, -9491, -4821, 5325, 5739, -2980, -5888, -1992, -413, 260, 4010, 4906, -3215, -9093, -135, 11254, 7725, -5112, -6924, 1809, 6557, 3711, 2425, 1962, -3546, -5248, 4098, 11462, 2628, -10284, -7086, 5624, 7155, -1121, -4460, -1897, -2400, -2869, 2768, 5226, -3159, -10472, -2764, 7433, 4250, -4922, -5043, 1258, 2179, -8, 1455, 2848, -1498, -3215, 2335, 6606, 1564, -3608, -660, 4144, 2574, -1088, -474, 1588, 418, -1177, 438, 705, -1288, -1479, -49, 534, -1726, -2498, -641, 830, -11, -1661, -2239, -826, 1230, 2312, 184, -2283, -908, 1952, 3120, 1480, -108, -175, 235, 1357, 3625, 2824]
1168B824l810k319L912M804k950n807K65M285P7k034P02L56l661q85M954L728
1184D441n745n676L998O258j469n148J097L452j908j732L987K632m960l905N171
1199D93N667m102o144K795N688k513m822K669L649l387l937L767L968m399m992
1214e600M282N203l991n573L152N689k799m591K635L925k563l130L876L158m254
1229e81l537M844M648l745m302J889L552o27k138M84R35j607p93J856J600k195
1245B83k906l46L360J122k308k568P66K164m51j324J275P10k267j154L416K251
1261B023k358k863J955K907p55j665J526J191j545j679K107K200p90k635p97K259
1277A081J440j631j235J058J20l007n69M429K110n929m118N236M477l708l885
$$ y = [2824, -986, -3305, 607, 5411, 2461, -3346, -3081, 1204, 1281, -753, -51, 305, -3356, -4241, 713, 4441, -1304, -6980, -2982, 3276, 1807, -3341, -2244, 1208, -700, -2432, 1555, 4187, -773, -4678, 493, 6160, 2058, -4086, -1291, 4397, 1884, -2938, -269, 3380, -7, -3944, -177, 3791, -608, -5600, -1318, 3885, -106, -5679, -2527, 3162, 363, -4228, -1593, 2332, -231, -3361, 515, 3673, -581, -4118, 726, 5374, 1629, -2673, -784, 2768, 2141, 3, 487, 1422, -185, -978, 878, 2478, 283, -2623, -2969, 391, 1513, -795, -3363, -2597, -433, -884, -2208, -933, -223, -2490, -3644, -228, 2023, -335, -3198, -1243, 1664, 909, -756, 770, 1961, 416, -1263, 844, 3044, 2254, -381, -1178, 1081, 2521, 890, -345, 713, 833, -2174, -2743, 1686, 3796, -2133, -6251, -1015, 3462, -246, -4131]
1292d131K993K017m042l30O684J646q844l162Q646N554o045m659M082K187l363
1307g67L01N348l26q029j619Q007M373n940o167K843M182j809j710K562L90m858
1323c219k724O143N868n364p567K893O894j383m499K637L555m745l940O761O670
1338G980n350p923L816O308j898l092K255J562m353k169N173M079l739n966j23
1353c440M269K414j292l228j010N6nJ308M238j203o347m279O642Q511l649p812
1369d827n16N285N47l99L353R0p257l487Q743Q737n014r901m36P090L135j936
1385C207j691k91l378k206N288P780l239j2293k565J1296O912p433o955M236K717
1400A385n266J167J0803j640j5509k308J7048O298j3322o809R894L584q819J283
$$ y = [-4131, -1138, 879, -3163, -3493, 3191, 4837, -4007, -7169, 1477, 7031, 986, -3673, 409, 2596, -767, -466, 4882, 4556, -3473, -5092, 2915, 7288, 1348, -4819, -1976, 2206, 397, -1313, 1249, 1639, -3219, -5943, 200, 6068, 704, -6863, -3970, 2924, 1541, -2958, -321, 3234, -1511, -5451, 1310, 7980, 2630, -5293, -1477, 4831, 2933, -159, 2096, 3658, -695, -2864, 2309, 6388, 2649, -3317, -3440, 829, 3243, 1951, -1277, -2287, -2231, -2236, -928, 3310, 2107, -4240, -8519, -1877, 6634, 2985, -4827, -5343, -58, 489, 90, 3443, 3533, -3724, -7211, 1532, 10269, 5255, -4646, -5082, 2008, 5143, 3207, 1516, 1225, -2153, -4359, 929, 8709, 5470, -6823, -9388, 1908, 8820, 1387, -5568, -1332, 1385, -3881, -2714, 8089, 6449, -9060, -11368, 5680, 11978, -1344, -8153, 1741, 5325, -3494, -2211]
1414b211J1105k344j4933L00J5621L351j2495m676P574K284o521N75P879j350
1428D159j1488k193J1301O171p571q084L139N326j869j795N717J400r943n282
1442a1012J1733J1355p844j2767K348R934K4k566L353n54r530k211J3298Q097
1456A3658r720j2637K102R850L813k349m290m518j673M573O321J673o533q621
1470h351j072J0359R826n454j3566j463J0469M252l997J11Q89o849m159J1834
1484B829J1214r984j5367M272J4297N23r982N89N378m874o019P810J0287p547
1498C426j4429K973J4009J043j1448j284Q885j894j0264M024J4675k061j7619
1511i964k699J7590N041j3160k980J1031j704j3277N917J9247l397k3636k047
$$ y = [-2211, 8894, 6550, -8383, -8083, 7538, 10889, -1606, -6282, 1292, 3576, -2945, -2370, 5509, 4159, -7329, -9522, 1779, 7950, 379, -7705, -4566, 760, -1109, -2904, 2813, 4213, -5730, -11012, 721, 12076, 4232, -8535, -6187, 3747, 3771, 1205, 4558, 4004, -5526, -7737, 5561, 13658, 3938, -8699, -6597, 3253, 7066, 4717, 427, -4091, -5764, -1191, 5130, 6803, 270, -8351, -9423, 936, 10762, 5308, -8258, -9721, 748, 5000, 1003, 1114, 2003, -4846, -9005, 2829, 14043, 4059, -11308, -7036, 7261, 7784, -2198, -1609, 3769, -1105, -7124, 686, 10973, 3426, -11003, -8030, 5979, 7022, -4426, -5710, 3175, 1281, -8983, -4959, 9716, 7655, -9964, -12663, 4927, 9968, -3192, -6172, 4859, 3155, -10122, -4205, 15042, 11645, -11991, -14038]
1524a4038K1932O445j5072n008Q610j690q441P868J4315q808k1024K131K1159
1537H379N725j4611r363N694M482j217L427M192p113j1886L320J6901N317j4237
1551i90j1857P334J1312r4m946m24p76m826K212J1085K095j2098p881O907R798
1566F851r80o514j902J129P0P96K635O39k973m402p65N324N192l085o783j92O351
1583A391m89m222L841O370p533j0407P882J4667l966j5126P68J1399r41o929O160
1598B865O754j2005j1939J3425J7747r140j9855J773J5774J034q781K210M167
1611D029q609p732J3092J5558j1355k1100L814K0476L596j4984l470Q528j539
1624C04o912P816J2495j0016j8881O868K1883l92j9437k570J3675M26j0169M509
$$ y = [-14038, 7894, 14339, -733, -5741, 2869, 1179, -7262, 606, 14921, 6113, -14911, -12780, 8379, 14104, -507, -9870, -4176, 306, -911, 2516, 6708, -405, -12291, -8971, 7930, 13247, -990, -12847, -5513, 5799, 5705, 759, 335, -441, -5267, -3055, 8030, 10125, -1973, -9854, -2947, 6851, 5871, -643, -2545, -1416, -1346, -550, 2085, 2724, -249, -4651, -5416, -92, 5100, 2015, -4768, -4960, 1391, 902, -3320, 521, 6891, -642, -11049, -3167, 11500, 7534, -7592, -6824, 4575, 3634, -3295, 2865, 9619, -2386, -14325, -900, 16847, 7707, -12148, -10375, 5399, 6433, -2348, -138, 4029, -4580, -12312, 780, 16338, 4983, -16117, -12303, 8173, 11769, -3215, -6685, 1843, 304, -6608, 1208, 13703, 3687, -15194, -8326, 13557, 13165, -6272, -8842, 4833, 5259, -4910, -401]
1638d01J0143p286j4371O717J5912l972j4522P90J1230j780q405L525Q076m274
1652A382r090K621R184q0o839k38L820r58k614L545M496k522p231m24P338M958
1668G348l462o301j923L549M231J113j912l704l562J000N728M993l461r568l791
1683i722R030Q956l265j0090k230O155K864o31J587j24p830l830J1463J0707r059
1698C981j4182L966J3503p36q578J715M940n662n966J0458Q887j1259j2914Q572
1712c275J3650o251j1767M668R416o182q957P435R836q493j0398P327J0834o768
1726A075r828P081J0040q065j0231P641J2460n818j2277L663J0534k731p472N243
1740A315N990q546p912J0054J1388p874j3901L680J1334j90p175J276J519m903
$$ y = [-401, 9742, 2456, -11915, -5198, 10714, 6742, -7780, -6990, 4240, 2460, -5945, -2420, 5656, 1382, -7708, -5087, 4097, 4017, -2822, -3060, 760, -198, -2812, 733, 5229, 2707, -4524, -4948, 2390, 7348, 3886, -2415, -4338, -789, 3442, 4555, 2643, -1061, -4623, -3623, 2105, 7098, 3637, -5931, -9722, -692, 8264, 4999, -5091, -7321, -1166, 1698, 1067, 2654, 2530, -5300, -9130, 2333, 13040, 3981, -10201, -6235, 7268, 6532, -2046, -331, 4609, -1053, -7019, 3439, 12326, 1067, -11847, -3275, 10375, 4124, -7643, -2975, 6441, 259, -8698, -1263, 8573, 80, -10318, -2991, 7843, 1075, -8753, -1672, 8368, 303, -9928, -2287, 10173, 4355, -7922, -4259, 6275, 3544, -3928, 1315, 7305, -1241, -9153, 901, 12289, 4415, -9486, -5806, 5528, 5338, -1837, -561, 958, -3945]
1754c945j639Q909N308j0282r142N938J0325k96o633k171Q93J083K866L738k190
1769B762o474j262N743N182j735m834k700J761M326K754l138m504k96L487J735
1784B807j942o32K0k050p12L947K100m668m019L967M343l357m861L849M833l794
1800a69n362M058N173l035m726M165L792n168l453O888N643q117p718O547R646
1815H164m116q620K502N064l634k895O831L029j0018o127J0004R508p682j0578
1829h568L726Q648k068m488L412J922o789k639J0434O075j0179q594P128R285
1843G305l454o284K200K633l408r54O689J307q569l511P263N625n460n464K765
1858a317L481k522j702K875N90m115n41M131Q37l759j395L310J476k554j215K143
$$ y = [-3945, -5584, 3325, 8633, -1649, -10791, -4853, 5472, 5176, -1457, -3628, -2735, -1652, 1214, 4952, 2762, -3712, -4974, 769, 5951, 4216, -618, -3318, -1557, 2769, 5523, 2385, -2119, -2415, 1072, 2807, 865, 233, 253, -1797, -2509, 1438, 3538, -1130, -5149, -1182, 3161, -196, -5057, -1208, 3625, -169, -5531, -1473, 3700, 665, -4061, 104, 3896, -1272, -4725, 2163, 7806, -311, -8029, -1482, 8164, 4048, -4572, -2070, 2994, -640, -3535, 3296, 6325, -3693, -9820, 184, 9692, 2010, -8568, -4842, 3806, 1738, -2750, 662, 2584, -4205, -6844, 3590, 9665, -514, -9108, -1980, 7305, 3851, -2433, -233, 2400, -1008, -1962, 4727, 6034, -2535, -6046, 1217, 6842, 1382, -4082, -1317, 2164, -358, -2060, 815, 1405, -2710, -3251, 880, 1717, -2042, -3437, -127, 1349, -1205, -2420, -277]
1874b77J100r55o16L10l27N44K127J65k701r50K355J768p56j109p17r36J00L010
1892B135J992l781m914K667N083j85l894j360J379m08N74L249r3n314k989N927
1908F8N842l625o133J194M632p9j621J376Q86m716n65N864L555o287n240M011
1924h38N343k347m081J834K177l317j602M875J803o340k834N594L309m575l152
1939d151L970K162l616j360L792J420l795q12M023N15l530k1L728K16l651q10
1955a920L897J309k440j094Q71N12j003Q96J178j684l250J060L757j97k754k007
1971b869J248J475K87L13p09k043j44K282K553j482l384l55K845J538k37Lj806
1988d85j212J156L929p1m089j249K513J782j299o34P72j656j614K547K425k659
$$ y = [-277, 823, -132, -748, -438, -765, -221, 1906, 2071, -630, -1580, 775, 2543, 1787, 678, -39, -975, -875, 2135, 4127, 346, -4568, -1901, 3182, 2997, -897, -2257, -878, -1286, -712, 2537, 2444, -2870, -5859, 68, 5910, 2285, -3848, -2654, 1978, 1899, 278, 1654, 2540, -2176, -2741, 3123, 6678, 391, -4849, -838, 4505, 2158, -1923, -89, 2088, -1229, -2831, 2044, 3847, -2493, -5327, 267, 3576, -999, -4151, -181, 1981, -1635, -2995, 797, 2217, -1578, -2390, 1633, 2148, -1382, -1403, 2325, 2541, -1110, -1920, 1977, 3286, 846, -248, 623, 1135, 132, 1028, 2206, 522, -2728, -1668, 2089, 1892, -862, -2869, -1621, -146, 141, 454, -255, -2298, -2442, -160, 2393, 911, -2473, -2828, 17, 1555, 1318, 1321, -485, -1697, -541, 3388, 3317, -772, -2021, 492, 2274, 975, 341, 1113, -543, -2157, 390, 2815, 156]
2004A56l063J274K797j329j424J063N07j465n03K033R50k259o35J825J342j918
2020f49j18J240J037j685j212J656J575q14j163J28O89r40j77K098L75l467j444
2037b871K842K825k456l264J165J344q35J69K053j168l979R32M618J402m299k020
2053c542K464J291o02J372J61k413j609L588L368k482l301N10J969P14j2j60j305
2070A1j618J373K124m4k307j055N45J205M09o61q78n26J58O71M70j75l18q37P40
2089g13J337n05j203Q72R66p21j189J418J232r65r12J274j82j899J097L111j596
2106A422l962R1M151j33k238k98L82j436J58L639M62m868k642M727L431k203k180
2123a497K38j25j35K646K633l358m505K159M940J161k646k367P0J025J939J233
$$ y = [156, -2907, -1633, 1164, -165, -1589, -526, -19, -1484, -1987, 46, 996, -1263, -1898, -73, 1269, -649, -767, 473, 1510, -175, -1387, 269, 1844, 1030, -133, -5, 684, -256, -433, 1665, 2040, -1427, -2871, -29, 2796, 340, -2924, -1759, -415, -1250, -1081, 972, -196, -4175, -3243, 1375, 2777, -1522, -3542, -1078, 213, -389, 983, 1144, -1269, -2878, 710, 4078, 1596, -1705, -1195, 774, 1488, 1476, 1316, 11, -1607, -234, 1890, 1846, -461, -1516, -971, 234, 643, -18, -896, -1422, -1264, -593, -123, -298, -616, -1453, -713, 624, 119, -1084, -212, 754, 33, -1156, 262, 1494, 529, -383, 891, 709, -1190, -93, 3018, 1422, -2540, -2449, 1702, 1569, -669, -967, -585, -2021, -1863, 1776, 2238, -2630, -5272, -545, 2886, 683, -1497, -1259, -1384, -1519, 1127, 3760, 402, -4103, -1944, 2996, 4157, 1511, -856, -786, 239, 2178, 3411]
2139C411j267k734j181J752L332l03l441k021J251L078k03j722q88K34j053Q07
2155i48K828m49l448j016L955J010k915n66K821k12k786J384K930j404k444J570
2171C10J672j854j387K732J539k567j934J211J939m35p43J36k140l96K409K034
2187B526j797k943l97K050J683N93j367l081n63L491L118r48l091j684J283K463
2203A336K348j103l856j186J998K849J545j999l817j162L274L357j096l819q28
2218b159J447L25J183J250k117m279N44N657J436m985j865L100J311k232P52L012
2234B380k566l553K302M901j201m474J456K981j532k465K135K477k027l089J523
2249g52K432o91j554j65J424j426r71J507K474j893l445p75L888K579k840k080
$$ y = [3411, 2144, -590, -1771, -19, 3313, 3010, -431, -2452, -1201, 1877, 1674, -48, -936, -702, -1755, -948, 1880, 1431, -2017, -3033, 922, 1932, -983, -1549, 1272, 1060, -1726, -342, 2588, 1184, -1260, 310, 1982, 128, -1259, 1473, 3012, 445, -1489, -278, 1661, 1226, 483, 619, -1521, -1917, 492, 2526, 729, -2214, -2611, -561, 1122, 1715, 348, -2733, -3296, 195, 3313, 2365, -726, -2410, -1127, 1336, 3684, 2581, -1275, -2461, -463, 2386, 3931, 1932, -1885, -3047, 227, 3584, 2488, -1331, -2159, -712, -387, 796, 2046, -71, -4350, -3806, 1851, 3287, -1698, -3563, -463, 848, -1384, -632, 2380, -186, -3739, -1437, 3464, 2263, -2211, -755, 2226, 694, -1771, 364, 2841, 814, -2275, -752, 1680, 989, -565, -730, 694, -732, -1703, -196, 2278, 385, -3060, -3835, 53, 2632, -208, -2288]
2265b288N09P08l42J587K948k923n138J626O739J093m982k368J905J565J63J681
2281B483Q1m217j999L940M401k235m220j200J789J994J202m81k978k073J755L036
2297A278J17j423j600q68N48L019J347k681k588J356K447m1j059N88L1j445j10
2314a084K780J130k668k100J862J663j131m95R60J5k169j200K590K278j533l314
2330b416n01K731R24j605K38J440k629j946L756M671k841o529R04O118J143l054
2346D04o06J470k155j085M762L335n119o191L434O506m50m371j097J483p88j94
2362f62L106P96m804l287L739M761j195m551j224K830J264q70L12N10j822k026
2378c123K439L730j098l496n73L367N30j684K65J322r42j690L88K944k26k196
$$ y = [-2288, -1779, -1071, -1413, 174, 3122, 199, -4939, -3313, 3426, 4519, -463, -2831, -926, 639, 802, 2483, 2564, -1653, -3652, 288, 4689, 2454, -1766, -2966, -1177, 817, 2019, 1538, -1440, -3513, -1758, 1278, 1395, -28, -1628, -2496, -1948, 1071, 2418, -263, -2851, -1495, 952, 911, -148, 440, 471, -974, -1084, 1696, 2826, 158, -1942, -80, 1583, 452, -43, 917, 932, -1237, -2437, 153, 2431, 898, -2416, -2917, -186, 738, -867, -629, 811, -1818, -3764, -8, 4663, 1822, -4707, -3803, 2315, 3458, 404, -202, 1268, -887, -1972, 2790, 6125, 1006, -5185, -1751, 4755, 4305, -66, -1163, 320, -468, -662, 2444, 3240, -1564, -4851, -1112, 3649, 2454, -2097, -3321, -491, 773, -97, 215, 725, -1097, -3123, -684, 3046, 1948, -1548, -2121, 1246, 1776, 92, 357, 1679, 737, -953, -565, 2379, 2153, -43]
2394d3p77R80J48M7P15j40j440j069P22J572R95j123k287o76K074K696r71k290
2412h67o38N03J125J120J675j626l576k71M769K460k974l817N85K926N33l41L13
2429A899j489l164J149M124J615m736l695K446L742k95k484l85P91j405k34L123
2445A002J454l687k910L022M250j544l749J203K355j049j381K140K486l479k934
2460b821L061K906k071k651J779K158k416j945K423K747k696l398J564L063r70
2475G33k190Q57P08j711r01K696J827k620l127J498L447P22k335r59N17M93K22
2492a23J778N7k316j702J682L178o4k899j864J209J720Q68r44r26j317M69R43
2509b51J524q40j877j244Q60K801j64j526j787J305J496r6j94l42Q5j082M67K253
$$ y = [-43, -820, 160, 308, 355, 1070, 930, -510, -1579, -857, 715, 1710, 587, -1700, -2376, -302, 2394, 1423, -867, -1505, -1002, 123, 1243, 2918, 1292, -2284, -2555, 2214, 4674, 1700, -2117, -1532, 1394, 1927, 1586, 1899, 410, -2754, -1605, 2519, 4134, -602, -4297, -1851, 1891, 1596, -888, -1273, -482, -1887, -2121, 1002, 2456, -1231, -4141, -1119, 3131, 1587, -2162, -959, 1396, 347, -1034, 1106, 3592, 113, -2821, 240, 3146, 1075, -1576, 203, 2361, -55, -2000, 423, 3170, 474, -2924, -1360, 1703, 733, -1457, -600, 108, -1603, -2504, 192, 2019, -601, -3728, -2230, 1217, 1939, -396, -1355, -838, -345, -123, 1655, 1712, -604, -2306, -624, 2554, 2490, -409, -2273, -1064, 656, 1524, 580, -346, -1663, -1194, -251, 1273, 433, -1444, -2688, -1828, 973, 809, -717, -2504, -1199, 297, 201, 7, -335, -250, -1332, -865, 1388]
2527A388K76k188j122K040J451j404j125R99J463j965j338K002J151k156j305
2542a833J326J451j926j205K373Q21k653k070L431K057k421k404J686J988j189
2557e68o86J836M36k558r11L544K367l166l025K316K813j067j690J065L68j822
2573g48j32K659Q02l490j729K509K576j497k445L22J031m35j34J238J47k155o26
2590b107K124J482j251j747N94J546k32k21m8M2j53r2Q50M13m78j289J134M76
2608A043P5q49l82M66Rk11n25M9N40k59o9p32K77K88L62l43K89k48n90P1J411
2629F72L76j258j166J657J761q91j336K88J096q50j67J293L58k400r87K996J303
2646B745k659j517J284J656q72j416J207K29k161K59K160L91k563j321K414J393
$$ y = [1388, 1664, -524, -1646, 394, 1845, 441, -684, 315, 1778, -187, -1525, 477, 1628, -528, -1833, -507, 944, -982, -2187, 186, 1007, -1646, -3716, -285, 1772, -649, -3053, -1367, 621, -568, -1254, 582, 1018, -1540, -2451, 1093, 3460, 294, -2731, -415, 2398, 1331, -359, 706, 1074, -748, -880, 1779, 2581, -909, -2638, -129, 2447, 950, -1495, -1173, -142, -577, -711, 527, 674, -1481, -2107, 17, 1499, 248, -1499, -905, 641, 409, 188, 140, 182, 29, -63, 787, 1200, 722, -567, 567, 1043, 1118, 269, -113, 353, 362, 151, -374, -325, 215, -44, -113, -845, -568, -280, 82, -261, 28, -220, -810, -739, 672, 1048, -210, -1376, 281, 2042, 1151, -185, 103, 1199, 349, 182, 1475, 1833, -567, -1554, 1442, 2745, 86, -1431, -147, 1509, 637, -779, 428, 657, -1504, -1245, 915, 1306, -1257, -2578, -164, 1229]
2662A229j355j649J355R55j064j27J590Q8j407p99J955J123j731j078J641J050
2678A776j135r02R89N01j240m50J300K40j680n82J677Q19k557l1J556M83j332
2695e68m30J064k47l63L99N80m52j217Q21J470l46p56l11K17J147q9m3p73l61
2714b58N28Q88m4p88p93p7M23M32J65j023n86J20R61L53j105m66J27M67N33n24
2734f67k23K21K58m23J195L3p02l61Q60J415r40j359R42J316r64r93J141R14j635
2753B8q33J907K53k155l75K434J41k124p68J552L76j422l6J197k02j470J134J130
2771G67k35k344O37J651K07q81o10N34N27m4M8M60l97r94K71J490L19j474j506
2790a574J015J692p27r55N10q6p65M19J403p67j932k86K243O35j446P4J43J6m19
$$ y = [1229, -126, -1775, -420, 535, -529, -656, 934, 1022, -385, -1184, 771, 1894, 163, -915, 726, 1776, 641, -261, 728, 1229, -11, -461, 839, 1079, -601, -1183, 494, 1313, -1244, -1275, 281, 764, -568, -998, 66, -181, -544, -145, 435, -17, -1234, -413, 1057, 711, -45, -356, -139, 1008, 919, 876, 103, -258, 270, 1158, 1114, 326, -467, -544, -121, 311, 476, -547, -1133, -1013, -52, 301, -804, -1270, -1143, -676, -143, -667, -890, -669, -411, -834, 361, 394, -308, -669, 191, 1606, 666, -693, 249, 1565, 601, -392, 749, 1663, 28, -805, 1102, 1355, -800, -1175, 1259, 1400, -724, -1492, 60, 436, -986, -1022, 175, -27, -1497, -363, 767, 532, -1812, -1175, 476, 683, -198, -808, -274, 253, 209, 257, 717, 320, -674, -403, 1087, 1406, -68, -1574, -559, 1133, 406, -549, -39, -125, -890, -471, 932, 165, -1767, -2053, 190, 825, -621, -547, -404, -388, -807]
2809h07J270R62j587p09J565R97j158n50P58O6n44N63O83j235k97O26Q45j044
2827D04r21P51N88q51PK99m36n51M64J061q03j224N81J053j94r51k31N50L95L31
2847C22j60q4o06j47Q66Q74M17j934p57J786J391j183j487M36Q26j14l09J118
2865A255m08k647J1L266O66l086j078J648O94j060P60P86j331j561J942K255j014
2882A098k541M98J951J42q81K31P4q18O12O39N94j068q67K19R97K64p34q04J03
2901b91P50n46l50M69J46p95m97P97L02r47J01R63R3j771P63J663l02j337L70
2920d19K53j23L87O72P3j588K26J521L69j055l95J55q32O58J711n85k176n27J989
2939C14N30j188r3k13m54o14J853J388k374j867J107K739p78j367K34N19l31L36
$$ y = [-807, 463, 1425, -162, -871, 694, 1691, 533, -17, 741, 807, 263, 826, 1509, 274, -23, 603, 1448, 404, -517, 234, 822, -29, -22, 277, -159, -710, -246, 815, 12, -1212, -631, 422, 228, -723, -954, -404, -9, 322, 162, 78, -528, -675, 191, 1065, 1482, -452, -1209, 577, 1968, 785, -702, -266, 560, 446, 137, 1255, 847, -1800, -1789, 1477, 2143, -943, -2021, -373, 321, -739, 21, 807, -524, -2085, -143, 2112, 1098, -1443, -945, 1006, 1148, 267, 498, 572, -246, 366, 1005, 1599, 531, -336, -117, 880, 1144, 410, -394, -291, 459, -87, -437, 32, 178, -617, -1114, -317, -15, -962, -861, 102, 195, -1576, -813, 850, 548, -789, -419, -166, -289, 98, 770, 843, -745, -519, 1002, 1371, 316, -79, 76, -756, -98, 1613, 1028, -1148, -1675, 314, 844, -344, -437, -650, -1104, -1718, 135, 1523, -851, -2718, -1611, 1128, 350, -1017, -783, -264, -595, -259]
2957b59J371k15j039j086J175J396m4j474n36N80J100k97o05K02N9j463O85J451
2975A001J6k442o97K772j72j810K11J738p53j996J165K257q99k222Q09J879r75
2992a18j274J788J397j827j487J281J839m29j545J41N88n52M62O43k09j500k84
3009a086R51P90R0j584j121J466P74K0n69l97l36k01P99J504n07j802j40J414
3027F5J184o46n94k27j75L82J495j06r52p01L69R55o6o2k00j332K07J053O58j725
3047d18l00P65K7q10O72P63m40k086Q83J506q28p48R98N06j049o89J255J642j735
3066h6r69O44J882o59o05Q2L92p69mJ228J028j711j931R06J934L98j936l16P19
3085B27j29o98J370L82j412k024J523K681p60k259Q1J566M7p16Q08L96j308q85
$$ y = [-259, 1112, 897, -142, -1228, -53, 1343, 1299, -175, -711, -131, 969, 672, 67, 269, 328, -1135, -450, 1001, 1017, -1425, -2122, 650, 478, -1332, -1121, 617, -136, -2132, -967, 1290, 391, -1831, -1022, 857, -118, -1392, 396, 1793, -34, -1521, -240, 1599, 1170, -375, -234, 354, -198, 264, 907, 698, -802, -1086, -135, 655, 745, -839, -1960, -494, 280, 300, -269, -666, -1002, -1203, -404, 1100, 593, -1209, -1349, 65, 1249, 603, 9, -218, -393, -11, 1484, 1378, 426, -275, 94, 1049, 983, 921, 721, -611, -404, 649, 1307, -418, -718, 47, 74, -736, -64, 699, 259, -1827, -944, 562, -266, -1014, -16, 490, -559, -1248, 7, 1649, -86, -1055, -411, 1471, 812, 207, 289, 681, -88, -92, 1136, 2164, 453, -1478, -572, 1362, 1760, -176, -492, 227, 98, -600, 770, 1152, -260, -2284, -761, 1920, 1160, -1099, -1018, 548, 595, -121, 687, 1083, -225, -1110]
3103a110K024J582j732j541P01J218l86m07L87j98o84n5J184J49j014n42K40K83
3121I9l07N9o0J47l07r5K33J8J32j00k96k0N22K41J32o2n16O6O70J01L12p76m13
3144b20k25P68R75M5j430p27Q41Q91L3o54j80j150q9J747P72j264j742K48J698
3163C37M22j276j78M95r73M35J702K89k226q02J524K126j087j558O23P60m66j76
3181b9R93P3j635n79J583J273j551j626J000J274p52j167P91L62r28m11Q04J065
3199E40j006p61J048O69j059r01J358O75o96q56O89R55n33l38L05L69j049K33
3217c58J033O98j730l50R01Q51m87o95l20m85K76Q13M34q34r75k71J601j11k06
3236b15q85k75O35O33R30m90j219m1R01Q57m09o76k0K76L25P09N6j037j184R41
$$ y = [-1110, 914, 2496, 764, -777, -76, 1142, 756, 349, 736, 538, -146, -201, 983, 1132, 118, -424, -184, 99, -208, -149, -209, -62, -369, -464, -231, -213, -81, -181, -477, -497, 25, 266, 398, 336, -180, -114, 556, 657, 969, 193, -220, -445, 323, 1298, 1343, -87, -814, 27, 918, 951, 297, 117, -1033, -1122, 625, 1397, 133, -1609, -1361, 337, 759, -517, -695, -200, -1173, -738, 964, 1253, -973, -1775, -251, 1875, 788, -770, -147, 613, 147, -29, 964, 1037, -598, -1177, 406, 1679, 128, -1498, -498, 776, 24, -1143, -352, 10, -918, -1329, -525, 540, -466, -1227, -179, 490, -569, -1470, -112, 563, -133, -989, -300, 655, 122, -216, 89, 458, -591, -358, 675, 1373, -357, -707, 194, 1045, 558, -137, -457, -942, -666, 147, 581, -253, -1228, -1499, 102, -9, -215, -1100, -1375, -740, -107, 823, 333, -886, -927, -26, 831, 422, -254, -274, 2, 327, 1036, 1092, 55, -1129, -188]
3256a88J399p24r66J15L62J84n46K18N6m84m82Q16N71r73r49O77J548p05j055
3275a126K98Q65q8n20O10M08q48k97J208M44j111o08J520N61q88r39M94Q23o12
3294A94j76Q43n05j279L05J383P6r42j385J221Q06p22m38K87n4k95M69R39k15
3313E12j650L14J090P06m83r14L57J03QK27M95n80m90L87J276l01j507k89Q82
3332A43J02o5l97K16k37j52N87J26j021j13L85M21j09k17Pj72L50L6N44n06k59
3353c31P12O18n70q98L27R05j00n27M26J94o68K70Q46n89n47n99P66O56q13o85
3373f07L78N22p76O40l35j65p10J36J351J30j042n99P00J147n17m77K72L35l45
3392C8QQ82q5r59o07J449N00j087p42N90P44q32J48J01j95p64M29O10k27p86j08
$$ y = [-188, 1211, 487, -479, -364, -2, 182, -364, -146, -90, -574, -1056, -240, 331, -642, -1591, -914, 634, -71, -1126, -828, 37, -51, -571, 39, 447, -401, -698, 510, 954, -157, -765, 755, 1316, 428, -511, -17, 806, 194, 18, 861, 356, -923, -618, 765, 841, -101, -1486, -265, 541, -181, -619, -332, -386, -681, -212, 727, 512, -1138, -824, 266, 972, 489, -425, -68, 35, 43, 270, 765, 185, -305, 82, 1358, 1057, -450, -739, 143, 245, 180, -217, -1, -238, -390, 197, 323, -698, -811, -426, -5, -114, -331, -324, -496, -146, -110, 434, -72, -331, 381, 999, 429, -469, -142, 763, 663, 136, 562, 756, 88, 358, 1204, 615, 68, -531, 235, 891, 78, -607, -229, 293, -483, 157, -178, -343, -1053, -917, 434, 564, -478, -1077, -377, 770, 253, -224, 48, 383, 38, 46, 928, 843, -116, -723, 726, 1226, 139, -603, -13, 731, -101, 47, 148, -47, -811, -382, 228, 1, -785, -893]
3413h93O55O7l81Q5K23j5l6j81N96l98j21O54L68j03o92J57N50l7L6j70K18J61
3435G43n08L37j75j11o31N67L28n37n77J32L22J94j9n8o44p1N3Q63j96q03j74
3456i65J060Mm48J39L26o42O9J289L8j255k02J099K40n54k93L55k72J00j70P99
3476G17p77q57L03J038j61n89L6k05M09L8n5l59K06N2J14N18k94r6l05K73O98
3497G04o35m62O24Q36k40o07K26N05p66J95Q08m0j646L60Q93K26j166k26L94j13
3517a30o51Q95L06j048m38Q61R78j020q12K39K83M06M32j08n66m09O84N32m12
3536B2M3n02M21M24L46J40j129J73M65J15j54j04j87j67j02Q89j84j210O6N52
3556h3L77m97j10m3l25K77R19p84k20n0R68K9o26J19N50k39k16N79r6o92J08P78
$$ y = [-893, -238, -171, -552, -467, -244, -259, -295, -476, 120, -278, -399, 255, 623, 520, -172, -15, 535, 498, 534, 364, 582, 743, 235, 572, 397, 286, -345, 222, 550, 13, -564, -432, -110, 84, 65, 7, -637, -708, -655, 208, 12, -791, -965, 95, 99, -349, -210, 116, -526, -457, 832, 870, -385, -587, 512, 752, 198, -95, 260, -12, 88, -82, 717, -60, -917, -614, 424, 263, -326, -290, -495, -86, -48, -103, -462, -256, -204, -90, 428, 134, 38, -267, 6, 704, 69, -393, 231, 1067, 827, 220, 446, 951, 185, 380, 1188, 1148, -498, -138, 755, 981, -185, -411, -17, -130, -781, 114, 420, -628, -1066, -205, 773, -247, -1059, -820, -537, -131, 301, 193, -373, -782, -98, 434, 22, 65, -437, -16, 408, 754, 894, -235, -62, 403, 518, 364, 260, 73, -94, -196, 693, 509, -701, -635, -83, 294, -203, -313, -356, -681, -404, 515, -269, -489, -539, 429, 458, -168, -49, 501, 262, 46, 625, 529, -163, -55, 723]
3578G23J80r49l24L65M61n94K45L12q97l70P06P31o21r91L45N20J96j46j65j76
3598d49l21Q50J56j93q38J25P52M17J81n72q04N97M92K35j55l55o1j65qJ074l11
3619F47j392l0J288N6r36n30O08q8m44R80K9r47k58R61J78m40n37N33J21m4J18
3640a27N20m24m28M89M28m68M7L63K47l52MJ87k96m21M86J00l07o25O35j84l7
3661a63k4k3m06L57Q5r1l03k61L61M30L62o18j73n45Q00J132m17q77K69L75J5
3682B85J74L17l70j282L00J221M38j226p84R06J33o55P35L33p81p25N78Q48n27
3701h2r81L63R43l53l66M45k07k24Q2P97N8n66j40M30K36q7J50o1J60j18l63L08
3723D24L4j59r6j02J08J8j16J5L27m18q41M50P83l47p13l35R05Q3n31O36L01j025
$$ y = [723, 903, -46, -370, -5, 456, -138, 107, 419, -478, -848, -142, 589, -32, -1023, -678, -158, 38, -108, -273, -449, -770, 80, 236, 43, -795, -670, 82, 499, 680, 108, -696, -99, 393, 628, 473, 118, 57, -108, -116, 958, 647, -745, -775, 513, 569, -367, -897, -289, -377, -821, 159, 188, -759, -1017, -56, 122, -318, -855, -322, -201, -245, -127, 393, -31, -459, 30, 458, -10, 37, 400, 647, 295, 299, 486, 190, -231, 255, 355, 48, -577, 58, -126, -163, -187, -210, -616, -259, -174, -265, -568, -829, -468, -38, 324, -294, -467, -1012, -212, 920, 503, -374, -105, 270, 285, 459, 776, 406, -876, -576, 645, 1083, -143, -927, -21, 112, -543, 192, 525, -256, -981, -403, 445, -82, -1063, -700, 243, -110, -476, -31, -238, -462, -380, 417, 475, -91, -231, 199, 435, 348, 498, 437, 597, 479, 116, 424, 458, 299, 203, 101, 209, 227, 111, 126, 453, 35, -806, -356, 427, 80, -633, -968, -63, 20, -511, 125, 426, -599]
3745e99j43J047K20m85o22L61L38K93M96k01r41l25J046N93k88p03K6j65K19J81
3765C48K66n42p36K44J092l08q57O0Q5J23j16O75m27n04R5J97R07m62o87P23K00
3786C76K63o10L50P9O2p50M70M97k74n08J05P88m55j045O11R82n21r49K21R53
3806F45n13r50O06L39n50k76Q39P10j406k65M53Q95l88l07k8J04l32O80N46m36
3826C66p32P2R07L01m64p74j6L29M71M91l59j179j2M62J133m82p84q04M92P50
3846A68q3l29l0J44m21N43M42n55k41l04J300l5l96k40J95K14k4J30j66l48J35
3867I9N95j49m62m45O56j6l29l72J37L20l34K80l52l37j63Q61L20j97j021r8P00
3888c07K09K9K30m78m76L00J061L18j462k63N58J056L4p74j48j4k2M93L82o9j213
$$ y = [-599, -742, 305, 525, 40, -582, -221, 117, 410, 906, 705, -236, -561, 485, 1078, 790, 87, 113, -52, 167, 348, 614, 72, -664, -420, 672, 364, -493, -433, -348, -225, -341, 334, -93, -597, -502, -305, 602, 140, -547, 176, 376, 639, 29, 379, 458, 520, -230, 240, 737, 463, -45, 60, 848, 393, -652, -41, 941, 420, -529, -308, 645, 132, -818, -212, 127, -423, -699, 140, 850, -556, -821, -368, 527, 139, -168, -196, -92, -424, 256, 802, 366, -366, -294, 613, 914, 450, -324, -340, -11, 460, 951, 592, -587, -599, -137, 996, 514, -270, -1074, -582, 168, 85, -244, -274, -130, -551, -8, 434, -121, -362, -666, 634, 599, 203, -37, 158, 372, 348, 478, 312, -36, 99, 694, 545, 83, -362, 294, 278, -51, -423, -286, 34, -300, -20, -372, -709, -872, -11, 309, 112, -909, -1007, -307, -98, -69, 161, -317, -793, -493, 568, 886, -576, -839, -281, 775, 809, 35, -113, -127, -149, 344, 726, 657, -556]
3909e56l74R71O61p31p37L38M98k53Q6N03m30r75K96Q76M98j010l48M45L71j6
3929A13m75P22k77m53M55O06k07p63K84J079m08p97J3L43L5l42r6J21j28l06P13
3950B32M8m94o72N47J54M25r74P4K52L22J55k20j97o20R83M49j7o59j8M27K04
3971D01J79o9k13q57K79N79P52p99j006K11J094k72l91k36K7R3j20L74J80r39
3991g33j22R53M61n88p96O05P26m94k29O12k42k96q2R06K15q73n26N34N97n04
4011A24j37J64L05m47r0M94k37n45L51K86k9q14p6R15k54m57p6L06K6j04K22N61
4033D88l76o47K14J111k17o37m76Q15K01k70k7R1j0l77O59J04m47p81M4R24J96
4054E82n74n11M19j87J69N77o04l44p3M49J90k10n32K00L32K77J13N7o95M9P43
$$ y = [-556, -930, 41, 702, -29, -766, -428, 70, -183, -97, 406, -24, -999, -703, 173, 671, -339, -687, -242, 129, 113, -362, 360, 83, -370, 85, 691, 484, -279, 5, 1084, 676, -121, -108, 235, 270, -72, -168, -47, -175, -481, 232, 280, -214, -886, -339, -185, 240, -734, -660, -408, -86, 69, -151, -348, -968, 15, 464, 447, -212, -230, 197, 401, 580, 511, 298, -559, -280, 299, 1051, 252, -754, -543, 551, 279, -112, -348, -321, -228, -348, 26, 206, -733, -855, 98, 559, -29, -825, -220, 506, 12, -217, 395, 153, -143, -225, 681, 896, 23, -503, 31, 628, 124, -13, 151, 456, 9, -81, 413, 176, -369, -18, 268, 239, -575, -651, 264, 10, -447, -523, -217, -191, -295, -73, 488, 112, -535, -321, 790, 573, -64, -540, 275, 476, 206, 179, 270, 260, -117, 542, 646, 199, -582, -538, 386, 582, 8, -503, -84, -271, -102, 475, -129, -473, -546, -97, 93, -117, -649, -449, -117, 160, 273, 330, -365, -316, 427]
4075D27k14j18l29Q0M21L72p0l58q2k76J66M21k64j76j84j0L45q8o64L18L06p5
4097e2l77M15Qm59R1O08j2q07j25J110R0n23L7K31K60l64j52O11l36m95J56J024
4119I39n22o11j95M80M64n44P5m3n04J07N02J05j03p77l7M12R2j19l22K44M37
4140H0k49J12j71J65k76M38L19l99k48L42N97k60l33l5K29P8n7K68l23m29j45
4161b97P58j51n48k83M44K07l48J71K58n63n18O12O73j57p98N56K85M0k10k61
4181a30NJ62M43L16o71l37P4O15m34RJ67l42L79q4K19k98q5k80j32N72J20n23
4203b35l04K71K69j6l70k7N45m64K96K30r7p08K90N26M94r87m4P85p1k00J59J81
4225E23l04l35P23J20m26o92L38O87m83l33K56j54j67K91L41j85q78K92j71J022
$$ y = [427, 213, 95, -234, -154, 267, 639, 569, 211, 129, -147, 19, 440, 176, 0, -184, -194, 151, 63, -601, -283, 23, -52, -429, -14, -6, -465, -374, 234, 222, -585, -710, 400, 490, -33, 4, 235, 495, 131, -21, 590, 254, -241, -85, 939, 417, -194, -389, 91, 555, 11, 86, 43, -461, -354, 148, 253, 150, -627, -664, -252, -160, -279, -601, -357, 80, -169, -57, -228, -63, -339, 99, 418, 19, -229, 113, 710, 450, 117, 82, 311, 389, 332, 600, 277, -152, -297, 461, 310, -238, -521, -77, 130, -218, -47, 211, -352, -870, -258, 415, 258, -540, 16, 301, 341, 131, -130, -125, 37, 480, 796, 125, -212, -138, 477, 43, 52, 219, -123, 256, 172, 391, 93, 8, -272, -404, 168, 288, -235, -539, -268, 1, -15, -385, -412, 133, -331, -35, 195, 98, -610, -320, 206, 700, -287, -331, 454, 383, 183, 342, 523, 219, -116, 607, 727, 301, -391, -53, 634, 151, -182, 74, -80, -247, 44, 385, 200, -678, -386, -557, 465]
4245D65o45J5j71K51K88k26p2j24J02r4L81j33j99M0L85J94k7n07r5O23R7l81
4267A67j37K03n60J25M79j37o64r3L24K40k59M64k24n08Q4N55J24m63m23P29L10
4288C36o13M59k36O7q4L98L06n91m51N26O23k19m41P5n2j86J96J11m71j76J91
4309b32K51J58m46m2l35J55N44j93k79o5P47k94k93N18j45l38K02O05p9n68m48
4330e77R92j6l64K3J00p0k82M47L21n86l82L83N35o80m75Q9J47J48K29K79m48
4351a87l50J72O72j81j26n5P9l55M76O6j70j69M13o4j45J37q8j60q7N99J42n29
4373I0j62k17P42l46j79K19n42J25J37K20n06O7L18p6k75P8J69l02R9rM29P0m67
4396c18L92K26q8k67N11l20P3j31M41m14j83J17M99m38m39L40J97k42O2K57l59
$$ y = [465, -180, -165, -336, -85, 203, -23, -95, -219, -117, -211, 170, 37, -162, -122, 263, 457, 430, -77, -172, 451, 548, 167, 30, 233, -327, -202, 277, 140, -524, -617, -293, -53, -312, 152, -72, -580, -496, 59, 183, -280, -703, 26, 336, -277, 182, -54, 13, -71, 327, 633, 42, -409, 117, 740, 521, 80, 155, 103, -83, 113, 224, -247, -423, -232, 19, 177, -269, -311, -646, -491, 53, -140, -419, -484, 263, -31, -324, 194, 49, -289, -87, 518, 439, -129, -577, 415, 399, 35, 58, 158, 88, -194, 253, 574, -12, -394, -11, 524, -156, -631, -542, -395, -247, -18, 261, -187, -537, -365, 307, 126, 0, -55, 24, -331, 145, 211, 41, -128, 285, 221, 76, 213, 125, -35, -122, 477, 619, 90, -72, -289, 453, 107, -72, 147, -395, -270, -133, 87, -419, -352, -34, -110, -385, -307, -138, -440, -341, -350, 79, 149, -318, 74, 300, 212, -55, 456, 136, 209, 78, 519, 105, -78, 39, 538, 100, -339, 1, 198, -44, 18, 275, -84]
4417h4j47n5M68l76j10j22L66rr9j5m73M48J2K95j32J53j28J75j99J79L62p74
4439b65J27M30R9l64J15J9p2l99N00M07n95m81M85K50k96n66M93K21p32J23M75
4460b6j59m4P9P0J26m55N67J4k86K43J1p7j5L40l22O2m7L64l1k79k6k68M14q1
4484A74j52K40n48K2L60j86n5L6k37K50Mr5L66n64M1M62mk76m0O1j29J18K27K35
4508C10k29l01J86J30j3M4L60j96l79M59J11l49n41J57K54l3l3kJ20n85J02L59
4530f9L05m93%J01J26m86N16M57j90l78J65p3L62l28J09K22n8R9l02L60J66o61
4552e0j47N57N6k19l45q8M72k40J27P5l63m56L73J46K31k16k95QK60n4J08l1P9
4575a2m34J17R39o06k67M35m02L46L29J64k77k0O3k9J0k34oN74o62l43J1N39l48
$$ y = [-84, -231, -286, 182, -194, -304, -426, -60, -69, -168, -183, -656, -208, -196, 99, -33, 120, -8, 167, -32, 147, 509, -265, -138, 292, 391, 27, 142, 161, 89, -310, 190, 597, 2, -479, 6, 256, -40, -606, -113, 108, -624, -501, -26, -185, -229, -150, -80, 46, -409, 158, 172, -114, 129, 140, 63, 48, 388, 66, 128, 81, 445, 414, 135, 109, -159, 255, 174, 22, 262, -286, -264, 96, -90, -145, -109, -346, -96, -92, -187, 179, -385, -344, 118, 114, -162, -202, -141, -270, -152, 75, 310, 81, -220, -34, 96, 83, 127, 487, 291, -88, 371, 482, 133, -408, -251, 3, -30, -63, -65, 55, -530, -428, -69, 236, -257, -257, -156, -30, -516, 0, 457, 267, -111, 54, -19, 343, 15, 124, 346, 288, 387, 85, 445, 611, -50, -197, 360, 416, 197, -148, -236, 236, -4, 123, 198, -165, -621, -248, -102, 129, -87, -382, -374, -114, -168, -60, -91, -12, -446, -329, 610, 4, -263, 172, -230, 116, 445, 609, 332, 312, 375, 346, 356, 122, 116, 690, 28, -315, -304, 235, -113]
4598a13j73J12L40k77o2O4l4Mk0o4O9O6K05l08K78M51k81P9K8m17j35L48K86n8
4622C88m48L39M6l91q9O02m46l61K75K13j21j61l19M01K59m29M02l68M60o66K50
4643a64J43o1p7Nl11N45k82J64p6M12j34K84l17l5J20k08M33o8j72l07L91j1j50
4666A24o9j42J85n05j29M95N9j97j76L94k2n9k60K0L05l05Q7J20P1Q8o7K22m12
4689a73K10K05k92J97J38o3q4j74L29j55k61k3J52J51k35l92J41K95j97j15M50
4710A04k57m2j54N50k05K6l73K55L72J2m31J81M2Q3L66j26j22l99J7O54l40n0
4732A63m19N21k2k10o2L25k96l78L9N4K64m77R0K64L42m85j36M84l21J30J19J86
4754A75l12o7J51M42l95l00M09N4K63l91j1N40j72J38n38K86l40l48K11M29J71
$$ y = [-113, -286, -174, 166, -111, -173, -109, -143, -139, -159, -223, -154, -88, 117, -191, 87, 538, 257, 336, 364, -53, -188, 160, 446, 388, -60, 279, 325, -66, -155, 447, 1, -360, -85, 128, 7, -154, -473, -72, 187, -242, 160, -208, 252, -414, -164, -21, -82, -159, -154, -465, 80, -202, -38, -114, 298, 164, 448, 131, 96, 216, 8, 441, 373, 201, -106, 285, 274, 124, 55, -87, 98, -407, -536, -41, 18, -179, -355, 39, 17, -42, -302, -282, 23, -282, -195, -75, -4, 84, 17, 239, -173, 37, 242, -50, 147, 285, 222, 138, -36, 293, 138, -123, -146, 6, 157, -78, -470, -329, -34, -231, -346, 104, -153, -195, -349, 201, -4, 22, -351, -96, 276, 288, -143, 38, 80, 163, 529, 403, 281, -118, -101, 553, 213, 163, -256, 265, 243, 33, -29, 296, 0, -378, -339, -285, -21, -498, -408, -144, 198, -287, -423, 61, -260, -130, -11, 175, -137, -204, -53, 389, -6, -306, 103, 157, 420, 29, 18, 558, 386, 524, -14, 272, -68, -416, -205, 224, 395]
4775C95m21m31N26J33l84P2m1L57n00N77j12Q8p97M34QJ44k47K44l18N30m22m9
4797b14N63n12M3N67n1n80J70L4K09l1J77k53o2l87M40L70k63m98j09L49L08l72
4819a02J27P2l86O5M14j47m28o8N47n9l7J44o8J24R6l0k11J47mj39K39j25k34
4842f3j30M45J02l71j87L01L99n55j96J83j94J0k01N05k5p85J38O21K39k85J45
$$ y = [395, -26, -457, 69, 202, -182, -110, -151, 206, -294, 283, 171, 259, -538, -104, -96, 48, -199, 45, -273, 257, -165, -214, 349, -163, -120, 447, 396, -184, -14, 20, 229, 198, 375, 122, 60, -327, 113, 483, 220, -278, -387, -38, 270, -102, 25, 97, -289, -224, 190, 43, -385, -453, 94, 35, -2, 142, 74, 198, 294, 264, 53, 200, 196, 57, 296, 171, -63, -193, 252, 354, -17, -204, 97, 496, -59, -255, -72, -266, -256, -457, 48, 23, -762, -624, -3, 236, -49, 96]
$$ [...]
8191G6
##END NTUPLES=NMR FID
##END=
