##TITLE=1H_LR-661-CK2
 CDCl3, 8 sc, 
 14.3.2019
##JCAMPDX= 6.0         $$ Bruker NMR JCAMP-DX V2.0
##DATA TYPE= NMR FID
##DATA CLASS= NTUPLES
##ORIGIN= UXNMR, Bruker Analytische Messtechnik GmbH
##OWNER= root
$$ XWIN-NMR		Version 3.5
$$ Thu Mar 14 14:26:30 2019 Russian Standard Time (UT+4h)  she@DPX200
##.OBSERVE FREQUENCY= 200.1315
##.OBSERVE NUCLEUS= ^1H
##.DELAY= (6, 6)
##.ACQUISITION MODE= SIMULTANEOUS
##.ACQUISITION SCHEME= undefined
##.AVERAGES= 8
##.DIGITISER RES= 18
##SPECTROMETER/DATA SYSTEM= spect
##.PULSE SEQUENCE= zg30
##.SOLVENT NAME= CDCl3
##.SHIFT REFERENCE= (INTERNAL, CDCl3, 0, 15.7039)
##AUDIT TRAIL= $$ (NUMBER, WHEN, WHO, WHERE, WHAT)
$$ ##TITLE= Audit trail, XWIN-NMR		Version 3.5
$$ ##JCAMPDX= 5.01
$$ ##ORIGIN= Bruker BioSpin GmbH
$$ ##OWNER= she
$$ F:/spectra/data/she/nmr/H-F/1/audita.txt
$$ ##AUDIT TRAIL=  $$ (NUMBER, WHEN, WHO, WHERE, WHAT)
(   1,<2019-03-14 14:25:39.01 +0400>,<she>,<DPX200>,
      <created by zg, POWCHK disabled, PULCHK disabled
       configuration hash MD5:
       00 E9 B6 7A A2 85 ED C7 34 08 36 98 17 FE 4E 26
       data hash MD5: 16K
       04 A7 50 21 FB FE 73 9F A7 03 FE 77 22 4A 73 05>)
$$ ##END=
$$ 
$$ hash MD5
$$ 65 60 12 55 33 59 80 F9 04 84 74 98 47 50 44 E4
##$RELAX= 
##$RELAX= 
##$RELAX= 
##$RELAX= 
##$RELAX= 
##$RELAX= 
$$ Bruker specific parameters
$$ --------------------------
##$DU= <F:/spectra>
##$EXPNO= 1
##$NAME= <H-F>
##$PROCNO= 1
##$TYPE= <nmr>
##$USER= <she>
##$AMP= (0..31)
100 100 100 100 100 100 100 100 100 100 100 100 100 100 100 100 100 100 
100 100 100 100 100 100 100 100 100 100 100 100 100 100 
##$AQSEQ= 0
##$AQ_mod= 1
##$AUNM= <au_zg>
##$AUTOPOS= <>
##$BF1= 200.13
##$BF2= 200.13
##$BF3= 200.13
##$BF4= 200.13
##$BF5= 200.13
##$BF6= 200.13
##$BF7= 200.13
##$BF8= 200.13
##$BYTORDA= 1
##$CFDGTYP= 0
##$CFRGTYP= 5
##$CHEMSTR= <none>
##$CNST= (0..31)
1 1 145 1 1 1 1 1 1 1 1 1 1 1 1 1 1 1 1 1 1 1 1 1 1 1 1 1 1 1 1 1 
##$CPDPRG= <>
##$CPDPRG1= <>
##$CPDPRG2= <>
##$CPDPRG3= <>
##$CPDPRG4= <mlev>
##$CPDPRG5= <mlev>
##$CPDPRG6= <mlev>
##$CPDPRG7= <mlev>
##$CPDPRG8= <mlev>
##$CPDPRGB= <>
##$CPDPRGT= <>
##$D= (0..31)
0 1.2 0 0 0 0 0 0 0 0 0 0.03 0 0 0 0 0 0 0 0 0 0 0 0 0 0 0 0 0 0 0 0 
##$DATE= 1552559138
##$DBL= (0..7)
120 120 120 120 120 120 120 120 
##$DBP= (0..7)
150 150 150 150 150 150 150 150 
##$DBP07= 0
##$DBPNAM0= <>
##$DBPNAM1= <>
##$DBPNAM2= <>
##$DBPNAM3= <>
##$DBPNAM4= <>
##$DBPNAM5= <>
##$DBPNAM6= <>
##$DBPNAM7= <>
##$DBPOAL= (0..7)
0.5 0.5 0.5 0.5 0.5 0.5 0.5 0.5 
##$DBPOFFS= (0..7)
0 0 0 0 0 0 0 0 
##$DE= 6
##$DECBNUC= <off>
##$DECIM= 24
##$DECNUC= <off>
##$DECSTAT= 4
##$DIGMOD= 1
##$DIGTYP= 9
##$DL= (0..7)
0 120 120 120 120 120 120 120 
##$DP= (0..7)
150 150 150 150 150 150 150 150 
##$DP07= 0
##$DPNAME0= <>
##$DPNAME1= <>
##$DPNAME2= <>
##$DPNAME3= <>
##$DPNAME4= <>
##$DPNAME5= <>
##$DPNAME6= <>
##$DPNAME7= <>
##$DPOAL= (0..7)
0.5 0.5 0.5 0.5 0.5 0.5 0.5 0.5 
##$DPOFFS= (0..7)
0 0 0 0 0 0 0 0 
##$DQDMODE= 0
##$DR= 18
##$DS= 0
##$DSLIST= <SSSSSSSSSSSSSSS>
##$DSPFIRM= 0
$$ [...]
##$SUBNAM2= <"">
##$SUBNAM3= <"">
##$SUBNAM4= <"">
##$SUBNAM5= <"">
##$SUBNAM6= <"">
##$SUBNAM7= <"">
##$SUBNAM8= <"">
##$SUBNAM9= <"">
##$SW= 24.9337058887773
##$SWIBOX= (0..15)
0 0 2 0 0 0 0 0 0 0 0 0 0 0 0 0 
##$SW_h= 4990.01996007984
##$TD= 16384
##$TD0= 1
##$TE= 0
##$TE2= 300
##$TE3= 300
##$TEG= 300
##$TL= (0..7)
0 120 120 120 120 120 120 120 
##$TP= (0..7)
150 150 150 150 150 150 150 150 
##$TP07= 0
##$TPNAME0= <>
##$TPNAME1= <>
##$TPNAME2= <>
##$TPNAME3= <>
##$TPNAME4= <>
##$TPNAME5= <>
##$TPNAME6= <>
##$TPNAME7= <>
##$TPOAL= (0..7)
0.5 0.5 0.5 0.5 0.5 0.5 0.5 0.5 
##$TPOFFS= (0..7)
0 0 0 0 0 0 0 0 
##$TUNHIN= 0
##$TUNHOUT= 0
##$TUNXOUT= 0
##$USERA1= <user>
##$USERA2= <user>
##$USERA3= <user>
##$USERA4= <user>
##$USERA5= <user>
##$V9= 5
##$VALIST= <valist>
##$VCLIST= <CCCCCCCCCCCCCCC>
##$VD= 0
##$VDLIST= <DDDDDDDDDDDDDDD>
##$VPLIST= <PPPPPPPPPPPPPPP>
##$VTLIST= <TTTTTTTTTTTTTTT>
##$WBST= 1024
##$WBSW= 4
##$XGAIN= (0..3)
0 0 0 0 
##$XL= 0
##$YL= 0
##$YMAX_a= 417203
##$YMIN_a= -595764
##$ZGOPTNS= <>
##$ZL1= 120
##$ZL2= 120
##$ZL3= 120
##$ZL4= 120
##$ABSF1= 10
##$ABSF2= 0
##$ABSG= 5
##$ABSL= 3
##$ALPHA= 0
##$AQORDER= 0
##$ASSFAC= 0
##$ASSFACI= 0
##$ASSFACX= 0
##$ASSWID= 0
##$AUNMP= <proc_1d>
##$AZFE= 0.1
##$AZFW= 0.1
##$BCFW= 1
##$BC_mod= 2
##$BYTORDP= 1
##$COROFFS= 0
##$CY= 11.3945322036743
##$DATMOD= 1
##$DC= 2
##$DFILT= <>
##$DTYPP= 0
##$F1P= 18.9103706918063
##$F2P= -1.10871071338519
##$FCOR= 0.5
##$FTSIZE= 0
##$FT_mod= 4
##$GAMMA= 1
##$GB= 0.15
##$INTBC= 1
##$INTSCL= 1
##$ISEN= 128
##$LB= 0.24
##$LEV0= 0
##$LPBIN= 0
##$MAXI= 10000
##$MC2= 0
##$MEAN= 0
##$ME_mod= 0
##$MI= 1.114404
##$NCOEF= 0
##$NC_proc= 0
##$NLEV= 6
##$NOISF1= 3.799351
##$NOISF2= 2.8
##$NSP= 1
##$NTH_PI= 0
##$NZP= 0
##$OFFSET= 15.70392
##$PC= 1
##$PHC0= -9234.24
##$PHC1= 32.20026
##$PH_mod= 1
##$PKNL= yes
##$PPARMOD= 0
##$PSCAL= 0
##$PSIGN= 0
##$REVERSE= no
##$SF= 200.130013532006
##$SI= 16384
##$SIGF1= 3
##$SIGF2= 2
##$SINO= 400
##$SIOLD= 16384
##$SREGLST= <1H.CDCl3>
##$SSB= 0
##$STSI= 0
##$STSR= 0
##$SW_p= 3612.71676300578
##$SYMM= 0
##$S_DEV= 0
##$TDeff= 0
##$TDoff= 0
##$TI= <>
##$TILT= no
##$TM1= 0
##$TM2= 0
##$TOPLEV= 0
##$USERP1= <user>
##$USERP2= <user>
##$USERP3= <user>
##$USERP4= <user>
##$USERP5= <user>
##$WDW= 1
##$XDIM= 8192
##$YMAX_p= 0
##$YMIN_p= 0
$$ End of Bruker specific parameters
$$ ---------------------------------
##NTUPLES= NMR FID
##VAR_NAME=  TIME,          FID/REAL,        FID/IMAG
##SYMBOL=    X,             R,               I
##VAR_TYPE=  INDEPENDENT,   DEPENDENT,       DEPENDENT
##VAR_FORM=  AFFN,          ASDF,            ASDF
##VAR_DIM=   8192,          8192,            8192
##UNITS=     SECONDS,       ARBITRARY UNITS, ARBITRARY UNITS
##FACTOR=    0.0002004,     1,               1
##FIRST=     0,             0,               0
##LAST=      1.6414764,     0,               0
##MIN=       0,             -595764,         0
##MAX=       1.6414764,     417203,          0
$$ Real data points
##PAGE= N=1
##DATA TABLE= (X++(R..R)), XYDATA
$$ [...]
2971C341r176J708R419j118r174J09R705J073r827k135R111K500q708k321Q424
2986B931L069q226l892P763M378p650l944P421M485p817n298P389N771n996n792
3001e408N374O542n129p151M096P635k654p530J102O763M1o454j170O517K469
3016E043n668l503M851M536m471m833L459N603l265o021K249O382j631o543J650
3031b162O707j624o618N93O860o3o885p8O910J63p490o44P571K082p533l365P840
3048B264L127o361m729N873N582n166o060L643O490k783o516J479O400J98o739
3063c298j014O353K021n637k156N078K591n033l349M758L914m737m317M915M186
3078D275m768m847M769N742m536o360M159O820l875p415L486P855k772p768J676
$$ y = [3341, -5835, -4127, 5292, 4174, -5000, -4891, 4814, 5887, -3940, -6075, 3036, 5536, -3172, -5493, 2931, 6000, -2226, -6118, 1645, 6023, -1627, -5571, 1850, 6335, -1482, -6780, 609, 6380, 384, -5408, -34, 6508, 1379, -5772, -1676, 5959, 3305, -4225, -3123, 3640, 3681, -2773, -3943, 2574, 5043, -625, -4128, 723, 5259, 788, -4045, -586, 5017, 1752, -4269, -2020, 4362, 2731, -3812, -2162, 4545, 2921, -3697, -3104, 3756, 3693, -3192, -3270, 3640, 3803, -3687, -4331, 3240, 5322, -2211, -5576, 2264, 5391, -970, -5699, 174, 5756, 590, -5470, -1827, 4663, 1880, -4636, -3157, 3243, 3441, -3298, -4312, 2041, 4062, -1575, -3731, 1347, 3938, -1095, -4444, 314, 4228, -509, -4826, 89, 4275, -493, -5340, -571, 5171, 635, -5725, -1566, 5254, 1379, -6036, -2550, 5305, 2533, -5235, -3559]
3093c559Q099q82q124O5P532J155p066k374O307L026n267l235M740L987m290l989
3109c875L343M336k544m608J697N009j954m775J536N339j308n633O27O237m41
3124B986o482K22O693J055p430j796P795K413p592l253P467M364o979n043N889
3139C09N694n204n940M645N865l606o200K762N673j561n711J022N605l48n293
3154b288N6N242J40m910r52M755J595n321j835M949K340m681l363M607M245m598
3170a9m684M278N917m154o686L407P156k166p924J674P795p87p861l54Q060P50
3186D402p504j425O592K107o114k651N821K703n006l042M258L548m396l310M264
3201B47L511l828l783L502L820k811m963L059M916k012o431J924O462k49p167
$$ y = [-3559, 4540, 3658, -4466, -4401, 3131, 4286, -2780, -5154, 1153, 4179, -1088, -4323, 417, 4404, 114, -3875, -532, 3804, 1260, -3348, -1651, 3358, 1404, -3371, -1835, 3504, 2196, -3437, -2810, 3427, 2986, -3496, -3274, 3419, 4474, -2956, -4752, 3043, 5456, -2136, -5389, 2078, 6442, -537, -5580, 309, 6003, 799, -5141, -496, 5369, 1763, -4437, -1675, 3998, 2437, -3274, -2252, 3353, 3005, -2288, -2232, 3010, 3150, -1760, -2712, 2043, 3638, -1683, -3518, 1431, 3771, -910, -4273, 334, 4579, -19, -4703, -425, 5492, 1338, -5348, -1941, 5215, 3049, -4875, -3201, 4594, 3807, -4054, -4408, 3652, 4402, -3102, -4527, 2065, 4172, -1942, -4593, 1228, 3931, -1075, -4117, 141, 3689, -707, -4017, 247, 3758, -70, -3853, -351, 3469, 658, -4305, -1246, 3670, 1658, -4773, -2849, 3613, 3364, -3803]
3216c803n00P118J473o957k371O267L487n889m331N252M802m306n391M339N093
3231D283l606m883K828N020k303n542K671N026j858n325J729N161j195n395J360
3246b029N144p54n423J85N972L84n923j224N626K057n307l328N341M222m756m665
3262d478L488N630k519o064J891O056r58o020J63O037K03n585r14N524J156n454
3278a844j033M677J573m803j601M832J801m608k168M569K512m522l050M608L622
3293D565m401m349M141M834l342n590K463N775j664o179R60N298Q57n901j194
3308c727N312K020m698k567M404K874l969l405L592L594l227l554K897L326k577
3323B95l351K014M087k186l956J540M373k017m060J521N009j369n500M93O156
$$ y = [-3803, -4303, 2815, 4288, -2669, -5040, 1227, 4714, -1175, -5506, -254, 4548, 242, -5149, -810, 4283, 677, -4206, -1378, 3642, 1339, -4203, -1532, 3494, 1636, -3689, -1960, 3201, 2006, -3389, -2029, 3115, 2361, -3062, -2877, 3095, 3479, -2444, -3668, 1958, 4015, -1292, -4620, 721, 4943, 187, -4478, -990, 4640, 2121, -3943, -2052, 4004, 3046, -2974, -2811, 3226, 3429, -2156, -3070, 2454, 3610, -1844, -2877, 1800, 3373, -1430, -3031, 1801, 3602, -1006, -3174, 1395, 3907, -615, -3665, 943, 4565, 164, -4185, -44, 4790, 1448, -4142, -1679, 4096, 2432, -3747, -2787, 2511, 3368, -2533, -3727, 1585, 3605, -1093, -3660, 744, 3618, -351, -3756, -164, 3430, 203, -3351, -454, 2872, 295, -3056, -1042, 3045, 859, -3097, -1557, 2816, 799, -3261, -1740, 3269, 1900, -3600, -3107, 3049]
3338C049J80o085j441O491J953n839k937M878M118m668m422L945M691l067n205
3353d359K983M828k037m441J542M683j362m833R62M499k08m952M1N007l30m498
3369b475n28N388P54n158j337N045K087n334k582N270L438m894m084M170M809
3384D569l874m775L091N637k641n303P81N560m71n138K4N210N57n002j069M612
3400A768J353m165j028L731J280l757j726L642K085l474j941L115K391l882k528
3415c136L660L308l199l518K420L956j839m803J624M986n83n096p54M745R80l557
3431h06k078M112K542l934l054K427L548j838l551K031L315j816l609P84M341
3446B414j161l168N96L397q84l692N43M048J43m079m70L780J017m934j196N312
$$ y = [3049, 3229, -2856, -4297, 2194, 4147, -1692, -4629, 249, 4367, -301, -4723, -778, 3913, 846, -4359, -1376, 3452, 1415, -3026, -1484, 3199, 1837, -2996, -2034, 2465, 2257, -2695, -2654, 2353, 2023, -2475, -3003, 2385, 3139, -2019, -3356, 1689, 3776, -1558, -4140, 1130, 4568, -326, -4410, -240, 4569, 695, -4080, -989, 4648, 2007, -3296, -2515, 3045, 2574, -2564, -2540, 2670, 3227, -1775, -2844, 1768, 3121, -1044, -2072, 1659, 2939, -818, -2544, 1098, 3183, -291, -2232, 883, 3274, -608, -3136, 524, 3832, 633, -2885, -465, 3491, 1652, -3151, -1527, 3459, 2876, -2220, -2974, 1771, 2751, -806, -2884, 1228, 3770, -164, -3218, -791, 2757, 919, -2632, -601, 2714, 898, -2711, -1927, 2414, 1253, -1915, -1319, 2078, 1194, -2498, -1955, 2093, 2236, -1843, -2313, 1467, 2484, -2450, -3646, 1666]
3462A666J820m468l155M511L255l723m295L780N067l197n561K169N320r94n348
3477c153M00N693K68o089o71M902J814m768j606M612K004n170k505N078L229m982
3493i44l114M855L255m720m053N142M369m784m955M330N423m276n787L821O790
3508E352l035p099K081O740q55p234O80O863P48o894j275N920J819n383j836N251
3524A843K430m990l001M545K891m051k904M318L052m267l785L596M562l529m201
3539c491K950N192l300n744K844N991j340o641Q91O340o61o543l1O703J030o125
3555a935j458M970J816m755k356M519K858l835l054K887L017k739k422K352K755
3570B620k291k621J625K619j551k280J115K943j003l885Q70L394P17m041q06L688
$$ y = [1666, 3486, -982, -4137, 374, 3629, -94, -4389, -609, 4458, 1261, -4300, -2131, 3189, 2195, -3153, -2753, 2940, 3208, -2881, -3552, 1350, 3164, -1604, -3210, 1402, 3406, -1764, -4269, 809, 4038, -944, -4058, 797, 4052, -668, -4721, 421, 4790, 6, -4949, -619, 4804, 528, -5259, -1438, 5352, 2317, -4782, -2701, 4039, 3184, -4050, -3370, 3493, 4241, -2653, -3928, 1992, 3811, -1572, -3408, 1843, 4273, -717, -3718, 827, 3718, -333, -3237, 1081, 4133, -134, -3919, -323, 4239, 710, -3491, -541, 4651, 1351, -4393, -1549, 4442, 3102, -3539, -2648, 3692, 3031, -3512, -3543, 3160, 4190, -1935, -3393, 1577, 3393, -1362, -3718, 801, 3659, -176, -3230, -343, 2674, -65, -2487, -135, 2620, 329, -2292, -667, 1952, 401, -1879, -764, 2179, 1176, -2709, -1839, 1555, 2272, -1769, -2575, 1113]
3586A113J298m102j906L868L249l469l594K670L912k598l883J653M556j217m177
3601b627J43M222k46l325l49L934L80l417j463L109J346k580j296L113P75k359
3617f40j710J986K585k552j694K251J858j901l219K265L773j217m320P70M266
3632B501l58m713n14N337J313m845k179M361K308l895k441L755L213l781l059
3647b997K845L135k642k883K471L112k651l205K430L185j676l216J953K610j538
3662I33l022J124L558q54l533P28L034K50l463p42L610J277l221k203L035K137
3678B648k450k818K367K833j168l646R15L560l86l595K62L191J3l389k92L246
3694A291M13k665l30K447L92k871l28K569P19k399j153L151J29k430j217K735
$$ y = [1113, 2411, -1691, -3597, 271, 3520, 51, -3543, -873, 3039, 441, -3442, -1789, 2767, 1550, -2627, -2484, 1738, 1492, -1833, -2182, 1752, 2132, -1285, -2748, 361, 1707, -873, -2169, 944, 1719, -640, -2350, -364, 2221, -331, -2025, 226, 2084, 183, -3036, -771, 3002, 1785, -2535, -1765, 2501, 2143, -2570, -3084, 2253, 3566, -1279, -3458, 903, 3211, -684, -3125, 630, 3843, 62, -2997, -152, 2983, 341, -2542, -71, 3041, 390, -2815, -385, 2800, 1124, -2092, -139, 2471, 933, -2089, -965, 2593, 1739, -1794, -1066, 1968, 2218, -1245, -1987, 1623, 2900, -321, -2524, 511, 2648, 198, -2620, -253, 2580, 1412, -2234, -1319, 2241, 1855, -1740, -1478, 1713, 1726, -1663, -1955, 1291, 1704, -961, -1291, 1156, 1548, -1323, -1651, 918, 1637, -762, -1915, 1236, 1365, -1065, -2282, 453]
3710D53J980k650j984J729K637j939k370R45L129n58l144k14K623J241k663j462
3726b247K170K048j753k739J513K908j493k541J066K888j264k619J188K571n68
3741A128l258J120K875r85l334J109L561r93l464P80L167l07l833M81L728L73
3757B148l722q95L671J538l409j896L011K366k657k752J944K920j251k964O97
3772a251L134l82l179K45L038K01l065k50K899N65l335k25L244O03l677n84L549
3789A530J076l942j292M159J593m081k189M067K468l518l377L657L484k950l464
3804b779K214L606j701l921J391L576n00l595J49K924J76k647l87K698M16k468
3820h48p87K132J197k396j041K351J081k036j756K168K049k015k778K326K697
$$ y = [453, 2433, -217, -2201, -472, 2165, 226, -2144, -1199, 1930, 1372, -1772, -1986, 637, 1878, -785, -2247, -77, 1971, 218, -2521, -1008, 1900, 407, -2134, -1068, 1820, 556, -2063, -875, 1696, 1128, -2130, -1010, 1865, 880, -2454, -1345, 2216, 1223, -2241, -1461, 1706, 1399, -2434, -1953, 1775, 2148, -1574, -2469, 1202, 2740, -669, -2565, 446, 2812, 155, -2597, -653, 2267, 1016, -1948, -1251, 1883, 1501, -1678, -1433, 1605, 1806, -1259, -1509, 1390, 1955, -1380, -1605, 1639, 2242, -1435, -2019, 1530, 2606, -1336, -2628, 1531, 3124, -957, -3146, 921, 3389, -129, -3506, 151, 3635, 685, -2779, -565, 3041, 1340, -2581, -1190, 2386, 1886, -1709, -1560, 1364, 1540, -1107, -1494, 1204, 1620, -848, -1635, 497, 1694, -702, -1743, 608, 1689, -347, -2103, 65, 2114, 99, -2679, -353, 2344]
3835B344j901l191J570L976j374m099J058M128j050l538j41L830M22l722q79L499
3851I32R55k982j167K519J486k256j346J823J829j876j572J065J756j005j596
3866a435J188J327r72j907J222J817l33k671K56K956j87k737o7K664P57k742j765
3883b629L055K234k916k449K306L099k316k724J485L210j402l165J677K600r49
3898A116k770P49K475l76k297K47K270j91j968m2K090J25k234k29J827R12k409
3915g05p88K358Q20j829j791K162K200j891k745J833K697r63l273M08L299pl188
3932a403m03L374N01k917j124K872R60k646j049K314J344k117j405K105J668k429
3948c55j456K293J402k101j642J917J856j639k108J259K452j308k698J127K556
$$ y = [2344, 443, -2748, -1178, 2798, 1424, -2675, -1617, 2511, 1461, -2077, -2218, 1612, 2034, -1688, -2567, 932, 1887, -1095, -2262, 257, 1743, -513, -1859, -36, 1793, -83, -1655, -590, 1166, 161, -1435, -247, 1080, 108, -1799, -577, 1240, 907, -1764, -1508, 1448, 1261, -1476, -1543, 1121, 1878, -864, -2629, 426, 2660, -256, -2705, -399, 2700, 384, -2340, -855, 2355, 953, -2212, -535, 2065, 1116, -1654, -905, 1570, 1194, -1103, -856, 1414, 1223, -745, -787, 1303, 1428, -806, -1035, 792, 1704, -705, -1493, 865, 1685, -144, -1935, 227, 2427, 536, -2209, -376, 2321, 1358, -1915, -1507, 1792, 1785, -1403, -1806, 1568, 2069, -848, -1972, 900, 1860, -786, -1835, 479, 1823, -294, -1699, 406, 2074, -355, -1811, 482, 1884, -217, -1859, 58, 1914, 275, -1833, -574, 1878, 570, -2128, -1001, 1555]
3963A555l17k797m26L167K94k450p53K209J494k518j364J765K492k105k237J522
3979d69K196j562k039R40K118m17k432P24J848m77k157P16K177n45j913M06K102
3996A216j42k759L68K608Q0k754k51K618Q12k451j324K011K184k264k119J792
4012c75K021j132j985M33K595R8k693o06K563N44j806p69J652J004j810j080J641
4029B95J265j678j336J812J089j884q30J547J628j894j759J647K051j757k104
4044a908J636K402j243k627P69L005m67l006k7L332M81l248p37K471J354k736
4060e49j204K373J453k096k020J673K112r93k147J169K176j574k057J306K326
4075A948j195k663J264K474j071k953J059L177o45l389L40L220J72l088q48L526
$$ y = [1555, 1238, -1559, -1985, 1182, 1476, -974, -1727, 482, 1976, -542, -1906, -141, 2351, 246, -1991, -469, 1727, 165, -1874, -934, 1184, 767, -1665, -941, 907, 430, -1727, -1011, 1166, 621, -1292, -886, 1216, 1074, -1685, -1317, 1291, 1371, -1383, -1634, 984, 1796, -655, -1979, 32, 2216, -48, -2167, -375, 1646, 514, -1471, -1038, 1557, 1655, -1038, -1644, 919, 1463, -343, -1112, 540, 1544, -266, -1346, 295, 1560, -118, -1454, 358, 1447, -437, -1267, 280, 1908, 14, -1745, -98, 1953, 196, -1908, -272, 2130, 887, -1740, -971, 2034, 1567, -1439, -1466, 1866, 2347, -901, -1638, 833, 2187, -549, -1753, 620, 2073, -23, -2043, -370, 1742, 749, -1398, -229, 1947, 373, -1684, -378, 1948, 753, -1910, -646, 1828, 757, -2196, -1137, 2040, 1395, -1994, -1654, 1566, 1738, -1350, -2198, 1328]
4091A328J077l154j740L045J661k758j614K010K769k290k202J019K517j072k106
4106a510O86K085o71k402M76K562l52k086Q9K229l65k228O8K491K76k395n93K226
4124E86R23k570q84K353J533k117j797J646J780j465j923J406K465j071k690M12
4140a413K611Q7k307k02K411J06j649j349J937J019j220q99J299O31r60j070P94
4157a74J634j384j153J457J125j448j599J193K109n84k259M48K354r67k045P2
4173a221K918L05k883p74K519R66k404j429K676J211j501k123J495K058j211j915
4189a313R46K071q17k051K39J868L21k089J32K026o53j793p8K482j36k070K3J996
4207A104K04k357m95K707Q69k613j241K714P91k465j409K588J355j574k008J280
$$ y = [1328, 2405, -749, -2489, 556, 2217, -541, -2155, -145, 2624, 334, -1868, -849, 1668, 596, -1510, -824, 1261, 590, -1812, -1336, 1226, 874, -1212, -1123, 1106, 741, -1487, -1419, 1072, 1348, -1047, -1640, 586, 1509, -1061, -1945, 408, 1941, -176, -1973, -327, 1453, -12, -1935, -529, 1936, 865, -1825, -1413, 1198, 1285, -1022, -1224, 1187, 1293, -356, -1705, 232, 1251, 31, -868, 431, 1062, 102, -968, -174, 1460, 76, -1077, 380, 1505, 57, -1542, -349, 1760, 1176, -1083, -635, 1719, 752, -1293, -1221, 1697, 2002, -881, -1655, 864, 1830, -574, -2003, 673, 1884, 383, -1740, -245, 1813, 602, -1313, -367, 1704, 887, -1164, -925, 943, 1264, -825, -693, 1333, 680, -1113, -1191, 1291, 1155, -915, -892, 1104, 1308, -1049, -1544, 1163, 2032, -581, -1822, 892, 1683, -782, -2191, 397, 1752, 178, -1830, -550]
4223e50J610r13j583R23J596j95j956Q7J756k47j367l2J088L75j672J57J207N7
4241C41q72q2J185k6r41p83J270M61o97j044J093J210r66j428Q24J856q66j330
4259g95p4J663j4j694j98J815N59j562n73N58J021q15l12J27J180n07q62k29P12
4278@O86o46k83L62N59q71m82P59M63o98k81N90N67j072m70J371R00j359j440
4297a345J219J389j170j782J323K405r97k594O28K707l80k944P22K278K57k748
4313a032m20K332Q37k282l06J733Q88k082j082J642R42j046r67R56J114j391j429
4330a593J707J408j425j488J100J892j105k462J516K303r81k717Q13K714k79k968
4346a565N3L218L46l296j151L080J084k646r43K400R78k041j255J890J399j971
$$ y = [-550, 1060, 147, -1436, -513, 1083, 888, -1068, -981, 775, 528, -839, -871, 217, 592, -1080, -923, 284, 341, -531, -613, 572, 546, -395, -1178, 92, 553, -144, -1188, -95, 1115, 149, -1279, -455, 1401, 535, -795, -869, 794, 780, -914, -1112, 703, 1262, -300, -873, -315, 706, -109, -421, -294, 886, 379, -483, -712, 0, 686, 40, -243, 119, 678, -193, -675, 84, 547, -151, -432, 158, 725, -347, -817, 554, 1454, 95, -1345, -126, 1263, 93, -1689, -366, 2039, 1042, -1552, -924, 1783, 1403, -1541, -819, 1459, 1716, -1032, -1452, 880, 1717, -565, -871, 862, 1750, -332, -1414, 228, 1170, 124, -843, 113, 1227, -164, -1593, 114, 1522, 97, -1391, -291, 1601, 496, -1966, -450, 1853, 872, -1845, -1032, 1682, 1403, -1565, -1512, 1706, 2052, -1244, -2395, 685, 1769, -877, -1820, 580, 1558, -483, -1738, 152, 1551, -420]
4362d20j476K264J183k219j010J919J264j559j735J590J526j342j988J364K196
4377A557r45k371O29K332n42k157j13K458Q85k462j199K550R24j741j429J800
4393A76J613j808j759J693J369j021j624R70J550q61j478P30J748q64j782P81
4409e67J825m25k090N52K226n23j909J50J690J31j580n05K072O42k020j050J634
4426B53J236j133j628Q90J659n39j892J70K310l5k280N6J614P51j803m58J454
4443F25P14j706q36J934M72j372j054J587J118j923p71J844J029j990j137J810
4459C44J231j609j471J405J743p80k337Q44K337q61j737m0J679O88j921q35J496
4476A76J208j351j140J006J057q43j260O92J278q68q27O74Q65m21j236M24J233
$$ y = [-420, -1896, 368, 1551, -668, -1678, 241, 1505, -54, -1789, -199, 1327, -15, -2003, -639, 1557, 612, -1759, -1130, 1202, 660, -1497, -1610, 848, 1733, -729, -1928, 622, 1546, -195, -1624, 176, 1789, -19, -1778, -85, 1284, 263, -1361, -391, 1159, 298, -1180, -450, 1298, 434, -1348, -567, 1258, 833, -1257, -705, 1521, 998, -911, -761, 929, 1060, -520, -1025, 1047, 1689, -331, -1381, 253, 1489, 356, -1272, -382, 1277, 738, -1154, -984, 1326, 1291, -989, -933, 681, 1432, -371, -829, 625, 1339, -367, -1203, 731, 1203, -169, -1223, 364, 1482, -441, -1212, 632, 1661, -329, -1466, 344, 1575, -34, -1505, -100, 1643, 863, -1474, -630, 1707, 846, -891, -931, 748, 1436, -485, -1320, 176, 1384, 33, -1107, -101, 956, 113, -1147, -455, 823, -45, -872, -198, 667, 246, -990, -566, 667]
4493F67k78j535O48J359m36j673L59J997k37k066j9K021ok106j80J891J082j989
4511e01q99J535R39j073j273J020J139o40j354J78J461nj106J16J151k24r63j32
4529f31P81L82q21k22P83M06r69m97J053Q22j136j242J506J172j322j077P09J895
4547A592j048j781N44J758j1k161M17K060l34j752k99J882J70j318o86J371R22
4564A326j320p62Q69J140j186p93O53Q68k62j325M80J230m20j359N74J212n21
4581D04j273N46J412j75j691J53J647R4j688n71J668R28j743j080J598J199j544
4598a16j647J554J519j342j464J180J941j437j199P29J058n34j150M91Q31jj081
4615f68k3J215N8j330K18J152J6j099n46J657K60j261p65R51J067j402p57R73
$$ y = [667, 389, -1146, -498, 861, 425, -1248, -889, 1108, 871, -1195, -1214, 807, 801, -1305, -1485, 406, 1488, -501, -1400, 135, 1074, 1, -1272, -252, 887, 247, -1107, -929, 532, 527, -579, -463, 688, 464, -499, -631, 150, 532, -289, -511, 272, 678, -291, -788, 265, 1087, -49, -1291, 215, 1387, 65, -1012, -303, 1592, 544, -1237, -693, 1065, 1054, -1107, -690, 1370, 1036, -716, -1015, 867, 1037, -281, -967, 404, 1326, 6, -756, 113, 1253, 67, -726, -73, 795, 533, -792, -312, 918, 498, -861, -287, 925, 404, -869, -323, 1089, 914, -777, -624, 1023, 1117, -571, -1142, 526, 1454, -289, -1369, 229, 1428, -116, -1763, -209, 1310, -32, -1496, -316, 1625, 188, -1011, -282, 776, 242, -908, -417, 414, 413, -668, -691, 524, 582, -748, -530, 622, 638, -461, -1007, 650, 910, -351, -1116, -165, 902, -500, -1257, -284]
4633b84J311r83j571Q39J912n68j964K08J997k00j681jJ472N01j353p51J361R26
4651A171j420q29J545L43j241l18J148K45r17o46J220O58j141q72R69J053r00
4668F8q99P44J275o34j756M75J794l63j268j76J433M98j390o94J387Q22j483p34
4686i01J120R72j019j288J052J221p10j691Q79J374p96j059P65J090k54j391L17
4703c19J262j32j255j29J437Lj588k56J962J90j700o26J660O69j465r55J364J247
4721A369q53j629Q42J351o60j321J29J730Pj734m5J608j12j319m74J498J30j206
4739f89m63J398M57j262n07J615P83j927p92J659J071j568r35J072J455j408j477
4756a518J142J649p62k043R24J427l77j530j87J963J37j567l41J205P51j252p69
$$ y = [-284, 1027, 44, -1527, -688, 1224, 656, -1308, -1100, 897, 697, -984, -985, 487, 988, -365, -1116, 245, 1171, -249, -1078, 467, 810, -431, -749, 399, 644, -273, -919, 301, 959, -182, -1054, -85, 968, 68, -831, -87, 1188, 554, -1202, -727, 1067, 704, -564, -740, 693, 1191, -199, -893, 494, 1316, -167, -901, 219, 1191, 172, -1116, -64, 1157, 447, -1244, -365, 1009, 213, -846, -81, 1009, 755, -636, -319, 943, 811, -444, -573, 864, 867, -721, -977, 985, 1175, -525, -1151, 509, 1178, -287, -1242, 122, 1369, 516, -1113, -271, 1080, 420, -901, -772, 958, 965, -769, -814, 794, 682, -637, -1111, 387, 517, -689, -1152, 246, 703, -559, -1066, 549, 1332, -595, -1387, 272, 1343, -225, -1160, -88, 1367, -41, -1518, -376, 1273, 511, -1532, -608, 819, 442, -1088, -1275, 688, 825, -742, -1083, 122, 873, -379, -1148]
4773a148J596L57j039q59J005R12j076p33J043N94p48r92M34J741r15j226Q87
4790a67J383q82j243Q05J268m44j752K94J332J62j598o7J746J84j380n07Q97R19
4808I50q71r17Q83R87p54r64N25R74j23j242K85P33P8r62J75P21k54n11k50R12
4828C75K97p72q35J091Q43j028n28P45Q64r15q72N10J473o48j305J70J126J01
4846F92j586J6J667K18j439o80J068J171j443q92J204J251j095j319J141R12j027
4863a41r37M90K067j128j606P27J201l83r89NJ651o28j628K88J838O7j983p9J859
4882F91K87k087j14K018M56k042o81J460Q76j227j213J346J632j138j872R96J647
4899A035p25j694R92J785p67j961M86J980p62j550M73J729l92j858K57J956k53
$$ y = [-1148, 448, 805, -234, -1093, -88, 824, -252, -985, 58, 652, -96, -1088, -654, 1087, 172, -1054, -167, 1216, 334, -909, -104, 1164, 720, -1032, -738, 594, 756, -842, -909, 837, 1021, -359, -866, 31, 950, 79, -838, 45, 1032, 278, -686, -161, 813, 690, -552, -267, 466, 544, -418, -243, 478, 224, -287, -537, 375, 672, -100, -935, 156, 999, -29, -557, 188, 1052, 137, -735, -225, 1248, 600, -705, -535, 591, 692, -894, -878, 789, 1007, -432, -1112, -44, 1127, -316, -1208, -4, 1247, 152, -1167, -26, 886, -141, -1078, -588, 1479, 351, -1255, -528, 673, 290, -699, -694, 957, 329, -1299, -1011, 827, 894, -1089, -1168, 691, 978, -1109, -1223, 795, 1251, -791, -1472, -12, 864, -363, -1576, -230, 1402, 264, -1608, -612, 1035, 310, -1384, -392, 1393, 626, -1335, -849, 1131, 369, -1181, -708, 1021, 629, -1229, -972, 984, 731]
4916G31j859M57J407N35k207o65K050N91j358j035J614J028j043j241J097J330
4932A432j234j310O90J294k23j309j65J693J71j654l31J584R9j285J16J057K87
4949I12r09o67J220O15j145q25J428Q38j298j315J106R09m03j414P37J622q35
4966E76j758L66J992kj900m8J593J16j519m26J599O91j823m19R81R38j143m76
4984f62R60N90o20j314Q15J148o13j139M33J442n39j489J13J685k79j598L23J363
5002F19J28j851m1J535N48j666j075K233J378k601p99J943J138j538j722J490
5018b81J466j146j363P82K070j291j850J132R99m51j028L28J526l97j293J73J331
5035G07k93j551L87J251K27j510lJ442M76j476p67J536Q43j443r84J155J255r03
$$ y = [731, -1128, -671, 736, 1271, -936, -1601, 449, 1040, -318, -1353, 261, 1289, 246, -995, 102, 1432, 198, -1112, -422, 872, 649, -660, -825, 868, 1039, -615, -946, 638, 737, -548, -432, 625, 912, 3, -664, 556, 1171, 26, -799, 629, 1467, 169, -1146, -40, 869, 466, -948, -211, 1411, 576, -1182, -816, 1176, 1174, -726, -774, 819, 935, -584, -1010, 589, 1280, -543, -962, 19, 957, -186, -662, 298, 888, 268, -1046, -231, 917, 304, -835, -402, 1040, 501, -988, -875, 810, 531, -1067, -744, 619, 747, -1104, -1145, 390, 938, -728, -1803, 430, 1808, -793, -1592, 351, 1489, -49, -1771, -281, 1185, 39, -1324, -542, 1528, 237, -1613, -481, 518, 67, -961, -633, 893, 496, -797, -624, 707, 414, -1137, -750, 501, 728, -782, -785, 657, 1133, -343, -1110, 426, 1269, -174, -1158, -3, 1252, 349]
5053C49j361P20J447p58j329N91J080N7j499n2J596j79j234K13R76k03m39o15
5071f40R66K50j018J91N49k5l47p37J219N65q82k45J27J027p50n84L80M00O1r31
5091d24q1J100L32j043o13R47Q41j019o07L57P84l86o13pJ269n45r94K79R53j42
5111C88q45P9O89K75j211J36P90K4q51j30R89L88j185q0N07N71p39n01P05R03
5131I02q63r42N19J164k88j280K47J266m38j081K40J042J84j534k18J362N48j494
5149f64p01J797L86j085l03N25J061j415n48J002M86n80r01R44J070j727m01P86
5167b68J164q31j339J058J469j202j109N79J098q1j220J07J198M43j584m84J476
5184D74K88q44q94R78J054q61r69P40J151r32r39N17J066o17p31J86J191m96p92
$$ y = [349, -1012, -292, 1155, 397, -932, -341, 739, 796, -703, -755, 841, 662, -572, -359, 617, 414, -25, -640, 326, 576, -442, -251, 298, 273, -74, -811, 408, 973, 91, -154, -27, 1000, 250, -334, 46, 446, 507, -424, -505, 595, 927, -116, -729, 218, 1059, 40, -567, -210, 574, 188, -425, -432, 837, 292, -702, -423, 530, 388, -457, -378, 311, 586, -625, -489, 301, 325, -526, -656, 333, 721, -464, -544, -37, 534, -205, -706, -1, 902, 39, -903, -384, 780, 492, -788, -541, 725, 287, -794, -554, 488, 672, -862, -1080, 282, 830, -664, -1365, 432, 818, -267, -570, -45, 1016, -399, -947, 55, 541, -39, -940, 4, 1074, -653, -1054, -268, 896, 65, -1274, -216, 1253, 51, -1058, -479, 619, 538, -682, -575, 623, 1066, -518, -1002, 474, 762, -82, -976, 2, 1056, 195, -774, -34, 1117, 185, -754, -237, 829, 212, -519, -333, 858, 362, -430]
5203d30K98J072m97j173K47J128j12j384L30J519L9j611j86J532J39j390m53J407
5221D75L76o73j194J469O39q97j286R05J248q29p46K60Q53J01j144l6J218k77
5239D62r72J21R07J92j388J26R38L86j150p57J368O08j087j070J618R41j324j033
5257a114Q13J085n96j594R83J437n84j499L50J405J08j546N9J256J20j313k44
5274h74J000M15q96n88R19N61j005o61J157M90n65r50R72O68q41q03P22J167m38
5293D50j408L22J889p41j507R4J791k2j870M3J760J56j372q47J741M89j429n07
5311i68J053Q22j006p87P36R02l85j393R41J024o28j036N92J028l03j219J98J097
5329F68J63j219%J018L05j466k58J346M94j484n72J313Q17j062r67Q66J231q35
$$ y = [-430, -132, 940, 443, -730, -483, 645, 533, -851, -521, 998, 1037, -574, -760, 772, 911, -479, -932, 475, 851, 178, -1016, 453, 1092, 195, -1091, -186, 1062, 233, -513, -253, 600, 701, -443, -479, 739, 462, -510, -389, 518, 710, -678, -552, 386, 772, -378, -1135, 233, 841, -246, -1316, 302, 1243, -81, -1114, -301, 784, 188, -1406, -423, 1014, 430, -1069, -719, 686, 794, -752, -693, 563, 683, -630, -874, 126, 541, -355, -943, -24, 537, -468, -1129, 28, 518, -47, -997, -25, 643, -198, -1001, -279, 888, 450, -958, -636, 1253, 512, -995, -901, 890, 868, -1002, -959, 801, 957, -415, -1262, 479, 968, -461, -968, 85, 907, -99, -886, -150, 752, 367, -1026, -85, 939, 311, -725, -133, 895, 592, -627, -429, 668, 831, -388, -388, 630, 935, -531, -789, 557, 1051, -433, -1005, 308, 1125, 63, -904, -38, 1193, 358]
5347C58j324O63J399m80j462K32J727m73j579N25J173R4j536q8J384l5q84k71
5365e77P63M70j010p22J478M77j388k67R30P23q03r26P43J138p89j377O15J250
5383G28l15j372K40J305N6j493k1J260L45j374l03J251Q12j795k59P93J018j029
5401a53n54N34J119q79j002P96J181p78j322P01J327r31r81M52J430k07j477j48
5419h92J998l74j366k79J583M53j139j211J044J180j136q59P84J122q69r61O25
5436b97J284n57j156R8J502l72j040J23J045K06j438j03J347k4j019p29J606N66
5454A042j559j48J148P16j423r59J565N51q42j439J528J023r50j092O33J369j73
5471I90j900O34J030j24j278k34J487L49j436j89J055L17q32o41J180Q79j409
$$ y = [358, -966, -303, 1096, 616, -846, -614, 1113, 640, -939, -414, 759, 853, -683, -771, 613, 578, -306, -577, 186, 656, -354, -1076, 402, 879, -509, -776, 154, 877, 74, -852, -109, 1029, 240, -1137, -522, 728, 413, -959, -719, 586, 642, -851, -872, 388, 733, -641, -944, 307, 1119, -676, -935, -142, 876, -153, -707, -173, 946, 67, -935, -139, 1042, 264, -1058, -357, 970, 39, -942, -490, 940, 733, -744, -892, 1106, 732, -634, -913, 670, 1123, -16, -1227, -183, 997, -139, -998, -214, 908, 39, -922, -297, 987, 430, -726, -628, 874, 502, -538, -415, 630, 836, -602, -705, 642, 618, -401, -1130, 476, 1042, -517, -665, 483, 1199, -224, -1183, 382, 933, 91, -1348, 180, 1203, 253, -839, -206, 1163, 990, -910, -276, 754, 630, -648, -882, 605, 954, -482, -671, 384, 701, -131, -772, 408, 1287, -122]
5488a22o47J147L49q26o88J033Q05q43j023O50J120n25j390M92J450q9j964J93
5506h78J419P0j438J79J297N3j155k56J056O27j040r10J147K84m90r49O86J237
5524I39o30j134K51J125m32p62K6J438n54q75m3J233M3j494J91J050K40j269k72
5543i29J116P42j179n83Q32J128r67j152N29J588q99j145N57J348l50j836O47
5560e53J627l76j322J88Q74n4r87j03J347M69j631l64J278L62j242l72J413M02
5578I56j040j120J340Q82j002r26J018J031q71j449Q13J603q53r96N82Q60k86
5595E42j621O04J274J82j477k06J161K46q09o63J211P04j314o80J182M73j147
5612c38j30M30J069j072q79R66P80q66q27J267O42n86j024M15P09m09q36K46R64
$$ y = [-122, -769, 378, 727, -99, -787, 246, 1051, 208, -815, -165, 955, 430, -960, -468, 982, 893, -1071, -878, 541, 611, -827, -648, 649, 702, -453, -709, 347, 974, -66, -976, 171, 455, -35, -984, -298, 939, 309, -825, -574, 551, 119, -643, -617, 821, 267, -608, -651, 582, 625, -869, -678, 372, 612, -657, -929, 187, 929, -250, -833, -1, 1127, 160, -992, -463, 1125, 226, -919, -362, 986, 636, -1200, -553, 1074, 698, -624, -436, 438, 384, -603, -706, 641, 1110, -521, -885, 393, 755, -487, -859, 554, 956, -84, -1204, 136, 1018, 16, -910, 108, 1139, 268, -1181, -368, 1235, 382, -614, -32, 828, 542, -1079, -475, 799, 981, -496, -702, 459, 705, -104, -767, 444, 1148, -166, -846, 336, 809, -338, -468, -38, 1031, -41, -920, 46, 826, -40, -867, 400, 1042, 456, -568, -153, 556, 147, -689, -443, 521]
5631E21O9j202j42J097M01q51o02R01M60o72q16O79Q88q06l42J52N12n0n68J55
5651b16O09K87j236K04M15Oq52J66P88R0o41j77P75p6p0q61J081K79o54n46L27
5672c02J069n92o68J84Q20k89q53n0J083J14q08l57J078K24j176N7P94l7m26m76
5692f11Q10p1l46n18P22Q61p17q88N11Q24n23o72L46J198o18j272O22J027j23
5711E62j351L74J388j73j276k01J319K40j252p36J604L59j134o35J384L94j007
5728a41n94Q33O97r31l10N56Q99p75p82K90Q49n74r10N48J377p14j008J38J091
5747E39L8j141m4J088L75j480j7R37P39j047q73Q07R45j051r63P20J523r21r19
5766g45K14Q49j99r75K23J221j87q99j38R80j97o76k68J217l8q66oN30Q06j381
$$ y = [521, 590, -612, -754, 343, 744, -107, -709, 192, 652, -20, -836, -157, 731, -75, -417, -265, 247, 197, -371, -216, 393, 680, -556, -352, 63, 69, -783, -617, 171, 261, -380, -557, 218, 142, 72, -789, 292, 571, -83, -629, -302, 767, 175, -493, -309, 511, 222, -631, -681, 402, 516, -292, -649, 429, 653, -523, -466, 328, 291, -135, -611, 199, 128, -218, -736, -14, 847, 130, -758, -247, 577, 54, -618, -272, 926, 308, -964, -342, 685, 562, -789, -415, 973, 800, -476, -677, 642, 882, -370, -1106, 498, 857, -277, -912, 472, 866, -141, -735, 98, 795, -136, -446, 110, 1009, 234, -548, -258, 591, 17, -893, -345, 1032, 318, -690, -552, 539, 577, -564, -608, 480, 855, -625, -642, 295, 1034, -13, -886, -79, 866, -185, -1148, -428, 1095, 174, -745, -531, 318, 119, -856, -633, 588, 401, -498, -636, 344, 147, -529, -797, 420, 382, -484, -490, 40, 846, -535]
5786e35o4O17N54j069l12R97M15n60q84P09J017p26j291M31J374k72j218P8J249
5805E10l1p89n45J332K97r03m72O54P45q34r98J090R27j128q78J291N63j194k26
5824e89N37R46r34r10O93J217n96j508P34J051o7j476J72J580P0j434rJ107M62
5843A046j216o51J221O94j280o36Q14R58p02j147Q99R19p50q34L60J161n11j069
5861g24M01J135n69j096M97J214j19j493K01J363p4j196M1J299k96p95p44J232
5879B77P69r93j086J371P15j100n66L42J467p52j332L38J024j79j022N9J047K32
5897F11r30l62J241J69j292k69J098K81q26l60Q36L85q40q65J131J066j075r37
5915i38R28Q57m00j583P58J181n10j493M04J741n58q58k98J100L76j016n39R44
$$ y = [-535, -599, 18, 572, -497, -809, 188, 603, 43, -841, -132, 885, 159, -1132, -701, 673, 401, -817, -739, 510, 479, -310, -855, 477, 774, -129, -601, 53, 798, -36, -1034, 56, 983, -145, -1023, 268, 831, -363, -589, -52, 894, -40, -950, -257, 960, 364, -1144, -410, 641, 574, -902, -730, 850, 920, -514, -523, 584, 1046, -170, -821, 400, 1094, -186, -822, -8, 950, 248, -899, 0, 919, 169, -665, -305, 856, 345, -724, -323, 812, 243, -853, -356, 858, 739, -754, -553, 810, 736, -460, -419, 880, 584, -211, -955, 277, 1046, 53, -1033, 338, 1053, -47, -613, -271, 1196, 444, -888, -550, 474, 295, -727, -668, 379, 611, -319, -681, 560, 729, -563, -832, 266, 547, -279, -639, 197, 582, -258, -1123, 8, 1074, -1, -938, -10, 847, 447, -1136, -378, 803, 293, -1200, -796, 945, 387, -471, -769, 331, 707, -309, -848, 96]
5933I6P22r94n20Q93N82r86l87M96P00r9j043M96O08k43j317N99Q23l17q38J05
5953f24Q57L48r87l60J540K16j267o46J721L09j461k32O67R27j209r55Q02J390
5971A036p59j170O71Q99o23o08N5J232n0j326N5Q61J71o93j56R46J40r34j73Q75
5991D49J62q62m88R12O72q44q56J063P94j116m88L76J177o53j182N07J351m36
6009E38j532M40R69K02j304j2J268M77j182m54J004J70n35j025Q33O81p44o11
6027h17P05P82n72p29M69O81k73r34N03P48n41n96K24J069k01j008j40P37N85
6046F92j147m12J073M90r94p46J136Q82o68j193N55J061m36p51k5J176p16n75
6064e98L22J125m06j170L73Q89k22r07M51M59L3p87m77J326L5j199K09Q35L03
$$ y = [96, 818, -176, -696, 197, 779, -207, -594, -98, 602, 503, -540, -44, 564, 321, -996, -397, 426, 109, -729, -624, 233, 581, -406, -766, 774, 990, -277, -923, 798, 1107, -354, -586, 81, 1008, -201, -1156, -354, 1036, 277, -893, -222, 677, 54, -554, -499, 733, 683, -643, -588, 273, 444, -249, -405, 541, 681, -253, -426, 449, 611, -251, -739, 173, 845, 1, -855, 208, 1002, -114, -602, -226, 951, 298, -884, -377, 974, 538, -994, -554, 415, 617, -687, -699, 569, 1046, -136, -590, 414, 584, 49, -976, -143, 538, -206, -817, -112, 670, 98, -631, -162, 519, 246, -688, -185, 563, 22, -574, -350, 719, 518, -490, -630, 107, 692, -455, -867, 206, 696, -298, -1044, 92, 974, 306, -887, -332, 729, 293, -458, -483, 693, -23, -598, -276, 849, 443, -727, -354, 535, 313, -594, -143, 316, 349, -438, -915, 411, 446, -753, -544, 291, 594]
6083E94j042k61O83M69m92p54M25J092k99p99J15Q60l39o31K40P63j88q49j0Q56
6103D33K26j100j25J181J38p41n99Q99L62r87j90P05N89p65m10O45R18j199n40
6122e60N35P81l92r89J02J087k09j215N09J044k29p75l38J065K38q61n65R99K05
6141D32n51n03P73L51o54n41L47R52o85n59M50P80n00q33M10R94n96q00M69R46
6161F82m70n81K57P83L6j436L39O07K74j070j49J227k57m97m62P92L24l61p38
6180g00N66L87m1p75K51R94o97m20L02K99J83q80L96N56m57m53J11O61K81j117
6200e53J98Q47o5m68l94P48M39q98m60P15N01k98q02N48N53l80n58k9R19j78r44
6221e59L57M56J78n59j3J75N13p93k48N79K70k51l08L33L92o12j75o1R24n44l36
$$ y = [594, -448, -709, -26, 443, -49, -803, -378, 714, 415, -384, -269, 591, 252, -379, -139, 624, 436, -413, -423, 433, 659, -441, -566, 615, 753, 12, -587, 312, 674, -313, -503, 202, 791, 26, -384, 261, 1179, -20, -560, -25, 756, 364, -625, -523, 564, 355, -860, -351, 693, 464, -311, -649, 416, 654, -207, -772, 227, 432, -119, -622, 151, 502, -152, -693, -346, 606, -79, -638, -188, 592, 92, -741, -331, 663, 67, -733, -264, 682, 212, -369, -112, 671, 707, -729, -390, 217, 491, -579, -728, 499, 242, -255, -717, 75, 399, 38, -700, -134, 253, 212, -563, -312, 682, -15, -435, -133, 166, 349, -531, -135, 421, -36, -489, -378, 283, 564, -553, -355, 492, 427, -41, -435, 313, 752, -146, -606, 109, 610, 312, -490, 58, 611, 231, -327, -356, 563, 385, -559, -202, 254, 432, -127, -140, 35, 548, -245, -493, 86, 356, 105, -203, 130, 522, -90, -265, -326, 598, 54, -282]
6242b82J42Q36l12p69K73M33R2q79K53Q83Qp93K0M94K02p79k15P99J49m54q25
6263g24Q76P22r99l83N72N88o59m22K34R48o17o91K22Q61l69n70L7P11M5q10j49
6284e77P17K03o74k3Q55j9q84k69P98O18q62p34P78Q79j015m41O30P72o13r77
6304h38N55Q98o02n30J83N56N8o40j65Q53j47l73m17J185j72q50o1P55J86p23
6324b89l91R31J02n27l65M86N92n10p80P07O31k87r88L13P87m1j121L46P87n9
6344C24p65k5O17N56p02l73N30K02m09l70O40N27o05r07P53O39n83p06O37Q84
6364H64l39j133L98J119k87j192J06J146N8j302m91J380M67j153l67J028N37q29
6382A0p55Q36Q38q72q73Q89Q23o69j018O95J314p19j618R30Q18j99r80Q3J165
$$ y = [-282, -140, 696, 384, -385, -112, 321, 413, -466, -213, 670, 678, -115, -95, 399, 601, -178, -393, 406, 555, 101, -724, 152, 874, -125, -508, 64, 652, -7, -429, -195, 753, 136, -555, -333, 528, 159, -411, -374, 337, 382, -428, -577, 140, 343, -331, -354, 501, 482, -402, -671, 127, 745, -117, -851, -73, 806, -209, -650, -20, 752, 139, -838, -283, 615, 13, -517, -334, 222, 280, -360, -525, 328, 181, -192, -609, 576, 404, -446, -507, 248, 434, -289, -680, 251, 353, -174, -539, -53, 539, 29, -751, -44, 587, 300, -688, -375, 412, 371, -750, -404, 383, 324, -441, -466, 151, 707, 5, -368, 162, 364, -45, -415, 225, 752, 147, -760, -7, 632, 49, -657, -20, 864, 525, -608, -210, 909, 622, -570, -464, 682, 740, -562, -1053, 327, 794, -359, -726, 302, 839, 10, -745, 91, 929, 57, -816, 73, 896, 227, -791, -96, 1218, 499, -1119, -189, 629, 430, -550, -467, 698]
6401F98q7j201K67Q48m7p68m34J312M04j643o7P78P97j093p19R87R67r44j032
6420i77J048O39p09n71K39P99l83j054L14J434k99j039j5R67J38j389P5J190J51
6439E58j057k29J165J27j270j57J148N60j267m90J049K93n62l74N50P45p94r81
6457i86Q87P15n80q61N37Q89P0j302N5J196K85j172m01J154K53r15m38R42K52
6476E80m64q09O40M97q05j57N20L41j64p38O68L58k70l58q2N53j79o10j13J111
6496E19J63o47m54O27L74l72p54L23R55o35n45N20Q62r63n49J59R05k03p72L25
6516a62O50Q0j001K8O78O1l19j59K07L78n67n01Q08K04m66l20O73L41p51m10L59
6537a89P90l35r06L82N65m2r29N34N47m51l00j70R37N3n54n90P15M74n31o96P21
$$ y = [698, 611, -590, -323, 525, 478, -290, -724, 588, 992, -651, -718, 60, 857, -236, -955, 32, 999, 55, -977, 71, 710, 1, -570, -331, 468, 85, -969, -655, 779, 480, -559, -574, 393, 531, -858, -783, 407, 558, -499, -728, 437, 564, -706, -863, 285, 845, -422, -912, 137, 430, -132, -506, 44, 789, -5, -986, -99, 616, 36, -825, -288, 601, 671, -631, -576, 620, 905, -267, -668, 486, 739, -176, -614, 328, 580, 116, -693, -53, 444, -361, -518, 2, 343, 179, -559, 109, 467, 197, -161, -243, 310, 131, -479, -592, 519, 682, 35, -419, 208, 582, 210, -544, -221, 734, 99, -446, 74, 936, -27, -576, -417, 488, 285, -487, -162, 488, 568, -433, -405, 273, 334, 15, -144, 63, 441, -126, -627, 181, 385, -81, -401, 272, 613, -138, -548, -189, 601, 266, -640, -258, 307, 265, -664, -130, 417, -34, -334, -504, 433, 486, -68, -658, 57, 531, 0, -696, 25]
6558B5K86n17n84P44O54n40p78K58R40l87o01J39P57j03r14K92N14J88j173L28
6578d72P90n6n26q8O56L48j013k02Q83N4n44j60K05Q87o75q31N21L88q5n44K16
6599b48O67Np61j96Q44L4n22L2M94j70l52l62P30M4k34m73Q40J17o77j40L37N17
6621E26p05l54M05P77o90k99K0J038n07q23N18O15K20r61j60O90N8l24k81M58
6641B21K33n54j07L92M36o41j64K56J76k90j75L44M17l33l97O1O51m28p02P70
6661A66L52l77m56k73J057j56q68J56Q51N3q91pQ34n0m81m49P35L19n34l77M80
6682H4M05l71m49P8P12m87m44L48N98l84l37Q4O35l32n34J99M38k19j68n21J146
6703D81J55q27k73N40K18o02l90P56L57o26o42R12L77n32m56L92O32j44r69P17
$$ y = [25, 311, -206, -790, -46, 608, 68, -710, -452, 488, 101, -500, -361, 396, 293, -621, -329, 185, 373, -800, -472, 318, 262, -264, -352, 304, 652, -361, -563, 320, 374, -170, -330, -125, 762, 87, -744, -223, 165, 80, -464, -248, 419, 424, -337, -533, 311, 345, -177, -145, 349, 179, -173, -535, 195, 239, 5, -468, 372, 489, -188, -328, 9, 526, -179, -533, -128, 649, -41, -340, -320, 718, 211, -612, -94, 521, 741, -220, -380, 310, 368, 44, -237, 221, 454, -100, -207, 185, 621, -20, -184, 72, 248, -42, -217, 127, 544, 211, -186, -125, 526, 98, -604, 166, 518, 141, -315, -588, 469, 313, -555, -399, 452, 505, -386, -393, 441, 391, -90, -539, 196, 515, -19, -396, 84, 489, 118, -331, -253, 459, -28, -472, -124, 474, 90, -247, -163, 472, 140, -394, -195, 243, 24, -144, -665, 481, 636, -191, -464, 76, 294, -308, -698, 58, 415, -211, -853, 59, 436, -96, -552, -160, 472, 328, -641, 76]
6723G6M08p66N5L6L65J7n66J1O37l18J6l53P11Q7q15k6L87J96m39j2M46R0n53
6746c10j1M78K85p22k45L15O58m25m07Q9Q67j41o76J52M50K33p47l81P99Rn03
6767b33K9L48L82o79j46J28N79m73k27O39K27m81n92O09L96n79m33M79N99l92
6787A80m37r3K85K59m76qM72J3m29k23P16L94p54l45N50K01o39J37K04M02j21
6808B88q16M21P81m76o01K7O84Lp64M15Q46n76q26J71Q32j43o79K04N58j8n65
6829b34k97P35K96o07n45M95N65l48n27K00P80l06r33K90O04j55o81L27Q74J41
6849F74j245J47Q61k11q13J89Q49j04o80j9N01L92o63j53N36N4p60k60Q25L21
6869D41p86n8L55P92n39j121P17Q57l04q93O9Q84K52r07j88O88J5m44j01M91L32
$$ y = [76, 484, -282, -227, -191, 174, 191, -375, -364, 273, -45, -29, -382, 329, 416, -399, -425, -38, 158, -281, -293, 153, 243, -310, -321, 157, 442, -280, -525, -210, 448, 23, -384, -295, 572, 431, -245, -93, 357, 590, -157, -538, 261, 270, -233, -204, 144, 526, -153, -299, -171, 408, -65, -292, 347, 574, 93, -499, 110, 506, -73, -506, -27, 572, 180, -257, -350, -65, 194, -282, -290, 182, 195, -234, -457, 259, 653, -101, -446, 104, 305, -334, -197, 7, 409, 288, -528, -107, 674, 198, -403, -376, 308, 311, -453, -38, 808, 232, -594, -423, 409, 266, -413, -209, 349, 331, -234, -531, 204, 500, -107, -652, -157, 408, 60, -467, -267, 513, 207, -726, -436, 168, 13, -668, -341, 533, 674, -571, -424, 437, 226, -587, -398, 451, 347, -333, -352, 149, 541, -122, -275, 261, 315, -445, -705, 120, 441, -345, -403, -48, 744, 205, -916, -199, 658, 354, -539, -470, 414, 666, -241, -429, 259, 274, -170, -271, 220, 552]
6890E52o69k52L62N21k25n82J37Q45p84j74j4Q73p44k88K95O07O3j010M58K01
6910A72K70q01j36J061M0r53j98J075l27l63n83O19J034o04r58N06J030o88o62
6929d66N3P96q1m91k11P62J13q46q2Q98k9o21j70Q98Q0p58m35O67J38l32m46M43
6951a20N35p24j83M55Q67n58r17M46O95m6j011K00Q21Q8j044j69Q63J63o65m53
6971g57J001L91p85k69M84O11p66m67N25N71o20n17N99N96o65o83N80Q05p68n63
6991f97N59O52l79n75K93O47j13j126N34O07k15o18N3M47L59r42j43P39O12r22
7011b28j04K42N82o05l34N51J02K72r79L75O02k67l45j6L60n3m54L92P1J11k68
7032GJ3K39K33q09K6O83J29n73j65L48L73k84n04J24O13j7q59K54M30J07o55L53
$$ y = [552, -117, -369, -7, 514, 289, -293, -156, 689, -95, -269, -283, 590, -154, -442, -147, 460, 523, -487, -29, 172, 442, -359, -495, 566, 606, -347, -545, 530, 203, -160, -743, -124, 910, 306, -652, -146, 884, 196, -466, -413, 383, 302, -189, -400, 362, 475, -371, -453, 445, 416, -205, -375, 523, 603, -155, -590, 77, 215, -117, -563, -120, 415, -309, -492, -37, 830, 272, -645, -199, 496, 450, -561, -361, 460, 548, -496, -665, 198, 361, -304, -757, 244, 635, -150, -419, 65, 676, -90, -557, -32, 539, -81, -598, 1, 597, -68, -751, -171, 634, -134, -697, -138, 514, 135, -440, -147, 500, 387, -739, -205, 402, 187, -431, -378, 69, 428, -514, -657, 82, 694, -228, -332, -90, 492, -113, -447, 104, 206, 478, -501, -126, 476, 209, -136, -152, 208, 155, -299, 93, 164, 275, 7, 20, 259, 492, -317, -291, 392, 521, -52, -217, 131, 504, 220, -284, -160, 453, 436, -423, -169, 261, 368, -287, 66]
7054F6J70K10q01K80L70L7l73n16O24J15m74j00O91j78m45r3M77N30o36k52K54
7075d4j09M42o55pO80n2p16NJ090m53l54%L20N59q21n34J035R4n96m69O07P09
7097G31p67m22J44N00k09j69J74L30r5n24l0N44k45l28Q9P43m59l64M09K64l48
7118c2k07k19P03n2m52q4O92P8l34n92N20J46m37K5K18K46j5l78J66N34mq55J59
7141a74L91ol43K23J97j8l46j01K62J08j30j89N25l07j80k77N41k46J74k79j11
7162b86R53m45m80m1P16k43n73K87M60j31j94m8K15j66J49n57N32K64p02KN7O64
7184D33o26J04j40M02m35N0J49M15n10j30L2L90j65j49R9L52k48l31K4P07K3r25
7206d79J93K54M30n78k27P22J54n18m31N80J75j34n90K05P56l26p41N19K98p6
$$ y = [66, 236, 446, -355, -75, 295, 332, -41, -557, 67, 182, -292, -392, 299, 121, -324, -417, 60, 590, -46, -298, -44, -153, 289, -366, -373, 307, 255, -461, -456, 634, 181, -173, -173, 147, 706, -115, -649, 386, 480, -116, -585, 22, 731, -36, -458, -314, 186, -23, -192, -18, 312, 217, -307, -337, 207, -38, -366, -277, 466, 7, -357, 52, 316, -32, -239, -458, 245, 193, -259, -343, 349, 427, 93, -499, 21, 167, -270, -245, -27, 219, 204, -174, -8, 526, 522, -333, -174, 217, 211, -132, 91, 288, 270, -76, -177, 85, 193, 63, -126, 399, 92, -88, -365, 176, -70, 104, -175, -286, 667, 222, -258, -299, 417, 174, -399, -112, 348, 217, 23, -25, 190, 24, 173, -384, 148, 412, -290, -288, -231, 433, -193, -89, -229, 173, -262, -212, -63, 352, -158, -288, -256, 134, -31, -180, -81, 271, 23, -308, -284, 423, 446, -479, -286, -32, 398, -180, -407, 315, 469, -49, -480, 100, 275, 141, -449, -244, 512, 186, -555, -36, 262, 186]
7226A86o87J55P53l65p6k08O04j86l71j05L71m4k07j70O30j57j65k90P20m58K0
7247e0m55P26K19m92m08N69K45m57j44J02K21Q7n76J75M38J33p51k2Q56l43m21
7268c48n9N36K00m44J9J08K30q46L67M19R4m88j70P36K37m79m39M76J69l64l01
7289c47K39L81o6n79J68N00J4p38mN76k4k43l69O43K67m34m89M98N00l57l30J83
7311a1K25l01o6J05M19j70r5j53K56j8o78M84K84j74n98M53K91Pn60k49O39M40
7333E30r31j49Q71j63o9o76R34o3k64k19k23O45n8m70Q0K72Pk36j18M34jn85L81
7356g1K10M3j93k45N85j16n24N2J87L54p87r0Q02M09m80q95N73P86l55p68K00
7377c23O99j93o67M29O92k47q59M72K41jk66k53Q10m01m57l7O83J95l38m44M55
$$ y = [186, -501, -346, 407, 42, -34, -242, 362, 176, -195, -300, 71, 27, -180, -350, 280, 123, -42, -332, 388, -70, -50, -505, 221, 440, -52, -460, 109, 354, -103, -247, -145, 76, 163, -413, -238, 200, 333, -418, -440, 416, 73, -348, -407, 129, 329, -115, -96, 12, 242, -604, -237, 182, 276, -212, -382, 354, 591, 112, -327, 149, 318, -46, -347, -108, 273, 207, -372, -204, 296, 310, -428, -432, 144, 120, -123, -492, 151, 418, -16, -505, -7, 493, 136, -194, -11, 214, -87, -153, -48, 371, 201, 106, -47, 209, 191, -487, -3, 281, 107, -491, -38, 253, 260, -300, -549, 90, 530, -401, -550, 321, 158, 89, -587, 347, 284, 20, -199, -422, 223, 165, -305, -225, 47, 54, -182, -300, 134, 133, -452, -71, 139, 182, -11, -256, 329, 213, -311, -259, -72, 282, -505, -595, 207, 616, 136, -759, -186, 600, 245, -523, -323, 376, 183, -484, -55, 637, 390, -469, 3, 244, 243, -23, -276, 534, 133, -324, -361, 322, 517, 179, -265, 190]
7398A90K52m37k97L9N78j80n52O56K52n01l69L85L94l69o97N82K89k78l15K30
7418a48L57J99p87K0N51M00o23l03M63O01q89k42L11P24p13j74M74q3N3n11K36
7439h4L46Ln48J18N06k91l39j65O17J7m00j20N03J76n24k53M85L89p87k97P09
7460F1L69m15o37K55Q56j56j049K67N82Q8p22R8O77J56o43l46P77n0m84J60K69
7481A13L13k93m30O78k89l02O0J89K91k92o11J83O23l18m15L99J21J28m67J81
7501a38O58n60j31p9L68K43o34n33R00N80o99k45m8Q30r8p70M70K40o2n59K91
7522B4L22j07n08K6N29J54m06m15J116m77l88l6P73k17o89r5N74K18n50k73O49
7543B24M24p70k72K54R79r19n20Q92j45l36oj01Q63r0o76j80O23K10o12j15M26
$$ y = [190, 442, 5, -292, -253, 325, 145, -407, 249, 501, 0, -369, 16, 410, 41, -656, -74, 215, -63, -378, -148, 209, 408, -379, -359, 192, 592, -31, -334, 129, 730, -159, -401, -90, 634, -79, -253, 221, 138, 191, -320, -84, 262, 265, -283, -165, 341, 50, -289, -454, 163, 180, -220, -340, 163, 339, -185, -438, 47, 436, -351, -648, 61, 430, 15, -622, -367, 489, 333, -716, -449, 133, 221, -501, -403, 274, 430, -213, -559, 218, 168, -316, -156, 113, 426, 133, -297, 381, 92, -210, -150, 39, 330, 38, -573, -390, 233, -85, -500, -101, 20, 148, -319, -138, 520, -40, -171, -250, 118, 361, -273, -806, 94, 674, -25, -270, -318, 512, 414, -356, 114, 354, 292, -267, 24, 346, 239, -269, -243, 286, 440, 34, -381, 735, 258, -130, -166, 607, 390, -299, -394, 180, 398, -152, -425, 224, 648, -122, -394, -140, 839, -80, -600, 292, 147, -189, -195, -296, 567, 477, -199, -379, 244, 454, -158, -273, 153]
7564A53j27n9j0J81L04n31j30L57J25m97j30L04M02j18m55J95%n7k83J38P13m41
7586C4j59k81M44K17n59m0J12N06n06OR0N00r3n59K49P0N7l70K57L59m30k79J52
7609b23Q6J58P0l45N14j85k70J4M90J11m53k28O24j58p20L36K57L23o13m5L30
7630G3M51o00k56J42L60p5n14N16K31J44j251K75O44R7k9m98N23M3n82j35N94
7651A53J61k55k00L24L24n84n8M36K31m57l15M76M8j97n12L58N75j33m76j03O84
7672D80k87o42J86P43k58l87J94P9R5m26k07N44J88o29QL78j34M7r2L08J39m78
7694a51o9J11M47k38m06L61K35m14J27k43L82J71o73K96M19k35m26K45j58L18
7714I9J5m46L58L89m84p4K88m9j06m79N17J96j26l87n1O77k18k32n6J59J32k83
$$ y = [153, 26, -33, -43, 138, 442, -89, -219, 138, 263, -234, -364, -60, 342, 224, -231, -36, -36, -93, -376, -238, 475, 34, -125, -406, 38, 255, -304, -344, -232, 274, -232, -226, -136, 364, 271, -288, -39, 31, 88, -282, -25, 334, -96, -375, -223, -137, 21, 91, -254, 260, 75, -195, -181, 309, 420, -33, -261, 363, 205, -515, -179, 78, 401, -212, -257, 73, 524, -76, -332, -190, 170, 95, -419, 97, 328, 472, -779, -504, 140, 237, 208, -290, 233, 276, -306, -441, 153, 314, 59, -141, 183, 507, -77, -135, 301, 532, 75, -240, 236, 284, 87, -425, -67, 508, 375, -101, -204, 480, 193, -449, -263, 480, 222, -165, 29, 108, 203, -223, -430, 114, 302, -327, -319, 59, -75, -28, -120, 188, 327, -151, -220, -109, 338, 100, -306, 55, 290, -124, 3, -240, 142, 313, -360, -64, 355, 120, -306, -61, -219, 99, 114, -332, 26, 415, -69, -143, 145, 96, -10, -489, 28, 224, 98, -289, -340, 337, 119, -113, -169, -10, 122, -161]
7736a61JJ60J55o04L49n9L24J1k41o4L15m22Q4k63O52l01m42O16J74k34k00J07
7758d3L14j81l15J0M31j26k95J02L07m9j08l19R5N26m03O3L8K10l59k69M63K03
7780B95l55k30M80L8o3l15K56M71o99k66J17O28J39r21N25N15k09p03J8M37j3
7801A45j42l22P40j62k88l21M79L05l87j55m4O43n22k54J95L20j37n50L98N42
7821D83l16m64N19o6k92l47O68L62m80m74Q3N17N2n36m9P29K16j034J69O94L7
7842D71j83q43O81L66l53p41O20R3l21j3P1L02j04n91O68J52m30J28o3N2P1k84
7864b51K81J05j1n84j20P95M1m25NJ46K60l63l22M40M82m77k39J00L50j73n81
7885e41L18N19l5l60k18L57J75l40jJ01J61l24k9L98q3k93J45K42k0p73K43M89
$$ y = [-161, -160, 0, 155, -449, -100, -159, 165, 176, -65, -129, 186, -236, -152, -415, 237, -64, -506, 110, 284, 50, -150, -43, 271, 90, -225, -215, 216, 90, -205, -103, 204, 155, 47, -272, -177, 349, -54, 9, 47, 257, -102, -371, 92, 295, -60, -290, 190, 228, 165, -150, 106, 577, -122, -388, -271, 357, 496, -425, 100, 615, 406, -297, -279, 158, 145, 3, -319, 421, 259, -29, -350, 129, 434, 47, -108, -152, 491, -31, -285, -90, 230, 93, -457, -59, 483, 167, -297, 222, 156, -136, -483, 185, 547, 67, -407, -324, 193, 245, -291, -340, 389, 605, -429, -260, 434, 471, 288, -555, 126, 492, 139, -602, 18, 111, -210, -223, -152, 150, 46, -545, 123, 275, -155, -27, -90, -38, 33, -251, 30, 135, 124, -460, -580, 215, 256, -169, -164, -18, 242, -121, -443, -3, 479, 2, -237, -137, 213, 40, -541, -223, 296, 261, -99, -317, 40, 215, -125, -126, -25, 136, -188, -217, 181, 98, -195, -50, 192, 172, -601, -358, 131]
7907A31m3O5q8k74N04j59p24M40N91k91k69P4K92N2n09q2M21J30j45n70L06L40
7929A92l14j41K83K74l00j36J7M62k59p50M87L31N2n77J56K04K78q31L67L13J53
7950B61k89o1N76k09n48j61P13j30j68j44K73K57k52k90K53Q6j53n33K43M47r1
7971H0n00K70K53J11m44J6K62R3j80k11O40l65l09k1N56J8k98l36M38J43l57j08
7993b49K22J61J5l43J42M03n03j10l0O88k89m90K67M01j14o50K94k5O20m00l80
8014c70O0O93n13k12J56M18p2o36M34K75j87k58R6K40k32j55L01L23k54m49Q7
8035b55K15J99k35J29M8o4l27J16L85l8l08k00J48M44jl66J41L23l86j42o3Q51
8057F14o09k70L02L70j15q11M28M19l64r7J69J63j98j30m08P54K1k54J8J19J71
$$ y = [131, 88, 153, 65, -209, 295, 136, -588, -148, 443, 152, -117, -43, 249, 301, -208, -290, 131, 261, 116, -454, -148, 192, -122, -263, 20, 294, -6, -142, -125, 337, 78, -672, -185, 146, 198, -379, -223, -19, 259, -572, -205, 108, 261, -28, -89, 487, 278, -270, -431, 282, 152, -16, -160, 113, 370, 118, -172, 81, 167, 14, -519, -276, 171, 80, -420, -150, 103, 214, -230, -214, 48, 141, -39, -250, 390, 25, -284, -305, 251, 269, -29, -365, 73, 216, -141, -249, -27, 134, 149, -194, -52, 351, -152, -262, -292, 396, 107, -383, -116, 285, 171, -479, -185, -210, 410, 10, -370, -310, 383, -130, -342, -186, 232, 160, -476, -42, 233, 46, -212, -116, 124, -108, -263, 38, 361, 107, -342, -255, -40, 159, -76, 53, 101, 37, -290, -174, 211, 173, -135, -335, -187, 257, 256, -110, 31, 354, -32, -174, -237, 614, 5, -265, 37, 407, 292, -519, -91, 328, -36, -133, 36, 199, 1, -129, -537, 217, 238, -16, 2, 121, 292]
8078B92l35k38K57L51m05j37J69L52l46j80p1O86l10k54m8J33J63k78J02RL94
8099C06l86n73M61L93n18j01N12J58l97k54N92k22J08l61j29O53k06l53L46J10
8119A39j10k07M5N13l03k44M8K35O7j88k02N74j87m04P6M4K60m66j53N78K98l82
8141C1o40O26J6P8m94J3O98j22m63K50K24k41j46j4L23K61l79r6L36K9j95p2K74
8164B97l20r0o5J38K29j13k00J47L50l60j38j41O03r7k56j30P37n24k80K06r1
8185i8L5kK7K40M3j81
$$ y = [292, -43, -281, -24, 327, -78, -215, -46, 306, -40, -220, -291, 395, 85, -169, -217, -84, 79, -199, -97, -88, 306, -80, -653, -192, 201, -317, -418, 94, 252, -145, -399, 193, -29, 79, -282, -411, 242, 36, -317, 29, 139, 29, -178, -133, 380, 77, -167, -119, 116, 183, -5, -207, 367, 180, -224, -148, -104, 156, -310, -463, 115, 413, 31, -609, 17, 33, 111, -383, -370, 328, 206, -257, -7, 217, -24, -170, -184, 139, 400, 21, -75, 261, 290, 95, 23, 297, -23, -113, -178, -40, 189, 76, -124, 23, 373, 13, -125, -266, 337, 240, -16, -146, 591, 67, -213, -7, -98, -63, -65, -38, 202, 245, 64]
8191F4
$$ Imaginary data points
##PAGE= N=2
##DATA TABLE= (X++(I..I)), XYDATA
0@%%%%qQqJ6j6J6k4M0m8N3o9Q8j01J16j37J62j89K17k54K95l37L84m38M99n66
29c01O36p16Q08r03J009j129J257j395J548j720J909k110K334k589K867l172L520
46A853l915M362m874N475o188P039q085R416j1163J3557j7068K2729l3313N9603
60C9428k38320l96872O35041L77926m33921l55828M27255L24545l90489l71608
70c82843L44059L72418k52054l47319K14487L01841j97565l12895J66163L11113
80B17405j10363k98907P5205K79764m8326k91115P261L04645Q2265k61342j33543
91a77051J92826J22075j82377j08442K24874J62383k52082k70552J83362L22828
101B17844q9810k93477O4472K80441o3202l08201J8067L07544L7938k61084m7032
$$ y = [0, 0, 0, 0, 0, -8, 0, -8, 8, -8, 8, -16, 24, -24, 29, -40, 48, -53, 63, -74, 88, -101, 116, -138, 157, -180, 204, -234, 265, -301, 335, -381, 427, -476, 533, -596, 661, -734, 814, -906, 1003, -1107, 1227, -1362, 1505, -1667, 1853, -2062, 2300, -2574, 2901, -3287, 3752, -4333, 5083, -6080, 7477, -9591, 13138, -20175, 39428, -198892, -595764, 39277, 417203, -16718, -372546, 54709, 379254, -11235, -382843, -38784, 333634, 81580, -265739, -51252, 250589, 53024, -259871, -93708, 217405, 107042, -191865, -116660, 163104, 114778, -176337, -169076, 135569, 217834, -43508, -177051, 15775, 137850, -44527, -152969, 71905, 234288, -17794, -288346, -104984, 217844, 128034, -165443, -100971, 179470, 116268, -191933, -173866, 133678, 171616, -89468, -136500]
112a36500K30464M2995k18080n3969J93675N8665j57623l5570J46500P717j77866
123i9592l2720J87645Q7306j37848j01953P9279O6484o8712l7541J03442P0814
134A16604j06950j23557O2212J43144j4972j35302o639J32879J2836j59036m6754
145a25535J72483R1928j59245j16530J53688J42811j45533j74909J15914J86488
155A41560q0487j63481P8416J44224j07624j67371J16111K06616q5196k17513
165a34745M6412J95638m3299j82796N7174K02999m9102k28815J5702K34461K2376
176A36005k22334m6825K09743O6307k02051q8773J90758J09181j83062j35032
186a66083J72638J69875j50121k05237J04904K18176n6714j99574M0024J87832
$$ y = [-136500, 93964, 136959, -81121, -135090, 58585, 117250, -40373, -75943, 70557, 78274, -99592, -132312, 55333, 142639, 4791, -97162, -17883, 48601, -20111, -57652, 45790, 116604, 9654, -113903, -51691, 91453, 76481, -58821, -65460, 67419, 80255, -78781, -125535, 46948, 138876, -20369, -136899, 16789, 159600, 14067, -160842, -44928, 141560, 61073, -102408, -23992, 120232, 12608, -154763, -38652, 167964, 82768, -134745, -88333, 107305, 64006, -118790, -61616, 141383, 92281, -136534, -120832, 113629, 136005, -86329, -133154, 76589, 142896, -59155, -147928, 42830, 152011, -31051, -166083, 6555, 176430, 26309, -178928, -74024, 144152, 87438, -112136, -72112, 115720]
196A15720m3091k04475K5287K20664J0718k14829m1893J92285N0936j72990m5618
207a07286J74143M9229j80435o4526J79414Q3445j72830j05488J54316J17742
217A27724j32491j21608J16754J23492j08471j30572J02629J53442p6457j68941
227a14499L6574J63450m167j45878j0773J30951J4153j33464k8138J38360N4090
238A00659j27402p5418J09177Q6099r0917q5697Q0452Q3284p9632q5111Q3268
249a238R5993q0097j10209O8918J19257n2080j16440M3205J11452m6984j20021
260h8244M3558J35576k7192j46784O90J44222K5218j27812l5715J19255M4788
271H7560j13662n7040J09564P5086j02019r8433Q0987J09396n9170j14676L9702
$$ y = [115720, 72629, -131846, -106559, 114105, 124823, -90006, -131899, 60386, 111322, -61668, -107286, 66857, 116086, -64349, -128875, 50539, 133984, -38846, -144334, 9982, 127724, -4767, -126375, -9621, 113871, 5400, -125172, -22543, 130899, 54442, -114499, -77925, 85525, 81358, -64520, -75293, 55658, 69811, -63653, -91791, 46569, 100659, -26743, -102161, 7016, 93115, 2198, -83499, -3047, 80237, 605, -84506, -1238, 94755, 14658, -95551, -26633, 92624, 40544, -75896, -32691, 78761, 31777, -88244, -44686, 90890, 63698, -83086, -82396, 61826, 87044, -40768, -76483, 42772, 87560, -26102, -83142, 26422, 101508, -511, -98944, -17957, 91439, 32269, -82407, -42705]
282d2705J12772k7885j10200K5770J19807j6699j30309J422J35312J6819j31741
293d7637k8900J25455K8998j29818l3897J38886M8552j44905o9465J39217Q8830
304A15316j27215j00362J12575J05721j01638j11054R2923J20466q0365j29100
314a02733O2124J35578l8043j33292J6156J20973l275j12643n303J06689J3183
325E9414j06047k7675J00644M3122q7043n0232P6150N1714o9789n1651P1217N6811
337F6635p3422o9264O9549Q0962o2493q9707N3091R4465m5134r7850M0135J04247
349G1214l4357j12732K1476J17909m566j16039j0266J08161K0687r7605k2762
360e8880R3134K7488q9231l5026Q3687M2165p5358m7524O3424M5652n8338m5096
$$ y = [-42705, 70067, 42182, -68018, -42248, 77559, 60860, -69449, -68027, 67285, 84104, -47637, -76537, 48918, 77916, -51902, -85799, 53087, 101639, -43266, -112731, 26486, 115316, -11899, -112261, 314, 106035, 4397, -106657, -13734, 106732, 26367, -102733, -40609, 94969, 56926, -76366, -60210, 60763, 57488, -55155, -60458, 46231, 59414, -46633, -74308, 26336, 69458, -17585, -67817, 8333, 60047, -9742, -61393, 9824, 66635, -6787, -76051, -6502, 74460, 11967, -77740, -24649, 69816, 24682, -73168, -33033, 71214, 36857, -75875, -54399, 63510, 58944, -57095, -67361, 40800, 61487, -36118, -58880, 34254, 61742, -27489, -62515, 21172, 63337, -12021, -59545, 3879, 49531, -8807, -53903]
372e3903N7720M8393n5911n3866N4797O4983m6196p1195L7479P5795k9473q0040
384e1417K0869Q4375j4246r1798K161R6626J4689r6985k9667R2005M2511q4200
396a5077n0098P8117N7277p3658o5768O6004P4906n5096p9385M3813Q0464l2989
408B8510p7663K6990P5737k4300p8065J8099P9051j2909q1914M823Q2121L228
420D3708q0314p378Q3149J4786q4448k3265Q6209L4985q5800m9278P6968N8407
432F7729o9924o7312O0959P2903n2483p8006M4414Q4207l2071q6143J9949Q5020
444D9242j0158q1103J114P6331K808p3915o927P2545J1977p1407j6420O9809K1939
457D5835o8145k6605O6609L0330o8567l7044O8897M6188o7538n6265O2904O6487
$$ y = [-53903, 3817, 52210, -3701, -57567, -2770, 62213, 16017, -55178, -17699, 58096, 28623, -51417, -30548, 53827, 39581, -52217, -50056, 46570, 61259, -35726, -65393, 26612, 69123, -15077, -65175, 12942, 70219, -3439, -69207, -3203, 71703, 16607, -62778, -18965, 61499, 28510, -49153, -22163, 53574, 29274, -48791, -30692, 48359, 35450, -46464, -41641, 40480, 43708, -36606, -43984, 39165, 53951, -30497, -53762, 32447, 67432, -18368, -67646, 9322, 67729, -2195, -69507, -8548, 64355, 11872, -66134, -21720, 62487, 30416, -55727, -35778, 49242, 39084, -42019, -40905, 35426, 38234, -35681, -42608, 29937, 41914, -29493, -45913, 23896, 45835, -22310, -48915, 17694, 48024, -20543, -57587, 11310, 57498, -10040, -66305, -3401, 63086]
469F3086n4182p3456M7038P9959l9290q6289K9595R1633j9095r5248N497R4269
481D3517P133r0196j7098Q4773K5394p9537l0326P3826L7034o8383m1766O2658
493G029M5634n6825m8308N2462N1837m8385n5666M5422O2576m0915p0729L2754
505b3114P7635k3193q3611J0632Q6611J130q7264j2070Q9879K6283q7335l9020
517f3437Q2427N2467p4916o2016O4555O8085n5798p3697M5271P6203l5641p7040
529e3537K5812P7068j6447p3777R089P0845k403o6176j964O2581N801o0987j1244
542c5339N9319J7780n5737k4949N1013K9853m7523l5428M3880M1216m0398n0198
554d6511L3662N7836k5388o2205J7124O7557o892o9203k108O9594J0830o8821
$$ y = [63086, 8904, -64552, -17514, 62445, 23155, -63134, -33539, 58094, 38999, -56249, -50752, 43517, 50650, -39546, -56644, 28129, 53523, -26014, -56340, 17486, 54520, -13863, -55629, 7029, 52663, -4162, -52470, -8, 51829, 3444, -52222, -6800, 55776, 14861, -55868, -23114, 54521, 31328, -52283, -41651, 44960, 46090, -41174, -53244, 36635, 62918, -24417, -63437, 18990, 71457, -3459, -65475, -920, 67165, 11367, -62330, -17059, 59144, 23503, -53537, -27725, 49343, 32896, -40881, -31792, 39053, 36650, -29526, -31490, 31091, 36892, -24095, -35339, 23980, 41760, -13977, -38926, 12087, 41940, -5583, -41011, 2869, 44085, 3687, -46511, -12849, 44987, 19599, -42606, -25482, 42075, 35183, -34020, -36128, 33466, 44296, -24525]
566b4525j9796O4236K4079o1498l0411N5323L2206m9699l0770M7608K9820m5798
578i225k9338M6617L2025m4025l3776M0273L2734l9577l4869L8296L6743l6125
590b47m0630L2627M4503k8151m8074K2550N3017j4006n6995M136N8100N631n8420
603b5959j5433N8784K7277n5153l8291M8417M5214m1139m7889L7477M9699l7264
615E740n4767L4361N9318l0307o0920K8068O3175k6066o5543K4677O9041j9925
627B6852o9544J7289O9419j6078p2892J1301P5915l796p5654l009P3169R583p1549
640b8994j8269P0665L1742o1983m3907M6516M8746l2834m8707K3978M9341j4040
652B2254n0801L131M9054N434m4332q049M3007R777m5657j6435M6000K1437m3062
$$ y = [-24525, -44321, 19915, 43994, -17504, -47915, 7408, 39614, -10085, -40855, 6753, 36573, -9225, -38563, 8054, 40079, -3946, -37722, 2551, 35285, -4292, -39161, -865, 35878, -247, -40877, -8250, 36253, 8102, -39972, -17422, 35595, 21589, -35406, -31270, 26830, 32461, -25959, -41392, 17392, 44669, -10484, -48775, -358, 44856, 3717, -44172, -6695, 43004, 5740, -49027, -14666, 44652, 14345, -46575, -18507, 44668, 18602, -46941, -22264, 46777, 26852, -42692, -25403, 44016, 27938, -44954, -33653, 42262, 38466, -37188, -40197, 32972, 42555, -28994, -47263, 23402, 55144, -6839, -50746, -4230, 44516, 11682, -37025, -13047, 36294, 22254, -28547, -25416, 23638, 29072, -15260, -23309, 19698, 29475, -16182, -32617, 13383, 34820, -8242]
665h242k2245M2668K3174m7059k7915M9132L4713m4160l5387M1080L3088m5467
677f620l6991M7964M6844m3227n2475L1717N0968k4598m9421K0239N0372j0857
689B3915m8558j714L9465P213k8992p586K4780R807k1708j5360J4543J6836p610
702E031j2558Q538J1560j4375k0718J2788K7180o422k7221O075K6558j1802l3581
715b8947J4493M6433q064n1017O30N0896M06n5026l563O0107J3502o0158k3515
728d3823N1238K5398m4089k3738M3260K6710l7623l0328K6905K4921j9339j5103
740a5611K1365J4101k5612j9594K0372K2666j1951j7820J1636J5363j5111k2098
752b2294J1282K8890k043k8582l390K7054M780l0786r266L6620K0937l3702k7863
$$ y = [-8242, -30487, 12181, 35355, -11704, -39619, 9513, 44226, 66, -35321, 5759, 38847, -6620, -43611, 4353, 51197, 7970, -44505, -12788, 38180, 13582, -35839, -15600, 34772, 23915, -24643, -26357, 13108, 20321, -8671, -16257, 8523, 18330, -3378, -18738, -4195, 12641, 5031, -7527, 1011, 12571, -1804, -22522, -9734, 17446, 11024, -16197, -10122, 16436, 4634, -28947, -14454, 31979, 23915, -27102, -26472, 24424, 24830, -30196, -33759, 26348, 39850, -20308, -43823, 7415, 32813, -11276, -35014, 8246, 34956, -2667, -32995, -6090, 18831, -508, -15611, 5754, 19855, -5757, -25351, -4979, 17687, 5736, -12084, -448, 14915, -196, -22294, -11012, 17878, 15835, -12747, -16137, 10917, 15697, -15089, -24355, 12265, 33202, -500, -28363]
765b8363K7284K8068k6414k9348K6803L5706k1674l8896J0264L2304o919k1624
777a2809J3273K0260j6767k1847J3222J8870j1319j0864J6591Q910k3631j3759
789a9870K2174J6619j7898j4022J7834J4046j8724j8771J2966K0560m347j5663
801e096P38J0961r33j3014k586J3887J2045o930j5755j554J0448K502p769K815
815b41J0775m907j6110J648J4485r95j2462O475J5085r239k0739Q388K2529p385
829G307k2542R484K5299j0082l0668M291L1383K49k6540r27K4296Q83k6297o635
843b0499K4307J4394j4984j6603M983J3303n96j1458j205J3308O281j3894j2889
856a5552J0924J6434q860j7297Q963J9676r945k2857Q288K3975p877k2969J1077
$$ y = [-28363, -1079, 26989, 575, -28773, -1970, 33736, 12062, -26834, -16570, 15734, 8815, -12809, 464, 20724, 3957, -17890, -4668, 14202, 2883, -7981, 8610, 17520, -6111, -19870, 2304, 18923, 1025, -12997, 4837, 18883, 159, -18612, -5646, 14914, 10567, -5096, -4358, 6603, 5670, -7344, -9930, 3957, 16002, 9072, -6683, -8237, 2211, 4713, -3056, -241, 10534, 5627, -10483, -8835, 5650, 4655, -7807, -1332, 13753, 4514, -16225, -7837, 14692, 7307, -15235, -5751, 19548, 9466, -21202, -16911, 14472, 14721, -11819, -12746, 11550, 12433, -13864, -20499, 3808, 18202, 3218, -13385, -8402, 4901, 4305, -7153, -8358, 4950, 11231, -2663, -15552, -4628, 11806, 2946, -14351, -5388, 14288, 4343, -18514, -10226, 13749, 5872, -17097, -6020]
869f020K5809j3054l0786J1785L3369q390l2868Q452L3297j0459l7248P552M1451
882B2890r35m0308n344L6996Q701l3119j1723L0401J6237k5899k0230K0560K2130
895B0357j5591k3620J1104K6208n109k6923P69K4970K185k4769k727K7320M566
908A8740l0631r094L1158J2657l1020j2451L2342J3389l5821j5882L9646K0153
920C3186m0599k4675M0037K9075l9967l3534L7044L6412l2451l8259K8847L9942
932C5058k4878m1418J8818M1111j1486l8042O008L3391m598l0270K467K9787J006
945A6954k8727m977K6161P868k3763j0920K2977J3631k2217j7744K1030K1067
957B1340k0583k5699J9308L0750j5955l4537J1824L6879q116l8710N524M0903
$$ y = [-6020, 19789, 6735, -24051, -12266, 21103, 12713, -20155, -11703, 21594, 11135, -26113, -18561, 22890, 21955, -18353, -23697, 13299, 22000, -11119, -22842, 7559, 23796, -2103, -22333, -1773, 20357, 4766, -18854, -7750, 18458, 13349, -13574, -12805, 12165, 14350, -10419, -13146, 14174, 18740, -11891, -20985, 10173, 22830, -8190, -20641, 11701, 25090, -10731, -26613, 13033, 33186, -7413, -32088, 7949, 37024, -2943, -36477, 567, 36979, 4528, -33731, -4884, 35058, 10180, -31238, -12420, 28691, 17205, -20837, -14829, 18562, 13964, -16306, -13839, 15948, 16954, -11773, -16750, 9411, 17279, -6484, -17404, 5573, 19204, -3013, -20757, 273, 21340, 757, -24942, -5634, 25116, 9161, -25376, -13552, 23327, 15211, -23499, -17975, 22928]
969B2928k338m3588l670M3005R642l9626j3638L5575J5257l2310j6358K9326J7901
982B2106k5479j8949K1336J9424j8216j8787J4882J8360j1459j8020R734J7008
994A1940q148j8484O684K0485l458k1827r13K2802L558k2535n670K4214Q919k6593
1008i026j3667K7454J9447k4473k4239K1534K6461j8799k7743J6013K8810j3261
1020H511k9054J0719K8576q230k6846O524K5592n366k3604N065K2229n230k2141
1033a3255N120K3552l312k4525P53K3571K116k2799l864K2836O659k3937j0451
1046a7536K2478J6183k0211k0380J7046K3944j3721k6335R754K9173n414l1447
1058a6466J041L1677L477l1940p772L0592J1768k8731j3445K5759J3556k4224
$$ y = [22928, 20590, -22998, -26668, 16337, 25979, -13647, -27285, 8290, 23547, -8763, -25121, 4205, 22106, -3373, -22322, -986, 18438, 222, -18565, -3683, 14677, 3218, -14802, -5068, 11940, 3792, -14692, -8008, 12477, 9019, -12808, -13721, 9081, 12639, -9896, -15566, 8648, 17567, -9026, -22693, 4761, 24208, -265, -24504, -2970, 23491, 4692, -23051, -7038, 21772, 8511, -20543, -9824, 18752, 10522, -16324, -9800, 15792, 10426, -13178, -8113, 14116, 8886, -13255, -8135, 15417, 12105, -12420, -11667, 11904, 14020, -8779, -12643, 10193, 16852, -7085, -17536, 4942, 21125, 914, -19466, -2420, 21524, 7803, -18532, -8778, 20395, 14981, -16466, -15425, 16252, 19729, -12211, -19983, 10609, 22377, -6354, -19799, 5960, 19516, -4708]
1070d708j3970K4400J5208k3659j7947K2673J8558k1165j9329J9980K0760j8673
1082B128k4490J7207K7189j3340k9776Q447L1146l467l1360j712L0815O379k9705
1095a0539j1812K7966J6260k5057k0570K1514K3775j6985k6153J2907K6329q870
1107H765k6676N974K6476m145k5843J247K5611P70k3691k667K2868K940k2111
1120a0482l612K2455N287k2539p462K1662J0022k1112j2021J9493J4577j7671
1132a403j6468J5518J8792j2514k0947R508K3003n988k3412J495K2874K765k1319
1145h096n673J9675Q294j8101r812J5866J1909j3601j2137J1142J1465r398j1080
1158i547R674J0744j0147j0899J0077J2323r853j3699R573J5589q791j7516P342
$$ y = [-4708, -18678, 5722, 20930, -2729, -20676, 1997, 20555, -610, -19939, 41, 20801, 2128, -22362, -5155, 22034, 8694, -21082, -12635, 18511, 15044, -16316, -18028, 12787, 19166, -10539, -22351, 5615, 21875, -3182, -23752, -2238, 21537, 4552, -21601, -8694, 17635, 8765, -17911, -11937, 14539, 10394, -15449, -14202, 11409, 12179, -11512, -14179, 8689, 11629, -10482, -14094, 8361, 13648, -8891, -16353, 5309, 15331, -5781, -17802, 1691, 16268, -1403, -17871, -2353, 16439, 3925, -17022, -7514, 15489, 9501, -13911, -12416, 10458, 13223, -8096, -13769, 5906, 14200, -3901, -13713, 2153, 14062, 461, -11676, -534, 10931, 1533, -9547, 127, 10871, 724, -10175, -98, 12225, 2372, -11327, -1754, 13835, 5044, -12472, -5130]
1171e130J9126m901k0791K305K1916J048k2307m633K1753P703k0403r887J8295
1184D094J2393j6779j4031J4506J5494j1679j6736R164J6815p454j5791N310J5658
1197A0964n425j4401M005J4157l508j4245L430J3816k351j4534J321J5195j57
1210H267j6471j409J6992M009j7037p469J6191R963j3934j2719J1723J4400r256
1223C250j5943O411J6705l507j6628P01J5708J075j4535k638J2978L565j1589
1236d447l788J0339L110r451k559R368K111q737k319Q770J828r109j669R680K564
1251E691r842m128R178N909q014o656O674P208m564q281K310Q781k3p981j705
1266e443P204L535p200m610O725O093n435o811M190P314m342p375M350Q354l698
$$ y = [-5130, 13996, 9095, -11696, -9391, 12525, 13573, -8734, -13367, 8386, 16089, -4314, -14201, 4094, 16487, -292, -14323, 183, 15677, 3998, -12738, -3574, 13241, 5787, -10004, -4694, 10964, 5539, -8862, -4857, 9300, 5792, -8453, -5023, 8793, 6442, -8092, -6771, 8424, 8267, -8204, -9613, 7379, 11388, -5649, -13118, 3073, 13036, -898, -13617, -1894, 12506, 3250, -12693, -6282, 10423, 6916, -9712, -9011, 6697, 7772, -6763, -9401, 3577, 7142, -4447, -8235, 2104, 5214, -4237, -6796, 2572, 4683, -4054, -6373, 2397, 4225, -4884, -6553, 3127, 5691, -4151, -8279, 899, 6808, -1206, -7862, -1188, 6020, 1456, -6825, -4515, 4266, 4243, -3738, -5443, 1761, 5296, -1904, -6514, 211, 6304, 869, -5942, -1752, 5562, 1220, -6155, -1805, 6549, 2851]
1281B851q339L368P329l715o680N212Q073p008q993P486J0224p815j1696P870
1295a833J4318o731j6668M242J7383j250j6467j182J5776L174j4656n701J2884
1308C289P597j0513q287Q673Q224p598r668O886J1372m837j2325L364J1659k692
1322E144j2466K714J3990j880j5692J317J5601j299j7119K273J9041q81k1503
1335a0760j238K2252K855k2380m486K2893O162k2413r492K0153J0876j6894r793
1348a2265J4828Q468j4457q522J2775Q314j0024o943Q671N303r279m616Q188N612
1362F053o730m326M884K829n497l347O143M585l976n978K437N690j691o781J239
1377d466Q783J710r326n812P543P896n693o793M474P139m509p481K228P209o96
$$ y = [2851, -5488, -2120, 5209, 1494, -5186, 26, 8099, 1091, -7902, -416, 9808, 1993, -9703, -1833, 12485, 5754, -10914, -6672, 10711, 9461, -7006, -8188, 7588, 10762, -3894, -9595, 3289, 10886, 373, -7914, 759, 8983, 1385, -8283, -1397, 9975, 5138, -7187, -3823, 7836, 5144, -7322, -4608, 9382, 7502, -8190, -6873, 8728, 7429, -9690, -7417, 11624, 10743, -10760, -11998, 10254, 13109, -9271, -13757, 9136, 15298, -7115, -16607, 3546, 14422, -2472, -12265, 2563, 11031, -3426, -11948, 827, 9141, -883, -7826, 845, 6148, -3131, -7747, 441, 6053, -677, -5003, -119, 2710, -2787, -6134, 9, 4594, 618, -5360, -2923, 2767, 1076, -5705, -4466, 4317, 6027, -3299, -9111, -1568, 6328, 635, -6158, -1684, 5455, 946, -6535, -4307, 2902, 2206]
1392B206l910J519J617l518j649M036K160k767m21L129j684m597J535N313j291
1407A678l391L077K492n761l496N676N063m633k993N318L25p717K0R816K9r294
1423c791J269J0956m027j4467L639J7578r16j7454o29J6609L12j7179r74J7635
1437H561L776j5949n240J2723M020j1781k568J2051M074j0926n739Q132M220o416
1451a062k908P674L897q139o919O234P692m072p317M661Q310n495j1960L192J4581
1466H369L4j5199r88J5558J223j7948l989J9358P766j7931q900J5069Q003j5626
1480e201p805J7146R381j5526j0212J2575P705j2215n607J4110O439j4012q517
1493a1739J1779P259j0139n765J0980O225j0322q512P661Q467n073o806M629P023
$$ y = [2206, -1704, -185, 1432, -2086, -3735, 301, 2461, -306, -727, 2402, 718, -3879, -2344, 2969, 1678, -1713, 1364, 3856, -1905, -5401, 275, 5338, 705, -2288, 3030, 3355, -4362, -4342, 5474, 5503, -3791, -2522, 8434, 4407, -10060, -6421, 11157, 10241, -7213, -7842, 8767, 9079, -8100, -9074, 8561, 12337, -3612, -8852, 3871, 7891, -3890, -6458, 5593, 9667, -1259, -6998, 1134, 5354, -1062, -3970, 3704, 7601, -538, -7457, -1223, 6469, 2397, -4920, -259, 8051, 2556, -9404, -6212, 8369, 8403, -6796, -7784, 7774, 8997, -8951, -12940, 6418, 14184, -3747, -12647, 2422, 10425, -5201, -13006, 4140, 13521, -2005, -12217, 358, 8063, -4152, -9759, 4351, 10790, -3222, -11739, 40, 7299, -2840, -8605, 2375, 8600, -1722, -10234, -2573, 5894, 821, -5985, -1356, 5667]
1507E667l377q898j033R256N450o899p133N301P908n528j0784M510J4468j014
1521G894j4593k841J3287K654j1564j852J3025K145j2755m074J2048L459j1658
1534d825j977J3168L057j4018m993J1948N783r639n353R700P030j0229q917O898
1548b367J0249k934r297J267R529q39j1608k525J4189O949j3188j0877J1501J2334
1562A2383j0437j4064R977J6841q278j7818N737J6837n387j6225N853J7363n229
1575G553j8047M070J6212l655j5435N073J6306n007j7455K651J6609j056j5011
1588g192J741J3751j421j4453m51J3836K599j0898m595R459N147q614p085O241
1602a935Q433k853q017j37P183M33o985j086P867K687p314m135N843K931n388
$$ y = [5667, 2290, -6608, -7641, 1615, 7065, 166, -6967, -1666, 6242, 714, -10070, -5560, 8908, 7894, -6699, -9540, 3747, 6401, -5163, -7015, 6010, 8155, -4600, -8674, 3374, 6833, -4825, -6802, 6366, 9423, -4595, -9588, 2360, 8143, -1496, -6849, 2851, 9881, -348, -9265, -2367, 7882, 4948, -4349, -3082, 6447, 5608, -6000, -8525, 5664, 12613, -575, -11452, 49, 12383, 1946, -12118, -2141, 14700, 6422, -11396, -5659, 11178, 5791, -10434, -4581, 12782, 7553, -10494, -6424, 9788, 6133, -9302, -4229, 12077, 7070, -10385, -7734, 8875, 7819, -7192, -5451, 8300, 6879, -7574, -8025, 5811, 8410, -2488, -7083, 2376, 7523, -1091, -8176, -1935, 6498, 3645, -4372, -4509, 2674, 3107, -3878, -4964, 2903, 5590, -1724, -5859, -16, 2915, -2473]
1617b473j572P000J471q721k515Q399K917p763j931Q129K115r433k580R130K483
1632D656q019k468P811K872p402l925N874M040l065k642J669J347r62j457m66
1647b137P55L373J163n122l216M338M746l994m213M509M371n158m784N921M390
1662D942n883l955O906L537p187m301Q020L940q267l658R474M449j0637n600R652
1677A432P120q258p370P612P506p024q213N730R305k841r555lQ840J835p808l299
1693d991O741N137o163o603N729O912m972q186M660R451l610r978K522J0236k433
1708D452j0603L025J0763k865j2696K408J3261q59j3368M78J3037m10j3449OJ3993
1723G173J010j3561l146J2434M670j1368n652R120P124p458p386M792P874l351
$$ y = [-2473, -4045, 2955, 4426, -4295, -6810, 1589, 4506, -3257, -5188, 2941, 5056, -4377, -6957, 2173, 4656, -3363, -5831, 1980, 4852, -2550, -6475, -601, 3439, 374, -2268, -599, 748, -214, -1671, -2137, -1382, 1991, 3154, -1968, -5184, -846, 3900, -94, -4307, 202, 4573, -585, -5369, 552, 4942, -941, -4896, 2010, 5547, -1640, -5941, 2079, 6019, -2248, -5906, 3568, 8017, -2620, -8220, 1432, 8552, 294, -7076, 536, 8042, 1018, -7195, -1465, 7840, 4999, -4556, -4559, 4281, 6116, -1692, -4991, 1750, 6887, 724, -5879, -150, 6762, 1790, -6396, -1736, 7715, 4105, -5873, -3351, 6885, 4452, -6151, -3126, 7637, 4772, -7924, -5516, 7745, 6886, -6482, -6004, 7033, 6623, -6826, -6820, 7173, 8183, -5378, -8524, 3910, 8580, -2788, -8440, 680, 7804, 346, -7040, -2248, 5626, 2275]
1737B275p307R82P228J077o750l083O056K827m142l036M113L511n417l891N995
1752D38M601n832n466N332O129o281o268O458P544o758q276N984R633n204j0214
1767h180M263J0673l176j0308K488R656j299r867K56R236J264q092k639O653L273
1782D201n044k547L590K732l915k671L783L174k743m188K946L881j644n038K668
1797h15N247k394o148J526P760j255q788J6R776R37r535k312J0095L417j0014
1812b487m438R932N988q960p268P284P609n470p463M380O696l676o728L766O415
1827E580k853o510J901O239r57n992N04N983j67o385o90P059J602p239k612P170
1843B633L608o645n110N825N909n484p471N562P938m476r414L178J0224j806r767
$$ y = [2275, -5032, -4050, 3178, 4255, -2495, -5578, 478, 3305, -837, -3873, 240, 3751, -1666, -5557, 438, 5039, -793, -6259, -927, 5202, -1079, -7347, -889, 6655, -103, -8379, -2395, 7238, 2034, -8180, -3917, 6756, 3580, -6728, -4240, 5416, 4117, -5750, -5494, 3742, 5006, -3086, -5725, 928, 4201, -843, -3390, 200, 2932, -983, -3654, 129, 3303, 560, -3628, -682, 3199, 1555, -3483, -815, 4432, 2038, -4110, -2584, 5176, 3921, -4867, -4851, 4925, 5862, -3673, -5985, 4110, 7527, -2487, -6925, 3007, 8995, 35, -7233, 51, 7660, 2190, -5273, -893, 5803, 2127, -4601, -835, 5580, 2727, -3783, -1882, 4357, 3400, -2592, -2088, 3895, 3728, -2657, -3347, 3712, 5314, -1925, -4537, 2633, 6241, -404, -5514, 311, 6220, 736, -6735, -1173, 6765, 2289, -7125, -3947, 6277, 4471, -5296]
1858e296N60R180N45q943j413Q476K326q299l577P404L883n873m157M961M015
1873C792m576l867M206L857l790m760M284M472l540n136L384N757l097o242K680
1888b576P031j612q021l4Q223J630p915l107O766M307n789m450N127M771l924
1903D27n145K871N739k097n216J221M708q71m531P43L747J03m164M29M100k82
1919A782l830k34M765j98m688m34N598R05o232j939P069L739o704m900N549O194
1935F442m871o558L593O953k873p050J668O631l40o397J68O017K41n118p38M963
1951B731J263n054j341M738J739m970k525M574K329m388k554N385L010n884m846
1966e793P322N927o210q314N646R109m156j0967L148J1532j221j1627k52J1324
$$ y = [-5296, -4736, 4444, 4989, -3954, -5367, 3109, 5435, -2864, -6441, 963, 4846, -1027, -5184, -223, 3792, -784, -4651, -445, 3412, -378, -5138, -854, 3618, 78, -5058, -1674, 4083, 986, -5256, -2576, 4455, 2843, -5178, -5212, 3011, 4641, -3274, -6381, 385, 4692, -1097, -5547, -420, 4351, 427, -4718, -1847, 3892, 1795, -3421, -2200, 2508, 1637, -2894, -2151, 1596, 1699, -2465, -2036, 2064, 1782, -2048, -2282, 2483, 2285, -2403, -2837, 2761, 3666, -2566, -4505, 2564, 6303, -401, -5301, 248, 6442, 1571, -4987, -1394, 5559, 2686, -4364, -2696, 3935, 3595, -2802, -2634, 3383, 3624, -1494, -2232, 2731, 3994, -1060, -2401, 2337, 4076, -894, -3419, 1155, 3484, -904, -3458, 1927, 4937, -947, -5793, 1529, 7456, 1246, -7068, -1422, 7687, 3531, -7436, -4288, 7244, 6023, -5604, -5856, 5468]
1980E468M94j0434j385J0213J272r094k360Q743K136r023j945Q994L244r013l850
1995f540Q214M212p453m240P886L542p765m995P360N804p121o393O145Q060n356
2010A360r017L319J0001q57j0109n82R637K006r275m133R036N231p661n812O337
2025e19N508o123n266N999O882o295o826M837O915m844o077M500O780m505o773
2040e807M108O812l311p279L869P748l140q874J337Q872P42q265k640P963M158
2055F293p101n858N721P820l502p926J399P915o15q645P16R053N60r526k151J0179
2071D332K369r955k841J0464L572j0991m362J0580N140j0561n246J1038N495j1288
2085b254o955J1451Q378j0682q790J0399R669j0647j1331Q615J2849o797j2841
$$ y = [5468, 5962, -4472, -5857, 4356, 5628, -3466, -5826, 2917, 5053, -3970, -5915, 3079, 6323, -2690, -6540, 1674, 5886, -1567, -5807, 2079, 5621, -2144, -7139, 221, 6025, -1096, -7489, -1344, 6716, 1360, -7657, -4338, 5663, 4806, -5303, -5885, 3752, 5758, -3517, -7650, 1386, 6617, -1044, -6856, -519, 4989, -1134, -6400, -401, 6481, 186, -6640, -1803, 5112, 268, -5809, -1309, 5471, 966, -5807, -1699, 5113, 1802, -5477, -1608, 6140, 3000, -5874, -4537, 4335, 5077, -3188, -5828, 2135, 6293, -808, -6666, -945, 6875, 3373, -4553, -3154, 4761, 4146, -4499, -3783, 5270, 5830, -3696, -5847, 4332, 6701, -3254, -6095, 4369, 7941, -3050, -7412, 3168, 8308, -2253, -7499, 3539, 9034, -2254, -9209, 2242, 10620, -62, -8852, 1547, 11216, 569, -10762, -2147, 10702, 3905, -8936]
2098h936M924J1965k876j2844K337J3123k16j2375k451J1722L755j1887m614J1540
2112C167O064j0718p668R436Q134r316q139R571R629r728j0803Q623J1286q119
2126A419j2061Q791J2602q038j5005O814J6149n263j4980L654J4848l503j4966
2139i539K255J4548q74j3529m32J2413M06j1427j799J1207M148r206m845P353
2153F79M237n749m266M444N135l296n666J290M989n59m431J206N461o60o955l82
2169d523P067J866o917k535P663L170p882m748P692O244o783o028N686N950n335
2184E87p159M601P880k696p099O44N972k67n120N3N144K453m221k960R08L838
2200B558J46l566o1L575k55m790o76N096J580n307j523O744J834q666k429Q887
$$ y = [-8936, -4012, 7953, 5077, -7767, -5430, 7693, 7477, -4898, -7349, 4373, 8128, -3759, -8373, 3167, 9231, -1487, -9155, 281, 8415, -901, -9040, 531, 10160, 432, -10371, -1748, 9538, 1419, -10642, -1851, 10751, 2713, -12292, -5478, 10671, 5408, -9572, -5918, 8930, 5427, -9539, -7284, 7264, 6390, -7139, -7571, 4842, 5248, -6179, -7978, 3229, 7377, -1829, -6674, 679, 4916, -833, -5099, -655, 4480, 1184, -4482, -3192, 1797, 1238, -3193, -1987, 3474, 2814, -4141, -4523, 2544, 4410, -2507, -5042, 2621, 5791, -2091, -6839, 853, 7097, 314, -5714, -28, 5922, 587, -6572, -1971, 5909, 3213, -3886, -3242, 2730, 2463, -2657, -2604, 2540, 4993, 772, -2188, -1280, 2558, 2704, -862, -923, 2652, 2397, -2393, -3069, 2027, 3607, -1700, -3223, 3521, 5355, -3311, -5740, 3147]
2216C147M629r067n250R367N485j0693o288J0366Q311r442q957Q499Q553q636
2230B4r257Q684J0343o865j1048M154J0838l348r441K691R507j471r108k14Q123
2245C612L39o956q54P131J177q220k763Q144L897p377m402P681O040q848p604
2260i003P735J0538p206j0454N202J0969n615j2070N503J3087l767j3529K636
2273e974J2954j839j3173J498J2790j88j2633l54J1017P07j0446m19J0309J504
2287E753r777j715Q579K233p521k445P409K850p674m860O705N525m471o081L886
2302a604O795k546p748R69R371j79q961j647R157L223r839m629R514O167q592
2317e49o931Q088P035p525p551P803P825o743q805O054Q067n202p916N577Q234
$$ y = [3147, 7776, -1291, -6541, 2826, 8311, -2382, -8670, 1696, 10007, 565, -8392, 107, 8660, 24, -9233, -549, 9794, 2929, -8119, -3965, 6873, 3525, -5916, -3225, 6282, 4811, -4297, -4511, 3612, 3951, -3005, -3859, 3272, 4449, -3771, -6534, 1610, 5507, -1870, -6272, 1409, 7449, -1399, -9003, -1268, 9270, 2064, -8390, -3188, 7781, 2166, -9904, -4401, 8686, 4919, -8610, -5974, 6980, 5141, -8032, -6534, 6256, 6068, -6565, -6919, 4098, 4805, -5641, -6060, 4249, 5753, -4024, -5739, 2840, 5073, -2448, -4893, 2516, 5366, -2308, -7168, -463, 5062, 591, -5490, -1604, 5191, 2645, -5103, -4134, 5237, 5058, -3903, -5550, 3607, 6830, -3009, -7638, 1876, 8043, -549, -7480, 608, 7643, 118, -7433, 370, 8195, 1452, -7353, -1299, 6768, 1566, -6350, -773, 7461]
2332G461n142q562M767R003m096r100L396Q801k485r354P62R150P53q817k177
2347e640Q513L838p579n666P348O756n442p954M394Q247m238q776L108R590j710
2362D789j0706Q47J0304k54r788o4J0151M27j0753r26J0812J026j0379j816J0950
2377D620K180j1052k741J0590L632j0368l617R615M640r995n778P987O786o436
2391F3p450N528P487m256p671L008Q705j343q150l77P247J658p373j955O231K699
2407D051o255l578O706L891o785m094O912N401p300o120P073O675o705p483P039
2422e72Q182o206r603O103R509m617r676L220R539k431j0017K007R644j74r886
2437d978l64Q795K254q258k487P129L588n464m446M735M600m620n186L652N526
$$ y = [7461, 2319, -6243, -1476, 7527, 3431, -5669, -2273, 6528, 4043, -5311, -4549, 4601, 5354, -3463, -5640, 2873, 6711, -868, -6534, 814, 7570, 2128, -5826, -1432, 6815, 2577, -6199, -3091, 6499, 4789, -5917, -5070, 5234, 4980, -4808, -4872, 5279, 5706, -5047, -5973, 4839, 5865, -4514, -6330, 4620, 6800, -4252, -6993, 3597, 7229, -3139, -6756, 2859, 7499, -2496, -8274, -287, 6499, 63, -7387, -1859, 5628, 1372, -6299, -3291, 5414, 4071, -4079, -4456, 2791, 4449, -2924, -4879, 1352, 4051, -2204, -5782, 924, 4815, -1970, -6064, 848, 6249, -1051, -7171, -98, 6577, -128, -7611, -572, 7610, 1404, -8199, -2096, 7413, 2796, -6880, -3660, 5879, 3448, -6569, -4562, 5082, 4908, -4978, -5342, 3453, 5707, -2551, -5038, 2091, 5679, 215, -4231, 504, 5104, 484, -4702, -1050, 4476]
2452D476k648o095K039O411j489o572J447P596j023q597L28R277Q76r562j974
2467e510R310K787r589l542R260N327q918o131P862P448p598p685N882P633m602
2482A934p982L682P626k293p405K230P089j023o993L29O310j24o151o07N876J120
2498C618o950j619O958L030o326m032O076N197o081o066N635P165n154q421M298
2513b672R218l661r639J983J0266j322r584M10R543Q56r926j406R127K077q856
2528c586k662Q027L084o896l631P146L380o168m006O358M451o070n178N164N644
2543E057n426n748M367P112l941q099L288R087j686r627L81J0001R73r602k764
2558f627R344L865r054m894Q776N721p757o653P242O875n864p433N564P109m882
$$ y = [4476, 1828, -4267, -2228, 4183, 2694, -3878, -2431, 5165, 4142, -4455, -4127, 5150, 6026, -3536, -5510, 3800, 6587, -3002, -6544, 2716, 8043, -875, -7006, 856, 8304, 706, -6979, -1097, 6536, 1934, -6048, -2366, 5260, 2967, -4438, -2208, 4881, 3858, -3135, -2806, 3504, 3380, -2771, -3378, 2498, 3618, -3332, -4951, 2007, 5037, -1289, -5321, 755, 5952, -129, -6195, -560, 6605, 1451, -6970, -2672, 6546, 2885, -6754, -4771, 5495, 4173, -5411, -5001, 4542, 5398, -4528, -5934, 3193, 5270, -3586, -6248, 1779, 4863, -2033, -5664, 1482, 4862, -1306, -5312, 1046, 5497, -573, -5751, -587, 5057, -369, -6117, -1750, 5362, 1421, -6678, -3390, 5697, 4011, -5616, -5235, 4766, 5739, -3863, -6627, 2717, 6582, -2472, -7366, 1410, 7131, -626, -7279, -37, 6838, 974, -6459, -895, 6214, 1332]
2573A332p283M181P956l552p903K938P885k165p727K113P813j699q381O43Q678
2588D829J52r427j184R511K468q865l986Q211N905p261o873O318P680m777q885
2603f184L585Q726j998q644P00Q770k84q401l02Q296J010q008k110P127K757o699
2619a659k901O402K851n952l420O723L619o999l897O548N364o736o917N606Q382
2634G014n245r350L937R558j633j0462J5J0719J535r322l024Q798L500q353m041
2649f354P936M267p070n896O786N821o136o281O018O811n504o834M866P414m864
2664I80p458M435P868l915q998L583R847k805j0375K028J1109k83j1972j594J1646
2679D096L570j0962n388R889O351r113o649Q319P624o911p670O319P290n456p761
$$ y = [1332, -5951, -1770, 6186, 2634, -5269, -2331, 5554, 3389, -4338, -2225, 5588, 3889, -4492, -3849, 4829, 4981, -4446, -5630, 3881, 6349, -2516, -6502, 1709, 7614, 353, -6520, -202, 7478, 2701, -6184, -2599, 6127, 4129, -4515, -3815, 4955, 4671, -3730, -4032, 4264, 5274, -2734, -4844, 2283, 5040, -1659, -4560, 1842, 4693, -1259, -4679, 2044, 5663, -1336, -5233, 1315, 6679, -57, -6974, -1368, 7014, 1769, -7581, -3644, 5914, 4281, -6181, -6166, 4553, 6088, -3234, -6258, 2540, 6040, -2313, -6354, 1582, 5849, -1221, -7117, -331, 5490, -646, -6927, -909, 5902, 398, -6436, -1570, 5844, 980, -6478, -2043, 5825, 1910, -7088, -3505, 6342, 3537, -6838, -4810, 6299, 6016, -5956, -7550, 4096, 7666, -3296, -8684, 1205, 7556, -1557, -8206, 113, 7737, 826, -6844, -525, 6765, 1309, -6452]
2694f452N030P983m602q068M151P505l532q064L279R042k939q663K051Q801j371
2709D151q900J154R212P0r968j699R591L098q642m134P602N289o511o666N449
2724i04O786l851o939L233O447k399o809K072O642p52o525K35O508No349p61O449
2741C088J391o131k231N765J546n029k328N863K706n846l377N744L880m738m904
2756d601M329N695l463o692J463P034o37n952r71N944K043n635l603N170M451
2771D575m286n051L506N045l139n436K495O648k044o373J137O669j321o593R94
2786c174P226j082p362oP361L88p945l26Q611J267r241k040Q730L894q464m703
2802f866Q171N054p550o362O200P465n106o969M100P208l230p678K437P910j075
$$ y = [-6452, -1422, 6561, 1959, -6109, -1958, 5547, 2015, -6049, -2770, 6272, 3333, -5330, -3279, 5522, 4151, -4749, -3595, 5617, 5687, -4281, -5980, 3611, 6709, -1933, -6067, 1535, 6824, 313, -6353, -904, 5882, 2031, -4908, -1675, 4772, 2373, -4436, -2364, 4278, 3526, -2999, -2764, 3744, 3749, -2600, -3361, 3088, 4479, -1652, -3883, 1882, 3428, -1601, -3929, 1934, 4640, -1206, -4583, 1161, 5041, 303, -4601, -272, 5423, 1960, -4732, -3269, 3765, 3128, -2824, -3795, 2149, 4192, -1443, -5046, 124, 4575, 289, -4762, -1256, 3789, 650, -4786, -2291, 4357, 2313, -4060, -2923, 3746, 2425, -4168, -3174, 4052, 2970, -4392, -4398, 2963, 3351, -4594, -4920, 3691, 4958, -4283, -6323, 2407, 6301, -2163, -6866, 1305, 6359, -1191, -7553, -1353, 6112, 1006, -5963, -1863, 5345, 2115, -5563, -3126, 4784, 3709]
2817C709q244Q9P684P83p704r86P301K511p322k391O777K555o434k849P115L459
2833F053p925m701P809M734p270n671P780O727o681p761N898Q225m447q273L746
2848a757Q126l114q147J789P581j001o787K51O531N27o275j465N532K151m532
2863e90k066L827K237l858k723L412L787l234l682K591L988k557n140K861N781
2878D634j741o967O95P258k3q292m57Q141K263p871l490P601M107o841m195N841
2894F63N564o460n697M453O055l407n759K886N663k324o022J188O257o55n466
2909c061J83N833o71n934j97O318J655o852k454P118L143p642m385P697O441p631
2925d39p470O430Q024n555r441N787J0648m965j0919L224J1175k217j0377J925
$$ y = [3709, -4535, -4446, 3238, 4021, -3683, -4669, 2632, 5143, -2179, -4570, 2207, 4762, -1672, -4521, 2594, 6053, -1872, -6573, 1236, 5970, -1300, -6971, 809, 7536, 855, -6906, -1008, 7217, 2770, -5503, -1757, 6369, 3255, -4892, -3103, 4478, 3477, -3310, -3059, 3472, 3999, -2276, -3741, 1791, 3942, -590, -2656, 1171, 3408, -450, -3173, 239, 4026, 792, -2890, -299, 3689, 1132, -4008, -1147, 4634, 2893, -4074, -3379, 3879, 3856, -4436, -4893, 3248, 5511, -2360, -5850, 1751, 5858, -983, -5178, 663, 6227, -233, -5930, -1477, 4578, 1171, -4588, -1702, 3961, 1637, -4385, -3197, 3060, 2405, -3061, -2878, 2955, 2284, -3650, -3847, 2471, 4126, -2726, -5180, 1938, 5081, -2561, -6946, 751, 7192, -439, -7909, -1479, 6545, 990, -8451, -2664, 7984, 3019, -7900, -4676, 6499, 4282, -6095, -4170]
2939d170J0715j808j1162N50J0700N3r988k46R992J75r587j164R880J831r046
2954c275k100Q867K640r406l138Q499N050p846o027O913O954o453p413N681Q440
2969G386m335r271K425R333j326r333Q01R324Q55r999j278R333K126q581k131
2984d671Q267K534q601l764Q651L591p396m227P687M161p862m912P709N907o834
2999B40n974N680O454n786n971M157P239l370p472J526P263m07o783l39O454J769
3015D680o583l067N720L646m299m990M251N044l315n792K660O210j831o175J379
3030b462O209j199o608Q84O950n60p011j95P002K82p447n02P764J538p600k206
3046e161P066L395p029l752O089M834n501n681M423N697k906o192J865O342q01
$$ y = [-4170, 6545, 4737, -6425, -5875, 4825, 4878, -5110, -5356, 4636, 4811, -4776, -5940, 3940, 5771, -3275, -5375, 3492, 6132, -3274, -6412, 2087, 7137, -709, -6736, 177, 7131, 678, -6735, -1054, 7386, 3051, -6220, -3795, 5538, 4212, -5121, -4320, 5004, 5859, -4140, -5418, 3915, 6041, -2540, -4671, 3596, 6130, -2471, -6235, 2416, 6007, -1389, -5616, 2071, 6232, -1630, -6542, 1167, 7074, 240, -5734, -54, 6400, 614, -5357, -1200, 6039, 2669, -4803, -3277, 3986, 3579, -3204, -3543, 2911, 4680, -1903, -4970, 750, 4396, 97, -4893, -642, 4402, 1087, -4705, -2045, 4165, 2334, -3841, -2462, 3747, 2548, -4060, -3176, 3774, 3214, -3797, -3992, 3010, 3292, -4155, -4657, 3107, 4645, -2955, -5161, 1905, 5300, -1729, -5481, 608, 5442, -59, -5740, -1317, 4380, 1474, -4718, -2853, 3489, 2688]
3061B688o416j15N808J788n983k021N231K916n042l328N110L665m984l713M645
3076B49M319m659m870N033N293n086n878M391O201l670p160L776P579k786p766
3091e034K210P820j146p760J73P878N08p487j654O780K404n775l423N218L749
3106D461m800l751M153M693l321m671J913M836j882m505J567M969j053n231O55
3121a967N725o56o218O4O747M65p631j244P598J970p221l002P283M213p282m534
3137e690O341N457n706n615M656N625l946o115L246N868k326n589J336N683q85
3152B340n077J39N176j21m846o74M817J298m950j839N035K358m951k829M583L941
3168D400n056m274M550N309m412o218L679P099k993p766K141Q199j591p718M39
$$ y = [2688, -3728, -3843, 1965, 3753, -2230, -4251, 980, 3896, -1146, -4474, 636, 4301, -683, -4396, 249, 4568, -91, -4961, 72, 5365, 279, -5599, -1208, 4993, 1323, -5837, -2061, 5518, 2732, -5034, -2824, 4996, 3850, -3910, -3737, 4141, 4649, -2838, -4492, 2288, 4692, -1083, -4506, 712, 4461, -339, -4090, 63, 4756, 1435, -3236, -1323, 3513, 1631, -2874, -1307, 3662, 2609, -2622, -1967, 3758, 3102, -3116, -3052, 3695, 4160, -3471, -4715, 2883, 4853, -2368, -5370, 1913, 6126, -1156, -5690, 651, 6108, 402, -5213, -557, 5068, 1122, -4993, -1747, 4121, 1795, -3794, -2458, 3225, 2340, -2737, -2598, 2578, 2457, -2389, -3063, 1754, 3052, -1898, -3737, 1298, 3656, -1295, -4124, 459, 4400, -656, -4930, -380, 4929, 517, -5701, -2022, 5077, 2084, -5682, -3541, 4658, 3067, -4651, -4212]
3183d212P833O51p695j016O760K002o456k672N897K347n242k624N057L651n319
3198a038l068M571L161l972l763L925L890l494m160L076N005k855n494J899O407
3213D090j138o410j79P053J079p073k070O806L034o303m190N992M747m906n347
3228d815M495N196l686n179L223N145l132n211K359N495j893n361J919N000j802
3243A753m837J058N467j015n397N87N389M63n786j329O020J724n137l080N508
3258A388L563m842m930M135N377l291n492K119N762j118o105O69N948L8n773n57
3274c109N736P81n371j157M751J772n143j186M193J595m509j931M799K298m687
3289a168k969M679L199l956m217M192M775l813n650L174N545j678o094J328N630
$$ y = [-4212, 3621, 4272, -3423, -4439, 2321, 4323, -2133, -4805, 1092, 3439, -1803, -4427, 630, 4281, -1038, -4106, 465, 3626, -346, -4109, -184, 3706, 212, -3948, -872, 4133, 1278, -4216, -2317, 4090, 2952, -3458, -3637, 3416, 4495, -2578, -4648, 2158, 5192, -1111, -5301, 691, 5438, 532, -4815, -320, 4876, 1190, -3989, -766, 4379, 1247, -3964, -1605, 3890, 1997, -3364, -1445, 3555, 1753, -3084, -2026, 3441, 2426, -2971, -2384, 3005, 3468, -2318, -3647, 2373, 4097, -1040, -4120, 1388, 4951, 109, -4821, -686, 4691, 1400, -4092, -1973, 3789, 2671, -3434, -2765, 3183, 3221, -2552, -3109, 2627, 3408, -1963, -3120, 1631, 3403, -1740, -2926, 1267, 2862, -1647, -3578, 1221, 3519, -1168, -4137, 542, 3741, -215, -4432, -240, 4535, 722, -4928, -1754, 3791, 2113, -3981, -2653, 2977]
3304B977j52n677o31N295J454m640k496M600K395m093l233M060L472l059l670
3319c398K992L299k939l540K955L969k370m603K180M618k304m460J790N551j722
3334B018n721R44N824k1n876m88O263J329o089k883N964L059m432m425M237M449
3350D152l543m420K628N111k076m720J492M211r12m926J046M656m17m140m8M749
3366B843m54m584j60N261K23m913j615N625J555n564j737N008L411n368l901M565
3382A95M481l878m557L294M775k552n698J986N639q85m888l89M813J94m939l05
3398b714M403J224m157j300L611J252l486j626L833K072l736k014L131J845l084
3413g46k617L679L002l109l712K198M144k211m080J820M602q19n311J29M657J234
$$ y = [2977, 2825, -2852, -3483, 1812, 3266, -1374, -3870, 730, 3125, -968, -4201, -141, 3331, 272, -3398, -406, 2893, -46, -3586, -631, 3338, 968, -3635, -1455, 3163, 859, -3601, -1811, 3740, 2018, -3703, -2759, 3065, 3044, -2832, -3320, 2943, 4272, -1817, -4700, 1264, 4323, -109, -4534, -297, 4152, 609, -3811, -1183, 3928, 1852, -2868, -1376, 2835, 1923, -3003, -1957, 2699, 2282, -1858, -1906, 2843, 2389, -2195, -2355, 2906, 3129, -1784, -3399, 2226, 3781, -1783, -3520, 1488, 4899, -469, -4370, 195, 4676, 798, -3759, -465, 4310, 1758, -3940, -1954, 3685, 2800, -2088, -2477, 2336, 2530, -2409, -2714, 1689, 2913, -1244, -2544, 1067, 2319, -1167, -2793, 1040, 3112, -624, -2638, 493, 2338, -746, -3363, 316, 3318, 209, -3503, -1305, 2839, 628, -3452, -1632, 2970, 2151, -3160, -3031, 1626, 2860]
3429B860m421j507L701K730m171k631K980L190k394l162J970K838j442l623J686
3444a396L654j075l592N44L819r19l480O52M176j75m477l35M168N82l987j083
3460b924N049J375m815k674M451L125l930l934L952M636l307n250K480N405j219
3475B420n762J063N501j78n497j003N872J262n197j689M968J295m671k017M977
3490A344K721m621l138M686L469n461l194N017M388m967m683M141N595m417o010
3505e130M411O279l447p015K628O937j619o952Q40P163j78p232q45O527J978o207
3521a862j503N285K037n231k711M850L116m428k905L968K878l922l627L840M335
3536D120l521m402L183M640l450n167K872N894j972o345J545O071r91o252L47
$$ y = [2860, -1561, -3068, 633, 3363, -808, -3439, -459, 2731, 337, -2825, -855, 1983, 541, -3082, -1396, 2258, 1183, -2409, -1865, 1954, 1035, -2445, -1793, 2383, 2208, -2269, -2604, 1564, 2146, -1841, -2924, 2125, 3500, -1315, -3989, 462, 3587, -343, -4277, -325, 4311, 1004, -4246, -1766, 3639, 2420, -3342, -2279, 3222, 3044, -2453, -3456, 2416, 3678, -1519, -3208, 1760, 3055, -1616, -3633, 1344, 4065, -556, -3694, 992, 4461, -1000, -4194, 823, 5211, 244, -4439, -298, 5297, 880, -5130, -719, 5560, 2113, -4902, -2274, 4663, 3044, -3908, -3068, 4095, 3917, -3315, -4160, 2367, 4345, -1862, -3365, 1920, 3957, -1274, -3985, 865, 3981, -447, -3352, 616, 3494, -428, -4055, -215, 4120, 599, -3803, -620, 4020, 570, -4597, -1725, 4169, 2197, -4148, -2603, 3468, 2477, -3775, -3428]
3551c428O810L78o183j846N843K063n406k098M958K281m274k990L570K816k608
3566a14k748K887K402k236k784J817K766j429k448J009K676j378k952N18L661
3581A647J50l740n99L699J169l550j841L635L031l735l259K693L534k125l830
3596c121K121M110j387m647R99L863J23m144K66M018p1l665j019L593J044k605
3612e22j113K811J134l129j384K926J698k133k268K260K151k036k854K329L313
3627C183j473m304J032M271o44m079k53M840P26m857j837M353K372l887k758M140
3643H25K688l611l399L490L329k681l057K205L130k926k773K382L005k091k734
3658b218J819K755j838l190J966L463j702k907N10K982q4l579J21L469R00l559
$$ y = [-3428, 3382, 3760, -2423, -4269, 1574, 3637, -1769, -3867, 1091, 3372, -902, -3892, -322, 2494, -114, -2862, 25, 2427, 191, -2593, -776, 1990, 561, -1887, -878, 1798, 420, -2532, -2014, 1647, 1797, -1943, -2542, 1157, 2326, -1224, -3065, 570, 3601, -134, -3393, -700, 2834, 709, -3121, -1000, 3110, 1723, -2924, -1925, 1938, 2061, -2083, -1817, 2201, 2130, -1535, -2554, 1039, 2083, -522, -1635, 1176, 2310, -819, -2203, 723, 2421, 288, -1980, 280, 2431, 395, -2459, -130, 3183, 1710, -2594, -1562, 2709, 2065, -2014, -2267, 2573, 3299, -1558, -3395, 958, 3330, -557, -3315, 825, 3513, -98, -3497, -7, 3322, 641, -2416, -211, 2919, -7, -2780, -398, 2607, 516, -2218, -399, 2356, 518, -2672, -706, 2757, 1055, -1852, -1342, 1640, 1556, -2023, -1902, 1567, 2467, -1092]
3674a092j852L233K116k472k472K591K291j645l559J372L592p72l116m0L601l88
3690A388l033m15L390N91l077o29K574M84k511l40K515L40k393m94K283Q14k645
3707a158j017K575J685k853k008K584J972j606k372J267K733o95k959R7K918R19
3723B082k690j450K488J452j979k241J904K677j564k498J225K526j340k129R80
3738e57K557j065k751J155L049j435k648Q67K859r82l384J156L506o63l448L04
3754a480L663J71l908n23L438J651l843j255K974K152k842k666K252L118j888
3769A014l339J318L033p86k765N8L243l9k813k52K256P37k913o46L449O37l480
3786a288p81L624Q30l968r91L809J644m284j875L921K737m102k825L598L324l293
$$ y = [-1092, -2944, 289, 2405, -67, -2539, 52, 2343, 698, -2861, -1489, 2103, 1331, -1785, -1825, 1776, 1388, -1645, -2060, 1330, 1921, -1156, -1785, 789, 1273, -1238, -1578, 937, 1277, -1116, -1610, 673, 1487, -1158, -2175, 400, 2085, -768, -2776, -192, 1780, 174, -2198, -931, 1802, 1107, -1852, -1755, 1163, 2082, -608, -2058, 430, 1882, -97, -2338, -434, 2243, 679, -1819, -594, 1932, 592, -1537, -557, 2000, 935, -1816, -661, 2388, 953, -1695, -828, 2031, 1049, -2335, -1179, 2327, 1664, -1784, -1480, 2183, 2354, -1554, -2077, 1361, 3012, -831, -2086, 888, 3040, 198, -2468, -216, 2902, 1014, -2325, -1007, 2026, 1240, -1525, -1467, 1776, 1737, -1076, -1328, 928, 1665, -1248, -1894, 1555, 2192, -1288, -2069, 1555, 2385, -1583, -2574, 1235, 2879, -1405, -3280, 641, 3378, -724, -3549, 49, 3373, 80]
3802H0l625K512L856j749m085J729L395q63l360N79L261l74k849j93K679L05k469
3819a171m23K208R63k501j042K016J890k780j469K589J626j958k480K510K247
3834B225k305k835K228K899j326l934J624L697n08m061L47L930M1l987o40L346
3850G41J867l560j257K664J574k353j612K103J757j789j490J284J600j309j540
3865a320J062J649r38j646Q42J753p07k071L86K631l97k773j28L083J006l705
3881a273p20L228J517k972k054K555K667k509k872J819L300j647k871J102K752
3896B022p03l025N87K836n33k315N7K304j67k189n6K082L85k426j74K431L68k570
3914a086l72K511M88k108j292K320J784k272k596K120K584j079l292R00L414n56
$$ y = [80, -3545, -1033, 2823, 1074, -3011, -1282, 2113, 1250, -2110, -1531, 1730, 1356, -1493, -1686, 993, 1298, -1171, -1594, 614, 1577, -924, -1966, 50, 1940, -840, -2309, 280, 1906, -52, -2532, -22, 2225, -80, -2915, -687, 2212, 886, -3048, -1424, 2273, 1765, -2296, -1949, 1981, 2022, -1965, -2605, 741, 2608, -952, -2209, 455, 2029, -324, -1936, 167, 1924, 135, -1355, -71, 1529, 220, -1320, -258, 1391, 453, -1193, -351, 1402, 695, -1376, -990, 1641, 1244, -1529, -1657, 1426, 2432, -1273, -1993, 1235, 2752, -220, -2274, 281, 2948, 439, -2433, -614, 2686, 1039, -1832, -730, 2022, 1319, -1706, -1119, 1717, 1184, -1131, -1074, 1230, 1063, -1126, -1182, 900, 1285, -1141, -1315, 1116, 1484, -1086, -1458, 1053, 1541, -567, -1859, 461, 2245, -27, -2623, -503, 2081, 1002, -2290, -1390, 2024, 1468]
3930A468l486o2L486M19l267q48K841J575k943j323K528J569k662j363K287J449
3946A668k110j439J810J866k126j738K209J346j740j704J568K212j280k729J263
3961i24K762j154k240r0K894L77k724q84K928Q45k303j503J855J953j944j802
3977a954J684K511j876j967Q31K184m90k366L60K314l85k423N00K336n77k066
3993a384M87K273n02k230N21K327K69k957m50K521Q42k376q59K029J384j940j665
4010a710J753J854j242j985O04K730m04k592j39K055P22k270n89J823J192k304
4026e02p79J913R77j703j239J701J040j838j041K002J349j974j475J319K083j735
4042I8j989J632K488j338l265J494K919r77k748J00L272J37l326p77L057J375
$$ y = [1468, -2018, -2080, 1406, 1825, -1442, -2290, 551, 2126, -817, -2140, 388, 1957, -705, -2068, 219, 1668, -442, -1881, -71, 1795, -331, -2069, 140, 1486, -254, -1958, -390, 1822, 542, -2187, -924, 1838, 684, -1556, -1646, 1248, 1625, -1099, -1983, 945, 1790, -513, -2016, -161, 1792, -152, -1954, -270, 2241, 365, -1602, -771, 1413, 923, -1443, -1083, 1231, 846, -1577, -1077, 1259, 682, -1384, -897, 1376, 874, -1356, -835, 1492, 1761, -1196, -1646, 875, 1717, -659, -1518, 511, 1895, -45, -1710, 43, 1897, 655, -1330, -726, 2004, 1600, -992, -1131, 924, 1646, -624, -1213, 610, 1802, -502, -1281, 632, 1609, -94, -1333, 368, 1408, -430, -1471, 531, 1880, -94, -1569, -250, 1833, 98, -1891, -259, 2229, 891, -2374, -880, 2039, 1062, -1686, -1586, 1686, 1823, -1503, -2280, 777, 2152]
4058B152k907j210K186J767k305j998J948K223j704j776J206J710j035k051J202
4073e92K321j307k246R80K542j029l020J277K900q06k949O10K760J28l242m12
4089b085L528O74l042k054L695J697k978j834K589K212k325k647J753K703j009
4104H77k671J111K409j039k380N60K495k66k168M52J914l70k161J42K102N30k724
4121a187j57K321L29k110p25K318J028k078j387J594J997j584k105J474K463j301
4137H90k528R79K339k29k373l1J979N61k204p22K072P15j352r51J309R15j416
4154d7j140J618J023j557j044R88J282j283j117J348J531j009k130J050J788o12
4170F89k103M46K623k27k552m13K389J030k374r46J288J997j934k005J594K404
$$ y = [2152, -755, -1965, 221, 1988, -317, -2315, -367, 1856, 152, -1624, -418, 1292, 257, -1794, -592, 1729, 422, -1824, -844, 1698, 669, -2351, -1074, 1826, 1020, -1929, -1319, 1441, 1569, -1673, -2085, 1443, 2117, -925, -2979, 716, 2413, -565, -2399, 190, 2402, 77, -2570, -817, 1886, 877, -1794, -683, 1726, 687, -1693, -1133, 1362, 1096, -1072, -620, 1294, 924, -1237, -1095, 1007, 1537, -1187, -1344, 977, 1306, -804, -1529, 789, 1817, -261, -1648, -54, 1943, 359, -1746, -272, 2191, 890, -1638, -659, 1680, 1451, -922, -953, 1026, 1587, -617, -1339, 733, 1448, 96, -855, 454, 1369, -47, -1187, 431, 1454, -103, -1147, -159, 1123, -160, -1277, 71, 1602, 593, -1537, -487, 1301, 689, -1414, -968, 1655, 1428, -1124, -1537, 852, 1882, -492, -1438, -150, 1847, -87, -2092, -498, 1906]
4186A906j760j924J436J491o24k504R99K072J4k025j2K028l95k218O47K133j22
4203A142k617L37K025r6k166j65K899K23k840q29L022Q17k486j454K582J819k322
4220a09j751J162J982p93j910P61J977q58j613K06J499p8j121j62J354J30j298
4237f22l17J379L4q31j23J136j6j517k43J612N76j364l45O32J044j077r51N65
$$ y = [1906, 146, -1778, -342, 1149, 525, -1979, -980, 1092, 1106, -919, -931, 1097, 702, -1516, -869, 1264, 1142, -1475, -1138, 887, 791, -1375, -1540, 1359, 1582, -1258, -2087, 935, 1752, -734, -2188, 394, 2213, -109, -1860, -698, 1284, 491, -1419, -658, 1319, 461, -1152, -946, 553, 475, -646, -808, 546, 676, -622, -939, 440, 474, -357, -480, 656, 640, -877, -1120, 492, 1068, -296, -641, -9, 1035, -42, -993, -428]
$$ [...]
8191c00
##END NTUPLES=NMR FID
##END=
